##TITLE=1H_TG-2273
 CDCl3, 8 sc, 
 24.12.2019
##JCAMPDX= 6.0         $$ Bruker NMR JCAMP-DX V2.0
##DATA TYPE= NMR FID
##DATA CLASS= NTUPLES
##ORIGIN= UXNMR, Bruker Analytische Messtechnik GmbH
##OWNER= root
$$ XWIN-NMR		Version 3.5
$$ Tue Dec 24 15:41:59 2019 Russian Standard Time (UT+4h)  she@DPX200
##.OBSERVE FREQUENCY= 200.1315
##.OBSERVE NUCLEUS= ^1H
##.DELAY= (6, 6)
##.ACQUISITION MODE= SIMULTANEOUS
##.ACQUISITION SCHEME= undefined
##.AVERAGES= 8
##.DIGITISER RES= 18
##SPECTROMETER/DATA SYSTEM= spect
##.PULSE SEQUENCE= zg30
##.SOLVENT NAME= CDCl3
##.SHIFT REFERENCE= (INTERNAL, CDCl3, 0, 15.7039)
##AUDIT TRAIL= $$ (NUMBER, WHEN, WHO, WHERE, WHAT)
$$ ##TITLE= Audit trail, XWIN-NMR		Version 3.5
$$ ##JCAMPDX= 5.01
$$ ##ORIGIN= Bruker BioSpin GmbH
$$ ##OWNER= she
$$ F:/spectra/data/she/nmr/H-F/1/audita.txt
$$ ##AUDIT TRAIL=  $$ (NUMBER, WHEN, WHO, WHERE, WHAT)
(   1,<2019-12-24 15:40:48.60 +0400>,<she>,<DPX200>,
      <created by zg, POWCHK disabled, PULCHK disabled
       configuration hash MD5:
       00 E9 B6 7A A2 85 ED C7 34 08 36 98 17 FE 4E 26
       data hash MD5: 16K
       41 9B 7E F0 35 58 7E 29 1A 07 2C 1C 0F 0F 79 B1>)
$$ ##END=
$$ 
$$ hash MD5
$$ 36 81 19 F7 8E 7D 11 C0 65 AB 13 50 10 59 4C B3
##$RELAX= 
##$RELAX= 
##$RELAX= 
##$RELAX= 
##$RELAX= 
##$RELAX= 
$$ Bruker specific parameters
$$ --------------------------
##$DU= <F:/spectra>
##$EXPNO= 1
##$NAME= <H-F>
##$PROCNO= 1
##$TYPE= <nmr>
##$USER= <she>
##$AMP= (0..31)
100 100 100 100 100 100 100 100 100 100 100 100 100 100 100 100 100 100 
100 100 100 100 100 100 100 100 100 100 100 100 100 100 
##$AQSEQ= 0
##$AQ_mod= 1
##$AUNM= <au_zg>
##$AUTOPOS= <>
##$BF1= 200.13
##$BF2= 200.13
##$BF3= 200.13
##$BF4= 200.13
##$BF5= 200.13
##$BF6= 200.13
##$BF7= 200.13
##$BF8= 200.13
##$BYTORDA= 1
##$CFDGTYP= 0
##$CFRGTYP= 5
##$CHEMSTR= <none>
##$CNST= (0..31)
1 1 145 1 1 1 1 1 1 1 1 1 1 1 1 1 1 1 1 1 1 1 1 1 1 1 1 1 1 1 1 1 
##$CPDPRG= <>
##$CPDPRG1= <>
##$CPDPRG2= <>
##$CPDPRG3= <>
##$CPDPRG4= <mlev>
##$CPDPRG5= <mlev>
##$CPDPRG6= <mlev>
##$CPDPRG7= <mlev>
##$CPDPRG8= <mlev>
##$CPDPRGB= <>
##$CPDPRGT= <>
##$D= (0..31)
0 1.2 0 0 0 0 0 0 0 0.06 0 0.03 0 0 0 0 0.0002 0 0 0 0 0 0 0 0 0 0 0 0 
0 0 0 
##$DATE= 1577187647
##$DBL= (0..7)
120 120 120 120 120 120 120 120 
##$DBP= (0..7)
150 150 150 150 150 150 150 150 
##$DBP07= 0
##$DBPNAM0= <>
##$DBPNAM1= <>
##$DBPNAM2= <>
##$DBPNAM3= <>
##$DBPNAM4= <>
##$DBPNAM5= <>
##$DBPNAM6= <>
##$DBPNAM7= <>
##$DBPOAL= (0..7)
0.5 0.5 0.5 0.5 0.5 0.5 0.5 0.5 
##$DBPOFFS= (0..7)
0 0 0 0 0 0 0 0 
##$DE= 6
##$DECBNUC= <off>
##$DECIM= 24
##$DECNUC= <off>
##$DECSTAT= 4
##$DIGMOD= 1
##$DIGTYP= 9
##$DL= (0..7)
0 120 120 120 120 120 120 120 
##$DP= (0..7)
150 150 150 150 150 150 150 150 
##$DP07= 0
##$DPNAME0= <>
##$DPNAME1= <>
##$DPNAME2= <>
##$DPNAME3= <>
##$DPNAME4= <>
##$DPNAME5= <>
##$DPNAME6= <>
##$DPNAME7= <>
##$DPOAL= (0..7)
0.5 0.5 0.5 0.5 0.5 0.5 0.5 0.5 
##$DPOFFS= (0..7)
0 0 0 0 0 0 0 0 
##$DQDMODE= 0
##$DR= 18
##$DS= 0
##$DSLIST= <SSSSSSSSSSSSSSS>
$$ [...]
##$SUBNAM2= <"">
##$SUBNAM3= <"">
##$SUBNAM4= <"">
##$SUBNAM5= <"">
##$SUBNAM6= <"">
##$SUBNAM7= <"">
##$SUBNAM8= <"">
##$SUBNAM9= <"">
##$SW= 24.9337058887773
##$SWIBOX= (0..15)
0 0 2 0 0 0 0 0 0 0 0 0 0 0 0 0 
##$SW_h= 4990.01996007984
##$TD= 16384
##$TD0= 1
##$TE= 0
##$TE2= 300
##$TE3= 300
##$TEG= 300
##$TL= (0..7)
0 120 120 120 120 120 120 120 
##$TP= (0..7)
150 150 150 150 150 150 150 150 
##$TP07= 0
##$TPNAME0= <>
##$TPNAME1= <>
##$TPNAME2= <>
##$TPNAME3= <>
##$TPNAME4= <>
##$TPNAME5= <>
##$TPNAME6= <>
##$TPNAME7= <>
##$TPOAL= (0..7)
0.5 0.5 0.5 0.5 0.5 0.5 0.5 0.5 
##$TPOFFS= (0..7)
0 0 0 0 0 0 0 0 
##$TUNHIN= 0
##$TUNHOUT= 0
##$TUNXOUT= 0
##$USERA1= <user>
##$USERA2= <user>
##$USERA3= <user>
##$USERA4= <user>
##$USERA5= <user>
##$V9= 5
##$VALIST= <valist>
##$VCLIST= <CCCCCCCCCCCCCCC>
##$VD= 0
##$VDLIST= <DDDDDDDDDDDDDDD>
##$VPLIST= <PPPPPPPPPPPPPPP>
##$VTLIST= <TTTTTTTTTTTTTTT>
##$WBST= 1024
##$WBSW= 4
##$XGAIN= (0..3)
0 0 0 0 
##$XL= 0
##$YL= 0
##$YMAX_a= 923790
##$YMIN_a= -880327
##$ZGOPTNS= <>
##$ZL1= 120
##$ZL2= 120
##$ZL3= 120
##$ZL4= 120
##$ABSF1= 10
##$ABSF2= 0
##$ABSG= 5
##$ABSL= 3
##$ALPHA= 0
##$AQORDER= 0
##$ASSFAC= 0
##$ASSFACI= 0
##$ASSFACX= 0
##$ASSWID= 0
##$AUNMP= <proc_1d>
##$AZFE= 0.1
##$AZFW= 0.1
##$BCFW= 1
##$BC_mod= 2
##$BYTORDP= 1
##$COROFFS= 0
##$CY= 11.3945322036743
##$DATMOD= 1
##$DC= 2
##$DFILT= <>
##$DTYPP= 0
##$F1P= 16.9975609425685
##$F2P= -3.02152046262296
##$FCOR= 0.5
##$FTSIZE= 0
##$FT_mod= 4
##$GAMMA= 1
##$GB= 0.15
##$INTBC= 1
##$INTSCL= 1
##$ISEN= 128
##$LB= 0.24
##$LEV0= 0
##$LPBIN= 0
##$MAXI= 10000
##$MC2= 0
##$MEAN= 0
##$ME_mod= 0
##$MI= 1.114404
##$NCOEF= 0
##$NC_proc= 0
##$NLEV= 6
##$NOISF1= 3.799351
##$NOISF2= 2.8
##$NSP= 1
##$NTH_PI= 0
##$NZP= 0
##$OFFSET= 15.70392
##$PC= 1
##$PHC0= -10159.82
##$PHC1= 28.0008
##$PH_mod= 1
##$PKNL= yes
##$PPARMOD= 0
##$PSCAL= 0
##$PSIGN= 0
##$REVERSE= no
##$SF= 200.130013532006
##$SI= 16384
##$SIGF1= 3
##$SIGF2= 2
##$SINO= 400
##$SIOLD= 16384
##$SREGLST= <1H.CDCl3>
##$SSB= 0
##$STSI= 0
##$STSR= 0
##$SW_p= 3612.71676300578
##$SYMM= 0
##$S_DEV= 0
##$TDeff= 0
##$TDoff= 0
##$TI= <>
##$TILT= no
##$TM1= 0
##$TM2= 0
##$TOPLEV= 0
##$USERP1= <user>
##$USERP2= <user>
##$USERP3= <user>
##$USERP4= <user>
##$USERP5= <user>
##$WDW= 1
##$XDIM= 8192
##$YMAX_p= 0
##$YMIN_p= 0
$$ End of Bruker specific parameters
$$ ---------------------------------
##NTUPLES= NMR FID
##VAR_NAME=  TIME,          FID/REAL,        FID/IMAG
##SYMBOL=    X,             R,               I
##VAR_TYPE=  INDEPENDENT,   DEPENDENT,       DEPENDENT
##VAR_FORM=  AFFN,          ASDF,            ASDF
##VAR_DIM=   8192,          8192,            8192
##UNITS=     SECONDS,       ARBITRARY UNITS, ARBITRARY UNITS
##FACTOR=    0.0002004,     1,               1
##FIRST=     0,             0,               0
##LAST=      1.6414764,     0,               0
##MIN=       0,             -880327,         0
##MAX=       1.6414764,     923790,          0
$$ Real data points
##PAGE= N=1
##DATA TABLE= (X++(R..R)), XYDATA
$$ [...]
3645b931P070J583n791o532J542O220M017j548o699m534M622P564J152o305n113
3660e683O11N539M877j687o589l163L142N537L399l511q065j856Q211O784l797
3675C749p249k151K956N657K150l231n224k080L643O519K099o980q154L508R987
3690E199K180p323m642R89L347L656J381l490n855q10N745P325j685j0569l979
3705h531Q782P746l917o544r69K119J797L335J123m611o275J510Q900M831p864
3720A432r759L154J0462J718o888l030J057L04J854N290p77q040n025O983J0065
3735H800j262j2104m522Q843P239l817m988M82j38j785M772N948m599j0898K31
3750g798J2230N654q660j0313L152R840R45n365n94N05m058Q29R261K811j1756
$$ y = [-2931, 4139, 5722, -69, -6601, -5059, 1161, 5178, 3630, -3069, -7603, -2981, 4583, 5735, -570, -5683, -5072, 467, 5344, 3657, -2932, -6095, -2953, 2584, 5983, 2472, -5593, -7449, 762, 7546, 3749, -3500, -5651, -2695, 2962, 5112, 1881, -3343, -5423, -1780, 4739, 6838, -142, -8296, -4788, 5199, 7379, 56, -4586, -3597, -250, 3406, 4787, 1297, -4558, -5368, 377, 7702, 6017, -4552, -8531, 251, 7997, 4080, -2464, -3433, -1314, 483, 3818, 4941, 330, -5945, -4435, 4465, 9296, 1432, -8327, -5173, 5289, 7007, 119, -2911, -1854, -1550, 304, 5594, 4817, -3223, -8248, -1265, 8800, 7538, -4566, -9088, -245, 6994, 3177, -1811, -1329, -1467, -3252, 1520, 7468, 2869, -8029, -7798, 4432, 10086, 1426, -8887, -5735, 4105, 5050, -315, -909, -404, -4462, -3633, 5628, 8439, -3317]
3765c317q102Q203J2387j712j2405l978Q201N448l394k084J740l532m918P321
3779a42J0026n421j4274l5J4135N784r312q817L486P324p54k593K453n31p666
3794f337l48J2898M663j3971j0391J0250J3165l196j1670j377O851J698k812K104
3808A527L093p106p467Q853J3504n959j6860N02J5275M477r926o078M878L028
3822A741k627O67O556k998j2015K52J6223N240j5537j0520J1195J1893n317q585
3836c832J582L927k694j796P628L623j1064r731J1145J5906p515j7386J137J4771
3850E701K136r498j421N156j786n231N036R862n418j5288J102J8549N219j6615
3864b496r650J1491R016p156n001N258R93p489J56J2082L538j5277r726J2652
$$ y = [-3317, -11419, -3216, 9171, 7459, -4946, -8924, -723, 4725, 1331, -753, 987, -2545, -7463, -142, 9884, 4463, -9811, -9846, 4289, 10073, 761, -8056, -4570, 2754, 2000, -593, 1860, 1329, -6337, -6685, 6213, 10876, -3095, -13486, -3236, 9929, 6733, -4937, -6314, 537, 2235, -577, 1527, 4620, -2486, -9953, -1100, 12404, 6445, -10415, -9913, 5362, 9839, -87, -6165, -1287, 1741, -886, -219, 6337, 3339, -8676, -8424, 7799, 13039, -2498, -13018, -1823, 10070, 4753, -3832, -2250, 1677, -1017, -2813, 4815, 8438, -2626, -12357, -1212, 14694, 7179, -10207, -9070, 5701, 7837, -1661, -3082, 2074, 288, -4943, 93, 9955, 4537, -10751, -9649, 8900, 14119, -2496, -12146, -655, 8361, 1205, -3796, 1462, 2455, -5034, -4878, 7204, 10742, -4535, -14261, -1609]
3878a609J5495q046j6470L315J3019j003p921K905N269q000o711J0158J2016p829
3892D588j7246K120J9235L500j6429p021J1040N852p685l91Q160l206j2186K153
3906g516J6133K889j7697r294J4608J4428q806j4161M735R436m350n849Q021M823
3920G400j2659o967J3971J3310j1077j8167M259J8256J608j4203l409J0469P67
3933C558q260L252J0505o746j5677N103K0209J063j9542p282J4919J0417r487
3946B032r858O185O196p286k573J2658L588j7334q359J7531J2862j2915j6281
3959a3554P210J5873j680j1725M99P832m538q459R259J2301r261j7770O983K0604
3973A3574j427k0158m402J4527O750r135l630Q283L42j1299M90J5675J393j9806
$$ y = [-1609, 13886, 5840, -10630, -7315, 5704, 4701, -3220, -315, 4954, -3046, -9757, 401, 12417, 4588, -12658, -10538, 8697, 12197, -4232, -11253, -213, 5639, -2046, -2437, 5723, 2517, -9669, -7516, 8617, 11506, -6191, -15485, -877, 13551, 4745, -9416, -4681, 4755, 405, -5444, 2577, 7400, -5259, -12226, 1745, 15055, 3978, -14189, -9930, 8326, 9934, -4269, -7678, 2791, 3558, -4702, -1450, 9055, 2309, -13368, -8265, 11944, 13007, -6535, -13817, 1102, 11519, 2032, -7826, -1641, 4555, -2731, -5304, 7354, 10942, -6392, -14751, 2780, 15642, 2727, -13554, -6344, 9529, 7849, -3876, -3377, 4455, -83, -8542, 717, 13018, 3757, -14013, -7030, 13574, 12147, -8011, -12413, 2114, 8864, -271, -3901, 4382, 4724, -6575, -6085, 9590, 10983, -8823]
3987h823o828J9953J2367j4314j3554P872J0651n164p038N317N837q996o892J3221
4001C609J1955j3343j8535Q321K0325k887j7166p32J3327J035r241J672P674m871
4015A143j2902N313J8518K45k1165n995J9259R772j4979j0472R208P321p076k625
4029d435J0172J773j4283o244J5990J2022j4526j7031J0320J8810m458j5316J748
4042e458R629m143p327P886R550r821j3706Q319J9051l098k1515m162J8304P819
4056A1328j3083m919R988P91r944J723J2724j737j7118k861J9077J0442j5546
4069H65j4600R770J4157o309j0785N164P192p998n145J2676Q841j4913j4317J0672
4083d730J8103m528j8278m44J5875K829j1389j219Q907l692j0985O427J5694m018
$$ y = [-8823, -15651, 4302, 16669, 2355, -11199, -3327, 7324, 2160, -4878, 439, 6276, -2720, -9612, 3609, 15564, 2221, -16314, -7993, 12332, 9445, -7721, -8453, 4874, 5909, -3332, -1660, 6014, 1143, -11759, -6446, 12072, 12317, -8848, -14843, 4416, 14188, -791, -11263, -2055, 5266, -1810, -4435, 5737, 7510, -6773, -13017, 2973, 14995, 469, -16562, -6242, 12568, 8110, -7206, -5458, 4171, 28, -7299, 587, 10137, 316, -13390, -5071, 13980, 10882, -10633, -14795, 3509, 11328, -1755, -6674, 3314, 4105, -5839, -4116, 8608, 6871, -10247, -13108, 5969, 16411, 865, -13735, -3965, 10192, 3883, -6902, -1738, 5454, -2544, -7689, 4987, 13828, -1085, -15402, -4730, 13373, 8845, -9433, -9877, 5998, 8827, -2562, -3781, 5126, 1434, -9551, -3124, 12570, 8552]
4097H552j8734j418J9161O578j5212j1096J0112R897o524n444Q022K881j2696
4110e921l139J5484O957j6564j2117J3131J6044o447j4864J308J0419q08p903
4123d420M151Q118p725j1554R842J6210p533j9354R55J7802M617j3173n707Q423
4137F52M113p128q22R091j069j4468p72J8677N975j7621j0901J2777J2536p746
4151C294j0310L562O743l901l950P814N953j1906j1446J1954J6088q027j8038
4164a2170K730J6081J280j0734j900O709j675o258M250J0529m353j5421J131J8679
4178H878L778j6971q685J1817R394o880n457N215J362p146k77J1195L277j4089
4192d589r190J3222J4393q259j5291L053J1595o08p009K235M145n917n041Q779
$$ y = [8552, -10182, -11600, 7561, 14139, -1073, -12169, -2057, 7840, 1316, -4128, 3894, 6775, -5921, -9060, 6424, 13381, -3183, -15300, -2169, 13875, 7428, -7436, -6128, 4291, 3483, -4420, -269, 7849, 124, -11430, -1588, 14622, 7089, -12265, -11310, 6492, 11109, -2064, -7771, 652, 4765, -2363, -3185, 5906, 4837, -9631, -10403, 8274, 14249, -3372, -14273, -1496, 11040, 3294, -7016, -3454, 3289, -612, -4562, 3252, 9205, -2701, -14147, -2193, 13895, 5868, -12170, -9440, 6641, 7921, -2813, -4713, 1996, 321, -5937, -1687, 8842, 4489, -10932, -9801, 8878, 12656, -4315, -13000, -1183, 8211, 1331, -4126, 1089, 2451, -4695, -4972, 6223, 9500, -4589, -13779, -557, 13836, 5577, -9714, -6661, 4934, 4326, -2683, -448, 3697, -2220, -7261, 1518]
4206A518R828p268j5412K295J7109L533j4731o033R831M897n692j218N493l107
4220A043q351K779J3121J537j4600p543J2130J1309p108j1646L239P898j963l908
4234b063N744J732r851m155J1265Q910q788j3384L505J4154J845j1002l980O493
4248D25J983m701K872N926n881r723M883J3276J79j4000n659J0273R090n436q145
4263d638K370M236l755l12P580J53j1790l453J2425Q236r107j1189L298J0410
4277D464J281o868j919L381j794k564O174N547p997j0325O084J3031r16j2146
4291d567m005P809N563k941l591J139j30l861L002Q519j180j2753k585J1945P043
4306I407p662q630K320O378R80k461J07k04l712j132Q098N071r045r786O183J1649
$$ y = [1518, 11346, 4078, -11334, -9039, 8070, 11603, -3128, -9161, 670, 5567, -125, -1343, 4150, 1043, -7308, -4529, 8592, 10129, -4471, -12014, 116, 11425, 4317, -7329, -4090, 3808, 1845, -2063, 3681, 5413, -4438, -8593, 2672, 11582, 2794, -10590, -7085, 7069, 8914, -2088, -6068, 425, 2408, -2293, 579, 6505, 624, -9099, -4216, 9060, 9239, -4761, -10420, -147, 8943, 3507, -4638, -2268, 1968, -1787, -2099, 5481, 5634, -6156, -9609, 2816, 11052, 1945, -9244, -5946, 4464, 5745, -1123, -3042, 339, -1455, -4019, 2155, 7702, -295, -10620, -4536, 8495, 7579, -4567, -8572, -763, 4800, 1859, -1732, -593, -723, -4584, -1582, 6937, 5757, -6996, -9581, 2364, 9407, 1745, -6885, -4565, 1813, 2793, 332, 439, 235, -3477, -4609, 3489, 8560, -485, -10271, -4088, 7561]
4322G561j185r028l069M312K989K65J30n86l808l138M852Q469j986j1925k445
4337h592J0468O118n472o537O26L039J510J203J123l418n103J095Q000M391p916
4352E35q640M167R295N72o378k513J326Q97K494K517j539n712k687N701P256j479
4368E812r757l160P829N218k590m450j043j35J412M205J298m682n791J841P466
4383C473L840n960p807J980P394J807l429k538j273o42L735M456k258o263k583
4398f068N166O431q58o883m146M163N346K55k614k684k307J471N918K068n152
4413A06n566J167N894L688l088o282j377N022L716k57k870l855r62M645N006j847
4429C140o306k198L074N119J647m106n256M93N619L295j981m398l191K153N710
$$ y = [7561, 6376, -2652, -5721, -1409, 1580, 1845, 1975, 1389, -2419, -5557, -705, 7764, 5778, -6147, -8592, 1876, 7994, 2522, -4015, -3389, -350, 1160, 2363, 3486, 68, -5035, -3940, 4060, 8451, 535, -8105, -3938, 5357, 5929, -449, -2962, -1636, -739, 1755, 4272, 2733, -2979, -5666, 35, 7291, 5812, -3945, -7105, 724, 5942, 3352, -1098, -2141, -2276, -864, 3341, 4639, -43, -5834, -3993, 3473, 7313, 1353, -6454, -4474, 2920, 4727, 1298, -1240, -2513, -3155, 580, 5036, 2778, -3485, -6068, -902, 5529, 4671, -2212, -6358, -2195, 3151, 3406, 792, -1892, -4199, -2728, 3190, 5258, 106, -5460, -4293, 1601, 5289, 2201, -4081, -5458, -436, 3280, 3023, 153, -3702, -4664, -19, 4987, 3140, -3166, -5364, -2290, 2829, 4476, 370, -4886, -4393, 1226, 4521, 2540, -1858, -5049, -2896, 2814]
4444B814K155m189n044l7M075M092K14n405m526K938O119J785l943m384r91M372
4460D5M701j190m673k890J091M173L819j682p130k132O164N224j844n143k835
4475d302J612M961K389k372m348j715J888N103K793m981o873J302P919K312l838
4490A850m620r73L185L882L86k492l889j291L577N867m2q233m233O342O484j513
4506D287n478j922O11K777K953N72l676m718L53O553M703m633q412L63Q446K464
4522E243m146l288m08J057J703L339j98n186m075L446P746J003q867m852N757
4537a726O459j768m146n69l16k41L338L887k700p449j099P360O356m615r073M86
4553e816P781K393m046j258K06k499L70O198K483o904o552L841Q914J371q503
$$ y = [2814, 4969, 780, -4264, -4301, -226, 3866, 4080, -1325, -5851, -2913, 3206, 4991, 1048, -3336, -4327, 45, 4746, 3556, -1117, -4007, -2916, 1257, 5076, 3394, -3736, -5868, 296, 5520, 3676, -1467, -4302, -2690, 2271, 4660, 2288, -2060, -3775, -1887, 3216, 6009, 1028, -5845, -4543, 3376, 5688, 1850, -2770, -3743, -558, 3324, 3710, 1218, -2671, -3962, -385, 5482, 5440, -2793, -7026, -684, 5800, 4287, -1191, -3113, -2502, 275, 3228, 3800, 124, -4594, -4241, 2312, 7015, 2382, -6030, -5667, 2779, 5243, 1097, -2191, -2599, -1542, 161, 3500, 3302, -1884, -5959, -2513, 5233, 6236, -2631, -7483, -1726, 4733, 2965, -1181, -1750, -2066, -2307, 1031, 4918, 2218, -5231, -6330, 1030, 7386, 2771, -6302, -5816, 1965, 4358, 312, -946, -740, -3239, -2869, 3329, 5812, -1092, -7644, -3803, 5111, 6482, -2021]
4568b021m633M903N237j782k155R96j919l397L981P426k151j0258j942Q692O785
4583G762m853q304J056O063N57k339J168L10n619p83Q899M283q488q029M508R792
4599E983L72p945l385M473K537j784R67K563m541o040N429R721k195j1467k321
4614g633R254O036n199o088J426L124o79P1M019j163q447j475J1226N193r364
4629C01r217N513R082m49o801j351K994p3j519M142K995o436p824O133J1863k856
4645F497j2783j381R222M116m663l501K162K68k956K404O960k525j0410j847J2574
4660D137N697j0208q502N878P920k640m062J198R50l356p97P209L842r147q464
4675a0345P458J2133l447j1924p98R129J620m419K1K401l121m503N146Q125l256
$$ y = [-2021, -6654, -1751, 3486, 1704, -451, 545, -1374, -4771, -790, 6636, 4485, -5773, -7715, 977, 7762, 2909, -5395, -4339, 1724, 2281, -58, 1110, 1420, -4199, -4982, 3917, 8200, -288, -8317, -3809, 5983, 6355, -1590, -4975, -502, 2035, 251, 1218, 3781, -760, -6800, -1371, 8350, 6155, -5312, -7633, 1621, 7657, 2458, -3630, -2204, 920, 241, 312, 4331, 3168, -5279, -6754, 4472, 9665, 301, -8916, -3403, 5679, 5230, -1571, -2922, 72, -1, -1520, 2622, 5617, -819, -8643, -2510, 9353, 6497, -6286, -7667, 1555, 5671, 1008, -2493, -331, -63, -3019, -615, 6345, 3820, -6590, -8437, 4137, 9834, -374, -8876, -2998, 4922, 2282, -1780, -582, 368, -2988, -3785, 3424, 7266, -1881, -10345, -2887, 9246, 5799, -6125, -6923, 2206, 3826, -593, -572, 1829, -1292, -5795, -649, 7476, 4220]
4690D220j1657j149J2581N218r856p079O126N428l603j676M320j188o848JR851
4705D689L987j0426q527P850J1028l633j0133O48P318j185l718L515L381p088
4719b294n573P483J0188n038j2148o03J2475L843r177m596N738K371m765J260
4733h36O947l191j0154J469J1758L486j1201p492P659R208l890p771K259M623
4747B874m068k166P270K798r582o582R933R875n767j2167Q76J0728K168p359j678
4762b847M875j149n249M372Q468n491j1838J885J3850K287j1360o217P486O802
4776E874m015m629L357J565n712p21R685K533j1897o683J0951R599o791j0196
4790g080K158Q276l39m870J309L134m311n283P401R214p134j2443L500J3412N73
$$ y = [4220, -7437, -8586, 3995, 9213, -643, -7722, -1596, 3832, 229, -1447, 2873, 1685, -5163, -5162, 4689, 8676, -1750, -10277, -2427, 8601, 4968, -5165, -4517, 2801, 1616, -2102, 1413, 4794, -2294, -7867, -384, 9804, 4766, -7382, -7985, 4490, 8333, -844, -5440, 298, 2669, -2096, -836, 6111, 2920, -7234, -5765, 5993, 9479, -1722, -9214, -1555, 7653, 3763, -4008, -1749, 2874, -1194, -3360, 3910, 6708, -2874, -9456, 477, 10352, 4585, -7582, -6706, 4022, 6190, -1169, -2847, 2028, 879, -4370, 2, 8470, 2979, -8859, -6974, 6876, 9163, -2197, -8414, -928, 5874, 1859, -2770, 587, 2152, -3560, -4281, 5404, 7937, -3960, -10643, 308, 9907, 3116, -7080, -4922, 3354, 3015, -1855, -546, 2588, -1723, -7006, 395, 9609, 2475, -9968, -6468, 6944, 7517]
4805G517j1108l015O542L194l688r09M752k115p529J291J1437J672j3028n615
4819a0602J1496Q339p301p909L326N076k647j816M335J735p298m801R201R107
4833A0241p921j2016L948J1892j05q906q37N016n87l330L170N284m773q974L613
4848d285J2176L24j2414n115J0427O642o812m887L863J925m207K57P164m3r601
4863d586l539J0128Q226p898j0726M097R903j476o304J052L801l966k694O257
4877B275N267o855q943M116J1761k1j1611l214Q293M382n670j750M320j448n638
4892d736K769Q994j635j0868l015J0727O895p271q824L745P136k029l798L099
4906A189J586o446k328R302N233q784q786N127J0578n23r259k419O433J563m000
$$ y = [7517, -3591, -6606, -64, 3130, -558, -1467, 3285, 1170, -6359, -5068, 6369, 8041, -4987, -10602, 894, 9233, 1932, -5977, -2651, 2425, -222, -2038, 2297, 4032, -3266, -8067, 1134, 10241, 2320, -9696, -5748, 6144, 6039, -2867, -3704, 1312, 725, -2605, 565, 5849, 1076, -7898, -4285, 7891, 8215, -4199, -9314, 1113, 7755, 943, -3944, -81, 1844, -2363, -2106, 5058, 5015, -4586, -8125, 2003, 10229, 2331, -8395, -4298, 5605, 4129, -2175, -1123, 2678, -1288, -3982, 2275, 7542, 687, -8256, -4140, 7621, 7600, -4011, -7225, 1068, 5450, -220, -1970, 2350, 902, -4736, -1967, 7027, 5392, -5476, -8491, 2236, 9131, 1860, -6964, -3219, 3917, 1888, -1910, 1189, 2775, -3671, -5999, 3303, 8536, -248, -9034, -3907, 6671, 6148, -3111, -5530, 903, 2466, -1534]
4921a534J497M148m876o508N428R744k797j1461j476R989N072o489n467K820M055
4936B145k868r18M838m18q144j248J0280M905r346q004N834Q361j751o448m14
4951c196M040p65k137L526L355n998p050O352R920l284j0463p92Q527L250m787
4966D98l171K366Q40l265K267N552k068q696p51J0579M258r166o252N129N774
4981C894j226l401L42J092k831j26N689K391p319o264O446R102l371q953l38O711
4997A838J016k396m37J331k678k153L653O069k907r077k48R645L749p577n044
5012e216L820L963j590q37J842j500m199Q46O756K259p734n989O010P914k473
5027C872p262J16M371Q3j273K048L12m934k318N772N699l736q410k07Q607L220
$$ y = [-1534, -37, 4111, -765, -7273, -1845, 7899, 5102, -6359, -7835, 2154, 7226, 737, -4730, -1910, 2145, -723, -1641, 3197, 2779, -5365, -6613, 3667, 8572, -774, -8778, -2944, 5417, 3666, -2782, -3196, 844, 79, -2058, 1468, 4823, -1175, -8225, -1873, 8047, 4763, -5700, -6492, 2035, 5285, 498, -2673, -307, 533, -2732, -465, 5087, 3019, -5677, -6428, 4151, 8409, -757, -7009, -1880, 3894, 2668, -733, -391, 701, -2130, -2256, 3433, 5824, -1495, -7759, -1313, 7789, 4418, -4535, -4873, 1838, 2854, 458, 21, 1352, -1326, -3479, 174, 6243, 3336, -5741, -5989, 3656, 7405, -172, -5216, -1396, 2567, 977, 140, 1982, 482, -3717, -2871, 3885, 6144, -1590, -7579, -1569, 6345, 3872, -3390, -3274, 1097, 1180, -93, 1955, 2267, -2667, -4985, 787, 6486, 2750, -5660, -5867, 2740, 5960]
5043E960o076l641K631J765j491J898K545l997n164K276P778R90p155m843M520
5058b004O818j852m985l24J934j113J119L622n39o281k055O260N566l799p064
5073d697l09O072K972l351k435P30o06k08L457K739m431n781K893O816J189n990
5089i40m075L119M481n0k530k89p00j687K021M598n00o971j802N987M885l117
5105B430n672k87M191J987r67j286q46j602J5M384K948m912n780K532O324J095
5121D554m463l312J270K747J271l32q99j952k030K644M919o83o399k377N234L928
5137D120j685l948j179J847J800J458o02j719l090L65M505L508m544n577J450
5152c291N415J643k854k576l33R92K319J565j398l222j898K800M490k8n424k915
$$ y = [5960, -116, -3757, -1126, 639, -852, 1046, 3591, -406, -5570, -3294, 4484, 5474, -1681, -6524, -2004, 4814, 2962, -2023, -2347, -413, -1526, -407, 3215, 2676, -3605, -5660, 600, 6166, 2367, -4697, -5006, 1066, 4038, 687, -1748, -1018, -1624, -1832, 1625, 4364, -67, -5848, -2955, 3861, 5050, -940, -5015, -1896, 2585, 2535, 5, -284, -984, -2671, -650, 3948, 3448, -3523, -5325, 662, 5547, 2430, -3242, -3529, 662, 2649, 1682, 396, -450, -2052, -2037, 2347, 5295, 383, -5397, -2865, 3459, 4554, 91, -3221, -1951, 796, 2067, 1735, 836, -1116, -3146, -502, 4417, 3734, -2665, -5042, 192, 4120, 2435, -1513, -2692, -845, 955, 2413, 1811, 92, -2998, -2633, 1872, 5380, 836, -4741, -3291, 2124, 3767, 913, -1663, -1996, -1004, 1315, 2880, 1482, -1740, -3638, -838, 3652, 3624, -1800, -4715]
5168d715L881L669p64j912k006m09J308K957M37k695l291M82M244L229l172m935
5184c692O01L930J723p54k246k178J29K936K537j112l895j942K608M114N58m045
5200g28l099J557L595J119j132k242k032J286L970Q18k980l315j91M075K615j077
5216B239m261j638L037L072K20k114k961p78L363L188j129l592j750J516L133
5231A545J850k394l736J21L165K057k18k853k446Q76L891J635k726k974m97K459
5247b45L140J98l629k669J488L582J112j384k985j688K602L576k99l069k270L07
5263b233L193K500j205l796j894K833L220K05k750k763M72L209J875j241k618
5278i93j461J014L222J816k600m361M08L959K241j659l177j358J927K912O9j404
$$ y = [-4715, -834, 2835, 2071, 159, -1847, -2256, -948, 2009, 2446, -249, -3540, -3058, 1186, 4415, 1243, -3692, -3091, 839, 2562, 1808, -438, -2616, -2487, 449, 2986, 1874, -2021, -3963, -1355, 2759, 3317, -728, -3827, -2270, 1325, 2444, 1312, -930, -2962, -1676, 2294, 3112, 132, -3183, -3374, 701, 3316, 2239, -2022, -3660, -623, 2449, 2669, 555, -2406, -3184, 179, 3367, 2238, -1354, -3104, -1588, 1545, 3395, 1001, -2735, -2614, 551, 2608, 2390, -463, -2909, -2033, 1858, 3493, 767, -2207, -2704, -245, 2895, 3093, -536, -3205, -1717, 1865, 2977, 1593, -1392, -3080, -478, 3098, 2799, -270, -2540, -2233, 960, 3460, 2255, -1541, -3435, -602, 2618, 2823, 73, -2690, -2218, 991, 2866, 1625, -993, -2454, -1440, 1782, 3598, 998, -3363, -2955, 1004, 3245, 1586, -1591, -2949, -1022, 1890, 1959, 555]
5294E55k489r66K406L210L71m579k580K592L665M02k439k333j51K149J882L23
5310B018k127k489J1K826L583k147m756l56L834K192j187k079j449L29K480J442
5326B125k72k647k616J353M766J117m304l442J947L539P66j850j558j085P04K725
5342A268J568j581l599j244L682M049j765n233n94L674J924n88j526j146j307
5357b418J676L011O51l184l538J562M658K160m469l595J910L270J80q28p32j174
5373h60j619K737L481j644m166j781L942L775j393m443q41K689J625l66P6j028
5389A84k572O59L764J935l620m213J391M547J658l484k779J115K096J66N08K57
5405A612k623k220K361M605o32n107j960L496L720q98l351j077J671Q49L12J285
$$ y = [555, -1934, -2900, -494, 2716, 3087, -1492, -4072, -1480, 2185, 2587, 148, -2185, -2336, -187, 1695, 2018, -109, -2598, -2587, 239, 3822, 1675, -3081, -3437, 397, 2589, 1402, -677, -2126, -1797, 683, 2125, 1853, -794, -3410, -2057, 2709, 3826, -478, -3920, -1973, 1566, 2332, 482, -1076, -2161, -1457, 1268, 2836, 1255, -2344, -3588, 94, 4143, 2378, -2855, -3449, 225, 2149, 1561, 35, -1111, -2418, -742, 2269, 2920, -264, -3802, -2240, 2418, 4578, 109, -3486, -1576, 1694, 1874, 1046, 314, -860, -2479, 258, 3739, 2095, -2071, -3852, 90, 3865, 2472, -1971, -2812, -123, 1502, 1136, 1212, 184, -2388, -1729, 2035, 3970, 350, -3863, -2472, 2075, 3733, 249, -2530, -1415, 681, 847, 1355, 1612, -1011, -3231, -870, 3735, 3103, -2004, -3964, -468, 3252, 2354, -997, -2074, -403, 446, 758, 2043]
5421B043j066l766n32N054K711l734m727J342M112J402k354k303L19N48N64J896
5437A509J175l212l749K708N534n67n620j738L352K997j036j691o59r2n61J671
5453B1K878j387m765n63N219K854l598m236J162L109R42j397m84k80j375R98K993
5470B091J307l904m057K694N456l12m725j463K413J892q12p6l14j457q50K143
5486B6L570j129n277j488N600K781l163l776J235K246K06K0M81j394k143O27L659
5503B081J627l660m314K790M910l96l765j459J745Q86K2J166q5k900j316K782
5519A14L787j436n069j365M837K743k494k574N95J034l62J229R95j787k992O40
5535b105M452J650l877l706J676M440m35l112m18J286o74O71K435K1m072j829
$$ y = [2043, 977, -2789, -3321, 1733, 4444, 710, -4017, -2675, 1437, 2839, 485, -1818, -1499, -951, -387, 1509, 2684, -528, -4277, -1569, 3965, 3398, -2222, -3960, -608, 2389, 1353, -338, -997, -1089, -1650, 21, 2899, 1512, -3253, -3816, 1403, 4257, 659, -3577, -2415, 694, 1636, 239, -245, -525, -1900, -902, 2091, 3398, -506, -4563, -1869, 3587, 3275, -1450, -2913, -500, 1392, 580, 504, 190, -1267, -2117, 26, 3596, 2467, -2810, -4298, 1302, 4083, 920, -2856, -1621, 625, 831, 851, 1332, -62, -2205, -1578, 2081, 3708, 48, -4266, -1476, 3434, 3038, -727, -2186, -441, 445, 467, 1633, 1548, -1352, -2668, 114, 3901, 2465, -2604, -3969, 868, 3611, 1117, -1457, -862, 172, -190, 1039, 2034, 247, -2745, -2105, 2347, 3997, 120, -3586, -1910, 2530, 2095, -1017, -1435, -149, -823, -152, 2283, 2304, -1768, -3597]
5551c597L164M038j135m733j092M085J718j737j546M34n95r91K696K434k466l882
5567c205L78N115J449m085k945J310L221J98j499j1l98j869R93L478Q36m743k286
5584d063L391M243j324m029j054K496J297n76k00K71j595j150L016K922k814m680
5600c849R54M462J189k582j930O27J620L19m78L28j314k016J439M224P34m908
5616a181k614L056L343j113k815n19J199J281P4R06p62k735r00L401L256k443
5632A434m383Q27L959R44k413j593J13Q07L94J160P10j656k821J207M213K75m502
5649a325k388L100K933q92j151n19n66j34J478J526o88l515q46L659L198k357
5665A513l943J28K974O79j282k02l20n81O48K496K13k624k782J277L936L39l211
$$ y = [-3597, -433, 3605, 2470, -2263, -3355, 730, 2448, 711, -835, -401, -996, -1987, 709, 3143, 677, -3205, -2827, 2288, 3737, -348, -3293, -1983, 1238, 1436, -63, -74, -472, -2341, -1348, 2130, 2966, -1777, -4063, -672, 3571, 2247, -1782, -2836, -340, 957, 381, 181, 452, -1143, -2293, 723, 3645, 831, -3849, -2895, 1567, 2756, 174, -1756, -1129, 491, 810, 332, 660, -654, -2670, -1231, 2993, 3727, -1181, -3795, -739, 2604, 1491, -1324, -1843, -644, 637, 711, 1617, 855, -1880, -2780, 621, 3877, 1434, -2949, -2122, 1837, 2781, 368, -1225, -1112, -305, 89, 1249, 1959, 303, -2518, -1311, 2902, 3177, -1325, -3713, -613, 2320, 1428, 277, -242, -808, -942, 536, 2062, 1374, -2141, -2987, 672, 3870, 1513, -2430, -2302, 672, 1351, 69, -133, -453, -1034, -386, 2110, 2323, -301, -3083, -1806, 2130, 2469, -742]
5682g42j602J835J753l50q83k4j424o27J999K712r28l650p77L213K518j798l259
5699b034K88K050L75q7K60r24k116M41K856J095k850k322J289L760K93k413j968
5716b007P79J009N27M04L40k031j178J935K740j011l299j247K823K225p31k122
5732h44l53M45O72L38R47j229k323O96K908J344k482k478Q30K454K71r96j123
5749i23K33J81R61J279k39k781j115K059K879r67k806q31J928J557M2j454q37
5766h34M3M30J292J067j410k551M35L103R48k266k153P94J884P55o10q52r46k27
5784a098R95J839K1k803j512K557K364o10k517q35J198J119O18q97o26j027L54
5801h60J819J144j550k570M19K636J235j787j522q9M43J601K48o25j627m42J215
$$ y = [-742, -2344, -509, 1244, 894, 11, -13, -1437, -2064, -65, 2647, 1719, -1931, -2708, 505, 3023, 1225, -2034, -1746, 304, 679, 592, 852, -72, -2188, -1747, 1109, 2204, -646, -2968, -1679, 2081, 2374, -39, -2007, -1228, -219, 308, 712, 1052, -979, -2157, -222, 2518, 1507, -1792, -3039, -216, 2009, 1278, -844, -1197, -752, -80, 258, 1205, -24, -2347, -1651, 1257, 2601, 119, -2359, -1529, 925, 1196, 200, -923, -690, -509, 452, 1731, 1492, -1289, -2404, -345, 2534, 1567, -1239, -2070, -142, 1415, 1457, 3, -834, -791, -361, 931, 1998, 588, -1963, -1528, 1575, 2523, 257, -1896, -1102, 782, 1537, 927, 75, -871, -1098, -103, 1736, 1757, -1046, -2558, -1, 2363, 1753, -764, -1599, -401, 718, 1336, 439, -187, -1214, -860, 959, 2103, 553, -2017, -1598, 1038, 2273, 486, -1036, -1125, -682, 919, 1167, 542, -1085, -1527, -312]
5818c12J958j68k070j512J331K385k13j631j171J71Q27J111M71j248j815L64K065
5835E43J287j205k260k33K357R28p62r58q70J41J247J232n47j504j126J424J509
5852A203K86j696j622J140J269O67j038j136k43L59J911L15j456j943N00J934
5868D50J139p22j594p57J281J133L1r28o63o08P61J884L0k228j129J445J978N3
5886A556j128j511J50J119R53l55j046p19P1J461J258q36k116k04K009O62k97
5903A027r95j150O22J291N90o69j056q93R08J633K93j861j095N10J653M96o22
5920F82j358m56R34J070O7q68j320K32J420J220q15j949n8J142J165k87o12j369
5938a160J63R24J191k46j244j094R11J800J43j355j265L73J130N18R7r83j062
$$ y = [-312, 1646, 1478, -592, -2104, -773, 1612, 1399, -232, -1403, -1232, -405, 706, 1177, -71, -1886, -1522, 543, 1830, 625, -1635, -1868, 489, 1417, 655, -303, -1173, -1032, 215, 1447, 900, -604, -1730, -306, 1203, 1489, -207, -1829, -689, 580, 1247, 209, -927, -1170, -811, 1100, 1415, -41, -1984, -1484, 450, 1589, 867, -727, -1484, -203, 930, 961, 33, -630, -1238, -477, 1407, 1437, -791, -1920, -475, 1503, 1556, 428, -1083, -933, 186, 1139, 784, -262, -981, -910, 551, 1809, 973, -1143, -1347, 662, 1324, 1027, 32, -1118, -496, 795, 1385, 716, -340, -1233, -325, 1308, 1601, -260, -1355, -845, 808, 1304, 682, -676, -1132, -198, 872, 939, 71, -1249, -1017, 403, 1623, 808, -1141, -1199, -57, 1108, 821, 209, -1160, -997, -73, 1118, 872, -372, -1466, -555, 1245, 1388, 33, -1232, -859, 271, 789, 886, -97, -1159]
5955a159Q3J880M78j008j351m44J595Q85k47j419p19Q86J119M60r33r37q19J405
5973b45J167m36r74r68N13J400N04q68j145p0M57J606Qr92r15Q2J032J158r89
5992C25j143l67Q45J104K2r81o98N3R67R34l83j010q50P11J386M31j653m39k63
6011a009J379Q86k99j381o07O55R70L20m07j457j11J200R25m78q88m83L32Q20
6029C67J050j008j165J54N89J215m85p68q20N37J164L79j008q62k4N89Q57L05
6047A066p53j088M88O43Q91p44p96n97J062Q73l82n26p58O2O82J093o69j072r4
6066f19J84J031M8m06j343M60O79P26k2j372j13K39J149M36j199o25L83L46R05
6085H87m47o42q27K56R93N80n88j239K12Q20J061q55j000K3M14L07N62n25m80
$$ y = [-1159, -1076, 804, 1282, 274, -1077, -1521, 74, 959, 712, -707, -1426, -540, 579, 1039, 106, -831, -1650, -245, 922, 486, -488, -1456, -943, 457, 961, 93, -1052, -1122, -665, 941, 949, -43, -958, -876, 156, 1314, 325, -818, -1185, -340, 764, 786, -195, -893, -840, 127, 1061, 678, -332, -1182, -471, 915, 1346, -307, -746, -1009, 370, 1256, 957, -424, -1031, -376, 594, 914, 507, -950, -1061, 139, 1064, 586, -302, -785, -453, 367, 1417, 409, -756, -602, -13, 1202, 717, -51, -871, -334, 830, 1209, 201, -661, -685, -96, 761, 1066, 313, -775, -287, 356, 1247, 503, -293, -890, 172, 1045, 663, 137, -621, -559, 123, 1216, 547, -525, -619, -435, 596, 644, 238, -1105, -645, 34, 760, 738, -634, -747, -508, 641, 1077, -122, -747, -364, -18, 887, 440, -202, -1029, -773, 220, 800, 212, -1027, -815, 5, 1066, 211, -789, -766, -352, -45, 517, -8, -488]
6104d88j78M71J112k12j647l46J346O34J97r97n57j43P36M81r7k64r25O7J001
6123A91P75p34j056K05N39O84m29l68k61L27J3N90J79q83q10O01J211k3j287n61
6143a097R69N66j33l39k06l0Q6L10Q21l34j390k42J396O41l37j258J87P93L58
6162G61n13k57N04q12j55P80O15q09j490J056J307o2j536j20O86O11k69J00K6
6181D23n81r4L99P17k74j385l65J500Q67p26j140K88Q89m16J1J48K74j168j60
6200g93J238O38j078j247P64J325l2j601J98R76l20m05K50O61n81j267R35J426
6218A087m33k110K81J592N46j349l71P12J95o92N1J425l90j394m69J511Q99j545
6236d54j159J457J062o33r13M57P38o63p19J326N23j323j035J249J594j068j586
$$ y = [-488, -666, -195, 917, 705, -942, -1288, 58, 692, 889, -108, -665, -808, -72, 409, 312, 48, -877, -810, 191, 966, 232, -824, -619, -80, 604, 175, -193, -454, -127, -114, 476, 655, -228, -1038, -437, 774, 751, -536, -1097, -128, 438, 305, -34, -240, -270, -184, 126, 947, 613, -777, -1019, 377, 1018, 681, -577, -390, 403, 761, 248, -9, 495, -317, -472, 308, 923, 114, -1376, -320, 987, 925, -611, -731, -45, 566, 297, 397, 423, -158, -252, 147, 864, 590, -795, -1160, 340, 1207, 481, -659, -371, 518, 102, 113, 261, 535, -633, -793, 445, 1083, 5, -1242, -478, 847, 815, -786, -588, 388, 68, -337, -87, 574, -7, -1274, -339, 1087, 654, -1456, -1175, 417, 963, -386, -757, -45, 150, -542, -491, 934, 544, -850, -1319, 192, 1091, -454, -1613, -156, 906, 273, -640, -183, 555, -108, -827, 499, 1022, -301, -1336, -87, 1507, 439, -1147]
6253a147L80J309M26j683q1J492o9j450M22J151j32j847J00K098M95j827o64J121
6271I4J200j446j035J454M60j043m28J648M02j600j136J443J598j025j726O46
6287d94J800p63j405M58J342o11j660J028J706q11j903L68K437Q4k111n65K038
6304I38J45j561k59J634K49j704l82J553N89j877n35J732J449j771j617J279J514
6321A376j202j204Q09J444j214j414J471J820j342k099M96K536n30k266K38K264
6337A183j2k167K35J666j73k325J46K538J51k359k97K243P02k246j296K002J162
6354A153j388q06J816N38k103q77J632J553j441k171J584K612j452k148O24J974
6370A100p85j958J276K116p99k315N78K270k51l089J17K743K65k023n31J997Q78
$$ y = [-1147, -767, 542, 968, -715, -796, 696, 627, -823, -401, 750, 618, -1229, -1129, 969, 1464, -363, -1027, 94, 1294, -152, -1187, 267, 727, -316, -744, 904, 1306, -294, -1430, 13, 1611, 586, -1140, -494, 1306, 543, -862, -404, 938, 327, -1333, -305, 1401, 590, -1313, -945, 1492, 1576, -535, -1100, 938, 1083, -478, -737, 897, 1146, -558, -940, 613, 1202, -675, -1210, 522, 1971, 200, -1417, -138, 1376, 174, -1030, -221, 1223, 9, -1405, 66, 1886, 544, -1555, -1059, 1477, 947, -1319, -1081, 1183, 1171, -996, -761, 905, 732, -1593, -1447, 1091, 1242, -1117, -1414, 829, 1531, -715, -2011, -9, 1153, -235, -1041, 775, 1313, -790, -1667, -35, 1518, 77, -2094, -510, 2102, 650, -1498, -874, 1100, 315, -1643, -367, 1749, 950, -1365, -787, 1483, 1232, -1857, -1740, 1003, 1268, -755, -1286, 711, 1589]
6387A589k374m54J980N77k602p35K817J517k399j763K074J510j804j813J932J562
6403A614j215j916J858J725j647k280J295K560r69k594Q47K524k80k589k78K454
6419A109k00k347N12K450j66k545J6K601L97k935q43K438J196k000j153K155R29
6436A614k080j010J563J902k292j487J869K405j720k511J171K118p64k562J287
6451d97K007q83j826Q02K655j224l277N55L068L78k964m0K381Q13k827p48K122
6468D95N35j936q06K683J227k645j747K556J747k823j607J983K372j500k202J706
6484C8J601j896j508J267K501j719k413J055L181o51l378P7K829j34k440O37K206
6501A253J1k516r7K735M25l341n61K632J313k442j117K166J550k447j587K176
$$ y = [1589, -785, -1239, 741, 1318, -1284, -2019, 798, 2315, -84, -1847, 227, 1737, -67, -1880, 52, 1614, 399, -1517, 341, 2066, 419, -1861, -566, 1994, 1025, -1569, -722, 1802, 1522, -1067, -1345, 1109, 909, -1438, -926, 1524, 1358, -1187, -1171, 1430, 1827, -1108, -1951, 487, 1683, -317, -1470, 685, 1614, -466, -1476, 87, 1989, -303, -1790, 79, 2484, 764, -1747, -576, 1542, 778, -1784, -497, 1510, 627, -1199, -397, 2258, 1034, -2243, -1688, 1380, 1758, -1206, -1246, 1135, 1948, -879, -1627, 495, 1030, -906, -1712, 971, 2198, -447, -2194, 362, 2109, -714, -2321, -338, 2034, 534, -1668, 38, 1639, -257, -1765, -498, 2003, 284, -2129, -1074, 2107, 1456, -1922, -1845, 984, 850, -1590, -953, 1253, 1264, -1252, -1349, 1386, 1811, -1530, -2091, 541, 1854, -588, -1705, 461, 2011, -436, -2023, 153]
6517A53J602k392j078K089J774k037k104J650K267q25k818Q79K663j077j979P69
6533d64K319j476k566J176K822n35k761l11L095R64k926j022K573J61j879n33
6549a363K522O40k810q67K649J581k884j699K413K055j684k076J631J705j561
6564B52j768J390J835j513k147J632K733r97l207K43L059j13k634K62K191m07
6580H11k109M75K146J26k783k54K810J001k901j186K278J218j815j343J755Q85
6596A114j756j243K421J281j856k367K311K231j718k418J037K070m77j733N34
6611e69J833r76j875P56K499j079k392K30L321K08k917n50K158L12j478m63J732
6628G50K56j779q35K531P27k435j804K852J803j870k055J405J581j024j149J022
$$ y = [153, 1755, -637, -1715, 374, 2148, 111, -1993, -343, 1924, 1099, -1719, -840, 1823, 746, -1233, -464, 1855, 379, -2187, -1011, 1811, 1276, -1485, -1796, 1299, 2263, -663, -1685, 888, 1049, -830, -1363, 1159, 1799, -1011, -1878, 771, 2352, -532, -2231, 182, 2237, 553, -1523, 108, 1813, 252, -1516, -126, 1709, 196, -1951, -319, 2414, 1417, -1790, -1547, 1512, 1399, -1235, -973, 1218, 811, -1298, -823, 1323, 1449, -1334, -1588, 1222, 2223, -678, -1864, 414, 1632, -183, -1526, 229, 1114, -642, -1885, 536, 1817, -39, -2406, -95, 2136, 418, -2000, -963, 1107, 630, -1103, -569, 1264, 288, -1587, -831, 1668, 589, -1803, -1573, 1748, 1956, -961, -1511, 647, 959, -519, -982, 750, 1006, -773, -1608, 923, 1650, -785, -2589, 263, 2066, 196, -1859, -454, 1127, 103, -1046, -24]
6644b4J487j831j256J363J900p83k924Q35K526j67k008l23K271j47j555L71J375
6661A110n00j559M7K478j78k468m64K173Q79j734p49J058J008j386m77J527J27
6678H92j226j106J896J246r46k418P43K206m70j307K27J162o01j311J094J152
6694A233n87k086Q70J931j39k043n61J780Q53q64o78M04L64j057j29J916k25j808
6712h26q64K129J337j289j532N39J136l86p34N11L26o34q42J401J009j263j656
6729a638J237J934o11j569l02R49M87l33p25J246o51q65P30J442n82j530m94J590
6747C15P19q86p36L1Q42k20M8J00K91j277k50J193Q29j375j491J548J410l81j294
6766e84k17P71M3o3K38R6m22j069J035J500p93j813L65J148O44p94p33K22K03
$$ y = [-24, 1463, -368, -1624, -261, 1639, 856, -2068, -1233, 1293, 1126, -882, -1205, 1066, 919, -636, -265, 1110, 610, -949, -902, 1576, 1398, -1070, -1534, 639, 1518, -216, -965, 93, 1101, -285, -762, 765, 892, -334, -1440, 456, 1702, 756, -1662, -919, 1287, 817, -490, -263, 899, 298, -1013, 81, 1233, 646, -1440, -570, 1361, 1222, -821, -1382, 398, 1251, 387, -291, 113, 477, -580, -709, 1207, 982, -826, -1690, 439, 1776, 487, -1045, -506, 630, 244, -490, 21, 347, -287, -1129, 272, 1281, 18, -1638, -401, 1533, 922, -647, -949, 0, 487, 154, -571, 675, 24, -841, -111, 1331, 749, -781, -1275, 315, 1034, 148, -588, -557, 285, 65, 113, 213, 504, -773, -1023, 170, 999, -376, -1867, -319, 1091, 710, -584, -801, -30, 13, -50, 188, 284, -138, -1207, -172, 1328, 535, -1278, -913, 235, 879, 85, -648, -426, -223]
6785b23K18M10L7n53o83K89J132K73o32j452Q82Q85J22q75k14j6M71K02J97q6
6805C84p85m29N05J242j61j302m2N72O93j36j51o01l62P32K31M54p58o32R2M48
6825fR34o58q74j56R71M56j98k33p16j92Q36L72k62r49J26M45Q66q2q51o27M22
6846c76O25O66o87m37p68P47P52K23r87k57R3K91P93Kq85p94L72J298Q7r54m13
6867f09K56O77M53q88k30l8n17J094N52n12j522K09J288Q27n25j105l00Q60M37
6886D07k56l10O5o28K23J075K36q16j129M96J432L82j234p40N29L37J18q9L6l81
6906b47n61N87J473m50j715m97J991O75q44r83k62P75N19O7j79K12j207o09J821
6925E66J139j507j916P59K152J38j337o29N80M29k37J18O45q21j445R19K084k2
$$ y = [-223, -5, 405, 442, -111, -794, -505, 627, 900, 268, -1184, -302, 583, 705, -170, -384, -400, 71, 273, 470, 384, -401, -830, -325, 917, 756, -546, -588, -16, 677, 541, 390, -211, -573, 159, 390, 844, 86, -546, -454, -6, 928, 270, -604, -760, 211, 667, 469, 236, -480, -672, 164, 536, 274, -675, -549, -104, 762, 680, -171, -798, -376, 249, 915, 228, -209, -977, -230, 522, 745, -242, -499, -406, -115, 678, 680, -205, -999, -627, 671, 758, -196, -609, -353, 324, 777, -111, -341, -379, -896, 198, 750, 238, -1284, -1075, 213, 1040, 515, -590, -890, -30, 407, 151, -159, -94, -722, -499, 576, 812, -4, -1133, -637, 795, 1177, -57, -797, -268, 69, 187, 98, 134, -247, -808, -221, 1252, 802, -913, -1410, 581, 1256, 412, -571, -833, -58, 461, 528, 349, 561, -646, -1255, 566, 1705, 198, -1718, -959, 1193, 1331, -6, -635, -55, 374, 137, 255, 900, 79, -1366, -447, 1637, 1615]
6943A615k643n15J930J136j215q99M01N93o38J22J047j68j488q37J859J764j893
6960A71j853Q82J873l20j203J79L69k72j11L76R74j031j369Q62K161l04k615n87
6978a818K577L84j455j65R31l65j084N38J782j4k640k20K053J910k227k212J158
6995h67K131q19j215J081J33j136m58J816R89j556k680K056K422o05k327m71K100
7012E94J35j509O16J208j095j548R99K542q24k565m68L089J050k387j507J249
7028d21J446j358o33J860J71k082m67K473J206k511j936J754K040m57k222J6K074
7045I53n09j525J112J669j628k087J784K844j498k939p6L106J051k843m24J392
7061C82K20j291Q4K274l88k956L3L162J009l074j965K197K359j646j380Q81J063
$$ y = [1615, -1028, -1543, 387, 1523, 308, -591, -190, 403, -235, -113, 934, 766, -722, -1559, 300, 2064, 171, -1682, -800, 1073, 753, -450, -271, 98, -174, -285, 91, 1065, 34, -1335, -473, 1688, 1384, -1231, -1818, 759, 1143, -312, -477, 454, 89, -995, -457, 1325, 1311, -1329, -1549, 504, 2414, 187, -2025, -867, 1264, 445, -770, 311, 444, -692, -1150, 666, 1655, 99, -2581, -525, 1897, 1292, -1035, -1506, 594, 729, -780, -164, 1044, -51, -1599, -600, 1942, 1118, -1447, -1915, 1174, 2224, -163, -1670, -421, 1025, -333, -966, 894, 1065, -1017, -1484, 989, 2195, -316, -2252, -498, 1542, 1085, -1137, -1121, 953, 444, -1081, 31, 1700, 72, -2015, -231, 2613, 1115, -1824, -1900, 1206, 2257, -586, -1010, 382, 602, -689, -605, 1669, 1281, -1675, -1642, 1520, 2529, -545, -2510, -313, 2046, 400, -980, -99, 964]
7078I64j432j026K105J398k674j934K481L125j793l318P02K602J65k161n7J864
7094A011n16j929J091K487r31l516L79L624Q73l438j358K498J307j774r04J522
7110D26M90k091o39K827J293l053k022K906K635k143k933J153K572p23j853P87
7126c68J795j248k523K060K747j523l862Q02M034K70l568m19K335P46k357J26
7142i53K187m43k431J19L372L57l419j911L182K266k111k302J723J874j740j128
7158a358J942J028k390j848K475L190j754l902R70L488J64l360K74J941m64j825
7174a429J393K251j541l256R25L999j40l660q85L167J492k492j461J889P78j767
7190g37o25K727O58l406j388L648K104k374l294J644K795p01k356R97K014j685
$$ y = [964, -468, -1494, 611, 2009, -665, -2599, -118, 3007, 1214, -2104, -1402, 1200, 1365, -796, -853, 1011, 495, -1434, -343, 2144, 1213, -2303, -1924, 1700, 2573, -865, -2223, 275, 1582, -192, -1096, 426, 916, -1175, -1814, 1013, 2306, -747, -2769, 137, 2772, 629, -2304, -1151, 1421, 698, -1155, -368, 1427, 179, -2344, -284, 2463, 940, -2922, -2120, 1914, 2184, -1384, -1803, 532, 1278, -1079, -953, 1234, 791, -1640, -1521, 1851, 2208, -1211, -3122, 60, 2326, 215, -2087, -364, 1510, -230, -1358, 584, 1612, -778, -2626, -151, 3039, 1285, -2617, -1647, 1841, 2005, -1355, -1081, 860, 396, -1429, -36, 2215, 674, -2582, -1657, 2342, 2202, -1458, -2343, 824, 2316, -176, -1637, 252, 1030, -737, -1362, 1365, 2023, -1383, -2771, 877, 2981, 607, -2687, -1043, 1752, 1051, -1305, -308, 1706, 21]
7206B1j938K182K278k227l224J657L899m43l673n92K872J091k615l71J968K37
7222A122k606K77L408j83m064q97L939J623k732k155J732K359j439j810J606J232
7238A412k451j456L415K376l349l151K025L871j291l077k45K851l01j569M88K164
7254A712j203k783P46L739m69l809m81M040R22k874j216K091O97j859o89K685
7270A249K39k557j489L485K177l610k676K338K911j307j970O02J751j059j266
7285a182J430J532j855k854J925L990j103m011L5L449M58k637m41J840J52j866
7301a138O26K561o11l292n28L695J816l673k073K679K074j833j778J881N54k257
7317a297l29K677J135k194k766K140L438j166l507L07K890k11j797L14J852j271
$$ y = [21, -1917, 265, 2543, 316, -2908, -1251, 2648, 2205, -1468, -2060, 812, 1903, -712, -1083, 885, 1122, -1484, -1207, 2201, 2018, -2046, -2943, 996, 2619, -113, -2268, -536, 1823, 384, -1426, 180, 1412, -1039, -2495, 920, 3296, -53, -3204, -1179, 2692, 1401, -1676, -1921, 930, 629, -940, -452, 1712, 509, -2274, -1528, 2211, 1742, -2067, -2548, 1492, 2414, -460, -1676, 415, 1112, -747, -1436, 1249, 1488, -1069, -2558, 927, 3104, -506, -3182, -844, 2067, 760, -1210, -608, 1143, 84, -1182, 248, 1780, -75, -2929, -1004, 2986, 1883, -2128, -2093, 1356, 1814, -823, -1264, 576, 728, -1138, -512, 2049, 1438, -1854, -2382, 1313, 3129, -544, -2617, 62, 2136, 303, -1475, 406, 960, -1297, -1626, 1051, 2186, -8, -2774, -634, 2804, 1638, -1869, -1562, 1328, 1117, -680, -366, 1486, 215]
7333B15k024J626K374j137l020K22L237J144l181j493K187J492k087k77J790o1
7349A007k186l73L090O92k942j999K195K863j236k660O67K049r21j383J432J133
7365A428j978j556K270K329j546l261O25L325L54k587p72J680O23j544j0K019
7381A399n92k935M82L394M55l275j399K555J805j149k032J134J048j380p15K056
7397H51Q62k613j860K658K604j826k893R02K542l84j677M39Q44m00j193J073K076
7414B005j184l146J057L090M1k742j131K166R77r60r19J172K45j651j36K471L37
7431A692k865j377K890J815j628k340J089J770r27n15M63Q20j298q77J866J354
7447A932j487k464J041K670J4k602j98J370L85q13L94P97r05j531O60K542j72
$$ y = [215, -1809, -183, 2191, 1054, -1966, -1744, 1493, 2637, -544, -2037, 150, 1642, -445, -722, 1068, 1007, -1179, -1552, 1538, 2230, -712, -2711, -516, 2347, 1111, -1549, -882, 1167, 246, -1137, 295, 1428, -550, -2106, 164, 2493, 947, -2314, -1689, 1636, 1990, -597, -1369, 311, 934, -610, -620, 1399, 807, -2128, -1646, 1748, 2203, -1072, -2471, 84, 1889, 740, -1292, -158, 890, -490, -1205, 851, 1713, -900, -2760, -102, 2502, 676, -2217, -1315, 1227, 843, -834, -395, 449, 49, -1144, -71, 2005, 821, -2325, -1268, 1822, 1863, -879, -2010, 156, 1133, 173, -746, 426, 671, -980, -1116, 1355, 1692, -1173, -2550, 340, 2155, 527, -1813, -724, 1046, 119, -396, 67, 887, -411, -1288, 578, 1932, 445, -2019, -978, 1692, 1706, -896, -1094, 276, 661, -152, 242, 1039, 134, -1397, -737, 1805, 1633]
7464A633k582r96K271J781j724j209M87P32k39o63J341k6j772k77J692J336j631
7481A54k247J044K471l08j376l69Q57m58l08R95N20j478j133J205J938l71k152
7498a016p55K092P26j070m02M71k9q70N12J502o37j714l46K147J238j680j748
7515a579M30K095J09j316j27M42m23l46J707P1j622j064J319J832l14k126l02
7532a214J135R41l66p04K85J9r63O47J729j086j801K88J443R30j239j055L47Q93
7550B29L71n95K47k90r63M19J549N34k071p99J196J079k96p70q59L08J340n15
7568A14M20m40r75m87J469J059o66j619m2J619M80n45n16o14O67M90R2J39q68
7587b23o38N7J989l68r50j423J015J163K01o35o93k64M89J094j25j0j348q9Q01
$$ y = [1633, -949, -1945, 326, 2107, 383, -826, -339, 393, 154, -509, 832, 806, -966, -1243, 449, 1785, 154, -2093, -1049, 1422, 1114, -262, -631, 226, -232, -540, 455, 975, -503, -1636, -431, 1507, 1136, -1016, -1771, 321, 1047, -23, -425, 46, 17, -853, -341, 1161, 524, -1190, -1536, 611, 1849, 169, -1579, -1149, 946, 1055, -261, -388, 54, -369, -715, 992, 1063, -559, -1623, -304, 1528, 1214, -912, -1214, -79, 862, 496, -208, 77, 96, -867, -220, 1509, 423, -1378, -1090, 353, 1283, 44, -1011, -664, 229, 600, 5, 252, -38, -1001, -582, 967, 1501, -570, -1369, -173, 906, 610, -160, -1019, -711, 629, 114, 534, 94, -881, -1368, 101, 1160, 494, -1125, -1167, 452, 932, 387, -129, -743, -76, 414, 506, 645, -223, -861, -804, 1185, 817, -133, -1556, -541, 622, 823, 188, -505, -769, -280, 814, 689, 679, -669, -758, 43]
7606D3J406q15j268n41J211O39J63o87o54k34J030O29q5j185k18L17R03M15j069
7625@m68j16O76N44L36j301p49L98R46N13n48j042N1M92J107K94j272p07N87N50
7645B91N65k39j287j61R55P46n36o64k56o3O65R23n62r96j63P21P98J40j164q51
7665a138N90J024L26o12p41J0P5Q95L82o10j446M26J121P81o63j180k15J253N58
7684H36m63n55L1m24l2J304J25j348j016R69J323K07r01j206O95Q89J96m21j56
7703E3n24m60P98J266n52j383n85J464J356p60j160k70R40K74J51m10L4j018J93
7722e93J140R65j583j395P15J716K57j351o44O02J87M43O7j35o59p64Q84J794
7740A646p64k073P5J067J562p82j108o4M24q7J90N74l30j212m69J957R76j932
$$ y = [43, 1449, 634, -634, -1175, 36, 675, 838, 151, -503, -737, 293, 922, 837, -348, -566, -249, 654, 1069, 0, -468, -584, 92, 636, 972, -329, -1078, -680, 266, 779, 231, -811, -760, -268, 839, 1133, -139, -846, -259, 291, 856, 617, -670, -831, 124, 870, 334, -330, -586, -649, 16, 939, 377, -619, -782, -61, 737, 877, -287, -1138, -548, 476, 802, 190, -551, -541, -466, 429, 811, 201, -1245, -819, 302, 1083, 420, -760, -975, 278, 836, 373, -182, -151, -575, -607, 697, 822, -526, -1542, -573, 750, 957, 56, -1150, -455, 434, 630, 209, 53, -471, -931, -133, 1133, 581, -802, -1387, 77, 1433, 673, -487, -757, 183, 457, 608, 198, 232, -786, -593, 547, 1512, -71, -1466, -751, 965, 1222, -129, -773, -171, 16, 459, 526, 391, -268, -1032, -148, 1646, 882, -1191, -1116, -49, 1513, 731, -377, -441, -17, -104, 86, 660, 330, -882, -1351, 606, 1582, -350]
7758c50j474R99J886m72q75m7j4K15mK43Q39j276j113J186K025n49k507l80K135
7777D67O46q37o10r6L84q49P99J446o55k101j31K478J020k052j885J362J303n67
7795A22m57K49L8o52J90J267M97j699j764J589K806q64k598j23J999J91r49J59
7813AP01p94j127J313J747j028k410k58K465J155j924j401J222J399j000l28J138
7830H71j69k041K66K592J00j944j610J399K430q25k468M76J564l60r08J198M48
7847A019j658j078K072J948j604k331K54K440O73k040q07J470J65r59K10J539
7863A313r60k275R22K477N50k770j513K092J952j275j565O31J465j533k82J738
7879I67L55k248j669K724K204j467k944N27K470M53k047k8J233l32j428Q27K349
$$ y = [-350, -1824, -825, 1061, 589, -286, -333, -347, -132, -136, 107, 946, -330, -1443, -257, 1768, 1219, -1288, -1668, 467, 1113, 276, -334, -430, -46, -895, -96, 1350, 695, -1406, -1537, 941, 1961, -91, -1976, -614, 689, 122, -335, -86, -48, -700, -510, 757, 1254, -445, -2209, -620, 2186, 1322, -1276, -1399, 600, 791, -158, 1, 702, -92, -1219, 94, 1841, 813, -1597, -1855, 610, 1765, -159, -1560, -338, 1061, 61, -267, 871, 702, -1339, -1073, 1519, 1619, -325, -1935, -536, 1894, 1069, -1399, -923, 641, 281, -627, 571, 1019, -639, -1717, 355, 2303, 699, -1632, -1378, 1062, 1735, -305, -1112, 358, 523, -436, -226, 1313, 353, -1922, -1000, 1477, 2027, -743, -2256, -164, 1788, 513, -1052, -421, 1044, -489, -771, 967, 1322, -926, -2595, 129, 2333, 866, -2078, -1551, 919, 1372, -675, -703, 530, 198, -1230, -403, 1946]
7896A946j058l004O85L219K79k723j286K242J064j266o62J131K5j662j74K631
7912A387M88l216j339K901K092j784k390J213J381k13j381P50J288j687j247K056
7928B99J759j622l035J526L134j16k857m88J880J07r24o2J230l12j997N12L048
7945B082j42l221j132K704K122k623j545J831J006j040m75J131P54k555j074K489
7961C12K399k317l008J442L161n15k484N04J485p28j218J240J124j001k536J161
7977i79L127O3l616q30K977J271k073j100J802R0j767L64K317k52k798q74L223
7994I45J676k449k525J706K652j427j715R48J524j930o95K079J351k369k521K164
8010e86K827p44l195j44K553N47j936k22J809n96j953R43K673n22l560r2L305
$$ y = [1946, 888, -2116, -1431, 1788, 2067, -656, -1942, 300, 1364, 98, -564, 567, 592, -1070, -1244, 1387, 1875, -1341, -2680, 221, 2313, 529, -1861, -648, 733, 520, -861, -111, 1177, -510, -1757, 299, 2058, 436, -2599, -1073, 2061, 1945, -912, -1400, 480, 587, -337, -399, 831, 519, -1478, -966, 2082, 1940, -1281, -2413, 291, 2413, -210, -1755, 76, 1082, 42, -433, 698, 1452, -1103, -2177, 312, 2711, 394, -2614, -1172, 1989, 1474, -1010, -506, 979, 251, -967, 273, 1397, 396, -2140, -979, 2148, 2211, -1405, -2235, 742, 2013, -60, -1160, 642, 732, -1035, -671, 1646, 1394, -1404, -2278, 945, 2621, 172, -2353, -647, 2005, 578, -1137, -189, 1335, -595, -1290, 789, 2140, -229, -2750, -586, 2241, 1497, -1698, -1842, 711, 1258, -678, -900, 909, 313, -1640, -697, 1976, 1454, -2106, -2198, 1107]
8027A107J113k546j877K207J099o00j388J578P71k264j096K962J503k971k124
8042b526J936K692j072k706M06J977J99k004J126J382j447k057J641K769j114
8057A202l339K46L107R60k440j218J552O74j223j97J990k03k701j98L417R61l201
8074f11k109K308K311j248k335J227J152q58j079J754J176k263j955K290K936
8089B696j542l551R32K939j9k181j87J086k8j198O25K520j208k976K23L420O49
8106B200k881j948K724J631j675n98R23L91j570k94K091R70k655j901K757K691
8122B856j781l013O39K499m61j535O50R97j052j033J118K362j383l130P31L096
8138A560N06l233q62K687K96j195k93J604n90k211O26K949J27l133r75K019K390
$$ y = [1107, 2220, -326, -2203, 4, 1103, 503, -885, 693, 1464, -800, -1896, 1066, 2569, -402, -2526, -590, 2102, 1030, -1676, -1270, 707, 906, -1098, 28, 1410, -37, -2094, -453, 2316, 1202, -2137, -1891, 1216, 2176, -264, -1482, 70, 744, -479, -676, 1314, 1111, -1590, -1788, 1629, 2590, -611, -2720, -412, 1899, 651, -1684, -457, 695, -163, -1242, 512, 1688, -575, -2530, -240, 2696, 1154, -2397, -1465, 1474, 1455, -726, -913, 173, 145, -1053, -428, 2092, 884, -2092, -1869, 1551, 2200, -681, -2629, 95, 1726, 51, -547, 376, 767, -803, -1097, 994, 1964, -691, -2592, 165, 2856, 1075, -1938, -1299, 1200, 739, -796, -146, 851, -201, -1234, -116, 2246, 863, -2267, -1536, 1560, 2066, -1167, -2029, 658, 954, -241, -534, 1070, 480, -1731, -1105, 1844, 1971, -1162, -2137, -118, 2272]
8155B272k057j565N57J615p46p95J419L14j866j207K446J920j829k843N45L420
8171A600J37k359n25J679k57j145P69J723j611k069J072K686R8k866j048K271
8187A55J778j666j147J010
$$ y = [2272, 215, -1350, -793, 822, 76, -719, 700, 1014, -852, -2059, 387, 2307, 478, -2365, -1820, 1600, 1737, -622, -1147, 532, 275, -870, -101, 1622, 11, -2058, -986, 1700, 1798, -1068, -2116, 155, 1933, 267, -880, 130]
8191A30
$$ Imaginary data points
##PAGE= N=2
##DATA TABLE= (X++(I..I)), XYDATA
0@%%%qK4k4K3l9N5o3P2r6J27j51J76k17K68l14L66m40N17n92O88q02R21j048J195
27F38j364J549j748J966k216K485k770L093l453L841m261M729n247N806o425P116
43C739p882Q734r683J0757j1985J3388j5008J6927j9234K2042k5573L0180l6439
56b0037M5481n9770Q5776j47745N48157M71928j470187j90550R95999L02354q07827
67b46421j38717O22445O0225o43027J37405Q52767l7834j153480l20574J069328
77B02117O23109q11675o40722N72518N90818l80788m12591K83758J91026m81330
87b63760k30383O76151N57907o05170q06838L96076R03650k07045r04967j6281
97e00660P11570Q3486m29793J22310M04487l10267o08647K56186P71190j03051
$$ y = [0, 0, 0, 0, -8, 16, -8, 15, -24, 31, -32, 40, -56, 71, -80, 96, -121, 147, -167, 199, -241, 276, -316, 372, -430, 491, -557, 638, -726, 823, -925, 1041, -1175, 1310, -1460, 1633, -1820, 2021, -2240, 2489, -2758, 3048, -3377, 3739, -4143, 4591, -5092, 5665, -6320, 7068, -7940, 8987, -10247, 11795, -13778, 16402, -20037, 25444, -34326, 51450, -96295, 451862, 923790, -546397, -736947, 259052, 561406, -246421, -385138, 237307, 297532, -345495, -208090, 644677, 606843, -546637, -867211, 202117, 825226, 13551, -627171, -54653, 536165, 155377, -257214, 26544, 217570, -263760, -494143, 182008, 739915, 134745, -672093, -276017, 627633, 420588, -484379, -500660, 210910, 294396, -135397, -13087, 391400, 81133, -527514, -271328, 499862, 396811]
107C96811q77731j06799R07560L73581p14009m58095M41794K63882l86775q1862
117b41643M85728N3455n73217j09444O70111L06290o77198o10129M35043P18440
127D57436j48561n73720P1845M15489j29312l26742K29727L01386l78401m59397
137e40250L92254P17733j38992p91446j52215O65297K77427n24812k82614M03948
147B6330J77892l50697J5484M93355p1473p02796j13423P37505L48489o06638
157d5972m94315M28051N54476k27817m62113J33039K64021k65572j96596M71994
167A59196L32435n27800n07861M37841O41189k45612o91896j1588N75157J60513
177C21574l64679p8080K91807q7561l91790J69158N47013j44653o94587k688P49111
$$ y = [396811, -480920, -587719, 319841, 693422, -20587, -478682, -36888, 226994, -159781, -241643, 244085, 297540, -275677, -385121, 284990, 591280, -85918, -696047, -261004, 457436, 308875, -264845, -193000, 222489, 93177, -233565, -3838, 297548, -80853, -540250, -147996, 569737, 430745, -360701, -512916, 152381, 429808, -95004, -377618, 26330, 204222, -146475, -130991, 362364, 290891, -411905, -525328, 212177, 560666, -45972, -540287, -112236, 442240, 214423, -247690, -114651, 149370, -116202, -312798, 159196, 491631, -36169, -544030, -106189, 535000, 289388, -402508, -414096, 161061, 321574, -43105, -121185, 170622, 83061, -308729, -139571, 407442, 262789, -431798, -434486, 314625]
188C14625K47631o02353l96885L55664L47204k18521k15082K42622J18322l70087
198a76860j06029N49386K37960o39544m67815N15807N98812k69579n43647Q4366
208b17143L92960k8797k49800J01349J99555k58786l19606L46837N40725k56262
218B51032o80973N6906O52974J16868n03828j97647L08014J45015j87974k355
228d1968K43590q0076m21662K308N62720J76318n76917l54424M55261M37152k56384
239A45918l66077J07989J91350j16908p3446K39375J04240l51001k58725L65605
249a1680M45152k57291n54050O9059N02107O9068l31704o7671J78400l8761j42486
260a39857J51266K30159j79859l87525P4812N01983J22285m75409k82660L30814
$$ y = [314625, 562256, -40097, -436982, -81318, 265886, 47365, -167717, 74905, 193227, -176860, -282889, 266497, 504457, -135087, -602902, -87095, 511717, 242138, -301509, -217143, 175817, 147020, -102780, -1431, 198124, -60662, -380268, -33431, 507294, 251032, -429941, -373035, 279939, 396807, -107021, -304668, 3346, 148361, -39613, -41968, 201622, 121546, -300116, -297808, 264912, 441230, -135687, -490111, -34850, 402302, 145918, -220159, -112170, 79180, -37728, -111174, 128201, 232441, -118560, -377285, -11680, 433472, 176181, -377869, -308810, 193297, 262365, -69339, -137010, 41390, 2629, -139857, 11409, 241568, 61709, -325816, -251004, 250979, 373264, -102145, -384805, -53991]
270e3991L02456j77052j93801J13217M5823j69309L2385K98806L4373l89587k12143
281c68823L53047L80927k04658m32679M4928L53584L2193k05582J8458R7739j49718
292h0584j11430K52842K34955k31326l70642Q9678M26262R4005l61963k11332
302b69535K22572J94440j06345o4121J03826o8490k07890R8267L34367L392l82427
313a41944j73302L06537L07242j43802l18012K415K12994K2777q0779P5941K5411
324I5478k18186q6256K98208K22289k50014l38615R1802L51413P9000k51057j55476
335a61414J13505R7467l9143L9440Q4460j51170k20061J47713L45519k4770l65167
346a33621j37426K55491K29754q8586j99781k6036P9770J2446K9786J11730m2267
$$ y = [-53991, 248465, 71413, -122388, -9171, 36652, -132657, -100272, 198534, 232907, -156680, -368823, -15776, 365151, 160493, -272186, -227258, 126326, 158519, -47063, -28605, 69134, -80584, -192014, 60828, 295783, 64457, -306185, -216507, 209755, 303760, -58203, -269535, -46963, 147477, 41132, -22989, 80837, 12347, -195543, -97276, 237091, 240483, -141944, -315246, -8709, 298533, 154731, -163281, -160866, 52128, 74905, -5874, 70067, 95478, -122708, -208964, 89244, 311533, 61519, -277096, -185294, 166119, 245119, -5938, -161414, -47909, 49558, 10415, 49855, 134315, -16855, -236916, -89203, 256316, 231546, -133621, -271047, -15556, 214198, 125612, -74169, -100205, -20435, -7989, 21797, 133527, 91260]
357I1260k56189n6360L11370J96320k37552k82234P9483K52770N9543j33661r6278
368g1528J0099J5142K4423J12761N6827j88843j99705J52858L02959k9282k92925
379a07214j00592J70053J44944j9392p9639n6592l6542R826J08144J18577p9280
390G2293k35397l6549K58251J60405j67995k04680K6949J37202O9233q238o0759
401A0715q9784l4859Q6679J40707J8943j74725j55439J09472K29414J3672j86795
412c2000j04262N7470R8950O9321l756j04824j05916L0745J45395R6204p6824
423G0503j81684n2464J65762J53737o0301j54262n4795N7252J02232P2390n2367
434F6003j42017n2989J04671J32356J5067j21720j31948K8861J66515Q2768r5635
$$ y = [91260, -164929, -221289, 90081, 286401, 48849, -233385, -153902, 98868, 158411, 24750, -71528, -61429, -46287, -21864, 90897, 147724, -41119, -240824, -87966, 214993, 185711, -107214, -207806, -37753, 107191, 87799, 8160, -48432, -84974, -75148, 32996, 151573, 72293, -163104, -199653, 58598, 219003, 51008, -153672, -126723, 10479, 79712, 71474, 10715, -79069, -113928, -27249, 113458, 132401, -42324, -197763, -88291, 141123, 154795, -32000, -136262, -78792, 20158, 89479, 85723, -19101, -125017, -94272, 51123, 147327, 70503, -111181, -163645, 2117, 155854, 95553, -58709, -113504, -56252, 45980, 118370, 66003, -76014, -129003, -24332, 108024, 123091, 1371, -130577, -101716, 64799, 147567, 51932]
445E1932j31246k9567Q1759J22666L2413j18563j27248K7215J30269Q1834l6306
456H5158j26948r0452P5825J61853L3862j28181j21819J1308J24650J07641m2773
467I0124j47882o1016Q5402J08758L1159o4521j22727m4544J23980J42449l4490
478A06692j59012q3496P7037J45150M5705j11963j24259J3132J02043P3669M194
489H8892q3390j22096M110J66825J04526j06867j66777j6341J34727J17069l5711
500H4967j30455n9073N4602P8182N1056p093j09632j08287P7873J86148J9859
511A38147j72990j16120P6274J45169L6687r0851r1835j158N1087N6970N5208
522H6588l1627j46890o3566J59856J61328q4468j92355k6278J36485R6856l6700
$$ y = [51932, -79314, -108881, -27122, 95544, 127957, 9394, -117854, -90639, 39630, 121464, 85158, -41790, -132242, -56417, 105436, 139298, 11117, -110702, -99394, 25256, 132897, 90124, -57758, -118774, -33372, 75386, 106545, 42024, -80703, -125247, -1267, 141182, 106692, -52320, -135816, -58779, 86371, 132076, 20113, -104146, -91014, 11029, 84698, 88892, 5502, -116594, -112484, 54341, 158867, 52000, -114777, -131118, 3609, 120678, 84967, -45488, -104561, -49959, 28223, 79279, 72186, -37446, -145733, -67860, 118288, 138147, -34843, -150963, -74689, 70480, 107167, 16316, -75519, -76677, -25590, 31380, 86588, 54961, -91929, -155495, 4361, 165689, 81221, -111134, -137412, -927, 95929, 59229]
533E9229q4928l3455P730K4183P2549O4437r3005j71273L5150K25709O2730j88274
545a9218j32639Q8543J29163O067n9278l1322j9845k5897M5487J24096J1276j88763
557g2330j16187J73847J99957q6914k03692q402J29672M7362l2335q584j4008
568H386o9874k5035J23916J25942j06149k19258K3386K46377O9243j90111j11698
579a24875R5700P8326k8183J552L5407o3791j09076N4580J93413K8551k26064
590f4460j35346J83399J97538r6545j78742K6805R6844k2350j5266Q2272k685
601G1464j57511o0094J82866J60931j34709k34860L9334K36072M2640j70845o0582
612h5294Q7570N607n0028P4984Q3665j18041j62818Q4213K30525J1880k39133
$$ y = [59229, -25699, -59154, -51424, -27241, 45308, 109745, 16740, -154533, -119383, 106326, 169056, -19218, -151857, -63314, 65849, 71916, 12638, -18684, -38529, -64426, -18939, 105157, 116433, -72330, -188517, -14670, 185287, 98373, -105319, -113721, 15951, 63313, 30978, 22394, 8386, -61488, -86523, 37393, 163335, 57186, -162072, -138686, 107691, 176934, -13177, -124875, -29175, 49151, 20968, 22520, 57927, -5864, -114940, -60360, 133053, 161604, -64460, -199806, -16407, 181131, 84586, -94156, -67351, 29493, 7143, -8123, 74149, 71464, -86047, -146141, 36725, 197656, 62947, -171913, -132579, 103493, 146133, -24712, -85294, 2276, 7883, -42145, 32839, 116504, -1537, -164355, -80142, 150383, 162263, -76870]
623g6870j17971J76208J65503q7927j29177L9399M5714o4464J6454J38321j1281
634I3909k07200o5360K15713J66066j46621k24156M1644K03861K6753j33126k0180
645d8697O9440m6986o0356J25322J15557j52565k01467R7357K52585P414k30665
656g3061r3652J58399J16390q6121p3015O2752m75j10906M1141J97089n373k49615
668a16447q1107K30419J59697j52685j89367O3115J58886j4190r3643M2076N6594
679F3348j16847q5603J72757J58544j69082k26931J09597K56072j8512k21438
689g8095m8793J45556M7168r2316O075J05239n2758j66567O0868K38976j5014
700A50339k80391o9173K50123J35496j62632j34610R0758Q6906p5492m1755J10168
$$ y = [-76870, -194841, -18633, 146870, 58943, -70234, -30835, 14879, -49585, -33131, 105190, 93909, -113291, -178651, 37062, 203128, 56507, -167649, -126005, 77856, 104609, -28517, -48697, 20743, -26243, -86599, 38723, 154280, 1715, -199752, -102395, 150190, 157604, -73061, -166713, -8314, 108076, 21955, -51060, 11692, 11217, -99689, -58548, 138541, 133168, -116447, -197554, 32865, 192562, 39877, -149490, -86375, 72511, 58321, -35322, 6754, 63348, -53499, -139102, 33655, 192199, 23117, -203814, -94217, 161855, 143343, -78095, -126888, 18668, 65836, -26480, -20405, 84834, 32076, -134491, -73623, 165353, 150339, -130052, -199225, 50898, 186394, 23762, -110848, -20090, 66816, -8676, -50431, 59737]
711E9737K9917j73417p1944K22369J57800k01721k25157J24295K23835n2482j74586
722h1354J9197J15028k9035p6955Q0274R9602j25277j83662J04118K56413l1191
733A47158k68092l9027K29312P8059j60816p1414R6346J3586r6564L5654J61160
744A25362j4275k21282n8505K34405J33420k06370j88949J37763J87929o6737
754F2761j21117N8112N6480j07951n7455J51501J05422j63937j75322J37658K45808
765A91960n9974k59005k4378J94965L9236j26969M910J07377n1389j24934P7667
776c0534J76854o0629k41550k4338K48114J18996j85552j44863J21687J17778
786I5963r3250p4639R3989K7559j38136k1481J99612R1563j98850j75789J33446
$$ y = [59737, 89654, -83763, -155707, 66662, 224462, 22741, -202416, -78121, 145714, 93232, -81354, -62157, 52871, 23836, -53119, 27155, 126757, 1480, -182182, -78064, 178349, 147158, -120934, -159961, 69351, 147410, -13406, -84820, 11526, 25112, -71452, -35798, 125362, 111087, -110195, -168700, 65705, 199125, -7245, -196194, -58431, 129498, 62761, -58356, -244, 56236, -51715, -109170, 42331, 147753, -16184, -191506, -53848, 191960, 131986, -127019, -151397, 43568, 82804, -44165, -39255, 68122, 16733, -108201, -30534, 146320, 85691, -155859, -180197, 67917, 186913, 1361, -143502, -21815, 95963, 2713, -71926, 22063, 49622, -88514, -109995, 89617, 181180, -17670, -193459, -60013]
797f0013K07825o4961k00799J7464J65603J307j07379M4184Q8645j12386j43132
808a63642J20296K07133o7642k30049K824K25712O4842j83657j01660J15554O4088
819E3799r4085j463J42444j0287j91995j8900K15437O6241k14432j34423J61095
830b6569J75054p3258j42056L8628Q9484o7843p6363J07705R0170j42594j30156
841a57798J56940J98159j03228k29867J2794J86620L0511j30095k2621J06345
851D7760o67j04279L7009J41769n7439k12519Q931K40693O6941j97985j01185
862a30971J40740J00918r6699q5263O7414M3098r0603k1668J56101O6939j83230
873c3224j35718J53506J68607j08065j75700N3151J51118p435r1425J9971N8518
$$ y = [-60013, 147812, 82851, -117948, -100484, 65119, 66426, -40953, 3231, 91876, -20510, -163642, -43346, 163787, 96145, -133904, -131080, 94632, 159474, -24183, -125843, -10289, 53799, -40286, -41749, 100695, 90408, -101587, -120487, 94950, 161191, -53241, -187664, -26569, 148485, 75227, -66829, -28201, 61283, -6560, -82923, 24782, 114952, -27642, -157798, -858, 197301, 94073, -135794, -123000, 63620, 94131, -35964, -58585, 47760, 47093, -57186, -20177, 121592, 64153, -148366, -139435, 101258, 168199, -29786, -130971, 9769, 110687, 13988, -71275, -3861, 39237, -51366, -73034, 83067, 150006, -33224, -168942, -15436, 153171, 45106, -130594, -77443, 73675, 66240, -25185, -5214, 53304]
884E3304p2523r5491R0153J53488o8276j92437K9327K13762K7546j90133p4153
895a25433J20719N8279p6143j0242Q9354r137j24274k484J62065L7436j92202
906g2062j05578J72768J58114j04351j44308N6409R4230n4148n8341P2959M4971
917F0663j07025o9981J35542J39480j07647j95232L8689J88117J0215j47076k1156
928g5411J06773O787p3245L2745Q1340o5844j35148M1121J79257K4679j74653
939e1599p9067J44112J06848j00356j00039N9905N3149o1590q940J07646J7964
950H8033j41432o5443J37662J14975j05399j51069N2553J51676l427j07602K623
961b6850O4953m2742o3914P7530R1965q3666j28073N9242J60036l409j56997n5139
$$ y = [53304, -19219, -114710, -24557, 128931, 60655, -131782, -102455, 111307, 138853, -51280, -125433, -4714, 53565, -22578, -32820, 56534, 47397, -76877, -79361, 82704, 120140, -72062, -177640, -4872, 153242, 48891, -95417, -39008, 55222, 1074, -57267, 15692, 60663, -46362, -116343, 19199, 158679, 51032, -144200, -105511, 82606, 92821, -54255, -75411, 31362, 38149, -35096, -2351, 78989, 13145, -122003, -80882, 98375, 123054, -51599, -130666, 13446, 120294, 19938, -80101, -20196, 32953, -28637, -37577, 70069, 88033, -53399, -118842, 18820, 133795, 28396, -122673, -70120, 81556, 78129, -29473, -26850, 38103, -4639, -68553, 8977, 100942, 17276, -110797, -51555, 108481, 105072, -51925, -107064]
973a07064J14101O8509p0951m0975O1997O197q1363J4371J17724m171j51354m4680
985a17659J44816R8924r5298j16522M3674R6633k0706o5388K9450M0713o6875
996b8238m5535J05887Q6608j06708j31165O3599J43373j2270j22646k4294Q5934
1007A4545K9382n3068j277N0866l5088q8798M1851J32247j2335j48584l3209J30296
1019B6828O9636q5352p7290L7845M9777k2780j5967N0126P571r0809l3734J14285
1031C0136P5647j04979j11657O4497J17081j5736q6374p227M4962n856k5979L6438
1043A0953M1767n9956q2154N6809J24031k2239j36689k3276J09054M8379o2393
1054D286l8044K8464P151k6761K0437N7892j9513r8806j4828J16025O4181r6347
$$ y = [-107064, 7037, 75546, 4595, -36380, 25617, 31814, -49549, -35178, 82546, 78375, -72979, -117659, 27157, 126081, 30783, -85739, -42065, 54568, 33862, -31526, -2076, 38637, -28238, -73773, 32114, 118722, 12014, -119151, -55552, 87821, 75551, -47095, -71389, 14545, 43927, -9141, -10418, 40448, 5360, -83438, -41587, 90660, 78325, -70259, -103468, 26828, 96464, 11112, -66178, -28333, 21444, -1336, -17303, 32823, 40394, -50415, -84149, 30136, 105783, 804, -110853, -46356, 70725, 54989, -31385, -38612, 6350, 494, -25485, 10953, 52720, -7236, -89390, -32581, 91450, 69211, -67478, -90754, 18300, 66679, 4286, -33758, -5294, 1857, -24904, -4467, 53425, 33912, -64894, -79722, 36303, 100484, 4137]
1066D137r2308N4531Q4923j7448n0069P836J3243k8099j608O0893K6984p6660
1078a3645p1605O0795J06868k1777j09855j6121Q1704K8964l9774j0311J6402
1089A1645k4010k6336M4697O0369l2614r2116o645R8633N0110p4516o9618L6464
1101b3937N4284j1504j8101J6376j1304m3642J1715P0855J7558p5672n8106N1427
1113b0051Q3212j2900p7458j6160M7613J5685j6000J0005O049m3131k4622N6341
1125H583N7561l6618q1244m802P6400M0741m7532m9649J5044K7774l913O543K0270
1138B9158k7674n2486J8866P4346J4251o9586m9078L8586O1978j470m7898j6804
1150b7811J7308N605M242K6088r86n5443k4855N8790N4912l2847o6954o542N1400
$$ y = [4137, -88171, -33640, 51283, 33835, -16234, -8398, 4845, -23254, -24862, 36031, 63015, -13645, -85250, -24455, 82413, 60636, -49219, -65340, 16364, 45328, 5554, -4757, 11645, -12365, -38701, 5996, 66365, 33751, -58365, -65010, 33623, 83733, 9217, -60401, -23937, 30347, 18843, 742, 17118, 5814, -37828, -26113, 44742, 62300, -13372, -71478, -20051, 63161, 50261, -27197, -43357, 4256, 19941, 3941, 13946, 19995, -23136, -47758, 8583, 66144, 29526, -51718, -56520, 19880, 60621, 13089, -36560, -21516, 6258, 2345, 8888, 29158, 1484, -51002, -32136, 42210, 56461, -13125, -62203, -23617, 38361, 36891, -11007, -27811, -10503, -4898, -656, 25432, 24446, -30997, -55852, 2938, 57850, 25003, -41951, -48493, 2907]
1163B907L3130j9312l1403n001M309M260K6022K1851l5508n4482J7520O9431J5101
1176D8825n4779l9557K0186L9931J2554j8518k0310q688M57K0347L3065o735n4682
1189b7904k3748N0753M8773k1257n0151j2827K6638K9182O445j7737k4194j0888
1201b6915J4447L5222J7235l5438m8283J2184N6968J8400l6289l4173J111K4796
1213g35K5342J982k4843k5515N54K8765L0023p410m5619k3130L4844M2279n787
1226C0750l5134k1058P001K7320K3463j0029l4392j7302J7822L3478J3927k5337
1238A0509l9453l92L9805K5426j5860l1425j5385J3395L2536J4741k5455l2699
1250b4257K4K6469K3970j087l0024k6681J3647L6849J2524k3137k9785o539K5679
$$ y = [2907, 36037, 16725, -14678, -19679, -15370, -11110, 14912, 36763, 1255, -53227, -35707, 33724, 48825, -5954, -45511, -25325, 14606, 27160, 8642, -11668, -20356, -19899, 448, 33513, 26778, -27904, -51652, -899, 47874, 26617, -23534, -36361, -9723, 19459, 25904, 8167, -16027, -26915, -12468, 22754, 39989, 4551, -43732, -31548, 25420, 43820, 7531, -26642, -25531, -735, 24607, 26589, 1746, -23769, -23215, 5550, 35573, 28163, -17456, -40586, -5742, 36537, 30750, -4384, -25442, -18441, 8879, 32342, 22313, -12079, -29381, -11559, 21919, 35846, 10509, -28944, -29336, 10469, 35895, 20035, -11390, -26775, -13380, 19156, 33897, 8442, -24257, -24233, 2236, 26206, 25119, -4905, -31586, -17939, 18910, 31434, 8297, -21488, -28027, -2348]
1263b348L1466m135l5240j9484J4807K5994J4279j1044l1342j5876K4067L4037
1275B5181J459k9808k7648N723L5379K1125k1388l3039k613K0495J8773O415j4699
1288E355k9600o149L1434K9083j1795l6906j6876K4334L5194k91l0924j7936R720
1301a5357J5265J3865O235k1831l1591Q016M2563J7537l0182l6053L125L4943
1313F535K0884j6052k5321m604P888J2094J8376J246l3984k4922K8656M2602n077
1326B8321m1877k0340K3356L1775Q55k1819j3168P36L797J6724K1316j5711m4169
1339c0204l803M9699K8307l2632l9428M708L1105J5160j0169j3301p133o945O560
1352h076L1033J2578m0580l7223K8707N1173m112m4807j5592K1485J9623O67o142
$$ y = [-2348, 29118, 24983, -10257, -29741, -14934, 11060, 25339, 14295, -17047, -32923, -8856, 25181, 26640, -3168, -30816, -25093, 10286, 31411, 10023, -23016, -25629, -5134, 13639, 20054, 5355, -24245, -30394, 1040, 30123, 18328, -18578, -35454, -11120, 24074, 23783, -7141, -25077, -15357, -92, 13773, 20008, -1823, -33414, -25398, 17165, 34702, 4520, -31533, -28408, 6535, 27419, 11367, -13954, -18558, -10670, 1424, 19800, 21046, -12938, -37860, -9204, 33398, 28321, -13556, -33896, -10540, 21235, 22090, 271, -12897, -12161, -8364, 8360, 29676, 13965, -30204, -34007, 15692, 43999, 11367, -28061, -23353, 7752, 22912, 12743, -558, -7691, -14636, -8076, 22957, 35535, -5045, -42268, -13561, 37612, 33500, -11307, -26899, -5414, 14209, 14876, 8734]
1365H734o752j3620p235K2975L2857j4528n1749q257N1499K8347l1875l3589P100
1378a6093K0280N609n9J312j1324k1835L313L9096J9406m1184m2349K5801N0609
1391C2582m818l9405q886J7643N223q51R641J928k5989j8635K6886M1140j2081
1404B4378n4625r970M9119K5516k9900k4144J0695P347n182J0559J6581j6220
1416D154l5210K299M6671K2226m1773m1623K3062M4685m926l0406r31J0948q935
1429i759q60K6410O976l6283k7082L1282M6698j1666n2876r535M2949J9154k4741
1442F67j2092J2748n718j5187K1074L0717j9989m7480K160N2228K1917m1052l5677
1455c5684K2254L3229q294j7923R737K514k4706Q49M1213J1665m6268l0222L5792
$$ y = [8734, 1982, -11638, -18873, 4102, 36959, 22431, -29318, -37575, 13924, 42271, 10396, -23193, -16093, 4187, 9796, 9737, 11049, -275, -22110, -18797, 20299, 39705, -1479, -43828, -18027, 32582, 27764, -11641, -20527, -2884, 2339, 1488, 11129, 13057, -12932, -31567, -4681, 36459, 24378, -30247, -40217, 8902, 34418, 4518, -19626, -8931, -1584, -6766, 3793, 20374, 4154, -31056, -28757, 17914, 40140, -1633, -43256, -20194, 24491, 19565, -10841, -11772, -824, -9759, -10619, 15791, 22767, -13516, -40598, -9316, 37382, 25716, -27160, -36695, 6254, 25408, 667, -11425, 1323, -4395, -19582, 1492, 32209, 12220, -35260, -33100, 19128, 41045, -7, -35684, -13430, 19799, 11505, -6418, 3319, 5833, -18873, -18024, 23189, 34854, -11414, -41636, -5844]
1468e844M4239j4786m4592l710L2293Q934j7549K820J1951j9063k1156K9212L8011
1481D0760k3878n1603N503N0926J6313l6774k5584J8428J9076r588n006J6212
1493A4785n714l2585L559M8671J0779n0547k9901L6233L9059j5445l4563J457
1505a4212K1081o00r939J2700R395k9047k2989L5256M1547k6043n1631P101M6704
1518A9323R025l2065j4115J5623O123j0942P859K1806j3721m0135M653N1742J1270
1531C6446m9962k5511L5736L0102j8203k2087Q398Q684j3708k118K6250Q881l7160
1544a4252k4216L7600M0332k6472m7699R966L9637J109k3796R03J2580j0611j4105
1557a9024J9859K5922k0004m2491Q913N1720Q443m5966j9107L0848J7609j8329
$$ y = [-5844, 38395, 23609, -20983, -24693, 7600, 16534, -1015, 1805, 13756, -5307, -26463, 2749, 40760, 16882, -34721, -29218, 21708, 38021, 1247, -24337, -5909, 13167, 3579, -1427, 14785, 9071, -23514, -19955, 28716, 39495, -11052, -40953, -4720, 34339, 18894, -15669, -14212, 6869, 6269, -3670, 9030, 18425, -10622, -33611, 1645, 43192, 17149, -34482, -27381, 19323, 28348, -3717, -17832, -2209, 3914, -7028, 831, 22637, 8916, -31219, -26566, 25176, 36446, -13516, -39027, -3291, 26811, 8608, -13479, -5081, 3603, -10105, -12223, 14027, 22908, -14252, -38468, -868, 39464, 12992, -34707, -24741, 14896, 16005, -7791, -6888, 5692, -4919, -19024, 835, 26757, 6753, -35738, -26825, 24895, 33338, -12628, -31735, -887, 16722, -1607]
1569a607p826J5482k982k1749O128L4208M017m1780k1448L6843L5033k3837l6397
1582b5915J1715K7777n777j4475J1021O561k2776j1699K9683K6952k4089l9674
1594c0696R799M3527N207l6565j2450K3521Q216j4592M842J7280j3505k8184J1177
1607a2423L8026Q80l9998j7183L3634K7781k0553k6223J0293J5628j1232m896
1619f266K0452L177l0800j0697L4543K4625k7831l5472J1239L5980K047k6023
1631e026m597J5383k677j2221J3673J7764k0712l0096J6361L9366k117l7901j2795
1644b5595K7761J8466j6219j5233R847O054j3054J185K4465o36l4899j0223L5784
1657G703K2164k6387k8450J2107K6149k039j7096J450Q320j0442q988K0613J8587
$$ y = [-1607, -9433, 6049, 3067, -18682, -12554, 21654, 25671, -16109, -37557, -714, 34319, 10482, -25915, -14200, 13577, 7800, -6675, 4346, 10907, -11869, -23568, 6115, 33067, 8978, -30696, -20897, 22630, 27837, -8728, -21178, 2343, 10559, -4033, 809, 18089, 4584, -23600, -12423, 25603, 26483, -13515, -30698, 2936, 30717, 10164, -16059, -5766, 9862, -1370, -6266, 14186, 17363, -13437, -24134, 10409, 35034, 7203, -28269, -17030, 18950, 20997, -5026, -9623, 5760, 3083, -9138, 4535, 22299, 1587, -28509, -12148, 27218, 25101, -12800, -25595, 2166, 20632, 4413, -10820, -973, 5081, -7973, -6788, 17677, 17041, -17858, -28081, 7703, 29867, 3480, -24970, -12863, 13286, 11247, -5849, -4399, 3921, -6521, -15509, 5104, 23691]
1670B3691k3739l0128J7005L5903m876l2371o041K1842Q510j1689k824R572m961
1683a06j6448P964K7156l055l4668p283L3586J6938k3797j9415J1117J4607n723
1696H73n706Q657J471j6961n418K4700J6085k4610k6970J6941K9968n495k3992
1709a0457j179J4227K1o970O757P964j2767j5665J2807K6159n134l1232n083K7588
1723G036J2601j8762j1303R707M435o406K912J1621m829j9838j512K4731J3340
1736B3733k2213k1582J3076K2800m624j5464J418O588n607k124J3134N581j7027
1749b311j4945J4089K2713m861k5112m041K0349P778j2074m915O617l390p298
1762g401R639J3144q287k0835O68K3055R398j8460j6096R316J5269l004q014L523
$$ y = [23691, -48, -30176, -13171, 22732, 17856, -14515, -20556, 1286, 9796, -1893, -4717, 4855, -106, -16554, -8590, 18566, 15511, -19157, -26440, 7146, 24084, 287, -19128, -8011, 6596, 873, -4833, 3824, 5295, -11666, -17084, 7616, 23701, -909, -27879, -10938, 19030, 13535, -10457, -11636, 2591, 2612, -4358, 2399, 10363, -2404, -18069, -5262, 20897, 15763, -15469, -20552, 7036, 19637, 875, -10428, -721, 3714, -2692, 220, 11841, 7012, -12826, -14338, 10393, 23733, 1520, -20062, -6986, 15814, 11190, -4274, -2856, 3732, -1875, -3999, 9135, 14716, -2311, -17256, -3167, 19546, 14685, -10427, -14468, 5881, 13659, 1585, -3330, 3287, -103, -7401, 2238, 15382, 7095, -13740, -13072, 9983, 19381, 921, -15175, -5859, 9410, 6406, -1608, 1915]
1776A915K58r949Q59J6884L813j9059j2465J4358J8770n298j9024k604J2905M272
1790E635o520L08L890p731o951J2039J3729j0284j9786K250J9705O799j3913j0753
1804a1583N774Q258j806j932M426l928j0967L336J7581L069j8401j0250J2038
1817d385J3595l810j1476j434O288O51p68M076J024j0643n834J3298J2254r185
1831C651j5978K169J4289M002p562n771J491K187l8L705M392o362j1295M073J6300
1846I253K350j5029q095Q989R687k049n023j509k50p73L205O297q88j0825m906
1861i566J1544J0902p316j2633J209R081L107l182k025j408k409J525O590L758
1875I177p955r453L388J2919K526j0792o069M680N324M84n91j445l735k733N398
$$ y = [1915, 2173, -7776, -6917, 9967, 13780, -5279, -17744, -3386, 15384, 10086, -8938, -11542, 1363, 5635, -885, -577, 3313, -4418, -11369, 670, 14399, 4115, -15671, -13421, 6284, 13083, -830, -11583, -5809, 2449, 643, -1289, 3137, -791, -11758, -8422, 9159, 12228, -6173, -16423, -4385, 9210, 5400, -6076, -7510, -1222, -571, -1339, 2737, 3761, -6882, -12716, 582, 12836, 3651, -12327, -10158, 4131, 8133, 571, -5200, -3709, -1522, -1560, 2145, 6537, 175, -11120, -7047, 9253, 11603, -3426, -11521, -2532, 7155, 5106, 83, -1426, -1676, -2449, 756, 7053, 6165, -4660, -9566, 1978, 12880, 5564, -7069, -5860, 3221, 6328, 3146, 1121, -287, -2696, -1171, 5419, 9177, 1222, -8231, -4843, 8076, 10602, -190, -6259, -1579, 3745, 4229, 3638, 2193, -1542, -4275, 1123]
1890A123O804j442r700m111P717R019m150q509j163M773K391K77J64l811m326
1905d944J763P511L006o699q086J825R781L198o720n522J374L015J878K147j667
1920A860o075k867O345O851k150q145l570N526O727j324o157j542J204J838L074
1935A595J217m069n621J924P618K322o128n891J136O487L070k960m538j084J395
1950c527L167L668j903n774k665N521N585j041n947k853K522M841J300k705l196
1965c007q12K098L518J739l462n122J261O125K059l396m535N0L095L828p1l504
1981a36k611J77L211L573k36n479k619L622M589J71l636k832R1L661K867p71l636
1998Fk552J679L774K173k759m503J66M301K412j471l194j985J556L516J706k965
$$ y = [1123, 7927, 6485, -3215, -7326, 391, 9410, 5260, -3249, -4412, 361, 2752, 3029, 3193, -618, -4944, -3181, 4330, 7336, 637, -7449, -5624, 4157, 7355, 635, -4887, -3513, -498, 1380, 3527, 1860, -4215, -7082, -737, 6114, 3964, -4181, -7751, -2225, 4502, 3178, -2979, -4521, -3317, -1479, 1595, 2812, -1257, -6878, -4954, 2664, 4986, -1142, -7033, -5897, 590, 3660, 700, -3838, -4922, -3527, -360, 3308, 1405, -4369, -7034, -1513, 4072, 3031, -2916, -5769, -3247, 1594, 2894, 189, -3007, -3819, -1721, 1797, 3536, 74, -5048, -3787, 2338, 4397, 1001, -3534, -3484, -389, 3439, 3368, -136, -2747, -2570, 641, 4214, 3978, -1501, -4120, -498, 4091, 4262, 626, -2206, -2115, 1546, 4413, 3642, 6, -2546, -867, 2907, 5080, 2321, -2182, -2016, 2285, 4697, 3226, 32, -1953, -397, 3119, 4825, 1860]
2014A860l313r21L637L035j32l820l016J876M002Q11k141k936j287K350L471K41
2030C717l446k659Q37K932K139j656l637j011K728K795n27k512k321M9L347K353
2046C128k095l538j134K420K750P17k707k816k82L798J958j465l198j330J755
2061b039L158K34k525k463K50K436J950n18k445k062J816K796R5j629k324L60
2077b910K126J726q76k019j526J410K222J042j430l101kK843J968p78k082j341
2093b728P53K296J275j375k124m58J494K212M91k497j721J162K604L26j566q94
2109g50j69O56J606N51j270j772L56K359J312j349l015L13K495J008p29j142k67
2126A93l95J194J832J09k325j920J675K786l49k229j487J790J170o3r26Q4m35
$$ y = [1860, -1453, -2374, 1263, 4298, 4166, 346, -2670, -794, 3208, 4019, 1878, -1058, -2345, 5, 3476, 3717, 271, -2388, -1551, 1381, 3520, 1864, -1773, -2784, -56, 2739, 2212, -300, -2621, -2572, 775, 3128, 1033, -2505, -3639, -1219, 1531, 2248, -459, -3275, -3557, 241, 2199, 734, -2464, -3794, -2039, 1119, 1353, -1172, -3635, -3385, -949, 1001, 483, -1962, -4024, -2208, 588, 683, -946, -3270, -2910, -784, 942, 66, -1953, -3479, -2069, 153, 1195, -235, -3336, -3338, -495, 1473, 695, -1387, -2728, -1975, 321, 1596, 221, -1903, -2361, -867, 1345, 1836, -661, -2382, -1220, 1384, 1710, 144, -750, -919, -263, 1343, 1894, 624, -1148, -792, 1567, 2879, 1530, -1485, -1172, 1323, 2331, 1602, 460, 193, -202, 992, 2824, 2933, 608, -1312, 363, 3149, 2800, 571, -916, 874, 2044, 1981, 1055, 1139, 704]
2143G04o45J179J830j177k981K20K912J338k391k286J293J693nj014l28O08j365
2160d15l13K681N44l165j708K006K745n28l315K87J812P3j612J14J486j006j855
2177b169J206K742r75l714O66L213Q37l396j097J768J100j640o30K115K04k526
2193b296n77L239J623m171k074K893L380k719k946J882K359j053k485J910K167
2208A132k260k618K338L353j918m165J835M189o93m469M44L861K88l434O5L362
2224A310l19m083Q37M277L29m834j226N360J991m318k326L530K444l338k085L729
2240A278K049l454k847M046L088m050m050L870N205l303m887K231N203j726m842
2255b189J563M361k039m575K233N735j343o310P28O085M47o301j222N622K182
$$ y = [704, 59, 1238, 3068, 1891, -1090, -870, 2042, 3380, 989, -1297, -4, 1689, 1684, 670, 342, 950, -415, -728, 1953, 2497, -668, -2376, -370, 2375, 1847, -1468, -1181, 631, 704, -908, -794, 692, -314, -2169, -963, 1779, 804, -2910, -2244, 969, 1806, -1590, -2687, -919, 181, -1459, -2089, 26, 230, -2296, -2873, 366, 1989, -2182, -4256, -1363, 2017, -702, -3648, -1766, 593, -460, -2945, -1035, 1132, -1128, -3746, -1408, 1945, 27, -4138, -2303, 1886, 1193, -3276, -2832, 1029, 1317, -2117, -2052, 1310, 991, -3092, -2255, 2022, 2351, -2483, -3709, 1651, 3642, -676, -3002, 528, 2972, -366, -2451, 1278, 3327, -127, -2974, 1072, 4160, 110, -3940, -70, 5135, 1832, -3055, -824, 4379, 2653, -2189, -626, 3735, 1696, -2879, -646, 5089, 3746, -2564, -1836, 4249, 4696, -1605, -2827, 2795, 4977]
2270D977n718j532N978R14o071j803N986K610n974l421N766M686n345n484L897
2285e34N162l743m575L627N050l955n309M097O132m147p912K754P820q43p152
2300c528N55O584m24o973K9O613n48p462N10R019Q38q846k194P441L006p322l861
2317f563O121M596n370l561O038K945p367m877P921N600o676o820O003Q074l912
2332B152q386K426O463k732o471L862Q171l348q612K849R314k472j0651K8J0272
2347B865K304q070j667P435J359q356j738Q163J678q760j971J0775N390r818p648
2362h059P397O456n654o629N517O999m939n172N625O050p539r070O050J1423l966
2377D489j0451K930J0847j402j0147k14P416q41p464K758J0113n14j1734j125
$$ y = [4977, -741, -2273, 3705, 4619, -1452, -3255, 2731, 5341, -633, -4054, 1712, 6398, 1053, -4431, -534, 4628, 885, -3690, -63, 4987, 1032, -4277, -180, 5952, 1805, -6107, -3353, 4467, 3624, -3528, -2973, 3611, 3187, -3786, -3757, 2856, 2308, -5154, -4644, 4375, 5213, -3633, -5827, 1614, 4620, -2702, -6563, -442, 4154, -1216, -4777, 1261, 4206, -3161, -8038, -117, 5483, -1193, -8013, -2010, 6064, 2152, -6234, -3808, 2655, -77, -6548, -2686, 5485, 2137, -6475, -3626, 5688, 3216, -7435, -7407, 2865, 5169, -2901, -4568, 2867, 4226, -4130, -5868, 2295, 3973, -4787, -6758, 4017, 9407, -411, -8059, -662, 5794, 140, -6489, -972, 6027, 1088, -4084, 1541, 7591, 52, -9018, -2968, 8455, 4489, -5962, -3032, 7815, 6413, -3734, -3948, 3468, 2627, -4837, -2079, 8034, 7520, -4214, -5339]
2391e339J1052K404j1792m916J0923O214p199m547P267K592r298m526R260O321
2405H416q980p354R414J0633p529j2089L628R743m187p966N302Q893m173r167
2419e416M341R764n262j3530J846J4663K195j1701k340J0140K019j0986k299R079
2433B513J063j0290M5J3164M057j2930p932R462Q010q584q528P784R130n513p175
2448e724P104N872j0669q915R332J1697n996j1880M584J3061k134j3294j227J0192
2462B003m84q656L661J1746k915j3504J310J3480J37j4965l898J3400P523q775
2476F3n954P796M008j0119n012J0950N523j1515n670J3108J0165j1113j2969O121
2490d618J0947m104r486M842R482l539r270N782R558p650j4501N529J6851q07
$$ y = [-5339, 5713, 8117, -3675, -8591, 2332, 8546, 1347, -3200, 4067, 6659, -2639, -7165, 2095, 8416, -564, -7918, 1496, 12129, 4600, -7489, -3861, 5882, 1695, -6271, -969, 7924, 3751, -5416, -1075, 8689, 3427, -10103, -8257, 6406, 8601, -3100, -5440, 4700, 6719, -4267, -6566, 2513, 3576, -6714, -6669, 6495, 10552, -2378, -10310, -848, 7162, -1422, -9950, -2166, 6964, 1451, -5724, 1380, 7252, -3417, -12332, -3000, 8697, 2701, -9179, -4595, 8466, 6332, -6962, -8189, 2003, 1519, -7137, -3476, 8270, 5355, -8149, -6839, 6641, 6778, -8187, -12085, 1315, 8838, 63, -5891, 1905, 5913, -4206, -9218, 1732, 7255, -4260, -9930, 3178, 13343, 2230, -10739, -4618, 6329, 2225, -7261, -2419, 7063, 3524, -5746, 36, 9594, 1944, -12557, -7028, 9823, 9016]
2504I016j4099j220J2395J905j0867k937Q486J595r572P43J3873K146j5580o061
2518a0177J3887P268j2239q669R269J0100o063p048O180M604r099p447J0313J0433
2532A1312r204j2521Q121J4885m716j5472J216J0741o74q277K672R690l423j1026
2546f676K606J3234j655j6495k119J5960O598j2490o371R365M286q921l753R326
2560B895K465j0127m033J3427Q153j3170j2615R221J2734o271j1458M932R868
2573F021m901o975O089O878q427j1169P684J4629l210j5460q5J4413K332j2157
2587d338l348R042J290r069K095J1482j603j3485j870J4169N636j3224r308J0431
2601b100J0679o418q257N384N378q053m657J0400O485j0823r535R930J3236o197
$$ y = [9016, -5083, -6303, 6092, 7997, -2870, -5807, 2679, 4274, -5298, -4555, 9318, 11464, -4116, -10177, 3710, 10978, -1261, -9930, -661, 9439, 3376, -3672, 2508, 7112, -1987, -9434, 879, 11312, 2108, -10413, -2292, 12593, 7877, -7595, -6379, 4362, 3688, -4589, -1917, 7773, 4350, -6676, -4070, 9164, 7509, -8986, -11105, 4855, 11453, -1037, -7408, 1957, 6243, -2678, -6431, 2895, 5360, -4767, -8800, 4627, 12780, -390, -13005, -3784, 8950, 2679, -8779, -3847, 6021, 1120, -5855, 234, 7112, -1315, -12484, -4800, 9829, 6619, -8841, -8926, 5487, 7819, -4338, -7686, 1356, 2646, -6423, -4328, 7154, 5551, -7934, -9804, 4365, 10001, -3223, -12531, -2100, 8579, 2161, -6096, -712, 4666, -3387, -8044, 2356, 8841, -1982, -11517, -1587, 11649, 5452]
2615E452j4498J731J1911M64q624R71P782l247r121N809J1226n146j4362J345
2629h307J5656L520j2939o213R229O386p191m194O958J685r561q31J2976L918
2643A1092j4173q055J1577J0797p095j1077L217Q889j771o148M119N019p459p367
2657h435Q641J1580o845j4503K985J4192J394j1502l195P087K539n323K8O892
2671E535j795j0624J023J3622K160j4338o319J1616Q150o584p475L601M011l394
2685h11k219N993L117r415o402J0484R960p928j2537L712J1362k12q086o12M821
2700A227j596l302L466O195n110j0098L165J3097J201j3457m659R688N580m983
2714D14l873L349o0m268J856P505n9j0306m732J0441R258p351j0699L248Q157
$$ y = [5452, -9046, -7315, 4596, 5060, -3564, -2593, 5189, 1942, -7179, -1370, 9856, 4710, -9652, -8307, 7349, 10869, -2070, -8283, 946, 7332, 141, -4053, 2905, 4590, -4971, -5802, 7174, 11092, -3081, -11136, 441, 11238, 4143, -6934, -3717, 5172, 3401, -2747, 1372, 6391, -1068, -8435, 206, 11786, 4941, -9562, -6577, 7615, 9009, -2493, -5688, 1399, 3938, -1385, -1357, 5535, 3740, -6884, -5861, 7761, 9921, -4417, -10736, 880, 9030, 2446, -5029, -1428, 2583, -811, -3030, 2963, 6080, -3335, -9737, 747, 10707, 2779, -9758, -6046, 5316, 5104, -2982, -3594, 1227, -369, -3671, -205, 5990, 880, -9218, -6053, 7044, 8245, -5212, -9871, -183, 5397, 414, -3459, -110, -170, -4438, -2582, 4923, 4864, -5442, -10174, 267, 9525, 2174, -8525, -5277, 2880]
2729B880o5m474J444Q29l947j231O676N102p119r190L664J1824J334j0805m109
2744g187O711L858l014JJ761l368m243M572Q120j673j0423l293Q931Q201n354
2759C600q294J504N148m31p95K535j449o261Q0R100L946p752q272L338R362J767
2775G126p431l662L058K241k30K336O91o081l866N866Q012k478r105k904O953
2790E26N705j715n775j434K031Q65K577K325l908o653J546Q791K282o508o363
2805e708J629O687K577l310m307n74J544K729L112r91o669l357N796O953j933
2820D178o986k851L148N184J700l627m491n86K981L975J568m241o235J120O857
2835A694L618l995n253j454L185N358P41m857m503J497M561L361j396n776l130
$$ y = [2880, 2815, -1659, -215, 614, -3333, -4564, 2112, 7214, 95, -9095, -5431, 6393, 7727, -3078, -7187, -476, 3382, 368, 369, 2130, -1238, -5481, -909, 7211, 5538, -4885, -8178, 753, 8954, 3600, -4694, -3190, 1958, 1527, 732, 3267, 1818, -4443, -4363, 4737, 8683, 931, -7341, -4003, 5359, 7126, -305, -3967, -909, 1332, 1102, 3438, 4129, -1952, -5818, 48, 8060, 5582, -3523, -6427, 526, 6231, 4516, -1259, -2693, -662, 203, 2780, 5105, 1197, -5456, -3910, 4881, 7163, 655, -5708, -4079, 2608, 5185, 1875, -2432, -3006, -1462, 1267, 4379, 3388, -3281, -6638, -842, 6111, 4178, -2808, -5659, -2511, 2673, 4373, 746, -3745, -4331, -1350, 2625, 4193, -48, -6283, -5163, 1694, 5312, 1317, -3936, -5390, -2205, 3153, 3894, -963, -5466, -3969, 592, 3953, 2557, -3219, -6349]
2850f349L981N936K7l778m991l53N307N598k443o835k029M396M558P94l101m905
2866d187j262M961M953l47n195m972J884P645L250o109o363J679N851K209j158
2881B839l281l785R12N271M031k658o547l245N567Q339j712q734k487N104L598
2896C212N73j328k986m005K106O599L230n549q353J002R702M983p265p158K258
2911b979M898J231J86n69m360l849M716Q486o64r930n730P111R930j653r759j949
2927d884M601K377l97K014j545o975j936R671P258p547j1194J144J1059M563p281
2942I28o454L460K435j192K784L483o015r038N436J2536K49j2992o469Q912R054
2957G117k988p830j16L360j650R2P076L34j2010m054J2269R716q744j2687K299
$$ y = [-6349, -2368, 3568, 3595, -183, -5174, -5527, -220, 5378, 2935, -3900, -5929, -1533, 3025, 3819, 718, -4187, -5449, -488, 4465, 4118, -1077, -6049, -4165, 3480, 6730, 621, -5742, -4063, 1788, 3997, 2839, -442, -4227, -3315, 1956, 5987, 3329, -3218, -6463, -896, 7443, 5731, -3003, -5490, -386, 3212, 3785, 2457, -529, -4534, -2428, 4171, 7401, 1852, -6501, -5499, 4203, 9186, 1921, -5237, -2979, 1919, 3150, 3336, 2767, -1593, -5442, -726, 7760, 7096, -2834, -8564, -1453, 8477, 6824, -2935, -4884, -283, 2094, 1697, 3711, 2166, -4809, -6745, 2926, 10184, 2637, -8557, -7413, 3646, 8209, 928, -5526, -2066, 369, -823, 1961, 5444, -571, -9609, -4173, 8363, 8612, -4380, -10849, -1937, 7117, 4129, -3701, -3817, -457, -2107, -2015, 5061, 5395, -6615, -10669, 1600, 11316, 2572, -10115, -7816]
2972g816J1316K396o992k546L138j249l018O108P065p946j2753N603J5611K61
2986I178j4219n495R595O711l867m700K533P83n819J825J1243L02j5576n807J5586
3001B273J0842j0367j2261M590R355p56m917J786K387o402l940J0376R963j0771
3015B158j6088O536J8734j077j5421k911R794K890n050P61M935m412r525M486
3029d190J5562K20j9188n938J7493J0437j2493j0356O410O661m631j702P401P45
3043F431j2128m740J5289J1291j3829j7551Q833J8558k712j4961K19Q872k489
3056A083n883P016P430r561j2846P696J9273k292k1539m993J8581Q752j2864p197
3070g344Q794K462q841J612J2394k213j7376l296J9446J1018j6027j6213J0024
$$ y = [-7816, 3500, 5896, -1096, -3642, -504, -1753, -4771, 1337, 8402, 456, -12297, -6694, 8917, 9178, -5041, -10536, -941, 5770, 1903, -2797, -264, 519, -5300, -3475, 7768, 8070, -7506, -13313, 2273, 13115, 2748, -9513, -4923, 4432, 3676, -1241, 545, 2932, -3470, -7410, 2966, 12929, 2158, -13930, -7394, 11340, 10263, -5158, -8069, 1725, 4615, -435, 326, 5261, 849, -8676, -4190, 11372, 11592, -7596, -13534, 3959, 14396, 1903, -8453, -2043, 4618, -13, -1715, 5686, 6431, -5697, -10437, 4852, 16143, 2314, -15237, -6404, 12154, 9442, -5519, -5300, 3572, 1083, -4800, 2216, 9646, 85, -12761, -5065, 14208, 11916, -9623, -14616, 3965, 12717, -147, -7344, 1450, 3912, -4929, -3317, 9077, 6864, -10512, -13808, 5638, 16656, 629, -15584, -5560]
3083e560J6374n668j2617M417P529p442n451J2844Q746j5089j5641J1358K0880
3096A4680m795k1197j408J7545M756j2327k855R775l170j2251O369J8007m439
3109H690k1932j187K2102Q218j8192j3378J1753J2461p534p143R368M012j4548
3122g310m729J8554Q926j9363j5367J5566K0074p197j9068J132J4270q42j1127
3135f481M468J1466q681j4685J1424K0730q480k5200O88K3175N815j6890p806
3148a0457J2596O043j0219k782J2186p6j8978k086K3951R426k2344j4920J7078
3161e82J6469j0782j5423N839J1218n841o850J1174R325j5571j6922J4813K2289
3174A9156j0743k4433M529K3157J674j6838k864J0723j888j1601N025J7307l846
$$ y = [-5560, 10814, 5146, -7471, -3054, 4475, -2967, -8418, 4426, 13172, -1917, -17558, -6200, 14680, 9885, -11312, -12720, 4825, 9581, -2746, -5601, 4174, 1004, -11247, -4878, 13129, 8690, -13242, -14429, 7673, 15891, -2301, -15679, -3926, 8535, 1001, -6142, 3226, 7238, -7310, -12039, 6515, 15441, -3922, -19289, -3723, 16351, 9154, -9914, -8782, 5488, 4646, -6481, -2013, 9453, 772, -13913, -2489, 18241, 9761, -15439, -14751, 8424, 14239, -2651, -10457, 2139, 8182, -2037, -4819, 7367, 7291, -11687, -13773, 10178, 19604, -2740, -17660, -582, 15887, 5105, -10318, -4479, 6739, 898, -5952, 5222, 14547, -1024, -17946, -3133, 19156, 8413, -16020, -11491, 11666, 13340, -3498, -6362, 4361, 2473, -9128, -4103, 13204, 9358]
3187I358k2603P44K5610O353k5809j2815J8672J3137j1213q324R923M484j2675
3200e158m339J5885P390k0265j4360J9842K2500j2671k4141N831J8810l567j4466
3213h709M670J1054p260j0995J1425J6980j0363k5085K662K6727M632k3708p240
3226a5210J8797P789j3486m559J1351j492j6393J937K2167N889k3068j2995J9956
3239F83J8164j5413k0076Q650J6128o268q751J0610P892j6067j2223J6392J7361
3252A7082j3323k2732Q068K5466Q57k1771m649J4973N80j3306M265J6200o540
3265E170j8993N477K3810O01k5833j0178K0812J4904j3617j2352J0902R005j1973
3278b265o239J5315M544k0291r391K2696J7564j6662k1330Q365K0042l682j6846
$$ y = [9358, -13245, -12501, 13109, 19462, -6347, -19162, -490, 12647, 1434, -6890, 3033, 7517, -5158, -9497, 6388, 13778, -6487, -20847, -1005, 21495, 8824, -15317, -9486, 9324, 5757, -8709, -4039, 7015, -245, -11240, 185, 17165, 6802, -18283, -15621, 11106, 15738, -7970, -15210, 3587, 11376, -2110, -6669, 4682, 3190, -13203, -11266, 10901, 16790, -6278, -19273, 683, 18847, 3434, -16642, -7992, 8136, 1868, -6883, 3727, 11619, -4448, -16671, -279, 17082, 3759, -18973, -10905, 14561, 15418, -6353, -11002, 3971, 4551, -8755, -4490, 11710, 5170, -13823, -8346, 15464, 16065, -9768, -19946, 866, 15770, 2153, -10199, 703, 9708, -2265, -8504, 6811, 11355, -8936, -18327, 4369, 21933, 5271, -16059, -7694, 12348, 8666, -8180]
3291h180J795J2869m015j0691J0346J5197j3063k2937Q192K5977j392k3768m482
3304a4152J9438Q292j3240p313J0320J235j3802Q46K0942K357k4067p936K3353
3317F273J3587j9114j7640J0767J5827m969r956P027O408j1585r422J5204J4450
3330A6857j6100k0875J2325K5171m569k2014j858J4828K224j1186J615J0716m564
3343B570j4462N719K1176k023k6157n890K3682J1561j7197j1298J1266Q224q394
3356a223m198R723J659j4935n495K0010J3177j8136j9832J2457K1004o506j7973
3369a0268K303J2410k844p197P467Q597j1165j4862R255K0715k942k3889k879
3382a5299K1722P689j5580p360R894J725q889K593J2976j623j8014k712J9904
$$ y = [-8180, -6385, 6484, 2469, -8222, 2124, 17321, 4258, -18679, -10487, 15490, 14098, -9670, -14152, 5286, 13578, 338, -6975, 3345, 4580, -9222, -8376, 12566, 14923, -9144, -17080, 6273, 19860, 746, -16894, -6127, 9700, 4731, -5225, 1802, 8210, -3375, -12797, 2407, 16857, 757, -20118, -7793, 17378, 12809, -9205, -11063, 3765, 5989, -5197, -3582, 7134, 2570, -11892, -6173, 15003, 12980, -13177, -19067, 4615, 16176, -1021, -12319, -1053, 7171, -1223, -5421, 4302, 5961, -8974, -14469, 5541, 18718, 582, -19250, -6793, 14211, 7705, -10268, -7965, 4445, 1601, -5596, 1871, 10468, -697, -15559, -6304, 14411, 11469, -12420, -15299, 6423, 14112, -1468, -8828, 1066, 2791, -6098, -3505, 9471, 7848, -10166, -12878, 7026]
3395G026J0634j8391j6622J2430J7206o366j2358N352O990q460m996J2653P344
3408A2442j5137j3331J2803J9915n901k0811j596J7051L781j1846j059Q760l443
3421A628j0209P866J4491o291j9982M0K0270P624j6013j1673J0198J1112o379
3434B682o473O689J614j1333j049J6459N728j7866j1725J2914J6118n928j6092
3447h262J5J1966R16o859L049N875q832r516J1241J5016q325j8850J438J8147
3461G019M835j2651p881O835N319m500l97P492l021j3093J295J7841M131j7447
3475d223j0485J2050J2455m633j0460P74N283j494j753O152L359j1832q227J2672
3489c62J4398q807j7250K185J4299L794q583m166L317K56k734M563P183o203j3371
$$ y = [7026, 17660, -731, -17353, -4923, 12283, 5917, -6441, -1089, 5901, -2559, -7555, 5098, 12442, -2695, -16026, -3223, 16692, 10791, -10020, -11616, 5435, 9216, -2630, -3689, 5071, 1628, -8581, -715, 13776, 7485, -12497, -12457, 7813, 15437, -576, -12249, -2051, 9061, 2682, -3791, 2898, 4512, -6821, -7870, 8589, 14317, -3549, -15274, -2360, 13758, 7830, -8262, -8247, 3719, 4635, -2224, 825, 6700, -2132, -11648, -407, 14609, 6284, -12566, -11128, 7019, 11854, -797, -8678, -1843, 3476, -1024, -1421, 6071, 3050, -10043, -8748, 9093, 13224, -4223, -14708, -2658, 9797, 5164, -5296, -4522, 761, -733, -2486, 3666, 7025, -4807, -13034, -362, 14036, 5229, -12021, -9836, 4463, 8257, -326, -4492, -1175, -919, -3653, 910, 8093, 1890, -11481]
3504a1481K585J7537L587j5835q734J0183R373l773n082M50L58l292K299Q173
3518F348J007j2617o976J2354J2608p548j3681J383J0300J734l994m44L3l939
3532c432q46P811O203p750j2404L208J4858L468j2429o991O527N560j419m77N69
3547B456m348l994M789R605p38j2145n906J0067J0865n248j0046m34N234J696
3561A853K43J966k897p073N45R910N202p717j0367K107J1113M060p802n932K158
3576b631K728J418K783k66p364m297O709Q545j275r625n569O441Q780o30p313
3591a566k643J835J708L440K848n175p597J191R285M702n816q804n71P946N562
3606F345l226n758k170J410L394N084r09q002m689O058Q229L47p797n571K573
$$ y = [-11481, -8896, 8641, 12228, -3607, -12341, -2158, 7215, 3442, -1640, -1190, -832, -4124, -1825, 6348, 7355, -5262, -12238, 116, 12724, 5176, -8505, -7122, 3178, 4912, 918, 474, 507, -3432, -4278, 3533, 9736, 1986, -10418, -7210, 7648, 11116, -1313, -8304, -1777, 3783, 2364, 1887, 2456, -1892, -5886, -1097, 8508, 7770, -4375, -10281, -214, 10651, 5403, -4643, -5077, 157, 1853, 2096, 4062, 1165, -5908, -5363, 4547, 9749, 2032, -8335, -6228, 4885, 8945, 1143, -4789, -2631, 97, 1515, 4298, 4032, -3332, -7629, -920, 7625, 6350, -3275, -8844, -2403, 6377, 5747, -1566, -4209, -2374, -666, 2774, 5622, 447, -7150, -5959, 3326, 8028, 2212, -6592, -7163, 783, 6345, 3119, -2639, -4809, -3399, -5, 5079, 4170, -3832, -8521, -2463, 5766, 6113, -1684, -7255, -4682]
3621d682P268L398m238n738j622L137N048L626n009q121L45Q038M740l010p014
3636c834k766L841P684P54n592n493O08M579N584q23p177m476M470O621J676m453
3652A203o150j364O413O815k088p497l678M070N715K649l990o459j156N425N205
3667E113J08n183n885N23R085M239n946p610P09N864M055l22m690m368O78M977
3683A347M814j004p565n009N266R833m85r359m200M352M885J613j273m120l795
3698d700J416O540L882m141r615p38J0111O424o447p968J120M402J998R40r49
3713B275m716l616L992P896J507r127p565N446J0757Kq936l414M049J757J212
3728A519K414j780p275k149Q157Q073m627j1613j695J0607O623o116p004J802
$$ y = [-4682, 2586, 5984, 1746, -3992, -5614, -2477, 2571, 6197, 1188, -6933, -6588, 1450, 6190, 3180, -3834, -6600, -2759, 4925, 5679, 87, -5406, -4798, -219, 5365, 4542, -2635, -7111, -2641, 3980, 5656, 1203, -4947, -6311, 102, 6917, 4829, -2668, -6346, -2276, 3439, 6088, 2098, -4361, -5517, -92, 5113, 5221, 38, -5847, -5324, 3761, 8000, 2054, -5556, -4847, 1017, 5072, 4750, 60, -4308, -3630, 1347, 6161, 5157, -2408, -7417, -2151, 7682, 7197, -2162, -6362, -2010, 2875, 4488, 3215, -905, -4700, -3284, 3256, 7138, 2997, -6618, -7356, 2755, 9179, 2732, -5236, -4116, 286, 2284, 3224, 2275, -2441, -6057, -2065, 5831, 7338, -1789, -9354, -3908, 6849, 6851, -2085, -5499, -1450, 307, 1519, 3933, 2153, -5122, -7271, 886, 8959, 4332, -7281, -8976, 1631, 8254, 2138, -4866, -3064]
3742c064K411n99L060L254n359q586L024J1809K883j0562q701O261J0179k89q212
3757b491j400L108j732J046O843K71j0981n336J0776J0702n443j2941j090J0298
3771A630N056n393m163K280m94l181N774P546o974j2722L425J4645L384j2165
3785a352q431O915Q610j756n224J035Q64n046J013J0952J442j3888p676J2540
3799bJ2061o456j2716N61R282K230m585j07K771n293m867Q641J0873q462j5894
3814a1963L708J6698K539j3004n969P265M771l066r56L813k012r624K156J4372
3828H728K788j6951q006J4070J1525p864j0712K836O152j927k363N008K085r578
3842d209o156J1646J2496r411j7348M296J6736O96j2087k283O634J64m886M143
$$ y = [-3064, -653, -1252, 1808, 5062, -297, -8883, -5859, 5950, 8833, -1729, -10430, -4169, 6010, 5721, -2491, -3891, -783, -2515, -1469, 5374, 5645, -5336, -10672, 104, 10806, 5363, -7578, -8668, 1630, 6686, 1293, -2870, -590, -1084, -4265, 1509, 9055, 2081, -10641, -7216, 7429, 10813, -1352, -9783, -2868, 5742, 3986, -1238, -203, 661, -4385, -3372, 7580, 9022, -4866, -12542, -2, 12059, 5603, -7113, -6552, 2730, 4960, 375, 268, 3039, -2254, -7121, 1520, 12393, 3931, -11963, -8255, 8443, 10982, -2022, -7991, -726, 4045, 979, 23, 3836, 1824, -7800, -5644, 8728, 11516, -5435, -13441, 629, 12154, 4290, -6422, -3586, 2566, 639, -1724, 3284, 5369, -4209, -10365, 1281, 13777, 4366, -12982, -8686, 8050, 8746, -3341, -5624, 1010, 1174, -3712, 431]
3856D31O591n678j2401L516J7439K275j8125p868J4149R902q848p404N374K736
3870B089n864L29R633J062j4013o541J4368J3251j0749j6559N542J5500j888j0624
3884d464J445O268n271n452R218R514r653j5042N365J8589R08j7977o190J3991
3898A249P186r023k996P174j705j0202L412J4502j60j7595o043J7267J2152j1918
3912C300j4797N755J2478l926p121O112M494j0338n511J3774J0092j3183j6175
3925a5046Q036J8695r08j6196l352J2037K908r414J337R042n777j2742O928J8173
3939A3721k232k0383m586J7348R595j2497j0747P947Q350o773l544R625K204j5324
3953g296n484J8052J0605j5524j5240J0749J6094m005j4120L99R180k148p287
$$ y = [431, 7022, 1344, -11057, -7541, 9898, 12173, -5952, -13820, 329, 10231, 1383, -6021, -647, 2089, -3775, -3446, 6187, 7249, -6764, -13305, 1063, 14314, 3565, -12994, -7452, 8048, 6160, -4464, -3019, 3249, -2022, -7474, 1744, 11258, 1605, -13437, -8072, 10517, 11425, -6552, -12742, 1249, 8435, -588, -3584, 3590, 1885, -8317, -4905, 9597, 9437, -8158, -14201, 3066, 15218, 3300, -11497, -5742, 6736, 2810, -4311, 1801, 6295, -4043, -9554, 4220, 14312, 1129, -15046, -7010, 11685, 10777, -5419, -8771, 3266, 6174, -3240, -1903, 7139, 1362, -11380, -4452, 13721, 11489, -8894, -13480, 3868, 13463, 966, -9781, -1834, 6516, -257, -3801, 5824, 8028, -7296, -12780, 5272, 15877, 353, -14887, -4138, 11956, 7951, -6169, -5770, 3410, 1262, -6025]
3966f025P094J0132r810j4934Q772J9453m788k1037j817J7768O281j1495n170
3979e576P436J702q841j4J3176L60j8077l933K0824J0024j7436j4317J0604J2741
3993H673n795r129N150O308p166n818J1170Q982j3684j5803J1196K0227n292j9278
4007a0259L48J5422J303j0809j15Q037l452j0065N987J5927k459k1024k652K0077
4021F266Q043j7080j0696J2418R079p806m277Q089J242j2506l340J5531Q953j5582
4035a666j4414J2865J8613p426j7844K317J2295k306p793O489P718r078j1314
$$ y = [-6025, 1069, 11201, 1391, -13543, -4771, 14682, 9894, -11143, -12960, 4808, 11089, -406, -5576, 1860, 3562, -5279, -5293, 7883, 8243, -9834, -13767, 7057, 17081, -355, -14672, -4068, 8673, 2878, -6251, -1101, 5207, -1959, -7777, 3393, 12375, -1309, -17112, -5916, 14311, 9019, -10259, -9911, 5511, 6814, -3995, -4110, 3927, 475, -9590, -3603, 12324, 9865, -11159, -13811, 6266, 14309, -2771, -13467, -1049, 8030, 224, -4053, 4036, 5278, -7228, -10568, 4963, 13916, -1666, -16080, -3215, 15398, 7972, -9872, -7555, 4740, 2434, -5359, 1130, 8848, -230, -11544]
$$ [...]
##END NTUPLES=NMR FID
##END=
