##TITLE=1H_TG-2273-2
 CDCl3, 8 sc, 
 24.12.2019
##JCAMPDX= 6.0         $$ Bruker NMR JCAMP-DX V2.0
##DATA TYPE= NMR FID
##DATA CLASS= NTUPLES
##ORIGIN= UXNMR, Bruker Analytische Messtechnik GmbH
##OWNER= root
$$ XWIN-NMR		Version 3.5
$$ Tue Dec 24 15:49:37 2019 Russian Standard Time (UT+4h)  she@DPX200
##.OBSERVE FREQUENCY= 200.1315
##.OBSERVE NUCLEUS= ^1H
##.DELAY= (6, 6)
##.ACQUISITION MODE= SIMULTANEOUS
##.ACQUISITION SCHEME= undefined
##.AVERAGES= 8
##.DIGITISER RES= 18
##SPECTROMETER/DATA SYSTEM= spect
##.PULSE SEQUENCE= zg30
##.SOLVENT NAME= CDCl3
##.SHIFT REFERENCE= (INTERNAL, CDCl3, 0, 15.7039)
##AUDIT TRAIL= $$ (NUMBER, WHEN, WHO, WHERE, WHAT)
$$ ##TITLE= Audit trail, XWIN-NMR		Version 3.5
$$ ##JCAMPDX= 5.01
$$ ##ORIGIN= Bruker BioSpin GmbH
$$ ##OWNER= she
$$ F:/spectra/data/she/nmr/H-F/1/audita.txt
$$ ##AUDIT TRAIL=  $$ (NUMBER, WHEN, WHO, WHERE, WHAT)
(   1,<2019-12-24 15:48:27.28 +0400>,<she>,<DPX200>,
      <created by zg, POWCHK disabled, PULCHK disabled
       configuration hash MD5:
       00 E9 B6 7A A2 85 ED C7 34 08 36 98 17 FE 4E 26
       data hash MD5: 16K
       49 4F 74 EC 8E 65 FC D0 8B 70 84 E9 D4 7D AC AA>)
$$ ##END=
$$ 
$$ hash MD5
$$ 71 DF A8 3F BE 41 1F A5 CE F8 A8 12 BE BD 6B 58
##$RELAX= 
##$RELAX= 
##$RELAX= 
##$RELAX= 
##$RELAX= 
##$RELAX= 
$$ Bruker specific parameters
$$ --------------------------
##$DU= <F:/spectra>
##$EXPNO= 1
##$NAME= <H-F>
##$PROCNO= 1
##$TYPE= <nmr>
##$USER= <she>
##$AMP= (0..31)
100 100 100 100 100 100 100 100 100 100 100 100 100 100 100 100 100 100 
100 100 100 100 100 100 100 100 100 100 100 100 100 100 
##$AQSEQ= 0
##$AQ_mod= 1
##$AUNM= <au_zg>
##$AUTOPOS= <>
##$BF1= 200.13
##$BF2= 200.13
##$BF3= 200.13
##$BF4= 200.13
##$BF5= 200.13
##$BF6= 200.13
##$BF7= 200.13
##$BF8= 200.13
##$BYTORDA= 1
##$CFDGTYP= 0
##$CFRGTYP= 5
##$CHEMSTR= <none>
##$CNST= (0..31)
1 1 145 1 1 1 1 1 1 1 1 1 1 1 1 1 1 1 1 1 1 1 1 1 1 1 1 1 1 1 1 1 
##$CPDPRG= <>
##$CPDPRG1= <>
##$CPDPRG2= <>
##$CPDPRG3= <>
##$CPDPRG4= <mlev>
##$CPDPRG5= <mlev>
##$CPDPRG6= <mlev>
##$CPDPRG7= <mlev>
##$CPDPRG8= <mlev>
##$CPDPRGB= <>
##$CPDPRGT= <>
##$D= (0..31)
0 1.2 0 0 0 0 0 0 0 0.06 0 0.03 0 0 0 0 0.0002 0 0 0 0 0 0 0 0 0 0 0 0 
0 0 0 
##$DATE= 1577188106
##$DBL= (0..7)
120 120 120 120 120 120 120 120 
##$DBP= (0..7)
150 150 150 150 150 150 150 150 
##$DBP07= 0
##$DBPNAM0= <>
##$DBPNAM1= <>
##$DBPNAM2= <>
##$DBPNAM3= <>
##$DBPNAM4= <>
##$DBPNAM5= <>
##$DBPNAM6= <>
##$DBPNAM7= <>
##$DBPOAL= (0..7)
0.5 0.5 0.5 0.5 0.5 0.5 0.5 0.5 
##$DBPOFFS= (0..7)
0 0 0 0 0 0 0 0 
##$DE= 6
##$DECBNUC= <off>
##$DECIM= 24
##$DECNUC= <off>
##$DECSTAT= 4
##$DIGMOD= 1
##$DIGTYP= 9
##$DL= (0..7)
0 120 120 120 120 120 120 120 
##$DP= (0..7)
150 150 150 150 150 150 150 150 
##$DP07= 0
##$DPNAME0= <>
##$DPNAME1= <>
##$DPNAME2= <>
##$DPNAME3= <>
##$DPNAME4= <>
##$DPNAME5= <>
##$DPNAME6= <>
##$DPNAME7= <>
##$DPOAL= (0..7)
0.5 0.5 0.5 0.5 0.5 0.5 0.5 0.5 
##$DPOFFS= (0..7)
0 0 0 0 0 0 0 0 
##$DQDMODE= 0
##$DR= 18
##$DS= 0
##$DSLIST= <SSSSSSSSSSSSSSS>
$$ [...]
##$SUBNAM2= <"">
##$SUBNAM3= <"">
##$SUBNAM4= <"">
##$SUBNAM5= <"">
##$SUBNAM6= <"">
##$SUBNAM7= <"">
##$SUBNAM8= <"">
##$SUBNAM9= <"">
##$SW= 24.9337058887773
##$SWIBOX= (0..15)
0 0 2 0 0 0 0 0 0 0 0 0 0 0 0 0 
##$SW_h= 4990.01996007984
##$TD= 16384
##$TD0= 1
##$TE= 0
##$TE2= 300
##$TE3= 300
##$TEG= 300
##$TL= (0..7)
0 120 120 120 120 120 120 120 
##$TP= (0..7)
150 150 150 150 150 150 150 150 
##$TP07= 0
##$TPNAME0= <>
##$TPNAME1= <>
##$TPNAME2= <>
##$TPNAME3= <>
##$TPNAME4= <>
##$TPNAME5= <>
##$TPNAME6= <>
##$TPNAME7= <>
##$TPOAL= (0..7)
0.5 0.5 0.5 0.5 0.5 0.5 0.5 0.5 
##$TPOFFS= (0..7)
0 0 0 0 0 0 0 0 
##$TUNHIN= 0
##$TUNHOUT= 0
##$TUNXOUT= 0
##$USERA1= <user>
##$USERA2= <user>
##$USERA3= <user>
##$USERA4= <user>
##$USERA5= <user>
##$V9= 5
##$VALIST= <valist>
##$VCLIST= <CCCCCCCCCCCCCCC>
##$VD= 0
##$VDLIST= <DDDDDDDDDDDDDDD>
##$VPLIST= <PPPPPPPPPPPPPPP>
##$VTLIST= <TTTTTTTTTTTTTTT>
##$WBST= 1024
##$WBSW= 4
##$XGAIN= (0..3)
0 0 0 0 
##$XL= 0
##$YL= 0
##$YMAX_a= 1051060
##$YMIN_a= -606359
##$ZGOPTNS= <>
##$ZL1= 120
##$ZL2= 120
##$ZL3= 120
##$ZL4= 120
##$ABSF1= 10
##$ABSF2= 0
##$ABSG= 5
##$ABSL= 3
##$ALPHA= 0
##$AQORDER= 0
##$ASSFAC= 0
##$ASSFACI= 0
##$ASSFACX= 0
##$ASSWID= 0
##$AUNMP= <proc_1d>
##$AZFE= 0.1
##$AZFW= 0.1
##$BCFW= 1
##$BC_mod= 2
##$BYTORDP= 1
##$COROFFS= 0
##$CY= 11.3945322036743
##$DATMOD= 1
##$DC= 2
##$DFILT= <>
##$DTYPP= 0
##$F1P= 16.9975609425685
##$F2P= -3.02152046262296
##$FCOR= 0.5
##$FTSIZE= 0
##$FT_mod= 4
##$GAMMA= 1
##$GB= 0.15
##$INTBC= 1
##$INTSCL= 1
##$ISEN= 128
##$LB= 0.24
##$LEV0= 0
##$LPBIN= 0
##$MAXI= 10000
##$MC2= 0
##$MEAN= 0
##$ME_mod= 0
##$MI= 1.114404
##$NCOEF= 0
##$NC_proc= 0
##$NLEV= 6
##$NOISF1= 3.799351
##$NOISF2= 2.8
##$NSP= 1
##$NTH_PI= 0
##$NZP= 0
##$OFFSET= 15.70392
##$PC= 1
##$PHC0= -10147.66
##$PHC1= 12.6008
##$PH_mod= 1
##$PKNL= yes
##$PPARMOD= 0
##$PSCAL= 0
##$PSIGN= 0
##$REVERSE= no
##$SF= 200.130013532006
##$SI= 16384
##$SIGF1= 3
##$SIGF2= 2
##$SINO= 400
##$SIOLD= 16384
##$SREGLST= <1H.CDCl3>
##$SSB= 0
##$STSI= 0
##$STSR= 0
##$SW_p= 3612.71676300578
##$SYMM= 0
##$S_DEV= 0
##$TDeff= 0
##$TDoff= 0
##$TI= <>
##$TILT= no
##$TM1= 0
##$TM2= 0
##$TOPLEV= 0
##$USERP1= <user>
##$USERP2= <user>
##$USERP3= <user>
##$USERP4= <user>
##$USERP5= <user>
##$WDW= 1
##$XDIM= 8192
##$YMAX_p= 0
##$YMIN_p= 0
$$ End of Bruker specific parameters
$$ ---------------------------------
##NTUPLES= NMR FID
##VAR_NAME=  TIME,          FID/REAL,        FID/IMAG
##SYMBOL=    X,             R,               I
##VAR_TYPE=  INDEPENDENT,   DEPENDENT,       DEPENDENT
##VAR_FORM=  AFFN,          ASDF,            ASDF
##VAR_DIM=   8192,          8192,            8192
##UNITS=     SECONDS,       ARBITRARY UNITS, ARBITRARY UNITS
##FACTOR=    0.0002004,     1,               1
##FIRST=     0,             0,               0
##LAST=      1.6414764,     0,               0
##MIN=       0,             -606359,         0
##MAX=       1.6414764,     1051060,         0
$$ Real data points
##PAGE= N=1
##DATA TABLE= (X++(R..R)), XYDATA
$$ [...]
$$ plain form
3098 4975 9578 2592 -6844 -4211 5005 7816 1829 -3857 -3595 2962 7383 3055 -2492 -1569 2370
3113 2370 3683 2532 110 -2854 -1190 2675 2017 -1354 -1471 340 -593 -363 794 1409 895 -919
3129 -919 -2173 650 4251 2178 -4205 -4682 874 3288 900 -2638 -4726 -3139 2836 4711 -657
3144 -657 -4992 -3824 1186 5035 3433 -3337 -6861 -938 4548 2959 -1058 -4230 -4884 -860 4944
3159 4944 3780 -3110 -6381 -3071 3905 7084 1773 -6604 -5917 2753 6801 2194 -3685 -5731 -2677
3174 -2677 3665 5618 -570 -5798 -3177 2199 4045 2249 -718 -2436 104 2783 1611 1437 1943
3189 1943 -1068 -3977 81 5081 3609 -1289 -4069 -1951 3991 7175 1827 -4486 -2961 4375 7813
3204 7813 4610 -2642 -5592 1215 8807 5269 -4167 -5172 1900 6710 4269 -2096 -4483 1154 6926
$$ packed form
3098D975M603o986r436K633R216K811n987n686K62O557M421m328n547R23L939
3113B370J313j151k422k964J664L865o58l371j17J811r33K30J157O15n14j814
3129i19j254K823L601k073o383m77N556K414k388l538k088J587N975J875n368
3144f57m335J168N010L849j602o770l524N923N486j589m017l172o54M024N804
3159D944j164o890l271L310O976L179n311q377O87Q670M048m607n879k046L054
3174b677O342J953o188n228K621N376J846j796k967j718K540K679j172j74N06
3189A943l011k909M058N000j472m898k780K118N942L184n348o313J525P336L438
3204G813l203p252k950O807P592l538r436j005P072M810k441o365k387N637N772
$$ plain form
3219 6926 4323 -1161 -2067 1911 4257 3705 817 -2375 -769 3554 2957 -689 -951 1401 1137 672
3235 672 408 1032 2219 1096 -1843 -791 4415 4518 -2032 -5341 -1574 3082 4003 433 -5661 -5761
3251 -5761 2071 6188 1829 -4549 -6193 -1214 5911 6156 -2162 -7847 -2963 3871 3956 -208 -4674 -6108
3267 -6108 -1600 3750 3418 -2073 -5118 -4306 401 5015 3148 -4006 -6183 -974 3488 2948 -789 -4717
3283 -4717 -5984 -379 4313 1953 -3364 -5408 -2626 2160 3569 89 -4473 -3248 905 2155 1702
3298 1702 444 -3414 -5249 -877 3783 2508 -2100 -5842 -4257 2716 6587 1013 -6410 -5334 1733
3313 1733 6735 5692 -2023 -8407 -3179 7236 7405 -2020 -7852 -3649 4591 7933 1934 -4817 -3636
3328 -3636 3001 5203 2721 177 -644 212 2836 3888 937 -525 735 451 -546 1846 3631 2139
$$ packed form
3219F926k603n484r06L978K346n52k888l192J606M323n97l646k62K352k64m65
3235F72k64O24J187j123k939J052N206J03o550l309L767M656R21l570o094j00
3251e761P832M117m359o378j644M979P125K45q318n685M884O834Q5m164m466j434
3267f108M508N350l32n491l045Q12M707M614j867p154k177N209M462n40l737l928
3283d717j267N605M692k360n317k044K782M786J409l480m562J225M153J250m53
3298A702j258l858j835M372M660j275m608l742J585O973L871n574p423J076P067
3313A733N002j043p715o384N228J0415J69r425n832M203Q240L342n999o751J181
3328c636O637K202k482k544q21Q56K624J052k951j462J260k84r97K392J785j492
$$ plain form
3344 2139 -552 -1943 952 5612 5723 -1054 -4946 1224 7242 4815 -1323 -4263 -1895 4123 5162
3359 5162 -334 -4718 -1514 4036 4587 503 -3637 -3206 2556 5542 250 -4984 -2156 2889 2518 -1216
3375 -1216 -4146 -3754 147 2001 197 -2982 -2581 -1428 -259 1123 -327 -3413 -3366 8 669 -63
3391 -63 -809 -3220 -5037 -2711 1031 628 -2590 -4998 -4456 6 3200 -85 -5824 -5755 -1259 1758 1660
3408 1660 -808 -5731 -6475 -1236 2345 494 -4097 -7096 -5355 1190 4621 -530 -7034 -7283 -2164
3423 -2164 3034 3495 -2577 -9326 -6613 2112 5008 -1274 -8688 -8429 -2170 4136 1883 -5712 -7597
3438 -7597 -2518 1689 932 -2091 -4666 -4831 -1036 709 -1034 -3055 -3341 -3795 -3312 -938 229 -1494
3454 -1494 -2854 -3731 -2460 1743 2797 -3005 -7048 -2567 3662 3292 -1976 -6550 -5023 2039 4907
$$ packed form
3344B139k691j391K895M660J11o777l892O170O018k427o138k940K368O018J039
3359E162n496m384L204N550N51m084m140M31N762K986n292n234K828N045l71l734
3375a216k930L92L901J854j804l179M01J153J169J382j450l086M7L374O61p32
3391f3p46k411j817K326L742m03l218k408N42M462L194l285n739O9M496L017r8
3408A660k468m923p44N239L581j851m591k999J741O545L431n151o504k49N119
3423b164N198M61o072o749K713Q725K896o282p414K59O259O306k253p595j885
3438g597N079M207p57l023k575j65L795J745j743k021k86m54M83K374J167j723
3454a494j360q77J271M203J054n802m043M481O229l70n268m574J527P062K868
$$ plain form
3469 4907 -1358 -7451 -4665 1680 5129 1807 -4606 -6532 178 5887 2230 -4778 -5062 291 3578
3484 3578 2170 -2322 -4872 -1943 1702 789 -1252 -1086 -1084 -1364 161 574 -741 -1136 -1531 -1872 -921 1693
3502 1693 1153 -3275 -4820 -2277 618 1849 -1013 -5917 -3683 2211 3493 -1263 -4911 -4267 -991
3517 -991 2588 2183 -3249 -5899 -2090 1439 1585 -1786 -5110 -4727 637 4211 1313 -3840 -4462 -1602
3533 -1602 2035 2815 -213 -5404 -4050 1854 4461 1131 -3968 -6068 -2001 4429 3992 -1578 -5019
3548 -5019 -1476 2510 4196 1852 -2994 -4289 384 4434 2978 -139 -2243 -2502 -283 3118 2880
3563 2880 -325 -2420 -1751 787 5129 5311 -1015 -5195 -1627 4961 6871 2363 -4697 -5474 2329 8646
3579 8646 4197 -4441 -5601 160 6643 7306 443 -5144 -1482 5814 6041 1023 -1914 -708 2620
$$ packed form
3469D907o265o093K786O345L449l322o413j926O710N709l657p008k84N353L287
3484C578j408m492k550K929L645r13k041J66Kk80J525M13j315l95l95l41R51K614
3502A693n40m428j545K543K895J231k862m904K234N894J282m756l648O44L276
3517i91L579m05n432k650L809L529J46l371l324L83N364L574k898n153o22K860
3533a602L637P80l028n191J354N904K607l330n099k100M067O430m37n570l441
3548e019L543L986J686k344m846j295M673M050j456l117k104k59K219L401k38
3563B880l205k095O69K538M342J82o326m180L568O588J910m508p060p77P803O317
3579H646m449q638j160N761O483O63o863n587L662P296K27n018k937J206L328
$$ plain form
3594 2620 4750 2679 -656 364 2234 1614 907 2508 3547 2271 1247 930 1761 4002 3573 -364
3610 -364 -1135 2671 5113 3504 -311 -1651 439 4522 4018 -1097 -2470 2267 5583 3485 -621 -2397
3626 -2397 219 4548 4615 -1026 -3803 -343 3968 4070 435 -3493 -3322 1795 5079 1936 -2339 -2722
3642 -2722 -57 2742 3765 58 -4131 -3465 1228 3421 1908 -1257 -5007 -2896 1784 3954 392
3657 392 -3697 -3801 -288 3923 4081 -1033 -5444 -2631 1657 3364 1607 -1915 -4140 -2114 2755 2931
3673 2931 -249 -3378 -3749 -546 3741 4376 -797 -4662 -2804 1768 3897 2300 -3069 -6016 -432
3688 -432 5741 4068 -2734 -6111 -2646 3363 5915 1276 -4443 -3090 3010 4817 1577 -2648 -3800
3703 -3800 -67 3714 2809 -1291 -1965 76 806 724 1032 498 -419 462 425 1265 3040 2035 -1985 -3142
$$ packed form
3594B620K130k071l335J020J870o20p07J601J039j276j024l17Q31K241m29l937
3610c64p71L806K442j609l815j340K090M083n04n115j373M737L316k098m106j776
3626b397K616M329O7n641k777L460M311J02l635l928J71N117L284l143m275l83
3642b722K665K799J023l707m189O66M693K193j513l165l750K111M680K170l562
3657C92m089j04L513M211J58n114m411K813M288J707j757l522k225K026M869J76
3673B931l180l129l71L203M287O35n173l865J858M572K129j597n369k947N584
3688d32O173j673o802l377L465O009K552m639n719J353O100J807l240m225j152
3703c800L733L781r05m100o74K041P30q2L08n34r17Q81l7Q40J775j005m020j157
$$ plain form
3721 -3142 1112 4556 3210 -874 -3754 -978 5278 5780 -889 -5235 -1672 4951 6630 2394 -3779
3736 -3779 -3890 3197 7182 2332 -3739 -3483 1345 5130 4006 -1215 -3765 -377 3693 2696 330 -927
3752 -927 -303 1304 3232 2068 -729 -1162 137 598 761 1424 -417 -1729 -556 994 1098 -376 -1310
3769 -1310 -1967 676 3173 1255 -2682 -2559 -2 999 1084 -871 -3482 -2030 1782 1970 -622 -3146
3785 -3146 -3735 -1084 2548 2247 -2126 -4069 -1588 1177 1996 -17 -4082 -5734 -1260 3430 2544 -2542
3801 -2542 -5728 -3966 1107 4569 355 -5587 -4729 647 3850 2112 -2277 -5795 -3626 1723 3019
3816 3019 -307 -3409 -3033 -1435 1552 2070 -561 -2675 -2360 -1109 1174 3114 1845 -3223 -5032 -666
3832 -666 3891 3379 -1267 -5660 -3748 3389 6242 575 -5495 -4884 724 5987 4700 -3110 -6485 -471
$$ packed form
3721c142M254L444j346m084k880K776O256N02o669m346L563O623J679m236o173
3736c779j11P087L985m850o071K56M828L785j124n221k550L388M070r97k366j257
3752i27O24J607J928j164k797m33J299M61J63O63j841j312J173J550J04j474r34
3769a310o57K643K497j918l937J23K557J001Q5j955k611J452L812J88k592k524
3785c146n89K651L632l01m373j943K481K765Q19k013m065j652M474M690q86n086
3801b542l186J762N073L462m214n942Q58N376L203j738m389l518K169N349J296
3816C019l326l102L76J598K987N18k631k114L15J251K283J940j269n068j809M366
3832f66M557n12m646m393J912P137K853n667o070O11N608N263j287p810l375O014
$$ plain form
3848 -471 6282 4010 -2107 -4725 -1874 3186 4509 137 -3643 -1369 2292 2293 551 -836 -1154 703
3864 703 2580 1773 -1130 -1060 286 -83 164 1001 215 -969 -182 505 876 1160 -533 -3040 -801 2964
3882 2964 2813 -1132 -2896 -1892 872 2849 149 -4088 -3930 474 3027 1747 -2330 -4801 -2559
3897 -2559 2355 3543 -1347 -4212 -2723 145 2183 1271 -2357 -5275 -2807 979 2014 461 -3201
3912 -3201 -4533 -1718 2658 1981 -2557 -3904 -2218 274 2017 702 -2996 -4433 -1545 754 355
3927 355 -1230 -2765 -2917 -786 1679 -144 -2281 -2469 -2840 -1221 1381 2090 -2452 -4818 -2168 1245
3943 1245 2044 -1193 -5204 -5024 765 3887 374 -5064 -5125 -1306 3685 3193 -2724 -6655 -2492 4275
3959 4275 3952 -1902 -6150 -4180 1566 4647 81 -4702 -3378 886 2764 1214 -1280 -3250 -1461
$$ packed form
3848d71O753k272o117k618K851N060J323m372l780K274L661Jj742j387l18J857
3864G03J877q07k903P0J346l69K47Q37p86j184P87O87L71K84j693k507K239L765
3882B964j51l945j764J004K764J977k700m237J58M404K553j280m077k471K242
3897b559M914J188m890k865J489K868K038r12l628k918K468L786J035j553l662
3912c201j332K815M376o77m538j347J686K492J743j315l698j437K888K299l99
3927C55j585j535j52K131K465j823k137j88l71J619K602P09m542k366K650L413
3943A245P99l237m011J80N789L122l513n438o1L819M991m92n917l931M163O767
3959D275l23n854m248J970N746L081m566m783J324M264J878j550k494j970J789
$$ plain form
3974 -1461 1768 2226 -329 -1002 -902 -1013 185 1261 669 -526 -1510 -1433 538 3857 2175 -2733 -3055
3991 -3055 1483 3956 2965 -654 -2861 -1188 3337 3693 -611 -3144 -1492 1685 3165 1592 -1959
4006 -1959 -2690 1502 3431 621 -1653 -811 475 1420 1293 -731 -1525 -800 502 12 -179 -619 -1630
4023 -1630 -328 1575 757 -1446 -1648 -1036 -112 602 682 -1585 -2512 -994 410 643 -661 -3018 -3387
4040 -3387 264 2489 791 -2313 -3007 -1895 290 2496 813 -3227 -4125 -871 2555 2756 -986 -5451
4056 -5451 -4802 1693 4771 1441 -3949 -5164 -1653 4235 5047 -1258 -6897 -4053 3160 5468 1576
4071 1576 -4621 -5967 -301 4746 2885 -2819 -4259 -1326 1863 2966 1019 -2927 -2797 249 1351
4086 1351 818 287 -955 -2037 -709 893 1376 71 -1340 -2696 -1059 2880 3000 -1556 -3570 -988
$$ packed form
3974a461L229M58k555o73J00j11J198J076n92j195r84P7J971L319j682m908l22
3991c055M538K473r91l619k207J673M525L56m304k533J652L177J480j573l551
4006a959p31M192J929k810k274Q42J286R45j27k024p94P25J302m90j91m40j011
4023a630J302J903q18k203k02O12R24P14Q0k267r27J518J404K33j304k357l69
4040c387L651K225j698l104o94J112K185K206j683m040q98L254L426K01l742m465
4056e451O49O495L078l330n390j215L511N888Q12o305n639K844P213K308l892
4071A576o197j346N666N047j861n704j440K933L189J103j947l946J30L046J102
4086A351n33n31j242j082J328J602M83j305j411j356J637L939J20m556k014K582
$$ plain form
4102 -988 2266 3140 570 -3084 -2742 1777 4432 755 -2794 -2698 332 3420 2633 -1575 -3178 792
4118 792 3602 2065 -862 -1929 -504 1860 2681 641 -1383 -553 961 1159 1363 1004 -1027 -932 1496
4135 1496 2033 1613 573 -628 -1932 726 3016 2064 -1124 -2436 -647 2107 3707 302 -3893 -2670
4151 -2670 1779 3478 1498 -1522 -3299 -1275 2763 3202 -873 -3589 -2462 661 3185 1568 -2960
4166 -2960 -4403 -801 2646 1595 -1225 -2777 -2623 830 3139 220 -3747 -3179 -56 2275 1193
4181 1193 -2394 -4183 -1499 2201 1301 -2201 -2758 -1507 262 1534 -22 -2512 -2344 61 576 -301
4197 -301 -702 -1497 -1789 -294 884 7 -564 -1213 -2409 -1094 1972 2105 -1440 -3256 -1476 1623 3269
4214 3269 803 -4021 -4225 1143 4182 1661 -2636 -4360 -2014 2995 4228 -814 -4530 -2109 2246
$$ packed form
4102i88L254Q74k570l654L42M519K655l677l549R6L030L088p87m208j603L970
4118G92K810j537k927j067J425K364Q21k040k024Q30J514J98K04l59k031R5K428
4135A496N37m20j040j201j304K658K290r52l188j312J789K754J600l405m195J223
4151b670M449J699j980l020j777K024M038M39m075k716J127L123K524j617m528
4166b960j443L602L447j051k820j552J54L453K309k919l967N68L123K331j082
4181A193l587j789K684L700r00l502n57J251J769J272j556k490J68K405N15q77
4197c01m01p95k92J495J178q77n71o49j196J315L066J33l545j816J780L099J646
4214C269k466m824k04N368L039k521m297j724K346N009J233n042l716K421M355
$$ plain form
4229 2246 3368 786 -1758 -2553 124 2283 1281 -910 -1235 -935 -597 986 1635 85 -1177 -894
4245 -894 -230 1487 2371 461 -2153 -1448 1325 2498 1216 -1204 -2522 -16 3477 2252 -2187 -2602
4261 -2602 101 1961 2198 -209 -2402 -967 2937 2802 -675 -2362 -1614 1350 2587 1211 -2468 -2960
4277 -2960 864 2710 1381 -1358 -2775 -1006 2053 3200 401 -3179 -2635 768 2718 2256 -1416
4292 -1416 -4060 -1948 2421 2914 -141 -2698 -2918 -716 2590 2484 -1358 -3360 -1559 521 2077 1509
4308 1509 -1754 -3634 -1612 1271 1833 628 -1491 -3581 -2067 2134 3156 -72 -3516 -3228 -346
4323 -346 3553 2989 -2480 -5241 -1674 2976 3097 -34 -3845 -3965 846 4332 1172 -2691 -2992 -7
4339 -7 2267 2224 -605 -2771 -926 1680 1558 210 -418 -975 -864 919 1662 267 -597 -714 -348 1093
$$ packed form
4229B246J122k582k544p95K677K159j002k191l25L00L38J583O49j550j262K83
4245h94O64J717Q84j910k614P05K773J173j282k420j318K506L493j225m439m15
4261b602K703J860K37k407k193J435L904j35l477j687P48K964J237j376l679m92
4277b960L824J846j329k739j417J769L059J147k799l580N44L403J950m62l672
4292a416k644K112M369M93l055k557k20K202L306j06l842k002J801K080J556n68
4308A509l263j880K022K883N62j205k119k090J514M201J022l228l444K88K882
4323c46L899n64n469k761L567M650J21l131l811j20M811L486l160l863l01K985
4339gK274m3k829k166J845K606j22j348o28n57J11J783P43j395q64j17L66J441
$$ plain form
4357 1093 2722 957 -1753 -1295 1519 2688 1937 -974 -2731 -428 4237 3844 -1111 -2868 -879 2904
4373 2904 4460 1305 -3031 -2642 2412 4803 2038 -1574 -2950 -136 3552 4026 -545 -3195 -1061
4388 -1061 2099 2704 1641 -618 -2192 226 2969 2438 419 -776 -864 -41 2148 1930 -573 -1225 -199
4405 -199 586 1453 1756 -505 -1719 -108 1705 1020 499 -681 -1033 -48 2377 1516 -1369 -1136 -737 482
4423 482 1539 683 -1336 -1482 935 1701 430 -1095 -1538 -667 1685 2195 -740 -2491 -500 1502 1740
4440 1740 293 -2300 -2641 538 3197 761 -2147 -2335 -414 1946 2387 -313 -3325 -1384 1734 2031
4456 2031 161 -1456 -2268 -800 1662 1789 -250 -1518 -1422 -793 1185 2197 556 -2197 -2212 502 2426
4473 2426 2637 -699 -4029 -2243 2496 3930 358 -2942 -2808 425 4306 2976 -2002 -3745 -42
$$ packed form
4357A093J629j765k710M58K814J169p51k911j757K303M665l93m955j757J989L783
4373B904J556l155m336L89N054K391k765l612j376K814L688M74m571k650K134
4388a061L160O05j063k259j574K418K743n31k019j195q8Q23K189k18k503o52J026
4405a99P85Q67L03k261j214J611J813o85n21j180l52R85K425q61k885K33L99J219
4423D82J057q56k019j46K417P66j271j525m43Q71K352N10k935j751J991K002K38
4440A740j447k593l41L179K659k436k908j88J921K360M41k700l012J941L118K97
4456B031j870j617q12J468K462J27k039j268R6O29J978J012j641k753j5K714J924
4473B426K11l336l330J786M739J434l572l300J34L233L881j330m978j743L703
$$ plain form
4488 -42 3222 2911 44 -1965 -1231 2234 3472 618 -1487 -819 1272 2241 1749 110 -778 725 2289
4505 2289 1193 424 501 392 904 1955 1524 176 -35 516 785 1723 1647 13 -541 937 2687 1905
4523 1905 691 -665 -566 1611 3657 1695 -1246 -1322 512 2500 2998 634 -2613 -1760 2222 3589
4539 3589 1185 -1226 -2593 -765 2781 3873 -171 -3224 -1911 1233 3133 2374 -1530 -3836 -903
4554 -903 3055 3132 -15 -2379 -2677 253 3294 2496 -1548 -2824 -917 1403 2361 1102 -1726 -2612 -110
4571 -110 1905 1496 112 -1603 -2104 230 3055 1669 -1241 -2315 -1029 1428 2860 996 -2897 -2651
4587 -2651 1021 3291 1442 -1145 -2758 -1016 2997 3502 -854 -3169 -1099 2317 2828 570 -2588
4602 -2588 -2778 1160 3757 1183 -1754 -1776 -688 1691 2174 170 -2117 -1282 1203 1298 823 238 -1521
$$ packed form
4488d2L264l11k867k009P34L465J238k854k105O68K091R69m92j639q88J503J564
4505B289j096p69P7j09N12J051m31j348k11N51K69R38p6j634n54J478J750p82
4523A905j214j356R9K177K046j962k941p6J834J988M98k364l247Q53L982J367
4539C589k404k411j367J828L546J092m044l053J313L144J900p59l904k306K933
4554i03L958P7l147k364k98K930L041p98m044j276J907K320R58j259k828q86K502
4571a10K015m09j384j715n01K334K825j386k910j074J286K457J432j864l893K46
4587b651L672K270j849k587j613J742M013N05m356k315K070L416N11k258l158
4602b588j90L938K597k574k937k2J088K379M83k004k287Q35K485R5m75n85j759
$$ plain form
4619 -1521 -1470 767 1897 1224 -355 -1579 -1341 909 2915 1101 -1955 -2112 410 2831 3180 68
4635 68 -2824 -1697 2458 3788 813 -1340 -2072 148 3315 3052 -776 -2294 -276 2141 2618 1377
4651 1377 -1022 -1423 1031 2325 1461 -257 -800 -591 1095 2104 783 -1349 -818 852 1179 904 410
4668 410 -1089 -451 1337 1390 -491 -1001 -322 81 1060 679 -1115 -1508 61 1223 323 -313 -1319 -1342
4686 -1342 -14 1435 716 -1737 -2234 -1041 606 1525 128 -2835 -2588 734 2167 762 -1579 -3540
4702 -3540 -1832 2029 2942 -905 -3287 -2249 664 2404 1365 -2338 -3791 -580 2502 1487 -505
4717 -505 -2264 -1930 582 2179 683 -1324 -1513 -427 337 1147 956 -957 -1595 -15 1080 831 892
4734 892 -492 -1573 -285 2091 1263 -955 -1804 -787 1046 2584 520 -2085 -1692 1275 2314 1127
$$ packed form
4619a521N1K237J130o73j579j224K38K250K006j814l056j57K522K421L49l112
4635F8k892J127M155J330k975k153p32K220L167k63l828j518K018K417M77j241
4651A377k399m01K454J294q64j718n43K09J686J009j321k132N31J670L27k75m94
4668D10j499O38J788N3j881n10O79M03R79l81j794l93J569J162r00o36j006k3
4686a342J328J449p19k453m97J193J647R19j397k963K47L322J433j405k341j961
4702c540J708L861R13l847k382J038K913J740j039l703j453L211L082j015j992
4717e05j759L34K512J597j496k007j89J086P64Q10j91j913o38J580J095k49O1
4734H92j384j081J288K376q28k218q49J017J833J538k064k605L93K967J039j187
$$ plain form
4750 1127 -1128 -1672 51 2454 2185 -1176 -2160 -193 2256 2147 658 -1812 -1323 1395 2977 910
4766 910 -934 -1178 -100 1669 2782 334 -1698 -1183 964 2338 1626 -203 -1858 -851 2158 2837
4782 2837 857 -1284 -1927 -333 2282 3156 227 -2326 -1196 1427 2728 2093 -864 -2756 -588 2742
4798 2742 3141 778 -1852 -2420 176 3047 2605 -1076 -3103 -935 1825 3082 940 -2424 -2950 482
4814 482 3011 1676 -910 -2220 -1207 1563 2476 66 -2762 -1830 732 1553 1025 -495 -2005 -1053
4830 -1053 1302 1225 -217 -879 -1047 -660 1062 1379 -361 -1550 -1115 228 1094 1073 -866 -2399 -823
4847 -823 1850 1916 -563 -2068 -2063 372 3051 1331 -2115 -2508 155 2428 2158 -122 -2674 -1838 1694
4864 1694 3294 464 -1775 -1824 24 2425 2220 -608 -2186 -407 1843 1884 712 -917 -1247 -43
$$ packed form
4750A127k255n44J723K403k69l361r84J967K449j09j489k470M89K718J582k067
4766I10j844k44J078J769J113k448k032N15K147J374p12j829j655J007L009O79
4782B837j980k141o43J594K615Q74k929k553J130K623J301o35k957j892K168L330
4798B742L99k363k630n68K596K871m42l681k027K168K760J257k142l364n26L432
4814D82K529j335k586j310J013K770R13k410k828R32K562Q21n28j520j510R52
4830a053K355p7j442o62j68L87J722L17j740j189M35J343Q66k1j939j533J576
4847h23K673O6k479j505NK435K679j720l446l93K663K273k70k280k552Q36L532
4864A694J600k830k239m9J848K401k05k828j578J779K250M1j172j629l30J204
$$ plain form
4880 -43 1954 1704 246 -594 -617 152 1947 1913 -78 -1354 -425 1112 2104 1714 -158 -1543 -81 2248
4898 2248 1681 243 -879 -387 1317 2383 939 -1270 -545 1258 1735 1288 158 -839 -84 1943 1541
4915 1541 -111 -690 218 738 1499 1284 -777 -1073 783 1948 767 -435 -856 -538 1098 2139 157
4932 157 -1781 -795 1037 1314 969 -882 -1865 -531 1444 1669 -29 -1013 -1486 -550 1337 1926 -118
4949 -118 -1675 -933 257 1343 1182 -832 -2234 -979 1762 1823 205 -1498 -2664 -399 2539 1850
4965 1850 -1550 -2528 -964 1163 2232 93 -2527 -2724 526 2340 662 -1558 -1957 -812 1212 1544
4981 1544 -571 -2054 -991 751 1063 263 -519 -1850 -810 909 683 -533 -1025 -833 -140 1218 936
4998 936 -857 -1715 -356 990 1017 566 -1369 -2037 72 1996 1099 -633 -1882 -1317 1001 2740 978
$$ packed form
4880d3J997k50j458q40k3P69J795l4j991j276R29J537R92l90j872j385J462K329
4898B248n67j438j122M92J704J066j444k209P25J803M77m47j130r97P55K027m02
4915A541j652n79R08N20P61k15k061k96J856J165j181j202m21L18J636J041j982
4932A57j938R86J832K77l45j851r83J334J975K25j698r84m73R36J887N89k044
4949a18j557P42J190J086j61k014j402J255K741O1j618j703j166K265K938o89
4965A850l400r78J564K127J069k139k620j97L250J814j678k220l99J145K024L32
4981A544k115j483J063J742L12q00p82j331J040J719k26j216m92J92O93J358k82
4998I36j793q58J359J346K7m51j935o68K109J924q97j732j249N65K318J739j762
$$ plain form
5015 978 -2288 -1988 808 2195 1972 -323 -2334 -1464 2021 3094 85 -2047 -1628 518 2677 2257
5031 2257 -630 -2437 -596 1517 2059 1375 -723 -2197 -212 2550 2402 -165 -1574 -1453 605 2623
5047 2623 1884 -1183 -1985 -417 1192 1964 937 -1823 -2577 122 2398 1249 -1010 -1995 -1347 1070
5063 1070 2292 801 -1941 -2173 -363 1223 1228 -186 -2832 -1610 1055 2023 93 -1850 -2061 -209
5079 -209 1467 1269 -1167 -2444 -647 1394 1276 19 -1495 -1903 317 1690 502 -1247 -1082 -384
5095 -384 455 1383 184 -1737 -1279 246 666 616 22 -1484 -1396 721 1818 637 -1071 -1396 -881 1278
5113 1278 1975 -8 -2464 -1390 774 1916 782 -1220 -2533 -904 1901 1616 -652 -1685 -1145 241
5129 241 1713 1259 -1087 -1969 -59 1495 924 -54 -767 -1210 745 1579 464 -670 -284 219 347 831
$$ packed form
5015I78l266L00K796J387k23k295k011Q70L485J073l009k132M19K146K159m20
5031B257k887j807J841K113N42o84k098j474J985K762j48k567j409J21K058K018
5047B623p39l067q02J568J609P72j027k760p54K699K276j149k259r85O48K417
5063A070J222j491k742k32J810J586Nj414k646J222K665R68j930j943k11J852
5079b09J676j98k436j277J797K041j18j257j514m08K220J373j188j749J65O98
5095c84Q39R28j199j921M58J525M20n0n94j506Q8K117J097j181j708l25N15K159
5113A278O97j983k456J074K164J142j134k002j313J629K805k85k268j033N40J386
5129B41J472m54k346q82J910J554n71r78p13m43J955Q34j115j134L86N03J28M84
$$ plain form
5147 831 360 -795 -258 1042 800 220 351 -391 52 1101 1213 96 -231 541 783 1120 1170 -111 -1023
5166 -1023 653 2040 1102 -66 -522 -108 1157 2231 835 -1098 -323 675 1598 1301 -18 -1783 -448
5183 -448 2046 2249 325 -1285 -1244 429 1784 1821 -780 -2158 -551 1593 2100 803 -1606 -2134 -5
5200 -5 2305 1578 -584 -1417 -1029 757 1876 848 -1537 -1890 -222 1358 1332 162 -1622 -1650 391 1901
5218 1901 593 -685 -1750 -1102 891 2249 554 -2014 -1666 63 1651 1521 -813 -2325 -792 1821
5234 1821 1869 -184 -1610 -1305 397 2058 1263 -906 -1680 1 1906 1345 89 -1096 -1400 970 2337
5251 2337 687 -1068 -1110 -400 1129 1961 196 -1814 -1049 873 1790 1077 -361 -1791 -970 1132 2551
5268 2551 670 -1350 -1489 -275 1955 2151 -262 -2556 -918 1645 2297 1098 -1237 -2409 -277 2519
$$ packed form
5147H31m71j155N37J300k42n80J31p42M43J049J12j117l27P72K42L37N0j281r12
5166a023J676J387r38j168m56M14J265J074j396j933P75R98R23k97j319j765J335
5183d48K494K03j924j610M1J673J355L7k601j378J607K144N07j297k409n28K129
5200eK310p27k162q33L88J786J119j028k385l53J668J580k6j170j784k8K041J510
5218A901j308j278j065O48J993J358j695k568L48J729J588j30k334j512J533K613
5234A821M8k053j426L05J702J661p95k169p74J681J905n61j256j185l04K370J367
5251B337j650j755m2P10J529Q32j765k010P65J922R17p13j438j430Q21K102J419
5268B551j881k020j39J214K230J96k413k294J638K563O52j199k335j172K132K796
$$ plain form
5284 2519 1958 -399 -1973 -1103 1010 2743 1791 -1146 -1896 22 2031 1846 219 -1344 -1585 1129
5300 1129 2339 1026 -1175 -1241 -59 1218 1942 474 -1555 -1044 633 1226 932 -385 -1225 -867 1344
5317 1344 1656 -21 -1335 -927 -121 1042 1450 -617 -1663 -416 892 791 105 -1013 -1701 -179 1927
5334 1927 584 -1162 -1893 -789 406 1150 -158 -2071 -1946 341 1455 340 -1194 -2070 -1171 1203
5350 1203 1005 -849 -2201 -1466 187 936 806 -1436 -2186 -892 903 918 -336 -1013 -1818 -932 992
5367 992 749 -1108 -1636 -939 58 1059 915 -858 -1865 -630 908 903 -146 -1526 -1543 252 1218 312
5385 312 -1455 -1002 -341 500 929 -263 -1380 -830 704 719 -303 -532 -629 -76 1379 714 -945 -1132
5403 -1132 114 905 570 141 -1041 -805 1001 1672 83 -888 -1131 178 1300 1609 -330 -1312 -404
$$ packed form
5284B519n61k357j574Q70K113J733r52k937p50J918K009j85j627j563k41K714
5300A129J210j313k201o6J182J277P24j468k029N11J677N93k94j317q40L58K211
5317A344L12j677j314M08Q06J163M08k067j046J247J308j01o86j118o88J522K106
5334A927j343j746p31J104J195P44j308j913J25K287J114j115j534q76Q99K374
5350A203j98j854j352P35J653P49j30k242p50J294J795J5j254o77q05Q86J924
5367I92k43j857n28O97R97J001j44j773j007J235J538nj049j380j7J795R66r06
5385C12j767M53O61Q41M29j192j117N50J534J5j022k29r7N53J455o65j659j87
5403a132J246P91l35m29j182K36J806O71j589r71k43J309J122L09j939r82R08
$$ plain form
5420 -404 1314 1028 65 -657 -1303 -368 1814 1676 -283 -1162 -867 235 1722 1665 -1039 -1893 -190 1138
5438 1138 1569 512 -1256 -2226 -24 2250 1622 -659 -1780 -775 1091 2128 778 -1963 -1625 87
5454 87 1941 1593 239 -1494 -1699 831 2029 303 -1491 -1197 -137 1393 1396 -367 -2294 -1271 685
5471 685 1118 545 -528 -1632 -551 1446 1321 -635 -1732 -713 165 1541 1243 -957 -1888 -623 760
5488 760 1373 220 -1367 -1683 123 2265 819 -1317 -1803 -865 859 1789 296 -1912 -1647 710 2277
5505 2277 984 -1289 -2202 -1058 1467 2293 -507 -1702 -884 458 1451 974 -749 -2132 -466 1566
5521 1566 1666 456 -1005 -1688 -151 1739 1418 -623 -881 -303 565 1693 1114 -1037 -1574 45 1790
5538 1790 1624 394 -828 -856 863 1741 460 -462 -380 241 1305 1839 633 -1116 -933 862 1455 966
$$ packed form
5420d04J718k86r63p22o46R35K182j38j959q79K95J102J487n7k704q54J703J328
5438A138M31j057j768r70K202K274o28k281j121J005J866J037j350k741L38J712
5454H7J854l48j354j733k05K530J198j726j794K94J060J530Lj763j927J023J956
5471F85M33n73j073j104J081J997j25j956j097J019Q78J376k98k200r31J265J383
5488G60O13j153j587l16J806K142j446k136m86R38J724R30j493k208K65K357J567
5505B277j293k273r13J144K525Q26k800j195Q18J342R93m77j723j383J666K032
5521A566J00j210j461o83J537J890l21k041k58N78Q68J128n79k151n37J619J745
5538A790j66j230j222k8J719Q78j281r22Q2O21J064N34j206j749J83J795N93m89
$$ plain form
5556 966 -638 -841 224 1467 1591 -476 -1185 -413 747 1408 986 -660 -1411 565 1643 535 -427
5573 -427 -1067 -418 909 1504 340 -925 -691 178 802 670 -63 -1413 -1050 1519 1736 217 -750 -1115
5591 -1115 -607 1155 1924 186 -1124 -444 553 1240 1050 -412 -2111 -260 1984 1787 -36 -1195 -1372
5608 -1372 190 1736 1239 -965 -1205 -42 1084 1368 228 -1299 -1423 623 1602 92 -599 -378 -325
5625 -325 713 1125 102 -1075 -118 587 600 743 -150 -639 -134 928 284 -512 -94 258 353 1094 543
5644 543 -533 -575 63 810 424 279 -704 -344 1039 1580 95 -1045 -581 190 1172 1509 283 -1048
5662 -1048 -632 1073 1341 266 -749 -970 152 2202 1647 -345 -1357 -347 737 1465 1036 -883
5678 -883 -1220 307 1766 1488 202 -1210 -878 659 2228 1121 -435 -568 -13 598 1517 592 -1286
$$ packed form
5556I66j604k03J065J243J24k067p09P72J160O61m22j646p51J976J078j108r62
5573d27o40O49J327N95j164j265K34Q69O24j32p33j350L63K569K17j519r67l65
5591a115N08J762P69j738j310O80R97O87j90j462j699J851K244j97j823j159j77
5608a372J562J546m97k204k40J163J126K84j140j527j24K046R79j510o91K21N3
5625c25J038M12j023j177R57P05J3J43q93m89N05J062o44p96M18L52R5P41n51
5644E43j076m2O38P47l86j45r83L60J383N41j485j140M64P71R82L37j226j331
5662a048M16J705K68j075j015k21J122K050n55j992j012J010J084P28m29j919
5678h83l37J527J459k78j286j412L32J537J569j107j556j33N55O11R19r25j878
$$ plain form
5695 -1286 -1365 845 1923 983 -99 -1236 -897 854 1584 138 -891 -948 266 1358 1701 -444 -2362
5712 -2362 -932 1095 1420 365 -945 -1235 195 1366 580 -996 -1746 -765 848 1590 734 -1366 -1954
5729 -1954 373 1413 523 -609 -1361 -972 1047 1416 73 -1695 -1177 -15 949 1065 -399 -1479 -756
5746 -756 787 1126 81 -987 -1403 -805 897 1235 -200 -1115 -1011 -392 1163 1233 -524 -1760 -398
5763 -398 1062 974 184 -1137 -1811 -788 1240 1065 -465 -1273 -661 611 1134 710 -1412 -1571 559 985
5781 985 489 -277 -779 -845 2 1093 -204 -987 -698 206 351 610 -318 -1355 -755 468 176 -421 -120
5800 -120 -459 -92 452 463 -864 -1318 375 578 664 236 -531 -1030 343 1197 -264 -735 -727 -409 822 1207
5820 1207 433 -1641 -1084 623 1135 563 -377 -1263 -309 1106 1092 -265 -1408 -978 184 1411 1263 -900
$$ packed form
5695a286p9K210J078r40j082j137L39J751P30j446j029n7J214J092L43k145j918
5712b362J430K027L25j055j310k90J430J171p86j576p50R81J613P42q56k100n88
5729a954K327J040q90j132p52L89K019L69j343j768N18J162R64J16j464j080P23
5746g56J543L39j045j068m16N98J702L38j435r15J04O19J555P0j757j236J362
5763c98J460q8p90j321o74J023K028j75j530q08O12J272N23m24k122j59K130M26
5781I85m96p66n02o6Q47J091j297p83K89R04J45K59r28j037O00J223k92n97L01
5800a20l39L67N44J1j327m54J693K03Q6m28p67m99J373Q54j461m71QL18J231L85
5820A207p74k074N57J707N12n72r40q86R54J415j4j357j143M30J162J227j48k163
$$ plain form
5838 -900 -1582 -136 797 538 -370 -1469 -968 36 1408 738 -501 -564 -561 -301 729 548 -871 -700 320
5857 320 129 552 -33 -894 -1307 -325 615 605 -121 -464 -946 37 700 -338 -1184 -754 293 648 546 -12
5877 -12 -950 -798 400 356 -290 -672 -625 73 999 427 -1327 -1098 340 732 487 -222 -615 -471 547 825
5897 825 -277 -1454 -730 284 824 1154 -240 -1128 -126 874 608 -178 -418 -980 -164 964 1282 -375
5915 -375 -1356 -633 -118 1099 1074 -470 -1194 169 1527 645 -540 -1079 -1351 219 1898 1000 -735 -1070
5933 -1070 4 922 969 -142 -1428 -666 974 1254 555 -132 -820 -155 1000 1260 95 -831 254 1060
5951 1060 984 479 -787 -1020 377 1214 848 46 -246 -330 131 764 646 -733 -595 377 614 940 657
5970 657 -864 -1285 111 858 532 -99 -838 -749 614 1760 575 -1645 -977 -213 1162 1154 156 -1353
$$ packed form
5838i00o82J446R33k59r08j099N01J004J372o70j239o3LK60J030j81j419J71J020
5857C20j91M23n85q61m13R82R40j0p26l43m82R83O63j038q46M30J047L55j02n58
5877a2r38J52J198m4o46l82M7O98R26n72j754K29J438L92k45p09l93J44J018K78
5897H25j102j177P24J014N40L30j394q88J002J000k66p86k40n62Q16J128L18j657
5915c75r81P23N15J217k5j544p24J363J358q82j185n39k72J570J679q98j735l35
5933a070J074R18M7j111j286P62J640K80o99o87o88O65J155K60j165r26J085Q06
5951A060p6n05j266k33J397Q37l66q02k92q4M61O33j18j379J38R72K37L26k83
5970F57j521m21J396P47l26o31p39Q9J363J146j185k220O68P64J375qr98j509
$$ plain form
5988 -1353 -1062 945 1246 146 -1283 -1340 -342 1332 1245 -399 -1651 -835 175 960 790 -853 -1532 -554
6006 -554 969 956 -214 -1192 -1352 -493 1235 851 -387 -1192 -280 80 387 571 -757 -1231 202 1115
6024 1115 458 21 -562 -898 -235 851 265 -643 -106 -68 357 600 211 -973 -822 784 811 -251 -720
6043 -720 -78 111 464 29 -1105 -338 291 600 389 -191 -440 -409 643 583 -673 -749 22 639 744 792
6063 792 -443 -754 -174 639 240 235 142 -477 30 966 539 -422 -660 -235 170 1004 853 -249 -972 -245
6083 -245 719 701 307 -318 -958 366 1373 671 -286 -874 -614 352 1197 546 -998 -985 691 1186 374
6102 374 -253 -1259 -654 621 1133 191 -692 -149 60 250 260 -51 -932 -192 890 211 -245 -368 -183
6121 -183 -197 735 371 -898 -254 -71 261 458 276 -1208 -1160 190 621 416 -265 -766 -630 581 1197
$$ packed form
5988a353K91K007L01j100j429n7R98J674q7j644j252Q16J010P85j70j643o79R78
6006e54J523j3j170r78j60Q59J728l84j238q05R12L60L07J84j328m74J433R13
6024A115o57m37n83l36O63J086n86r08N37L8M25K43l89j184J51J606K7j062m69
6043g20O42J89L53m35j134P67O29L09k11n80k49L1J052o0j256p6P71O17J05M8
6063G92j235l11N80Q13l99nr3o19N07R36m27r61k38M25M05Q34j51j102p23P27
6083b45R64j8l94o25o40J324J007p02r57n88K60R66Q45o51j544J3J676M95q12
6102C74o27j006O05J275N12r42q83N43K09J90J0l11q81P40J082o79m56j23J85
6121a83j4R32l64j269O44J83L32J97j82j484M8J350M31k05o81n01J36J211O16
$$ plain form
6140 1197 -94 -1173 -915 370 1116 1083 -399 -1288 -577 699 803 -293 -729 -687 -161 1090 1043 -812
6158 -812 -1489 -264 438 798 416 -804 -850 389 834 273 -726 -581 -420 -8 1142 664 -670 -296 -173
6177 -173 4 339 432 -515 -730 365 502 373 155 -500 -949 -88 1161 584 -799 -553 278 910 867 -444
6197 -444 -1360 -85 985 1036 -31 -831 -872 56 978 400 -672 -919 164 939 790 378 -680 -724 472
6216 472 1253 298 -642 -431 -248 649 1565 -29 -1478 -628 353 1004 777 -298 -1160 -691 943 882 76
6235 76 -879 -597 12 1126 1206 -119 -1083 -770 475 913 863 -152 -1310 -216 1048 994 -226 -867 -859
6254 -859 -191 1506 519 -873 -1007 -138 518 298 -52 -475 -755 -31 528 292 -73 -641 -986 -61 433
6273 433 -54 -290 -146 352 -266 289 100 -714 -592 343 221 -14 128 -133 -381 -66 376 -415 -428 184
$$ packed form
6140A197j291j079K58J285P46l3j482q89P11J276J04j096m36M2N26J251m7j855
6158h12o77J225P02L60l82j220m6J239M45n61r99J45J61M12J150m78j334L74J23
6177a73J77L35R3r47k15J095J37j29k18o55m49Q61J249n77j383K46Q31O32m3j311
6197d44r16J275J070N1j067q00m1R28R22n78j072k47J083P75j49m12j058m4J196
6216D72P81r55r40K11J83Q97R16j594j449Q50R81O51k27j075q62M69J634o1q06
6235G6r55K82O09J114Q0j325r64L13J245M38n0j015j158J094J264n4j220o41Q
6254h59O68J697r87j392j34Q69O56k20l50m23k80P24N59k36l65n68l45R25M94
6273D33m87k36J44M98o18N55j89q14J22R35j22k35J42k61k48L15M42p91j3O12
$$ plain form
6293 184 -112 -81 382 175 -579 -258 385 113 -247 -293 -128 537 718 76 -1206 -570 623 369 5 -473
6313 -473 -470 -144 983 975 -829 -988 -146 729 725 59 -973 -877 686 777 195 -291 -233 -532 467 871 140 -805
6335 -805 -706 91 258 190 -1 -549 -327 574 499 82 -285 -576 -218 703 1086 -329 -981 -193 559 670 268
6356 268 -522 -785 39 963 611 9 -543 -694 8 1161 680 -418 -548 507 1010 744 -100 -865 -610
6375 -610 763 1138 118 -458 -660 -112 896 1111 -159 -943 152 1099 615 422 -297 -814 -383 658
6393 658 655 180 -381 -492 -174 1033 1072 -304 -826 -533 509 1162 1063 -267 -1274 -212 753 1122 98
6412 98 -838 -957 169 1557 832 -461 -802 -144 653 859 478 -445 -576 723 1191 338 -613 -529 -134
6431 -134 773 1079 17 -623 241 524 58 429 -55 -690 -94 643 664 113 -348 -72 -138 499 567 -422 -571
$$ packed form
6293A84k96L1M63k07p54L21O43k72l60m6J65O65J81o42j282O36J193k54l64m78
6313d73LL26J127qj804j59Q42Q75mo66j032R6J563R1n82m86N8k99R99M04p31r45
6335h05R9P97J67o8j91n48K22R01p5m17l67k91L58R21L83j415o52P88P52J11m02
6356B68p90k63Q24R24l52o02n52j51P02J153m81j098j30J055N03k66q44p65K55
6375f10J373L75j020n76k02N48J008K15j270p84J095R47m84j93p19n17M31J041
6393F58lm75n61j11L18J207L9j376n22K93J042O53r9j330j007J062R65L69j024
6412I8r36j19J126J388p25j293l41O58P97K06l81r23j31J299M68q53r51Q4L95
6431a34R07L06j062o40Q64K83m66L71m84o35N96P37K1n51m61K76o6O37O8r89j49
$$ plain form
6452 -571 19 518 715 459 -157 -800 299 1198 184 -378 -348 -199 946 908 -277 -1152 -552 685 1016
6471 1016 431 -79 -1120 -313 962 835 -239 -743 -288 243 478 581 -522 -1125 -96 396 569 432
6489 432 -321 -666 46 759 363 -266 -626 -342 -33 646 685 -592 -713 -273 355 377 416 -607 -852 226
6509 226 613 252 -403 -554 -753 149 636 159 -880 -628 -55 378 111 -277 -997 -573 715 381 -319
6528 -319 -225 -95 -174 146 -182 -671 -451 408 255 -203 -584 -520 -278 364 198 -613 -676 -112 463 13 157
6549 157 -818 -726 -471 413 342 -309 -415 -417 -191 441 52 -999 -764 -71 6 463 158 -409 -1050 -147 710
6570 710 103 -392 -746 -639 199 772 -208 -1172 -1151 71 330 515 -92 -972 -452 615 797 -120 -751 -559
6590 -559 321 552 435 -627 -834 -74 195 93 79 -210 -514 196 978 442 -373 -745 -362 117 501 296
$$ packed form
6452e71N90M99J97k56o16o43J099Q99j014n62L0J49J145l8j185q75O00J237L31
6471A016n85n10j041Q07J275j27j074n04M55N31K35J03j103o03J029M92J73j37
6489D32p53l45P12P13l96o29l60K84L09O79L9j277j21M40O28K2L9j023k45J078
6509B26L87l61o55j51j99R02M87m77j039K52N73M33k67l88p20M24J288l34p00
6528c19R4J30p9L20l28m89K20Q59j53m58l81O4K42O42j66q11o3N64N75m50J44
6549A57r75R2K55Q84p1o51j06kK26O32l89j051K35O93P7M57l05n67o41R03Q57
6570G10o07m95l54J07Q38N73r80r64K1J222K59J85o07q80N20J067J82r17o31J92
6590e59Q80K31j17j062k07P60K69j02j4k89l04P10P82n36q15l72L83M79L84k05
$$ plain form
6610 296 -623 -411 77 451 760 -139 -987 -670 665 1328 433 -612 -843 36 863 1250 -156 -1145 -369
6629 -369 426 938 763 -348 -1473 -551 1077 875 -39 -863 -620 -82 1283 985 -748 -1235 -177 637
6647 637 1016 489 -712 -1062 206 1042 297 -396 -406 -482 247 669 479 -696 -814 -316 368 933 598 -865
6667 -865 -955 148 951 437 -524 -979 -540 721 970 50 -678 -568 374 566 345 -256 -999 -47 814 759
6687 759 -46 -518 -103 42 622 385 -525 -580 312 375 -64 45 -520 -463 92 535 -70 -655 111 -46 59
6708 59 523 -36 -444 -120 142 497 126 -87 -607 -514 410 490 -80 -381 -524 -53 995 667 -377 -1111
6728 -1111 -439 819 607 372 -548 -594 85 814 241 -446 -841 -101 516 756 416 -472 -668 224 192 -97
6748 -97 -225 -287 -699 261 561 -94 -213 -166 -3 163 536 11 -542 72 397 261 -171 -415 -244 -27 700
$$ packed form
6610B96r19K12M88L74L09q99q48L17J335O63q95j045k31Q79Q27L87j406r89P76
6629c69P95N12j75j111j125R22J628k02r14q24K43N38J365k98j733m87J058Q14
6647F37L79n27j201l50J268Q36p45o93j0p6P29M22j90j175j18M98O84N65l35j463
6667h65r0J103Q03n14r61m55M39J261K49r20p28J10R42J92k21o01p43R52Q61n5
6687G59q05m72M15J45N80k37r10n5Q92O3m39J09n65N7N55M43o05n85P66j57J05
6708E9M64n59m08L24K62L55l71k13n20R3R24Q0n70l01j43M71J048l28j044p34
6728a111O72J258k12k35r20m6O79P29n73o87l95P40O17K40l40q88j96Q92l2k89
6748i7j28o2m12R60L00o55j19M7J63J66L73n25n53O14L25j36m32k44J71K17P27
$$ plain form
6769 700 465 -503 -535 191 148 -19 -68 -130 -429 116 388 183 -523 -320 117 34 571 -59 -605 -186 241 330
6791 330 144 -273 -1185 -438 430 509 -184 -758 -655 49 835 138 -932 -779 299 692 505 -176 -687 -589
6811 -589 346 488 -115 -398 -239 -138 48 388 -286 -910 -622 32 510 419 -355 -784 -519 449 733 54
6831 54 -596 -562 -120 513 554 -612 -973 -161 575 585 39 -604 -654 277 1011 368 -739 -1302 -124 774 1028
6852 1028 242 -968 -763 311 1012 193 -608 -1172 -361 817 1018 52 -897 -254 105 643 1113 -150
6870 -150 -1122 -455 360 745 357 -587 -898 -427 661 1044 39 -1127 -772 221 932 954 -355 -1037 -145
6889 -145 712 943 379 -525 -847 -44 942 733 -291 -887 -273 435 1111 511 -853 -655 29 667 551
6908 551 194 -644 -708 628 885 277 -266 -501 14 523 702 134 -587 -410 -42 57 53 -90 -422 -189 163
$$ packed form
6769G00k35r68l2P26m3j67m9o2k99N45K72k05p06K03M37q3N37o30n46M19M27Q9
6791C30j86m17r12P47Q68P9o93n74J03P04P86o97j070J53J078L93j87o81n11R8
6811e89R35J42o03k83J59J01J86L40o74o24K88O54M78r1p74m29K65R68K84o79
6831E4o50L4M42O33M1j166l61Q12P36J0n46o43n0R31P34o43j107n63J178Q98K54
6852A028p86j210K05J074P01q19q01n64Q11J178K01r66r49O43L59N38M70j263
6870a50r72O67Q15L85l88r44l11M71J088L83j005j166L55R93P11K2j309o82Q92
6889a45Q57K31n64r04l22Q03R86k09j024n96O14P08O76o00j364J98O84O38j16
6908E51l57q38o4J336K57o08n43k35N15N09J79n68p21J77L68R9mj43l32K33L52
$$ plain form
6929 163 312 -48 -117 -390 -407 114 326 3 -313 -47 607 182 113 -584 -576 -70 596 38 -453 -318 131 7
6951 7 121 43 -722 -332 588 476 -15 -495 -320 -306 233 376 -629 -765 109 168 15 122 -473 -569 46 260
6973 260 106 46 -339 -478 46 409 105 -534 -471 207 70 -36 12 -397 -601 220 231 -78 -340 68 -149
6994 -149 384 441 -256 -404 -146 66 138 456 -219 -703 41 767 72 -373 -499 -203 347 443 -225 -742 -447
7015 -447 482 362 19 -243 -603 16 720 551 -378 -830 -97 287 527 241 -355 -1045 -195 565 557 61 -255
7036 -255 -615 -40 847 361 -299 -601 -179 219 589 419 -465 -512 -133 282 469 3 -728 -701 -35 781 362
7057 362 -622 -298 -352 509 662 -49 -1075 -766 421 603 166 -497 -627 -41 617 504 -552 -671 -385
7076 -385 -52 50 247 -476 -680 -28 331 370 -341 -555 -401 -103 693 91 -662 -484 -205 212 314 185
$$ packed form
6929A63J49l60o9k73j7N21K12l23l16K66O54m25o9o97QN06O66n58m91J35M49j24
6951GJ14p8p65L90R20j12m91m80J75J4N39J43j005j36Q74N9j53J07n95r6O15K14
6973B60j54o0l85j39N24L63l04o39O3O78j37j06M8m09k04Q21J1l09k62M08k17
6994a49N33N7o97j48K58K12P2L18o75m84P44P26o95m45j26K96N50R6o68n17K95
7015d47R29j20l43k62l60O19P04j69r29m52P33L84K40k86n96o90Q50P60qm96l16
7036b55l60N75Q87m86o60l02M22L98L70j70q84m7L79M15J87m66p31K7O66Q16m19
7057C62r84L24n4Q61J53p11j026L09J187J82m37o63j30N86O58j13j056j19K86
7076c85L33J02J97p23k04O52L59L9p11k14J54K98P96o02p53J78K79M17J02j29
$$ plain form
7096 185 -857 -884 65 722 512 -399 -991 -481 260 826 -250 -775 -705 17 536 637 -467 -1125 -413 904
7116 904 744 48 -524 -814 -79 971 650 -338 -954 -825 290 951 47 -420 -1071 17 498 291 -109
7135 -109 -509 -482 220 766 338 -356 -524 -191 62 1075 271 -554 -525 235 514 477 -22 -540 -638 29 616
7156 616 232 -393 -23 -21 47 717 -296 -656 -65 522 402 46 -90 -745 -616 479 687 -234 -685 -443
7176 -443 281 253 186 -404 -623 101 340 -31 -28 253 -215 -3 35 197 -215 12 227 -92 158 428 -84 33
7198 33 248 -39 -47 48 -285 -476 77 435 -271 -262 -264 153 132 329 5 -572 32 188 -250 -402 -87 -170 -195 240
7222 240 -139 -412 -305 301 45 -97 -151 -119 293 440 22 -254 59 219 143 18 163 -267 -341 51 316
7243 316 -152 -267 -446 -219 375 402 50 -406 124 230 32 -35 -113 -637 -401 385 481 -260 -324 -532 -158 249
$$ packed form
7096A85j042k7R49O57k10r11n92N10P41N66j076n25P0P22N19J01j104o58P12J317
7116I04j60o96n72k90P35J050l21r88o16J29J115O61r04m67o51J088M81k07m00
7135a09m00K7P02N46m28o94j68L33K53J013q04q25K9P60K79l7m99n18r8O67N87
7156F16l84o25L70KO8O70j013l60N91N87j20l56j36o55J29J095K08r21m51K42
7176d43P24k8o7n90k19P24K39l71LK81m68K12L8J62m12K27K15l19K50K70n12J17
7198C3K15k87qR5l33j91N53L58p06RkM17k1J97l24n77O04J56m38j52L15q3k5M35
7222B40l79k73J07O06k56j42n4L2M12J47m18k76L13J60p6j25J45m30p4L92K65
7243C16m68j15j79K27N94K7l52m56N30J06j98o7p8n24K36P86R6p41o4k08L74M07
$$ plain form
7265 249 361 63 -466 -215 9 549 638 -155 -1103 -245 903 598 -99 -351 -567 81 778 668 -311 -481
7285 -481 -49 242 890 263 -504 -593 177 574 3 -225 -232 -77 367 414 -42 -246 -21 -31 405 555 228 -700
7307 -700 -28 433 281 -125 -176 -343 -284 209 288 34 -353 -419 209 281 81 -549 -544 13 539 419 -226 -528
7329 -528 -646 58 622 254 -602 -483 116 392 479 -95 -1054 -780 369 617 58 -108 -718 -371 301 610
7349 610 -78 -882 -528 147 235 418 50 -730 -466 355 427 183 -54 -473 -511 878 626 -214 -658 -392 282
7370 282 377 326 -477 -622 102 272 249 -114 -573 -848 45 794 366 -674 -708 -317 542 565 322 -571 -316
7391 -316 167 203 145 -389 -485 -484 473 587 -76 -791 73 -142 308 279 80 -152 -247 277 225 115 34 -554 -300
7414 -300 400 500 -135 76 -46 247 -55 519 47 -479 -12 116 499 301 -555 -476 229 772 22 -207
$$ packed form
7265B49J12k98n29K51K24N40Q9p93r48Q58J148l05o97k52k16O48O97j10r79j70
7285d81M32K91O48o27p67q9P70L97n71k28pJ55M44M7m56k04K25j0M36J50l27r28
7307g00O72M61j52m06n1j67N9M93P9k54l87o6O28P2k00o30NN57N26j20o45l02
7329e28j18P04N64l68q56J19N99K76Q7n74r59K74J149K48n59j66o10L47O72L09
7349F10o88q04L54O75Q8J83l68p80K64Q21P2k44k37m19l8J389k52q40m44K66O74
7370B82R5n1q03j45P24J70k3l63m59k75Q93P49m28j040l4L91Q59K3k43q93K55
7391c16M83L6n8n34r6JR57J14o63p15Q64k15M50k9j99k32r5N24n2j10q1n88K54
7414c00P00J00o35K11j22K93l02N74m72n26M67J28L83j98q56P9P05N43p50k29
$$ plain form
7434 -207 -389 207 309 86 49 -293 -73 25 226 -22 120 -294 -104 220 85 -401 -312 -161 -36 -218 135
7455 135 225 -200 -297 -64 -385 32 78 -17 -234 75 25 -206 95 -168 -761 163 78 -203 -149 -153 -26 -413 -547
7478 -547 73 -150 251 -121 -433 -162 77 243 -242 -552 -287 -317 332 308 136 -847 -431 149 297 -91 -335
7499 -335 -512 17 678 350 -103 -432 -489 -203 578 412 -147 -855 -145 361 542 210 -65 -708 101 811
7519 811 538 -125 -250 -423 -43 439 315 -381 -328 -243 431 716 95 -283 -256 -217 59 515 459 -141 -534 213
7541 213 628 266 -447 33 89 760 620 427 -295 -271 282 361 -60 90 -182 137 611 651 -189 -265 -112 188
7563 188 257 76 -44 -93 138 643 93 -41 -434 -271 157 537 149 -243 -144 -24 41 313 334 -472 -368 158
7585 158 907 446 -107 -720 -503 333 852 -25 -579 -163 -12 496 118 -131 -846 -404 497 298 -10 -398
$$ packed form
7434b07j82N96J02k23l7l42K20R8K01k48J42m14J90L24j35m86Q9J51J25j82L53
7455A35R0m25r7K33l21M17M6r5k17L09n0k31L01k63n93R24q5k81N4mJ27l87j34
7478e47O20k23M01l72l12K71K39J66m85l10K65l0O49k4j72r83M16N80J48l88k44
7499c35j77N29O61l28m53l29n7K86P81j66n59p08P10N06J81l32k75o43Q09P10
7519H11k73o63j25j73L80M82j24o96N3Q5O74K85o21l78K7L9K76M56n6o00l93P47
7541B13M15l62p13M80N6O71j40j93p22K4N53P9m21J50k72L19M74M0q40p6J53L00
7563A88O9j81j20m9K31N05n50j34l93J63M28L80l88l92R9J20O5K72K1q06J04N26
7585A58P49m61n53o13K17Q36N19q77n54M16J51N08l78k49p15M42R01j99l08l88
$$ plain form
7605 -398 -414 -380 534 370 -121 -604 -99 191 201 338 -116 -846 -219 328 496 188 -270 -242 -29 507 285
7626 285 -640 -465 -117 77 330 253 -353 -611 -220 422 321 -36 -42 -172 -60 304 219 -286 -448 38 235
7647 235 338 83 -225 197 622 522 -74 -427 -130 116 824 433 -36 -333 31 472 439 482 -407 -332 589
7668 589 648 345 147 -377 -351 136 356 469 -441 -25 463 133 597 165 -573 -538 -158 274 782 227 148
7689 148 -65 94 475 254 -324 -97 -210 327 505 204 -350 -395 200 216 86 -28 37 6 30 105 -290 -191
7711 -191 69 -280 -96 127 162 132 -106 -214 -544 -309 258 92 -331 -94 49 -126 315 57 -575 -188 -55
7732 -55 -123 98 428 -88 -592 34 -89 28 54 -268 -544 -345 230 421 -340 -572 -719 -382 361 563 -250
7753 -250 -905 -453 391 257 -50 -525 -904 -128 349 502 -126 -748 -831 180 635 242 -506 -822 -9 222
$$ packed form
7605c98j6L4R14j64m91m83N05K90J0J37m54p30O27N47J68l08m58K8K13N36k22
7626B85r25J75L48J94K53p7o06k58L91O42j01l57oj30J12L64q5n05j62M86J97
7647B35J03k55l08M22M25j00n96l53K97K46P08l91m69k97L64M41l3M3q89P5R21
7668E89N9l03j98n24K6M87K20J13r10M16M88l30M64m32p38L5L80M32N08n55p9
7689A48k13J59L81k21n78K27j13N37J78l01n54m5N95J6j30j14O5l1K4P5l95R9
7711a91K60l49J84K23L5l0k38j08l30K35N67j66m23K37J43j75M41k58o32L87J33
7732e5o8K21L30n16n04O26j23J17K6l22k76J99N75J91p61k32j47L37P43K02q13
7753b50o55M52Q44j34l07m75l79P76M77J53o28o22q3J011M55l93p48l16Q13K31
$$ plain form
7773 222 350 -8 -677 -704 194 578 283 478 -550 -197 -46 419 -74 -348 -430 250 497 499 225 -489 -353
7794 -353 193 472 220 111 -382 -178 568 410 -635 -501 -366 94 566 677 -273 -628 -327 654 327 264
7814 264 -534 -309 651 886 464 -647 -449 126 277 375 152 -275 -245 6 641 140 -143 -434 -146 28
7834 28 544 -6 126 -171 -420 -187 224 -5 -969 -586 447 819 403 -342 -596 -502 431 485 34 -512 -240
7855 -240 -181 325 187 -269 -958 -536 289 -30 -82 -9 -420 -182 28 70 -581 -364 -353 -155 99 292 -329 -673
7877 -673 -224 114 -23 -367 -90 -309 203 346 235 -266 -341 -161 249 440 -33 -99 23 50 98 -283 -362 -24
7899 -24 -215 451 415 -66 -333 -167 300 295 -110 -342 -605 573 649 -67 -355 -350 -49 190 613 -27 -335 142
7921 142 445 381 233 -289 -560 -129 447 550 -99 -292 -2 267 -65 566 73 -268 74 409 600 398
$$ packed form
7773B22J28l58o69k7Q98L84k95J95j028L53J51M65m93k74q2O80K47Kk74p14J36
7794c53N46K79k52j09m93K04P46j58j045J34J35M60M72J11r50l55L01R81l27o3
7814B64p98K25R60K35m22j111J98N75J51R8k23m27L0K51O35n01k83k91K88J74
7834B8N16n50J32k97k49K33M11k29r64L83J033L72m16p45k54R4R33N4m51n46K72
7855b40N9N06j38m56o89M22Q25l19n2P3m11K38K10M2o51K17J1J98K54J93o21l44
7877f73M49L38j37l44K77k19N12J43j11n01p5J80M10J91m73o6J22K7M8l81p9L38
7899b4j91O66l6m81k67J66M67nm05k32k63J178P6p16k88NL01K39M23o40l08M77
7921A42L03o4j48n22k71M31N76J03o49j93K90K69l32O31m93l41L42L35J91k02
$$ plain form
7941 398 -99 -170 -98 51 120 116 190 -15 -16 -105 353 0 -355 -387 218 395 480 88 93 336 -115 -100 -204 294 -19
7966 -19 27 -13 50 -95 -259 317 120 -254 -318 23 326 632 -388 -698 -185 470 204 -129 -354 -238 -128
7987 -128 225 473 -80 -666 -619 288 478 374 -562 -683 -350 -111 215 47 -486 -742 44 813 661 -307
8007 -307 -675 -558 159 463 576 -155 -498 43 475 55 -260 -517 -768 405 668 501 -157 -386 -201 7
8027 7 529 -77 -459 -148 59 574 676 -159 -861 -339 535 448 -20 -122 67 353 287 166 -510 -436 -88 257
8049 257 423 370 -154 -306 127 684 249 -212 -349 68 166 432 339 -17 -386 -301 525 525 124 -656 -684 328
8071 328 913 247 -471 -691 -315 108 793 521 -448 -352 60 512 253 -297 -607 47 770 595 90 -381
8091 -381 -82 -420 439 604 207 -161 -360 -56 32 -199 -89 -301 -380 168 36 263 -110 -415 -241 108 438
$$ packed form
7941C98m97p1P2J49O9mP4k05jq9M58l53l55l2O05J77Q5l92NK43m51J5j04M98l13
7966a9M6m0O3j45j64N76j97l74o4L41L03L06j020l10N13O55k66l33k25J16J10
7987a28L53K48n53n86M7R07J90j04r36j21L33K39L26j68n33k56P86P69j52r68
8007c07l68J17P17L04J13p31l43N41M32m20l15k57k51J173K63j67o58k29J85K08
8027GN22o06l82L11K07N15J02q35p02N22Q74q7m68j02J89K86o6j21o76P4L48L45
8049B57J66n3n24j52M33N57m35m61j37M17R8K66r3l56l69Q5Q26%m01p80k8J012
8071C28N85o66p18k20L76M23O85k72r69R6M12M52k59n50l10O54P23j75n05m71
8091c81K99l38Q59J65l97l68j99L04Q8k31J10k12p9N48j32K27l73l05J74L49L30
$$ plain form
8112 438 -245 -150 -14 186 488 -80 -97 -660 -117 151 -98 43 22 -306 -168 -342 -494 -458 -231 77 -140
8133 -140 -288 -267 128 128 -101 -399 -721 -336 45 -31 276 141 -562 -351 17 356 -322 -384 -76 351 378 225
8155 225 -599 -780 -339 8 -15 292 -201 -366 8 178 185 10 -152 -72 12 275 307 98 -188 -508 -214 380
8177 380 505 -242 -567 134 690 420 92 -402 -444 27 476 353 -30 -226
$$ packed form
8112D38o83R5J36K00L02n68j7n63N43K68k49J41k1l28J38j74j52L6K27L08k17
8133a40j48K1L95%k29k98l22L85L81p6L07j35p03K11L68L39o78o2L08M27K7j53
8155B25q24j81M41L47k3L07m93j65L74J70Pj75j62Q0Q4K63L2k09k86l20K94N94
8177C80J25p47l25P01N56k70l28m94m2M71M49j23l83j96
8191b26
$$ Imaginary data points
##PAGE= N=2
##DATA TABLE= (X++(I..I)), XYDATA
$$ plain form
0 0 0 0 0 -8 8 -8 16 -24 24 -32 43 -48 64 -80 96 -112 139 -162 194 -227 267 -309 361 -411 475 -544 619
27 619 -704 800 -899 1013 -1139 1275 -1424 1592 -1773 1970 -2188 2428 -2691 2981 -3300 3653
43 3653 -4044 4483 -4971 5528 -6161 6890 -7738 8745 -9955 11451 -13343 15842 -19293
56 -19293 24400 -32745 48786 -90971 435776 1051060 204546 -200955 54280 627191 694712
67 694712 385571 28700 43820 287748 529273 489129 275632 79094 128131 295282 391722
78 391722 368593 382356 335438 161799 80392 309618 517475 343935 -21845 -76029 234681
89 234681 504185 389099 62638 -69350 106564 307724 325923 215733 112776 110776 234835
100 234835 330957 236054 65599 46572 145226 179688 135117 118080 147095 153798 104848 66362
$$ packed form
0@%%%qJ6j6K4m0M8n6P5r1J12j44J76k08K51l01L56m21M94n76O70p72Q86j019J163
27F19j323J504j699J912k152K414k699L016l365L743m158M616n119N672o281O953
43C653p697Q527r454J0499j1689J3051j4628J6483j8700K1406k4794K9185l5135
56a9293M3693n7145Q1531j39757N26747O15284q46514m05501K55235N72911O7521
67F94712l09141l56871J5120K43928K41525m0144k13497j96538M9037J67151R6440
78C91722k3129J3763m6918j73639q1407K29226K07857j73540l65780n4184L10710
89B34681K69504j15086l26461j31988J75914K01160J8199j10190j02957k000J24059
100B34835R6122r4903j70455j9027R8654L4462m4571j7037K9015O703m8950l8486
$$ plain form
112 66362 104485 154485 133041 115410 175597 200125 121507 79147 133932 146523 67463 12214
124 12214 33179 88706 136108 130798 55673 -15396 -692 78656 139345 111142 25521 13761
136 13761 110375 160562 76592 -21174 -36209 -14104 10036 35443 27666 -6605 -15460 -11420 -23145
149 -23145 -11671 23641 17554 -20512 -20513 24719 70272 59100 -38791 -137443 -100350 25499 51514
162 51514 -56831 -144337 -95830 39330 95601 -30254 -192159 -142679 80457 177938 32332
173 32332 -146310 -125419 62945 158148 -5219 -228705 -191236 57435 166211 14417 -160875
184 -160875 -142419 24747 130974 46228 -106048 -98656 62249 150714 66516 -53187 -62678
195 -62678 11407 30167 -50658 -85124 21276 96220 -14231 -130603 -38604 126030 108186
$$ packed form
112F6362L8123N0000k1444j7631O0187K4528p8618m2360N4785J2591p9060n5249
124A2214K0965N5527M7402n310p5125p1069J4704P9348O0689k8203q5621j1760
136A3761R6614N0187q3970r7766j5035K2105K4140K5407p777l4271q855M040j1725
149b3145J1474L5312o087l8066jM5232M5553j1172r7891r8652L7093J25849K6015
162E1514j08345q7506M8507J35160N6271j25855j61905M9480K23136R7481j45606
173C2332j78642K0891J88364R5203j63367k23486L7469K48671J08776j51794j75292
184a60875J8456J67166J06227q4746j52276P392J60905Q8465q4198j19703r491
195f2678P4085J8760q0825l4466J06400P4944j10451j16372R1999J64634j7844
$$ plain form
206 108186 -67899 -158055 -30319 177839 207353 1915 -188688 -136273 66032 156928 23258
217 23258 -180647 -195880 18887 181386 75005 -124300 -146829 -22155 61381 55419 21761
228 21761 -6049 -29000 -42171 -21451 26155 17720 -83877 -149428 -73168 38887 53883 -3124
240 -3124 -61668 -94887 -59692 32077 65799 -2571 -59727 -26019 32566 28594 -29978 -64265
252 -64265 -43314 -37413 -75830 -60560 31968 55208 -37131 -90094 -34739 18989 12589 4965 12341
265 12341 4950 -14228 -17252 1441 18215 -9434 -76371 -110033 -70969 12506 89922 79816
277 79816 -65631 -192028 -85943 152671 198347 -17416 -207068 -132610 110614 231373
287 231373 76226 -183482 -253254 -74121 139676 167660 -7360 -189999 -152829 67705
$$ packed form
206A08186j76085r0156J27736K08158K9514k05438j90603N2415K02305R0896j33670
217B3258k03905j5233K14767J62499j06381j99305k2529J24674Q3536n962l3658
228B1761k7810k2951j3171K0720M7606q435j01597o5551P6260J12055J4996n7007
240c124n8544l3219L5195R1769L3722o8370n7156L3708N8585l972n8572l4287
252f4265K0951N901l8417J5270R2528K3240r2339n2963N5355N3728o400p624P376
265A2341p391j9178l024J8693J6774k7649o6937l3662L9064Q3475P7416j0106
277G9816j45447j26397J06085K38614M5676k15763j89652P4458K43224J20759
287B31373j55147k59708o9772J79133K13797K7984j75020j82639L7170K20534
$$ plain form
297 67705 185107 68550 -89039 -101874 -15249 62417 99007 81777 4217 -92673 -127355
308 -127355 -41081 100727 125050 -20844 -153718 -98558 88700 206157 117069 -111288 -211094
319 -211094 -16578 249606 235322 -35652 -207629 -89763 133978 174335 -8525 -166350
329 -166350 -97837 83459 143731 55204 -37921 -40152 25232 71633 44524 5442 32741 66253
341 66253 22863 -27941 3934 51283 14678 -65410 -75025 18610 109448 72617 -45487 -67367
353 -67367 37765 107955 50083 -42260 -51223 32224 110825 70681 -56700 -103517 -15386 60628
365 60628 22434 -51195 -54384 10535 62540 44078 -8884 -18796 4178 5485 6283 37340 41301
378 41301 -7771 -39471 -18696 5287 -2239 -34125 -63222 -41159 31256 65213 12568 -47132
$$ packed form
297F7705J17402j16557j57589j2835Q6625P7666L6590j7230p7560r6890l4682
308a27355Q6274J41808K4323j45894j32874N5160J87258J17457q9088k28357r9806
319b11094J94516K66184j4284k70974j71977J17866K23741M0357j82860j57825
329a66350O8513J81296O0272q8527r3125k231O5384M6401k7109l9082K7299L3512
341F6253m3390n0804L1875M7349l6605q0088r615R3635R0838l6831j18104k1880
353f7367J05132P0190n7872r2343q963Q3447P8601m0144j27381m6817Q8131P6014
365F0628l8194p3629l189O4919N2005j8462n2962r912K2974J307P98L1057L961
378D1301m9072l1700K0775K3983p526l1886k9097K2063P2415L3957n2645n9700
$$ plain form
390 -47132 -32414 31024 57637 2905 -60477 -22921 71873 62214 -54265 -101697 -22311 45951
402 45951 10745 -63325 -72100 7778 87157 61761 -35246 -69618 -2576 69123 61604 -11290
414 -11290 -56660 -6252 67854 39439 -54953 -68206 977 26369 -11009 -18435 31282 72629
426 72629 43532 -28186 -39763 41687 106743 57368 -42347 -64442 19029 116518 98323 -53479
438 -53479 -157642 -53022 137064 160634 4688 -111361 -46425 111268 169813 60822 -76739
449 -76739 -76329 38821 122745 99322 6507 -65857 -47144 26805 55006 26909 12049 10058
461 10058 -9284 914 74291 123590 62111 -56502 -91474 19738 157049 136927 -32733
472 -32733 -138219 -57126 93399 133894 25434 -110099 -102929 57496 172957 101498 -39449
$$ packed form
390d7132J4718O3438K6613n4732o3382L7556R4794r659j16479m7432P9386O8262
402D5951l5206p4070q775P9878P9379k5396r7007l4372O7042P1699p519p2894
414a1290m5370N0408P4106k8415r4392j3253O9183K5392l7378p426M9717M1347
426G2629k9097p1718j1577Q1450O5056m9375r9715k2095Q3471R7489j8195j51802
438e3479j04163J04620J90086K3570j55946j16049O4936J57693N8545j08991j37561
449g6739M10J15150Q3924k3423r2815p2364J8713P3949K8201k8097j4860j991
461A0058j9342J0198P3377M9299o1479j18613l4972J11212J37311k0122j69660
472c2733j05486Q1093J50525M0495j08460j35533P170J60425J15461p1459j40947
$$ plain form
483 -39449 -69235 12958 83393 72633 15449 -12960 6152 20427 13497 17727 23369 -4652 -30765
496 -30765 -6172 36971 56230 52827 31850 5381 8839 34524 35744 16702 16711 27449 16229
509 16229 -10335 -18464 11488 45060 15529 -58110 -54227 49896 113422 53848 -32525 -41651
521 -41651 11894 58404 48910 -2991 -34552 -16453 9655 13242 8709 -996 -23032 -42988 -39488
534 -39488 3704 75027 90547 -9454 -108838 -48893 103044 131950 -8437 -137662 -96057
545 -96057 64450 142634 35389 -119645 -130603 -2829 102435 82606 -20798 -80740 -16645
556 -16645 90135 93355 2373 -46381 -13063 21498 20581 16704 23563 17251 -17369 -46109 -12581
569 -12581 56597 61707 -8355 -43181 9637 81892 93823 32412 -50810 -57935 37476 110578
$$ packed form
483c9449k9786Q2193P0435j0760n7184k8409J9112J4275o930M230N642k8021k6113
496c0765K4593M3143J9259l403k0977k6469L458K5685J220j9042RJ0738j1220
509A6229k6564q129K9952L3572k9531p3639L883J04123O3526n9574q6373r126
521d1651N3545M6510r494n1901l1561J8099K6108L587m533r705k2036j9956L500
534c9488M3192P1323J5520j00001r9384N9945J51937K8906j40387j29225M1605
545i6057J60507P8184j07245j55034j0958J27774J05264j9829j03404n9942O4095
556a6645J06780L220r0982m8754L3318L4561r17l877O859o312l4620k8740L3528
569a2581O9178N110p0062l4826N2818P2255J1931o1411q3222p125R5411P3102
$$ plain form
581 110578 50434 -65274 -81307 17437 97086 50028 -66007 -90793 12189 100589 69783
592 69783 -12730 -42687 -5574 49500 57511 -4123 -62853 -39062 24328 35416 -8276 -42706
604 -42706 -37843 -14096 -5454 -13256 -5386 15954 5202 -26265 -14293 27169 22922 -27836 -58553
617 -58553 -40744 698 23714 -6505 -59568 -65630 -19550 13310 599 -30274 -40671 -11879
629 -11879 27680 26133 -7826 -22079 -17885 -24578 -23905 -411 6379 -22370 -45040 -33358 -3607
642 -3607 12702 -8136 -44322 -35644 19415 46941 14808 -24371 -23767 7047 21437 -12022 -50318
655 -50318 -25583 27617 13470 -51880 -59867 2679 42695 6619 -57281 -60878 19718 90672
667 90672 49180 -56048 -85619 -7559 69729 44816 -54466 -102284 -30409 59546 41293 -41652
$$ packed form
581A10578o0144j15708j6033R8744P9649m7058j16035k4786J02982Q8400l0806
592F9783q2513k9957L7113N5074Q011o1634n8730K3791O3390J1088m3692l4430
604d2706M863K3747Q642p802P870K1340j0752l1467J1972M1462m247n0758l0717
617e8553J7809M1442K3016l0219n3063o062M6080L2860j2711l0873j0397K8792
629a1879L9559j547l3959j4253M194o693O73K3494O790k8749k2670J1682K9751
642c607J6309k0838l6186Q678N5059K7526l2133l9179O04L0814J4390l3459l8296
655e0318K4735N3200j4147o5350p987O2546M0016l6076o3900l597Q0596P0954
667I0672m1492j05228k9571P8060P7288k4913r9282m7818P1875Q9955j8253q2945
$$ plain form
679 -41652 -61662 -15163 13286 6654 7189 24314 26753 -4507 -38810 -15845 49466 61247 -15886
692 -15886 -89872 -63775 43117 113952 49071 -94015 -126935 17373 154926 106918 -47463
703 -47463 -103622 -4006 118475 120694 9114 -78589 -55408 28810 80759 64001 -1821 -50731
715 -50731 -24275 43155 66941 40432 16786 4383 -2880 23975 75507 83382 19071 -51862
727 -51862 -45316 36874 91931 43993 -44383 -57507 5741 60088 59173 13765 -37234 -32005 37654
740 37654 84693 45496 -22107 -35118 4738 35503 18246 -21922 -29317 -2945 7722 -2794
752 -2794 -3172 -1570 -13581 -10049 17356 23388 -1583 -12508 5603 22212 11204 -20589 -40555
765 -40555 -20974 11987 13963 -12906 -35237 -34804 -3258 36802 26449 -33104 -51039 8870 61909
$$ packed form
679d1652k0010M6499K8449o632N35J7125K439l1260l4303K2965O5311J1781p7133
692a5886p3986K6097J06892P0835o4881j43086l2920J44308J37553m8008j54381
703d7463n6159R9616J22481K219j11580q7703K3181Q4218N1949j6758o5822m8910
715e0731K6456O7430K3786k6509k3646j2403p263K6855N1532P875o4311p0933
727e1862O546Q2190N5057m7938q8376j3124O3248N4347r15m5408n0999N229O9659
740C7654M7039l9197o7603j3011L9856L0765j7257m0168p395K6372J0667j0516
752b794l78J602j2011L532K7405O032k4971j0925J8111J6609j1008l1793j9966
765d0555J9581L2961J976k6869k2331M33L1546M0060j0353n9553j7935N9909N3039
$$ plain form
778 61909 38355 -20457 -41328 -10957 20752 11264 -19682 -23571 -5892 -5964 -11618 3568 18412
791 18412 7096 -12744 -17878 3148 43720 55156 3581 -51674 -30561 41134 62412 -1541
803 -1541 -75566 -58095 40763 88360 13237 -75418 -48336 48040 81873 23689 -40535 -29905
815 -29905 41649 76553 24313 -42340 -35880 19480 43423 13316 -24991 -19307 24606 43558
827 43558 9595 -12752 16885 43915 25268 2476 18066 47061 45519 4811 -28570 -3113
839 -3113 52516 51098 -9743 -41284 2164 65231 73179 16828 -36712 -14466 62272 92668 41615
852 41615 -17479 -17786 31020 70104 50032 -12550 -39152 2276 49040 49515 21107 -1122 -3772
865 -3772 18268 46772 49711 26537 3436 674 23676 51303 40631 -3337 -24993 -5495 18759
$$ packed form
778F1909k3554n8812k0871L0371L1709r488l0946l889J7679p2n654J5186J4844
791A8412j1316j9840n134K1026M0572J1436n1575n5255K1113P1695K1278o3953
803a541p4025J7471R8858M7597p5123q8655K7082R6376L3833n8184o4224J0630
815b9905P1554L4904n2240o6653O460N5360K3943l0107l8307N684M3913J8952
827D3558l3963k2347K9637K7030j8647k2792J5590K8995j542m0708l3381K5457
839c113N5629j418o0841l1541M3448O3067P948n6351n3540K2246P6738L0396n1053
852D1615n9094l07M8806L9084k0072o2582k6602M1428M6764M75k8408k2229k650
865c772K2040K8504K939k3174k3101k762K3002K7627j0672m3968k1656J9498K4254
$$ plain form
878 18759 26045 19913 830 -13782 2297 32982 37608 15473 -4251 -3870 16695 32070 21032
891 21032 3023 -2586 -8917 -17401 -1500 21726 8197 -24965 -23242 9100 28593 19496 -2873
904 -2873 -14114 -1329 17472 19003 7571 -4178 -12870 -7538 3722 -7452 -25296 -7380 20278
917 20278 -69 -39011 -21375 37625 53677 -154 -54906 -36169 40322 74266 16049 -59494
929 -59494 -61685 1927 56256 40667 -34162 -80631 -30361 54938 62404 -3898 -43568 -17092
941 -17092 24136 32423 16188 8165 7429 -10962 -31249 -3830 47679 39609 -31203 -70628 -25684
954 -25684 52303 80359 22330 -61392 -63786 32916 108929 65469 -43288 -83284 -6897 86999
966 86999 75474 -23650 -76146 -25654 41835 49419 15732 -16011 -21117 3800 36109 41366 21777
$$ packed form
878A8759P286o132j9083j4612J6079L0685M626k2135j9724L81K0565J5375j1038
891B1032j8009n609o331q484J5901K3226j3529l3162J723L2342J9493r097k2369
904b873j1241J2785J8801J531j1432j1749q692N332J1260j1174j7844J7916K7658
917B0278k0347l8942J7636N9000J6052n3831n4752J8737P6491L3944n8217p5543
929e9494k191O3612N4329j5589p4829m6469N0270Q5299P466o6302l9670K6476
941a7092M1228Q287j6235q023p36j8391k0287K7419N1509q070p0812l9425M4944
954b5684P7987K8056n8029q3722k394R6702P6013m3460j08757l9996P6387R3896
966H6999j1525r9124n2496N0492O7489P584l3687l1743n106K4917L2309N257j9589
$$ plain form
979 21777 124 -9331 2005 27330 35912 13052 -15961 -24759 -6195 28647 37660 -1712 -37213
992 -37213 -11185 41656 49417 10576 -20398 -10499 25508 42782 17286 -16938 -19140 1316 15819
1005 15819 15717 -952 -23827 -21078 10427 29648 17294 -5502 -16386 -5083 24386 38505
1017 38505 11754 -25970 -28913 2644 31813 22023 -25136 -54279 -21417 32218 33406 -11842
1029 -11842 -40538 -21849 21686 41033 10675 -29927 -25681 10520 22679 1152 -21506 -24381
1041 -24381 -10842 366 -7022 -19223 -11369 1802 -3781 -14085 -6501 9399 12469 -1307 -20770
1054 -20770 -17634 12187 22386 -13602 -44131 -23302 14910 14653 -20113 -43045 -20271 24566
1066 24566 29744 -14282 -41112 -8490 36566 35174 -10461 -46420 -25121 32723 43385 -17658
$$ packed form
979B1777k1653r455J1336K5325Q582k2860k9013q798J8564L4842R013l9372l5501
992c7213K6028N2841P761l8841l0974R899L6007J7274k5496l4224k202K0456J4503
1005A5819j02j6669k2875K749L1505J9221j2354k2796j0884J1303K9469J4119
1017C8505k6751l7724k943L1557K9169r790m7159k9143L2862N3635J188m5248
1029a1842k8696J8689M3535J9347l0358m0602M246L6201J2159k1527k2658k875
1041b4381J3539J1208p388j2201P854J3171n583j0304P584J5900L070j3776j9463
1054b0770L136K9821J0199l5988l0529K0829L8212k57l4766k2932K2774M4837
1066B4566N178m4026k6830L2622M5056j392m5635l5959K1299N7844J0662o1043
$$ plain form
1078 -17658 -65107 -31360 32532 41442 -7798 -47214 -25764 28780 44504 7950 -22074 -10417
1090 -10417 12146 18720 11903 -1264 -11121 -8096 -2927 -4970 1844 15202 4851 -22287 -22606 14869
1104 14869 46474 29572 -22461 -41546 6946 59730 38734 -26487 -50535 -14994 28292 34748
1116 34748 -301 -40464 -36710 7805 38137 22791 -11847 -27502 -10208 21443 30454 8599
1128 8599 -13567 -20221 -15801 1602 19105 5263 -31615 -38548 -5276 22052 12726 -14640 -26220
1141 -26220 -7810 16574 13665 -6281 -11322 -2309 -1497 -6463 -10736 -14141 -9907 -2449 -11243 -27444
1155 -27444 -17881 8789 12267 -9514 -23844 -13062 10639 16958 -3420 -20138 -10472 529 -8874
1168 -8874 -16726 -8700 -4705 -14033 -23544 -22243 -5341 17891 13032 -24574 -43476 -9515 37092
$$ packed form
1078a7658m7449L3747O3892Q910m9240l9416K1450N4544J5724l6554l0024J1657
1090a0417K2563O574o817j3167r857L025N169k043O814J3358j0351k7138l19L7475
1104A4869L1605j6902n2033j9085M8492N2784k0996o5221k4048L5541M3286O456
1116C4748l5049m0163L754M4515L0332j5346l4638j5655J7294L1651R011k1855
1128H599k2166o654M420J7403J7503j3842l6878o933L3272K7328r326k7366j1580
1141b6220J8410K4384k909j9946n041R013Q12m966m273l405M234P458q794j6201
1155b7444R563K6670L478k1781j4330J0782K3701O319k0378j6718R666J1001r403
1168h874p852Q026L995r328r511J301J6902K3232m859l7606j8902L3961M6607
$$ plain form
1181 37092 37178 -14457 -60180 -39410 27812 50370 -6535 -68221 -57663 3772 43814 22084
1193 22084 -34828 -57133 -14663 36551 34271 -7415 -32649 -21392 6369 19626 6089 -13630
1205 -13630 -18456 -17939 -17369 -1568 18624 8987 -22616 -31597 -3321 32723 37816 -1739 -41364
1218 -41364 -23782 34035 54660 10013 -43894 -43642 10639 51761 23681 -38072 -46220 8440
1230 8440 49871 33712 -8497 -27073 -4187 33940 41430 10761 -16348 -10002 10773 22168
1242 22168 17301 -2004 -17253 -11322 7596 21671 24248 8125 -16503 -12841 24310 45384 19020
1255 19020 -17613 -21448 7336 35722 28172 -10872 -33987 -14710 16209 24826 9315 -12705
1267 -12705 -18801 1381 25347 23929 6090 -6714 -10729 -2732 18805 28109 4263 -27465 -29603
$$ packed form
1181C7092Q6n1635m5723K0770O7222K2558n6905o1686J0558O1435M0042k1730
1193B2084n6912k2305M2470N1214k280m1686k5234J1257K7761J3257j3537j9719
1205a3630m826N17N70J5801K0192r637l1603q981K8276L6044N093l9555l9625
1218d1364J7582N7817K0625m4647n3907K52N4281M1122k8080o1753q148N4660
1230H440M1431j6159m2209j8576K2886L8127P490l0669k7109O346K0775J1395
1242B2168m867j9305j5249N931J8918J4075K577j6123k4628L662L7151K1074k6364
1255A9020l6633l835K8784K8386p550l9044k3115J9277L0919Q617j5511k2020
1267a2705o096K0182K3966j418j7839j2804m015P997K1537R304k3846l1728k138
$$ plain form
1280 -29603 670 28289 18870 -21817 -37916 -1649 38235 29230 -8529 -25671 -6656 24452
1292 24452 29362 -584 -24619 -7608 20343 14108 -14259 -23084 -2917 18551 12270 -13137 -15802
1305 -15802 15249 32978 10648 -15273 -9637 14532 26711 13740 -10875 -16086 5989 19383
1317 19383 2955 -14333 -7320 8340 12190 4047 -507 10412 24263 12560 -12204 -7746 23525
1330 23525 34598 8312 -21544 -21389 12034 39991 19158 -29810 -38823 7939 50656 39013
1342 39013 -6985 -32749 -5892 41755 47345 6037 -25163 -13157 17068 32268 20874 -6959
1354 -6959 -20922 -6372 14751 20061 15739 8584 -1406 -1685 14936 30461 27184 5669 -15870
1367 -15870 -10180 24135 42594 14138 -23371 -22833 7651 30306 24906 -1706 -19145 -2036 30366
$$ packed form
1280b9603L0273K7619r419m0687j6099L6267L9884r005l7759j7142J9015L1108
1292B4452M910k9946k4035J7011K7951o235k8367q825K0167K1468o281k5407k665
1305a5802L1051J7729k2330k5921N636K4169J2179j2971k4615n211K2075J3394
1317A9383j6428j7288P013J5660L850q143m554J0919J3851j1703k4764M458L1271
1330B3525J1073k6286k9856J55L3423K7957k0833m8968r013M6762M2717j1643
1342C9013m5998k5764K6857M7647N590m1308l1200J2006L0225J5200j1394k7833
1354f959j3963J4550K1123N310m322p155r990k79J6621J5525l277k1515k1539
1367a5870N690L4315J8459k8456l7509N38L0484K2655n400k6612j7439J7109L2402
$$ plain form
1380 30366 35726 13265 -7971 -8532 9096 24765 17899 -1937 -8158 -737 3771 7205 8572 -3429
1394 -3429 -14753 -2235 20242 21835 3257 -10639 -3871 16239 21416 -2243 -21788 -8968 15473
1407 15473 16085 -4985 -24994 -22936 3779 23024 4574 -26224 -21018 13140 28789 8886 -18783
1420 -18783 -21984 842 15056 1501 -14414 -9761 -3608 -9425 -11568 -2606 918 -5955 -13144 -12929
1434 -12929 2429 22473 16497 -15109 -31339 -8122 24634 25078 -12616 -44098 -22639 27505
1446 27505 33779 -14214 -47630 -22778 22318 35133 7289 -24877 -20321 15501 32295 9746
1458 9746 -18921 -20615 428 19031 14504 -8494 -17972 -2603 8099 2021 -205 6320 5922 -249
1472 -249 3655 15382 21148 9915 -12412 -16854 8555 29957 15870 -14190 -23418 -4241 23753
$$ packed form
1380C0366N360k2461k1236n61J7628J5669o866j9836o221P421M508L434J367j2001
1394c429j1324J2518K2477J593j8578j3896O768K0110N177k3659j9545J2820K4441
1407A5473O12k1070k0009K058K6715J9245j8450l0798N206L4158J5649j9903k7669
1420a8783l201K2826J4214j3555j5915M653O153n817k143Q962L524o873p189K15
1434a2929J5358K0044n976l1606j6230K3217L2756M44l7694l1482K1459N0144
1446B7505O274m7993l3416K4852M5096J2815k7844l2166M556L5822J6794k2549
1458I746k8667j694K1043J8603m527k2998r478J5369J0702o078k226O525l98o171
1472b49L904J1727N766j1233k2327m442K5409K1402j4087l0060r228J9177K7994
$$ plain form
1485 23753 29205 -630 -30929 -15628 29105 46026 18435 -17857 -23707 6026 34952 25304
1497 25304 -9959 -25062 -8665 15823 24930 11855 -14657 -24772 -3322 23065 26984 10388
1509 10388 -8883 -12824 6275 25868 18097 -8165 -20765 -11067 8413 20363 8330 -16911
1521 -16911 -22192 -2142 13336 8752 -2053 -6727 -2132 7808 9490 2526 -2114 -4326 -11665 -12725
1535 -12725 851 9192 -2180 -16740 -18099 -6813 6669 5344 -12562 -19402 -2158 14462 8897
1548 8897 -8513 -18021 -11532 2672 2307 -17811 -25529 -4608 10689 -5294 -27862 -23920 1677
1561 1677 15233 -2420 -28619 -21550 12281 24429 -1882 -29624 -28873 -6180 13139 5290 -23127
1574 -23127 -33367 -9739 12626 3614 -17178 -21222 -7793 3733 2089 -4035 1060 5548 -8117
$$ packed form
1485B3753N452k9835l0299J5301M4733J6921k7591l6292n850K9733K8926r648
1497B5304l5263j5103J6397K4488R107j3075k6512j0115K1450K6387L919j6596
1509A0388j9271l941J9099J9593p771k6262j2600R698J9480J1950j2033k5241
1521a6911n281K0050J5478m584j0805m674M595R940J682o964m640k212p339j060
1535a2725J3576Q341j1372j4560j359J1286J3482j325j7906o840J7244J6620n565
1548H897j7410r508O489J4204l65k0118p718K0921J5297j5983k2568L942K5597
1561A677J3556j7653k6199P069L3831J2148k6311k7742P51K2693J9319p849k8417
1574b3127j0240K3628K2365r012k0792m044J3429J1526j644o124N095M488j3665
$$ plain form
1587 -8117 -23416 -10221 12723 8060 -17694 -29535 -14299 14212 23349 -2251 -33970 -27785 11144
1600 11144 35857 19117 -18879 -32611 -1207 34755 22663 -19713 -34611 -9894 15997 19297
1612 19297 3694 -14290 -16872 -832 15576 15693 3592 -8656 -6959 11330 22377 10193 -7712
1625 -7712 -11322 -6696 2336 13044 9422 -9268 -16388 693 18161 13360 -4814 -14340 -2178
1638 -2178 17839 19206 2745 -7670 -5169 -1848 2527 5662 -2425 -14217 -10753 3687 9736 3925
1652 3925 -7226 -14578 -7975 8731 15470 5249 -9390 -15527 -5238 12991 11653 -17160 -34616
1665 -34616 -14004 14605 14287 -9627 -26984 -18723 5830 15118 -2975 -20455 -13893 4114 10688
1678 10688 1466 -15093 -21151 -8852 642 -8265 -17806 -9792 -458 -4818 -12444 -11313 -3116 1317
$$ packed form
1587h117j5299J3195K2944m663k5754j1841J5236K8511R137k5600l1719O185L8929
1600A1144K4713j6740l7996j3732L1404L5962j2092m2376j4898K4717K5891L300
1612A9297j5603j7984k582J6040J6408J17j2101j2248J697J8289J1047j2184j7905
1625g712l610M626R032J0708l622j8690p120J7081J7468m801j8174r526J2162
1638b178K0017J367j6461j0415K501L321M375L135q087j1792L464J4440O049n811
1652C925j1151p352O603J6706O739j0221j4639o137J0289J8229j338k8813j7456
1665c4616K0612K8609l18k3914j7357Q261K4553R288j8093j7480O562J8007O574
1678A0688r222j6559o058J2299R494q907r541Q014R334m360p626J131Q197M433
$$ plain form
1692 1317 -6184 -15900 -7800 10112 7298 -15115 -24485 -11042 4052 608 -18092 -28523 -10919
1705 -10919 15241 11330 -18433 -31759 -10904 17038 18630 -9487 -32082 -14621 21234 22858
1717 22858 -14360 -38918 -23229 7416 18321 -896 -24102 -20447 3035 14136 4050 -8512
1729 -8512 -11816 -6787 5766 12272 4990 -3969 -7987 -10247 -7872 3207 9279 -1812 -14790 -11426
1743 -11426 6811 21525 13084 -12989 -21098 2591 25629 19829 -469 -11421 -7459 6349 15139
1756 15139 6149 -10935 -14131 -1238 13842 18501 7929 -7572 -7982 5873 15218 13467 6825
1769 6825 -2628 -6108 6653 19394 9196 -12548 -17003 -1189 14411 13427 -1764 -9180 1719
1782 1719 12898 7692 -1502 -1644 1956 5518 7557 3989 -3431 -2824 1341 -3708 -10331 -5870 2694
$$ packed form
1692A317p501r716Q100J7912k814k2413r370J3443J5094l444j8700j0431J7604
1705a0919K6160l911k9763j3326K0855K7942J592k8117k2595J7461L5855J624
1717B2858l7218k4558J5689L0645J0905j9217k3206L655K3482J1101j0086j2562
1729h512l304N029J2553O506p282q959m018k260K375J1079O072j1091j2978L364
1743a1426J8237J4714q441k6073q109K3689K3038n800k0298j0952L962J3808Q790
1756A5139q990j7084l196J2893J5080M659j0572j5501m10J3855R345j751o642
1769F825r453l480J2761J2741j0198k1744m455J5814J5600r84j5191p416J0899
1782A719J1179n206r194j42L600L562K039l568p420O07M165n049o623M461Q564
$$ plain form
1797 2694 5389 -102 -6656 -3415 7378 6292 -7572 -9680 4415 9539 -1265 -9316 -5380 846
1811 846 615 -9578 -18415 -10292 8716 11948 -4074 -17559 -10734 9909 20119 715 -27071
1824 -27071 -19873 15489 28398 636 -28845 -25594 1446 19819 6028 -20137 -22673 1991
1836 1991 19771 12905 -5659 -15847 -7794 9561 12824 -118 -7325 -1690 1068 -3698 -3173 1176
1850 1176 -685 -7235 -9709 -638 15579 16758 -3273 -17912 -4968 16226 18531 2328 -13807
1863 -13807 -12022 8150 22323 7608 -18098 -20955 -492 17860 16890 -112 -12340 -3403 14523
1876 14523 17405 5953 -3427 -6661 -959 12778 18122 5795 -10403 -12388 -1254 12655 15324
1889 15324 930 -12965 -3708 17433 24134 10299 -7478 -12214 2903 21207 19256 -237 -10516
$$ packed form
1797B694K695n491o554L241J0793j086j3864k108J4095N124j0804q051L936O226
1811H46k31j0193q837Q123J9008L232j6022j3485O825K0643J0210j9404k7786
1824b7071P198L5362J2909k7762k9481L251K7040J8373j3791k6165k536K4664
1836A991J7780o866j8564j0188Q053J7355L263j2942p207N635K758m766N25M349
1850A176j861o550k474R071J6217J179k0031j4639J2944K1194K305j6203j6135
1863a3807J785K0172J4173j4715k5706k857K0463J8352r70j7002j2228Q937J7926
1876A4523K882j1452r380l234N702J3737N344j2327j6198j985J1134J3909K669
1889A5324j4394j3895R257K1141O701j3835j7777m736J5117J8304j951j9493j0279
$$ plain form
1902 -10516 -3719 7136 11770 6431 -5796 -8979 1135 12194 15283 11195 1591 -8334 -3514 13207
1916 13207 18147 4793 -10325 -11345 4524 18628 9479 -14690 -21649 -1769 16818 14020 -2595
1929 -2595 -12892 -3604 14940 15062 -5566 -17633 -4491 11805 9875 -6078 -16028 -7484 7099
1942 7099 3878 -13668 -16973 -312 11340 5956 -5283 -9848 -3321 6196 3888 -8490 -11559 -1869
1956 -1869 4347 -1144 -8465 -8960 -3291 -660 -7411 -12658 -1572 12625 6454 -10373 -12268 1485
1970 1485 11862 6059 -11342 -19655 -4586 15961 11927 -10051 -23463 -13090 7045 15494 1039
1983 1039 -16629 -11366 9744 16816 4828 -7644 -10776 -5278 5153 7635 1223 -5313 -7880 -7073
1997 -7073 199 6668 1567 -8808 -9302 1051 11258 12968 2615 -12400 -12339 4662 13959 3449
$$ packed form
1902a0516O797J0855M634n339j2227l183J0114J1059L089m088r604r925M820J6721
1916A3207M940j3354j5118j020J5869J4104r149k4169o959J9880J8587k798j6615
1929b595j0297R288J8544J22k0628j2067J3142J6296j930j5953r950Q544J4583
1942G099l221j7546l305J6661J1652n384j1239m565O527R517k308j2378l069R690
1956a869O216n491p321m95N669K631o751n247J1086J4197o171j6827j895J3753
1970A485J0377n803j7401q313J5069K0547m034k1978j3412J0373K0135Q449j4455
1983A039j7668N263K1110P072j1988j2472l132N498J0431K482o412o536k567Q07
1997g073P272O469n101j0375m94J0353J0207J710j0353j5015O1J7001R297j0510
$$ plain form
2011 3449 -10896 -12998 -2055 9702 6826 -8539 -15771 -5932 5469 8341 4590 -2100 -6878 -1482
2025 -1482 6530 4866 -3734 -8527 -7643 -1439 6441 4612 -8232 -14987 -7068 3867 6390 -1457 -10679
2040 -10679 -6871 9317 13342 -2213 -15662 -10712 2404 7685 -1128 -13902 -13407 1357 8205
2053 8205 -4369 -16306 -11799 567 6610 2100 -8367 -7839 2128 3900 -6594 -12087 -5934 -735
2067 -735 -3782 -8460 -8902 -3501 583 -6644 -16502 -10787 4283 7794 -3590 -13709 -9692 4270
2081 4270 10420 -4636 -24033 -18574 4885 12860 -3231 -21125 -19596 -1406 11404 1401 -17168
2094 -17168 -17518 408 13083 7893 -6652 -15558 -9429 3729 5426 -5704 -11211 -7196 -2132 683
2108 683 2102 -1815 -8240 -8945 -3112 5814 11696 5556 -9203 -11618 2900 13267 6302 -9490
$$ packed form
2011C449j4345k102J0943J1757k876j5365p232R839J1401K872l751o690m778N396
2025a482Q012j664q600m793Q84O204P880j829j2844o755P919J0935K523p847r222
2040a0679L808J6188M025j5555j3449M950J3116N281q813j2774M95J4764O848
2053H205j2574j1937M507J2366O043m510j0467N28R967J772j0494n493O153N199
2067g35l047m678m42N401M084p227r858N715J5070L511j1384j0119M017J3962
2081D270O150j5056j9397N459K3459P975j6091j7894J529J8190J2810j0003j8569
2094a7168l50J7926J2675n190j4545q906O129J3158J697j1130n507M015N064K815
2108F83J419l917o425p05N833Q926N882o140j4759k415J4518J0367o965j5792
$$ plain form
2122 -9490 -17230 -7007 12341 17884 -861 -18799 -13601 6654 18492 10661 -7535 -13725 1863
2135 1863 18209 14664 -1730 -12455 -10679 934 13466 10870 -4627 -13036 -5639 6841 12310
2148 12310 5646 -7136 -10843 2839 16186 13800 254 -10351 -9434 2956 11241 3449 -9503
2161 -9503 -8355 943 5338 3516 -1920 -5537 -3472 1237 2371 3536 5665 1455 -6666 -7109 385
2176 385 4315 -912 -9080 -12231 -3568 8973 5823 -10485 -16505 -4927 8034 7543 -4548 -13337
2190 -13337 -5362 9483 7419 -10960 -19185 -7931 5038 3470 -8806 -17080 -7909 7359 5361
2203 5361 -11293 -17259 -5440 7118 6339 -4011 -12344 -8878 1947 2593 -7879 -14151 -9609 -3125
2217 -3125 -479 -2457 -6392 -6205 -4398 -5981 -6123 1397 4944 -3824 -11613 -6004 4404 5216 -5216
$$ packed form
2122i490p740J0223J9348N543j8745j7938N198K0255J1838p831j8196o190J5588
2135A863J6346l545j6394j0725J776J1613J2532k596j5497q409P397J2480N469
2148A2310o664j2782l707J3682J3347k386j3546j0605R17J2390Q285p792j2952
2161i503J148R298M395j822n436l617K065M709J134J165K129m210q121m43P494
2176C85L930n227q168l151Q663J2541l150j6308o020J1578J2961m91j2091q789
2190a3337P975J4845k064j8379q225J1254J2969j568j2276q274R171J5268j998
2203E361j6654n966J1819J2558p79j0350q333L466J0825O46j0472o272M542O484
2217c125K646j978l935J87J807j583j42P520L547q768p789N609J0408Q12j0432
$$ plain form
2232 -5216 -17175 -15762 643 11431 2317 -13559 -16231 -3307 10818 9955 -7149 -18100 -5339
2245 -5339 13101 12820 -2826 -13130 -10634 -779 6129 2159 -7262 -9218 -3084 3800 6650 2892
2259 2892 -6471 -8684 1345 8845 6630 1150 -3417 -5227 -829 5879 3137 -6205 -9542 -3169 5775
2274 5775 8451 952 -7233 -4139 4192 5677 2631 1011 -303 -2035 1760 5577 2058 -5079 -8558
2289 -8558 -5732 1675 7723 3225 -6480 -8507 -371 7559 7861 -2159 -12713 -6777 11671 15289
2303 15289 -2849 -17916 -12724 3780 10528 -780 -16299 -13762 3553 11843 1937 -11453 -12253
2316 -12253 -2531 7325 5308 -6847 -11522 -2529 3787 -1924 -9481 -10282 -6311 -3194 -3313 -5294 -3128
2331 -3128 -687 -4928 -9767 -4256 2992 292 -7864 -9672 -2946 3511 2531 -10102 -18600 -9568 5276
$$ packed form
2232e216j1959J413J6405J0788r114j5876k672J2924J4125q63j7104j0951J2761
2245e339J8440k81j5646j0304K496R855O908l970r421j956O134O884K850l758
2259B892r363k213J0029P500k215n480m567j810M398O708k742r342l337O373Q944
2274E775K676p499q185L094Q331J485l046j620j314j732L795L817l519p137l479
2289h558K826P407O048m498r705k027Q136P930L02j0020j0554N936J8448L618
2303A5289j8138j5067N192J6504O748j1308j5519K537J7315Q290r906j3390q00
2316a2253R722R856k017j2155m675Q993O316n711p557q01L971L117j19j981K166
2331c128K441m241m839N511P248k700q156j808O726O457r80j2633q498R032J4844
$$ plain form
2346 5276 5804 -7012 -16273 -10074 6518 12670 -2561 -19191 -12637 6776 13625 1914 -12034
2359 -12034 -13814 -2016 8281 3069 -9793 -12634 -4476 4094 7631 3599 -4975 -7875 -688 5094
2373 5094 5700 3364 -1191 -5695 -2584 5556 7940 559 -9021 -10783 -149 13428 11655 -2690
2387 -2690 -10126 -1558 9504 12331 5964 -4977 -7712 2955 13446 11158 -158 -9198 -7962 3539
2401 3539 13268 8584 -4058 -6903 958 10973 14032 6270 -6375 -8163 5827 17219 11408 -3556
2415 -3556 -10179 -1715 11477 11873 -2373 -9770 -931 10327 10745 4822 -1353 -1931 4729 9405 4526
2430 4526 -1252 658 5237 4628 1281 -1653 -444 2928 1877 -2042 -352 7328 6698 -1198 -2389
2445 -2389 3916 6131 2397 -2444 -3175 2850 7651 1765 -7829 -7433 797 6116 2411 -6790 -9718
$$ packed form
2346E276N28j2816r261O199J6592O152j5231j6630O554J9413O849j1711j3948
2359a2034j780J1798J0297n212j2862k841Q158Q570L537m032q574k900P187N782
2373E094O06k336m555m504L111Q140K384p381r580j762J0634J3577j773j4345
2387b690p436Q568J1062K827o367j0941k735J0667J0491k288j1316r040J236J1501
2401C539R729m684j2642k845P861J0015L059p762j2645j788J3990J1392n811j4964
2415c556o623Q464J3192L96j4246p397Q839J1258M18n923o175n78O660M676m879
2430D526n778J910M579o09l347k934J209L372j051l919J690P680o30p896j191
2445b389O305K215l734m841p31O025M801n886r594L96Q230N319l705r201k928
$$ plain form
2460 -9718 1458 13954 7545 -9973 -13334 1114 11887 6513 -7394 -12914 -2627 8602 4764
2473 4764 -7126 -11519 -5337 2111 5577 1847 -4982 -5271 1527 3795 -146 -1399 -360 -1490 -2811
2488 -2811 -701 2462 3021 -2467 -9896 -6683 5992 10120 462 -8006 -4151 5737 11222 6523 -5508
2503 -5508 -9874 404 12217 10268 -1159 -9728 -6376 5772 11860 3294 -7724 -5377 4795
2516 4795 11203 10319 2753 -5956 -4590 6550 12823 7236 -3668 -7917 -600 11370 11454 -1624 -10894
2531 -10894 -4467 8057 12915 8101 -2932 -6631 2773 12660 9341 -1260 -6124 -1636 6012 9065
2545 9065 3405 -4117 -3980 -87 2447 3904 5622 1458 -3089 -692 6496 9260 4092 -4728 -7828
2560 -7828 671 11087 8440 -4543 -10817 -3878 6472 9407 -121 -11413 -7379 8744 13536 2054
$$ packed form
2460i718J1176J2496o409j7518l361J4448J0773n374j3907n520J0287J1229l838
2473D764j1890m393O182P448L466l730o829k89O798K268l941j253J039j130j321
2488b811K110L163N59n488p429L213J2675M128r658q468L855R888N485m699j2031
2503e508m366J0278J1813j949j1427q569L352J2148O088q566j1018K347J0172
2516D795O408q84p566q709J366J1140O273n587j0904m249P317J1970Q4j3078r270
2531a0894O427J2524M858m814j1033l699R404R887l319j0601m864M488P648L053
2545I065n660p522J37L893K534J457J718m164m547K397P188K764n168q820l100
2560g828Q499J0416k647j2983o274O939J0350K935r528j1292M034J6123M792j1482
$$ plain form
2574 2054 -9136 -6880 3874 9245 1498 -9007 -7013 3357 5579 -1316 -6760 -5714 -1938 2099
2588 2099 1088 -3657 -3222 1622 1812 -1901 -2979 -1293 -1195 -2961 -4517 -3113 1343 1648 -6744 -11573
2604 -11573 -3081 6208 2905 -7598 -10897 -2559 8542 8654 -5226 -15090 -8416 5713 9126 -341
2618 -341 -12605 -13776 43 11138 3667 -11022 -13006 -2433 7575 8483 646 -7558 -7207 956
2632 956 6332 4494 -2008 -8596 -7389 2828 9348 2631 -6807 -8705 -2736 5822 9265 2766 -6227
2647 -6227 -5051 4321 9119 5430 -3151 -8044 -2724 6429 6956 -27 -4510 -3444 -1138 2597 5712
2662 5712 1958 -3657 -2714 2857 7515 7027 -601 -7522 -3849 5403 6822 310 -5941 -6022 790 7371
2678 7371 4343 -6788 -8888 1525 9271 5377 -3681 -6775 -805 6550 4184 -6022 -8166 -640
$$ packed form
2574B054j1190K256J0754N371p747j0505J994J0370K222o895n444J046L776M037
2588B099j011m745M35M844J90l713j078J686R8j766j556J404M456L05q392m829
2604a1573Q492R289l303j0503l299Q338J1101J12j3880r864O674J4129L413r467
2618c41j2264j171J3819J1095p471j4689j984J0573J0008R08p837q204L51Q163
2632I56N376j838o502o588J207J0217O520o717r438j898N969Q558L443o499q993
2647f227J176R372M798l689q581m893N320R153N27o983m483J066K306L735L115
2662E712l754n615R43N571M658m88p628o921L673R252J419o512o251q1O812O581
2678G371l028j1131k100J0413P746l894r058l094N970P355k366j0206k144P526
$$ plain form
2692 -640 3790 1068 -3513 -5761 -3666 1664 1734 -3376 -4032 241 2183 -598 -2710 -1921 -847 -1181
2708 -1181 -5028 -6513 -1394 3664 -1943 -9380 -6936 1446 3443 -1844 -9022 -8662 1538 8203 1298
2723 1298 -11158 -11250 -1299 5983 1819 -10058 -14997 -4116 7705 3546 -9635 -13669 -5448 3778
2737 3778 5542 -2693 -10672 -7322 2115 3765 -1789 -6874 -8508 -5176 108 1758 -2543 -6268 -6057
2752 -6057 -4061 -231 3851 -198 -6770 -6504 618 5892 4328 -3373 -10717 -7190 4467 7652 -730
2767 -730 -8940 -8282 -284 7234 6236 -3750 -9218 -3437 5753 8405 4293 -4059 -8516 -2104 7242 8026
2783 8026 -1157 -8092 -7429 1669 10426 7433 -5728 -10613 -2031 8928 10777 2571 -7436 -6715 5486
2798 5486 11309 3543 -6677 -6735 -280 5333 5724 -317 -4501 -1959 2330 3122 2591 1919 -352 -1102
$$ packed form
2692f40M430k722m581k248K095N330P0n110o56M273J942k781k112P89J074l34
2708a181l847j485N119N058n607p437K444Q382J997n287p178L60J0200O665o905
2723A298j2456r2R951P282m164j1877m939J0881J1821m159j3181m034Q221R226
2737C778J764q235p979L350R437J650n554n085j634L332N284J650m301l725K11
2752f057J996L830M082m049o572K66P122N274j564p701p344L527J1657L185q382
2767g30q210O58P998P518r98r986n468N781R190K652m112q352m457O412R346P84
2783H026r183o935O63R098Q757k993j3161m885Q582J0959J849q206j0007P21J2201
2798E486N823p766j0220n8O455N613L91o041m184K542M289P92n31o72k271p50
$$ plain form
2814 -1102 1553 3933 4007 1856 -3202 -6288 35 7487 4616 -4645 -7287 -498 7333 7188 -2163 -9094
2830 -9094 -1982 9382 8813 -1357 -8118 -3877 4928 7472 -823 -10200 -6188 5833 8218 -667
2844 -667 -7354 -5217 2802 7526 2570 -5206 -4330 2886 4651 1416 -1786 -3439 -2415 619 1357 -656
2860 -656 -513 130 -2429 -2101 2532 4861 193 -3814 -3327 2073 7785 5408 -4670 -8474 -825 7363
2876 7363 5866 -1643 -6829 -4425 5876 10647 3058 -6154 -4047 3745 8826 7536 -43 -4660 -894
2891 -894 6594 7438 2722 -1848 -3582 1007 8291 8534 1564 -3060 209 5727 8873 7398 463 -2685
2907 -2685 3269 9924 7788 1435 -2157 -775 5335 8692 4145 -1087 354 4596 5734 5400 4331
2922 4331 1623 934 3954 5820 5717 3822 -49 -2411 1598 7161 5432 -563 -3400 -586 6128
$$ packed form
2814a102K655K380P4k151n058l086O323P452k871r261k642O789P831j45r351o931
2830i094P112J1364n69j0170o761M241Q805K544q295r377M012J2021K385q885
2844f67o687K137Q019M724m956p776Q76P216J765l235l202j653J024L034P38k013
2860f56J43O43k559L28M633K329m668m007M87N400N712k377j0078l804P649Q188
2876G363j497p509n186K404J0301M771p589r212K107P792N081j290p579m617L766
2891h94P488Q44m716m570j734M589P284K43o970m624L269N518L146j475o935l148
2907b685N954O655k136o353l592J382O110L357m547n232J441M242J138l34j069
2922D331k708o89L020J866j03j895l871k362M009N563j729n995k837K814O714
$$ plain form
2937 6128 9804 3320 -6463 -3983 7208 11068 3848 -4879 -5178 2868 9865 4736 -6036 -7077 1635
2952 1635 7113 3717 -2675 -5157 -375 6401 4311 -2836 -3939 1420 3652 1053 -1862 -2875 -745
2967 -745 1731 -973 -3886 -1570 2146 -316 -3725 -1901 1110 1349 -1177 -4427 -3595 1694 3931 -2753
2983 -2753 -8041 -5429 1422 3264 -1634 -9547 -9251 919 7197 175 -9862 -8755 -419 5414 2935
2998 2935 -5904 -10411 -4573 3638 3095 -3087 -8524 -8153 -2445 3515 2219 -5146 -7951 -4307 455
3013 455 3261 1945 -3802 -7877 -3924 3344 4597 -254 -7084 -9177 -1649 6389 3804 -4656 -7518
3028 -7518 -3488 2687 6417 3328 -4449 -6453 14 5662 5705 953 -5086 -6332 891 6900 4225
3043 4225 -2615 -5954 -3476 3313 9162 4784 -6129 -7500 1956 9527 7422 -2070 -8353 -2971 7460
$$ packed form
2937F128L676o484r783K480J1191L860p220q727k99Q046O997n129j0772j041Q712
2952A635N478l396o392k482M782O776k090p147j103N359K232k599k915j013K130
2967g45K476k704k913K316L716k462l409J824L011K39k526l250Q32N289K237o684
2983b753n288K612O851J842m898p913K96J0170O278p022j0037J107Q336N833k479
2998B935q839m507N838Q211n43o182n437L71N708N960j296p365k805L644M762
3013D55K806j316n747m075L953P268J253m851o830k093P528Q038k585q460k862
3028g518M030O175L730l089p777k004O467N648M3m752o039j246P223O009k675
3043D225o840l339K478O789N849m378j0913j371R456P571k105r492o283N382J0431
$$ plain form
3058 7460 8329 -1118 -7178 -4003 2872 5941 3078 -3660 -4205 1466 5581 2169 -1188 -1347 -157 1438
3074 1438 1065 -430 -62 1053 -1456 -3864 32 4600 1298 -4193 -4076 1270 5555 3913 -3292 -6410
3090 -6410 -308 6965 4348 -3564 -7095 -3190 4381 6070 -1936 -9192 -4234 5978 6049 -1833 -6494
3105 -6494 -3547 3499 5663 -124 -5838 -3772 1880 2295 -624 -2895 -3813 -1678 1878 886 -2838 -2531
3121 -2531 -79 54 -637 489 316 -735 -2022 -1829 281 2345 -395 -5430 -4508 2022 3619 -234
3137 -234 -3801 -4024 -120 4070 4027 -1516 -5006 -1442 3873 4861 1375 -4613 -5195 1616 6268 2284
3153 2284 -2723 -3542 -1383 2949 6322 3786 -3294 -4365 1619 7289 6654 138 -5956 -2663 5936
3168 5936 8078 993 -4156 -3511 1631 6666 6022 -875 -4484 351 5890 5995 2319 -612 -930 2210
$$ packed form
3058G460Q69r447o060L175O875L069k863o738n45N671M115l412l357j59J190J595
3074A438l73j495L68J115k509k408L896M568l302n491J17N346M285j642p205l118
3090f410O102P273k617p912l531L905P571J689q006p256M958J0212P1p882m661
3105f494K947P046K164n787n714K066N652M15k919k271r18K135L556r92l724L07
3121b531K452J33o91J126j73j051j287J93K110K064k740n035R22O530J597l853
3137b34l567k23L904M190m3n543l490L564N315R88l486n988n82O811M652l984
3153B284n007q19K159M332L373k536p080j071N984N670o35o516o094L293Q599
3168E936K142p085n149O45N142N035o44o897l609M835N539J05l676k931l18L140
$$ plain form
3184 2210 4006 2034 869 1164 -852 -2217 1983 5724 2898 -2587 -3266 465 5635 6501 -153 -5553
3200 -5553 -1426 6011 6723 647 -5464 -5395 2007 7750 2369 -6762 -5433 3485 6449 1288 -4587 -4085
3216 -4085 1715 6075 2230 -4226 -3689 1246 2157 131 -2399 -4051 -1557 2279 1168 -2750 -2874 -133
3232 -133 270 -1004 -785 -118 194 -860 -2642 -1890 2190 1797 -4833 -6697 -1360 3399 1903 -2930 -6467
3249 -6467 -4201 3125 5578 -1113 -7256 -5429 1163 5579 2628 -5779 -9061 -2052 4368 2677 -3535
3264 -3535 -6216 -4121 1062 4519 2055 -4001 -5374 -1725 2387 4849 1242 -5314 -5231 1163 4738
3279 4738 1659 -2643 -4684 -3359 2519 5532 1843 -4021 -3195 1176 4367 4533 -4 -3663 -899
3294 -899 3679 3889 1357 69 -2087 -2382 2262 6096 3158 -1666 -2656 720 6425 7374 525 -5559
$$ packed form
3184B210J796j972j165K95k016j365M200L741k826n485o79L731N170Q66o654n400
3200e553M127P437P12o076o111O9P402N743n381r131J329Q918K964n161n875N02
3216d085N800M360l845o456N37M935R11k026k530j652K494L836j111l918j24K741
3232a33M03j274K19O67L12j054j782P52M080l93o630j864N337M759j496m833l537
3249f467K266P326K453o691o143J827O592M416k951q407l282P009O420j691o212
3264c535k681K095N183L457k464o056j373L649M112K462l607o556Q3O394L575
3279D738l079m302k041J325N878L013l689n864Q26M371L191J66m537l659K764
3294h99M578K10k532j288k156k95M644L834k938m824r90L376N705R49o849o084
$$ plain form
3310 -5559 -1719 5808 8180 3514 -3361 -6235 494 9370 6935 -3250 -7094 452 8121 7539 317
3325 317 -5282 -1874 5487 6304 1270 -1593 -837 1086 2778 2921 5 -1594 384 842 409 1968
3341 1968 3155 886 -1728 -1138 1701 4798 3301 -2996 -4851 1637 6633 2235 -4624 -5101 -65
3356 -65 4643 3887 -2226 -5431 -423 5084 3631 -1594 -4202 -1885 3295 4750 -1498 -6209 -1511 3836
3372 3836 1699 -2589 -4031 -1935 2020 2793 -217 -2915 -1925 552 1132 1226 -644 -3241 -2216 1385
3388 1385 1808 -701 -1843 -2500 -2940 -288 3014 1160 -2263 -3056 -1034 2742 4301 -245 -5230 -3207
3404 -3207 2544 4177 1579 -1723 -4879 -3295 2082 5236 1116 -2993 -3728 169 5031 6211 47
3419 47 -5669 -3178 3289 6701 4198 -2198 -6412 -1647 6935 6948 -1373 -6550 -2937 4551 8128 3462
$$ packed form
3310e559L840P527K372m666o875k874O729Q876k435j0185l844P546P669n82p222
3325C17n599L408P361Q17n034k863P56J923J692J43k916j599J978M58m33J559
3341A968J187k269k614N90K839L097j497o297j855O488M996m398o859m77N036
3356f5M708p56o113l205N008N507j453n225k608K317N180J455o248m711M698N347
3372C836k137m288j442K096L955P73l010k698R90K477N80R4j870k597J025L601
3388A385M23k509j142o57m40K652L302j854l423p93K022L776J559m546m985K023
3404c207N751J633k598l302l156J584N377L154m120m109p35L897M862J180o164
3419D7n716K491O467L412k503o396m214M765Q582J3q321n177L613P488L577m666
$$ plain form
3435 3462 -4597 -4428 2566 5910 3091 -1055 -2505 -960 2796 3733 564 -2120 -833 -35 589 2188
3451 2188 2073 162 -1263 -958 611 2963 2746 -2676 -5146 355 5367 3157 -3452 -5694 -2273 4015
3467 4015 5024 -1701 -6791 -1973 4800 5047 -282 -5589 -4896 2089 6414 908 -6217 -4558 1889
3482 1889 3543 255 -3777 -4640 -665 3003 1338 -1791 -1700 -524 -921 -44 242 -1171 -2105 -1234 -1267
3499 -1267 -763 1019 -232 -3985 -4203 -796 1917 1420 -2014 -4855 -2446 3148 2958 -3443 -6187 -2926
3515 -2926 860 2372 189 -4527 -5847 -1004 2319 390 -3672 -5005 -2702 2103 4042 -609 -5471
3530 -5471 -3907 -92 2301 1470 -1885 -5419 -2718 2904 3748 -1395 -5541 -4585 784 5555 3397 -3443
3546 -3443 -5021 36 4013 3072 -605 -4130 -3638 1609 5116 1852 -2146 -2954 -1164 1661 3713 2176
$$ packed form
3435C462q059J69O994L344k819m146j450J545L756R37l169k684J287P98O24J599
3451B188j15j911j425L05J569K352k17n422k470N501N012k210o609k242L421O288
3467D015J009o725n090M818O773K47n329n307O93O985M325n506p125J659O447
3482A889J654l288m032q63L975L668j665l129R1J176l97Q77K86j413r34Q71l3
3499a267N04J782j251l753k18L407K713m97l434k841K409N594j90o401k744L261
3515b926L786J512k183m716j320M843L323j929m062j333K303M805J939m651m862
3530e471J564L815K393q31l355l534K701N622Q44n143m146R56N369M771k158o840
3546c443j578N057L977r41l677l525M92N247L507l264l998q08J790K825K052j537
$$ plain form
3562 2176 -1431 -2094 -124 2388 4541 2608 -3067 -5635 55 6076 4738 -1321 -5822 -3964 3783
3577 3783 7493 1265 -6513 -5193 2786 7261 4160 -3337 -6640 -1084 5600 3639 -2613 -4682 -1362
3592 -1362 2050 2855 -357 -3191 -2064 693 457 -774 645 785 -615 -1307 -954 -195 800 282 -3043
3609 -3043 -3295 950 2758 -50 -3597 -3006 -368 2739 1363 -3113 -3612 1661 4060 321 -3448 -3318
3625 -3318 -387 3586 2414 -3285 -4777 86 3902 1961 -2355 -4201 -1866 3326 5044 235 -3759
3640 -3759 -2527 1319 2999 2263 -1523 -4484 -1847 3417 3869 595 -2575 -3550 -928 4371 4580 -133
3656 -133 -3393 -1486 2639 4525 2875 -2033 -4676 -357 4576 4152 640 -2127 -2555 997 4788 3627
3672 3627 -385 -2475 -217 3058 5458 4462 -1085 -4005 266 5045 5369 1931 -2497 -2708 3444 7895
$$ packed form
3562B176l607o63J970K512K153j933n675k568N690O021j338o059m501J858P747
3577C783L710o228p778J320P979M475l101p497l303N556O684j961o252k069L320
3592a362L412Q05l212k834J127K757k36j231J419J40j400o92L53P59R95n18l325
3609c043k52M245J808k808l547N91K638L107j376m476m99N273K399l739l769J30
3625c318K931L973j172n699j492M863L816j941m316j846K335N192J718m809l994
3640c759J232L846J680p36l786k961K637N264M52l274l170r75K622N299K09m713
3656a33l260J907M125J886j650m908k643M319M933m24l512k767m28L552L791j161
3672C627m012k090K258L275K400r96n547k920M271M779L24l438m428k11O152M451
$$ plain form
3688 7895 4370 -2650 -3530 1843 7140 7281 967 -3497 -128 5944 6326 1229 -1989 -1011 3403 5751
3704 5751 3755 -594 -605 2434 3409 2838 1903 1949 1329 1970 2430 2358 2896 1843 -1610 -1265 3110 5432
3722 5432 2483 -1566 -2512 1343 5792 4600 -1999 -4596 1159 6554 5530 -456 -4743 -2683 4207
3737 4207 6448 113 -5376 -2520 3444 4829 2216 -2974 -4099 270 4268 2242 -1470 -2037 -486
3752 -486 1121 1807 388 -2659 -2005 193 810 414 282 -872 -1971 -327 1250 255 -769 -1298 -1235
3769 -1235 1384 2792 -252 -3543 -2423 461 1467 398 -1710 -2912 -809 2700 1903 -1714 -3283
3784 -3283 -1524 1035 3475 1622 -2597 -3440 257 2613 1711 -665 -3196 -3148 1626 5193 2361 -2712
3800 -2712 -3742 -826 4242 5194 168 -4854 -1887 3918 5299 1400 -2894 -3848 -316 4534 4584 -9
$$ packed form
3688G895l525p020q80N373N297J41o314m464L369O072L82n097l218R78M414K348
3704E751j996m349j1L039R75n71r35M6o20O41M60p2N38j053l453L45M375K322
3722E432k949m049r46L855M449j192o599k597N755N395j024n986m287K060O890
3737D207K241o335n489K856N964J385k613n190j125M369L998k026l712n67J551
3752d86J607O86j419l047O54K198O17l96j32j154j099J644J577r95j024n29O3
3769a235K619J408l044l291J120K884J006j069k108j202K103L509p97l617j569
3784c283J759K559K440j853m219q43L697K356r02k376k531M8M774L567k832n073
3800b712j030K916N068R52n026n022K967N805J381l899m294r54L532M850N0m593
$$ plain form
3816 -9 -2661 -932 2160 3217 2813 -9 -1565 -25 1947 2884 3129 1028 -3126 -2960 2228 5559 2942
3833 2942 -2349 -3965 -356 5807 6100 -939 -5929 -2559 4260 6677 2644 -4300 -5473 1794 6639
3848 6639 2648 -4262 -4477 645 4664 3780 -942 -3987 -951 3276 2464 -812 -1532 -603 1440 2248
3864 2248 543 -2019 -1562 391 106 82 380 -26 -994 -307 389 506 419 -1222 -2181 214 3244 1760
3882 1760 -2347 -3376 -1258 1197 1629 -1091 -4276 -3105 1975 3446 140 -3774 -4451 -883 3198
3897 3198 2445 -2625 -5119 -1858 1513 1767 -508 -3137 -4469 -1426 2656 1983 -1410 -3520 -3468 121
3913 121 2789 937 -3501 -3744 -549 1574 1843 -725 -3573 -3766 68 2409 823 -1780 -2280 -1486
3929 -1486 1073 2511 218 -2262 -2025 -659 527 2350 1682 -2548 -3422 28 3230 2412 -1100 -3504
$$ packed form
3816ik652J729L092J057m04k822j556J540J972R37K45k101m154J66N188L331k617
3833B942n291j616L609O163K93p039m990L370O819K417m033o944j173P267M845
3848F639l991o910k15N122M019q84m722l045L036M227q12l276p20R29K043Q08
3864B248j705k562M57J953k85k4K98m06r68O87O96J17q7j641r59K395L030j484
3882A760m107j029K118K455M32k720l185J171N080J471l306l914o77L568M081
3897C198p53n070k494L261L371K54k275k629j332L043M082o73l393k110N2L589
3913A21K668j852m438k43L195K123K69k568k848j93L834K341j586k603n00P94
3929a486K559J438k293k480K37J366J186J823o68m230q74L450L202q18l512k404
$$ plain form
3945 -3504 -1765 3543 5147 161 -4624 -3301 1967 5092 2948 -3238 -5542 378 6390 3429 -3467
3960 -3467 -5751 -1242 4171 4472 -852 -4901 -2105 3009 3037 203 -2299 -3131 -553 2682 1720 -1650
3976 -1650 -2275 -1462 -795 -186 574 -262 -1802 -1989 -1073 1067 2212 -221 -4501 -3577 1355 2992 -105
3993 -105 -3239 -4043 -996 2448 1689 -3050 -4608 -1504 1762 1915 -417 -3801 -3040 976 2494 -1301
4009 -1301 -3722 -1839 -82 441 -425 -2177 -2912 -1343 304 -670 -1349 -1383 -1743 -939 490 -760 -2681
4026 -2681 -2650 -802 -562 -396 -845 -2445 -3112 -1122 251 -425 -1986 -3108 -2737 412 1892 -868 -3818
4043 -3818 -3269 -968 731 1641 -704 -4175 -3769 395 2597 922 -3055 -5374 -2487 3368 4832 -508
4059 -508 -5099 -3873 901 4800 3717 -2850 -6781 -1348 5680 5264 -559 -5206 -3743 2877 6287
$$ packed form
3945c504J739N308J604m986m785J323N268L125k144o186k304N920O012k961o896
3960c467k284M509N413L01n324m049K796N114K8k834k502q32K578L235r62l370
3976a650o25Q13O67O09P60q36j540j87R16K140J145k433m280R24M932J637l097
3993a05l134q04L047L444p59m739j558L104L266J53k332l384P61M016J518l795
4009a301k421J883J757N23q66j752p35J569J647r74o79l4l60Q04J429j250j921
4026b681L1J848K40J66m49j600o67J990J373o76j561j122L71L149J480k760k950
4043c818N49K301J699R10k345l471M06M164K202j675l977k319K887N855J464n340
4059e08m591J226M774L899j083o567l931N433P028m16n823m647J463O620L410
$$ plain form
4074 6287 2309 -3630 -2980 1325 3878 3135 534 -2397 -1356 2510 3223 1662 13 -242 -493 612
4090 612 2906 1750 470 -616 -733 1129 4382 3173 -1431 -2857 568 4132 3144 -264 -2807 -1316
$$ packed form
4074F287l978n939O50M305K553p43k601k931J041L866P13j561j649k55k51J105
4090F12K294j156j280j086j17J862L253j209m604j426L425L564r88l408k543J491
$$ [...]
8191C29
##END NTUPLES=NMR FID
##END=
