##TITLE=1H_TG-2273-1
 CDCl3, 8 sc, 
 24.12.2019
##JCAMPDX= 6.0         $$ Bruker NMR JCAMP-DX V2.0
##DATA TYPE= NMR FID
##DATA CLASS= NTUPLES
##ORIGIN= UXNMR, Bruker Analytische Messtechnik GmbH
##OWNER= root
$$ XWIN-NMR		Version 3.5
$$ Tue Dec 24 15:56:22 2019 Russian Standard Time (UT+4h)  she@DPX200
##.OBSERVE FREQUENCY= 200.1315
##.OBSERVE NUCLEUS= ^1H
##.DELAY= (6, 6)
##.ACQUISITION MODE= SIMULTANEOUS
##.ACQUISITION SCHEME= undefined
##.AVERAGES= 8
##.DIGITISER RES= 18
##SPECTROMETER/DATA SYSTEM= spect
##.PULSE SEQUENCE= zg30
##.SOLVENT NAME= CDCl3
##.SHIFT REFERENCE= (INTERNAL, CDCl3, 0, 15.7039)
##AUDIT TRAIL= $$ (NUMBER, WHEN, WHO, WHERE, WHAT)
$$ ##TITLE= Audit trail, XWIN-NMR		Version 3.5
$$ ##JCAMPDX= 5.01
$$ ##ORIGIN= Bruker BioSpin GmbH
$$ ##OWNER= she
$$ F:/spectra/data/she/nmr/H-F/1/audita.txt
$$ ##AUDIT TRAIL=  $$ (NUMBER, WHEN, WHO, WHERE, WHAT)
(   1,<2019-12-24 15:54:50.57 +0400>,<she>,<DPX200>,
      <created by zg, POWCHK disabled, PULCHK disabled
       configuration hash MD5:
       00 E9 B6 7A A2 85 ED C7 34 08 36 98 17 FE 4E 26
       data hash MD5: 16K
       E3 17 92 FD B9 8A D4 EB 16 EF 1D 59 58 22 A1 54>)
$$ ##END=
$$ 
$$ hash MD5
$$ A5 CA AD 8A 3C 52 36 1E B6 40 45 0F E1 1C 9F 8E
##$RELAX= 
##$RELAX= 
##$RELAX= 
##$RELAX= 
##$RELAX= 
##$RELAX= 
$$ Bruker specific parameters
$$ --------------------------
##$DU= <F:/spectra>
##$EXPNO= 1
##$NAME= <H-F>
##$PROCNO= 1
##$TYPE= <nmr>
##$USER= <she>
##$AMP= (0..31)
100 100 100 100 100 100 100 100 100 100 100 100 100 100 100 100 100 100 
100 100 100 100 100 100 100 100 100 100 100 100 100 100 
##$AQSEQ= 0
##$AQ_mod= 1
##$AUNM= <au_zg>
##$AUTOPOS= <>
##$BF1= 200.13
##$BF2= 200.13
##$BF3= 200.13
##$BF4= 200.13
##$BF5= 200.13
##$BF6= 200.13
##$BF7= 200.13
##$BF8= 200.13
##$BYTORDA= 1
##$CFDGTYP= 0
##$CFRGTYP= 5
##$CHEMSTR= <none>
##$CNST= (0..31)
1 1 145 1 1 1 1 1 1 1 1 1 1 1 1 1 1 1 1 1 1 1 1 1 1 1 1 1 1 1 1 1 
##$CPDPRG= <>
##$CPDPRG1= <>
##$CPDPRG2= <>
##$CPDPRG3= <>
##$CPDPRG4= <mlev>
##$CPDPRG5= <mlev>
##$CPDPRG6= <mlev>
##$CPDPRG7= <mlev>
##$CPDPRG8= <mlev>
##$CPDPRGB= <>
##$CPDPRGT= <>
##$D= (0..31)
0 1.2 0 0 0 0 0 0 0 0.06 0 0.03 0 0 0 0 0.0002 0 0 0 0 0 0 0 0 0 0 0 0 
0 0 0 
##$DATE= 1577188489
##$DBL= (0..7)
120 120 120 120 120 120 120 120 
##$DBP= (0..7)
150 150 150 150 150 150 150 150 
##$DBP07= 0
##$DBPNAM0= <>
##$DBPNAM1= <>
##$DBPNAM2= <>
##$DBPNAM3= <>
##$DBPNAM4= <>
##$DBPNAM5= <>
##$DBPNAM6= <>
##$DBPNAM7= <>
##$DBPOAL= (0..7)
0.5 0.5 0.5 0.5 0.5 0.5 0.5 0.5 
##$DBPOFFS= (0..7)
0 0 0 0 0 0 0 0 
##$DE= 6
##$DECBNUC= <off>
##$DECIM= 24
##$DECNUC= <off>
##$DECSTAT= 4
##$DIGMOD= 1
##$DIGTYP= 9
##$DL= (0..7)
0 120 120 120 120 120 120 120 
##$DP= (0..7)
150 150 150 150 150 150 150 150 
##$DP07= 0
##$DPNAME0= <>
##$DPNAME1= <>
##$DPNAME2= <>
##$DPNAME3= <>
##$DPNAME4= <>
##$DPNAME5= <>
##$DPNAME6= <>
##$DPNAME7= <>
##$DPOAL= (0..7)
0.5 0.5 0.5 0.5 0.5 0.5 0.5 0.5 
##$DPOFFS= (0..7)
0 0 0 0 0 0 0 0 
##$DQDMODE= 0
##$DR= 18
##$DS= 0
##$DSLIST= <SSSSSSSSSSSSSSS>
$$ [...]
##$SUBNAM2= <"">
##$SUBNAM3= <"">
##$SUBNAM4= <"">
##$SUBNAM5= <"">
##$SUBNAM6= <"">
##$SUBNAM7= <"">
##$SUBNAM8= <"">
##$SUBNAM9= <"">
##$SW= 24.9337058887773
##$SWIBOX= (0..15)
0 0 2 0 0 0 0 0 0 0 0 0 0 0 0 0 
##$SW_h= 4990.01996007984
##$TD= 16384
##$TD0= 1
##$TE= 0
##$TE2= 300
##$TE3= 300
##$TEG= 300
##$TL= (0..7)
0 120 120 120 120 120 120 120 
##$TP= (0..7)
150 150 150 150 150 150 150 150 
##$TP07= 0
##$TPNAME0= <>
##$TPNAME1= <>
##$TPNAME2= <>
##$TPNAME3= <>
##$TPNAME4= <>
##$TPNAME5= <>
##$TPNAME6= <>
##$TPNAME7= <>
##$TPOAL= (0..7)
0.5 0.5 0.5 0.5 0.5 0.5 0.5 0.5 
##$TPOFFS= (0..7)
0 0 0 0 0 0 0 0 
##$TUNHIN= 0
##$TUNHOUT= 0
##$TUNXOUT= 0
##$USERA1= <user>
##$USERA2= <user>
##$USERA3= <user>
##$USERA4= <user>
##$USERA5= <user>
##$V9= 5
##$VALIST= <valist>
##$VCLIST= <CCCCCCCCCCCCCCC>
##$VD= 0
##$VDLIST= <DDDDDDDDDDDDDDD>
##$VPLIST= <PPPPPPPPPPPPPPP>
##$VTLIST= <TTTTTTTTTTTTTTT>
##$WBST= 1024
##$WBSW= 4
##$XGAIN= (0..3)
0 0 0 0 
##$XL= 0
##$YL= 0
##$YMAX_a= 1174233
##$YMIN_a= -909814
##$ZGOPTNS= <>
##$ZL1= 120
##$ZL2= 120
##$ZL3= 120
##$ZL4= 120
##$ABSF1= 10
##$ABSF2= 0
##$ABSG= 5
##$ABSL= 3
##$ALPHA= 0
##$AQORDER= 0
##$ASSFAC= 0
##$ASSFACI= 0
##$ASSFACX= 0
##$ASSWID= 0
##$AUNMP= <proc_1d>
##$AZFE= 0.1
##$AZFW= 0.1
##$BCFW= 1
##$BC_mod= 2
##$BYTORDP= 1
##$COROFFS= 0
##$CY= 11.3945322036743
##$DATMOD= 1
##$DC= 2
##$DFILT= <>
##$DTYPP= 0
##$F1P= 16.9975609425685
##$F2P= -3.02152046262296
##$FCOR= 0.5
##$FTSIZE= 0
##$FT_mod= 4
##$GAMMA= 1
##$GB= 0.15
##$INTBC= 1
##$INTSCL= 1
##$ISEN= 128
##$LB= 0.24
##$LEV0= 0
##$LPBIN= 0
##$MAXI= 10000
##$MC2= 0
##$MEAN= 0
##$ME_mod= 0
##$MI= 1.114404
##$NCOEF= 0
##$NC_proc= 0
##$NLEV= 6
##$NOISF1= 3.799351
##$NOISF2= 2.8
##$NSP= 1
##$NTH_PI= 0
##$NZP= 0
##$OFFSET= 15.70392
##$PC= 1
##$PHC0= -10149.23
##$PHC1= 14.6008
##$PH_mod= 1
##$PKNL= yes
##$PPARMOD= 0
##$PSCAL= 0
##$PSIGN= 0
##$REVERSE= no
##$SF= 200.130013532006
##$SI= 16384
##$SIGF1= 3
##$SIGF2= 2
##$SINO= 400
##$SIOLD= 16384
##$SREGLST= <1H.CDCl3>
##$SSB= 0
##$STSI= 0
##$STSR= 0
##$SW_p= 3612.71676300578
##$SYMM= 0
##$S_DEV= 0
##$TDeff= 0
##$TDoff= 0
##$TI= <>
##$TILT= no
##$TM1= 0
##$TM2= 0
##$TOPLEV= 0
##$USERP1= <user>
##$USERP2= <user>
##$USERP3= <user>
##$USERP4= <user>
##$USERP5= <user>
##$WDW= 1
##$XDIM= 8192
##$YMAX_p= 0
##$YMIN_p= 0
$$ End of Bruker specific parameters
$$ ---------------------------------
##NTUPLES= NMR FID
##VAR_NAME=  TIME,          FID/REAL,        FID/IMAG
##SYMBOL=    X,             R,               I
##VAR_TYPE=  INDEPENDENT,   DEPENDENT,       DEPENDENT
##VAR_FORM=  AFFN,          ASDF,            ASDF
##VAR_DIM=   8192,          8192,            8192
##UNITS=     SECONDS,       ARBITRARY UNITS, ARBITRARY UNITS
##FACTOR=    0.0002004,     1,               1
##FIRST=     0,             0,               0
##LAST=      1.6414764,     0,               0
##MIN=       0,             -909814,         0
##MAX=       1.6414764,     1174233,         0
$$ Real data points
##PAGE= N=1
##DATA TABLE= (X++(R..R)), XYDATA
$$ [...]
546 15468 -61001 -117973 -42376 116730 140893 -32830 -214839 -216883 -29835 181114 200704
557 200704 2990 -168989 -100156 117419 202262 8052 -271925 -272764 51268 290636 140120
568 140120 -167493 -251043 -88676 76850 85914 -26662 -111943 -66408 60979 145201 108792
579 108792 -39898 -183381 -167026 -14198 88809 64436 -16727 -101549 -135420 -36842 104765
590 104765 64226 -150391 -242525 -41155 237140 248359 -32505 -255857 -163622 61998 112013
601 112013 -19108 -140054 -146827 -39119 104139 112333 -63376 -220681 -172135 8560 123485
612 123485 92165 -12681 -77505 -68584 -20907 35804 37478 -92694 -240589 -155961 123373
623 123373 225508 -4925 -267389 -245460 479 167240 77522 -130272 -181059 -16001
633 -16001 158327 142500 -56682 -252896 -230755 -2086 148117 38831 -140303 -147498 -30095
644 -30095 32884 -2429 -64691 -95564 -82176 -32318 53711 119657 47473 -138911 -211167 -68352
656 -68352 73339 23002 -113804 -148565 -54706 60480 75291 -39754 -164568 -154868 -13898
667 -13898 113020 89971 -53608 -121489 -17448 73788 -21295 -152761 -118103 -6947 4914
678 4914 -39894 -21335 26811 -1823 -89260 -107018 -12665 64462 27204 -30432 -11772 19922
690 19922 6546 -8992 -36669 -105661 -117402 -615 95865 31144 -80285 -60051 44245
701 44245 49143 -58831 -89709 30989 115243 32084 -52358 8254 69812 -6017 -97609 -77666
713 -77666 -8707 29476 45206 35747 -8917 -37808 1884 63766 48033 -41587 -57022 64993
725 64993 147001 54934 -56044 -26399 26357 -22928 -61176 12286 82934 37297 -38785 -11691
737 -11691 87510 104116 -3203 -83654 -22379 91589 132172 89072 -3302 -86255 -51434 84694
749 84694 118355 -29991 -146852 -44264 149616 184635 28249 -105630 -55614 72938 102687
760 102687 50366 24468 14228 -10187 15052 85815 72884 -44608 -120555 -54906 81224
771 81224 143532 72487 -42917 -72919 3130 104333 135279 38037 -112803 -105992 103721
782 103721 238368 81009 -167997 -183514 22461 165489 91327 -63433 -95525 2319 92223
793 92223 108537 65653 -28376 -104295 -37627 123043 158725 21237 -98633 -78953 7768
804 7768 65601 65587 2250 -86891 -98651 35298 196765 157740 -87124 -213575 -21605 220767
816 220767 175934 -55739 -153397 -47929 88388 121507 38161 -89851 -139674 -40296 124008
827 124008 169441 28792 -121406 -76470 85598 131996 43083 -22647 -30702 -35159 10344 112328
839 112328 114528 -50844 -182954 -82374 138601 191973 11988 -144781 -70936 108601 161459
850 161459 67534 -48865 -98198 -29499 118672 170015 25971 -135798 -103701 59615 128327
861 128327 35955 -65438 -44114 42388 73815 61121 60141 28194 -52247 -53532 70745 148434
873 148434 56348 -76771 -81860 25610 101849 59812 -42069 -82077 -19638 81603 132650
884 132650 77307 -47878 -90792 29177 145700 81082 -60760 -70540 37667 91651 36578
895 36578 -29832 -32643 -6053 -3810 5827 56216 74804 8812 -38429 16593 78220 49608 -11585
908 -11585 -28060 -10019 21913 56413 49669 -16975 -77436 -46744 51204 84002 -5809 -78376
920 -78376 16 112273 76130 -36629 -45529 25929 39321 -6070 -17549 14225 25642 -3891
932 -3891 -28538 -15671 830 -5123 -1074 17858 7412 -8319 33334 72780 12965 -67974 -35815
945 -35815 52038 48702 -29711 -53287 4857 39370 -7816 -51632 -14762 31356 821 -34603
957 -34603 11851 65832 38460 -16364 -25840 -8778 7644 24598 16582 -29891 -57028 -13324
969 -13324 58258 51949 -48233 -105117 -15592 99366 71462 -35521 -47838 22923 50038 17926
981 17926 -7474 -12191 -20818 -24490 -1690 32833 27929 -25718 -55477 -16118 32570 36023 20867
994 20867 2277 -27415 -17631 58485 94404 4838 -101211 -73972 52312 105096 12402 -97026
1006 -97026 -72498 37487 75331 19415 -27829 -29611 -10821 29416 70519 48907 -21633 -52602
1018 -52602 -13657 35859 39915 1049 -36403 -40383 -17949 20594 59191 38556 -53302 -91110
1030 -91110 15242 130580 83978 -57679 -100018 -3906 93627 74537 -28851 -90507 -52507
1041 -52507 24898 64068 37336 -34068 -78893 -26316 70142 79404 222 -47915 -21686 18067
1053 18067 35758 36767 12448 -38056 -68785 -28473 57531 75639 -24378 -114397 -54832 76783
1065 76783 102349 9132 -71557 -58307 20590 85191 62788 -29571 -87151 -43802 45013 72841
1077 72841 1891 -81583 -67471 18953 54844 17022 -12129 -11722 -17457 -9397 36260 61650 12870
1090 12870 -59463 -63461 13651 76812 36379 -61452 -89829 -20994 52510 59716 3772 -63284
1102 -63284 -61949 28856 100733 51001 -53530 -76643 -3103 64845 46324 -24989 -57565 -27463
1114 -27463 5841 12214 15659 7026 -32682 -48552 5695 66300 54369 -11529 -56193 -33295
1126 -33295 33233 66198 19657 -55039 -72557 -15399 58142 60536 -28447 -100120 -47114 63477
1138 63477 82532 2407 -55314 -31529 25302 48055 19297 -21343 -34056 -22100 -3534 19711
1150 19711 23110 -15187 -51482 -34865 9881 32104 23735 -7317 -37835 -21040 38283 61482
1162 61482 7458 -62482 -64081 7037 63012 25305 -59313 -71104 -2264 40160 13924 -26632
1174 -26632 -35028 -12971 19234 32015 12921 -10857 -18680 -16372 -7897 2718 1145 -12386 -22665
1187 -22665 -27093 -16880 12797 21274 -22058 -58092 -21268 42874 49887 -1936 -45469 -30656
1199 -30656 19052 32849 -11521 -50453 -34428 2216 15248 1963 -21731 -33098 -15004 6336
1211 6336 989 -7854 5365 14327 -214 -12633 -5516 6322 1637 -24548 -43120 -17234 24702
1224 24702 19442 -25037 -42244 -15917 13299 16661 -4969 -21990 -4575 26978 22978 -8914
1236 -8914 -20296 -9668 -5233 -12630 -18294 -10567 8863 12071 -16359 -35119 -8584 25692 17674
1249 17674 -14664 -26192 619 40868 41555 -12534 -54605 -29902 17787 23697 -6778 -30803
1261 -30803 -23512 7050 23588 6633 -16603 -16447 -5479 4566 22233 31739 12496 -16828 -27603
1274 -27603 -13845 13592 22452 -11734 -50565 -30058 31945 55928 11834 -49730 -57746 5552
1286 5552 68775 48997 -23023 -48147 -3960 42487 37276 -11499 -54971 -44324 7300 38229
1298 38229 25170 -4395 -25967 -26809 1497 34652 30472 -4283 -28194 -16643 26643 59297
1310 59297 29075 -46767 -77283 -22825 51209 61509 -3990 -68530 -45116 45747 81712 14548
1322 14548 -61416 -53408 17585 71394 57968 -6540 -53203 -35091 15495 38007 15192 -28181
1334 -28181 -45622 -8120 45283 52188 12472 -28224 -42028 -13445 47864 75642 20641 -53413
1346 -53413 -47835 28616 75158 26986 -63092 -81473 118 79005 66563 -5029 -51760 -34696
1358 -34696 27489 69633 36404 -33697 -44328 15255 63394 46833 -7265 -44072 -36026 110
1370 110 29297 37453 19143 -19863 -33832 15038 70204 44412 -32699 -57760 -1598 66530
1382 66530 74818 13189 -54189 -52436 11363 57222 33004 -30607 -56692 -2101 74042 71349
1394 71349 -7571 -54854 -22552 29660 45785 29539 1122 -17345 -10187 13521 27802 13561
1406 13561 -25385 -48489 -12520 50295 62273 13105 -32758 -30905 8910 46264 37497 -14390
1418 -14390 -43356 -5611 51549 54296 -6250 -63586 -49133 21059 52807 10739 -27664 -8760
1430 -8760 26146 27450 8436 -7250 -13452 -7283 7998 20551 22083 6028 -15937 -18996 -5719
1443 -5719 -1671 -4633 2460 5398 -1756 9199 33224 21887 -21313 -32670 3456 32987 17356
1456 17356 -13841 -11516 18390 19351 -18484 -34869 -7768 13821 6942 4182 12325 12441 10138 12024
1470 12024 1027 -18260 -14726 14373 32030 12545 -17405 -13899 15885 13905 -24412 -30930 9388
1483 9388 30046 10664 3032 21174 22090 -3881 -19463 -5734 17571 20550 4323 -5470 766
1496 766 8161 9399 4505 -16696 -34585 -4212 51899 54214 -2878 -33253 -161 36850 25870
1509 25870 -13298 -28165 -2164 26933 27946 13318 -2254 -22614 -30081 775 35817 27323
1521 27323 -5441 -11346 11423 33488 31501 1888 -32035 -33834 4391 47729 49978 -4280 -58424
1534 -58424 -34938 40810 57867 -11440 -62918 -24012 50421 72079 25889 -32532 -44260 -8088
1546 -8088 29445 32938 3473 -31530 -29840 16858 48029 13527 -40724 -44278 -6376 25326 36418
1559 36418 27740 -1509 -28660 -19655 20872 40890 762 -57115 -46587 30401 68049 15756
1571 15756 -48957 -52009 -11242 24527 32330 7828 -24807 -23060 16998 46178 21832 -34575
1583 -34575 -55761 -15339 30549 26462 -775 -10439 -16081 -25851 -7488 27750 19586 -29510 -43266
1596 -43266 9105 63226 46551 -23232 -63769 -31889 22033 37322 12053 -25699 -42956 -9383
1608 -9383 45546 42484 -29523 -72254 -24682 48361 59897 11708 -29009 -22621 4556 14194 8085
1621 8085 -3054 -22994 -31210 4035 49787 35600 -26878 -55145 -20564 26926 39593 14843
1633 14843 -15471 -17259 10644 35597 27286 -17477 -56449 -32659 35969 58758 5307 -41513
1645 -41513 -20360 20689 21840 -5815 -18100 -4256 16004 23205 20545 14264 -2967 -23505 -19300
1658 -19300 4070 10987 1237 2946 7488 -343 -3482 7830 7710 -14191 -24063 2988 40191 39030
1672 39030 -2456 -28137 -7080 14527 -2523 -21788 -9737 8626 8143 6703 10544 2009 -15598
1685 -15598 -20196 -5397 12120 15802 8516 5854 5970 -4691 -11347 -2579 -4550 -26443 -24510 16973
1699 16973 38556 6691 -30528 -23526 7126 12656 -10822 -20570 3649 25375 15649 -5024 -12054
1712 -12054 -15992 -20269 -11381 -1254 -6897 -8391 10894 19507 -4589 -30446 -21888 6868 14012
1725 14012 -8302 -17862 9079 28907 5199 -26880 -27216 -14843 -12384 -5986 8017 8867 -5290
1738 -5290 -10766 -1611 5318 -5481 -21934 -18360 5018 19638 15990 6105 -11331 -32698 -27584
1751 -27584 6570 17465 -14909 -35418 -4577 37092 32305 -16038 -46968 -24050 16207 23883
1763 23883 5084 -6123 -6406 -2879 6490 5802 -18403 -36535 -18200 14146 22599 8363 -3500
1776 -3500 -4722 -6232 -11701 -7816 9843 13464 -7777 -15267 12914 29919 411 -37437 -36867 -7110
1790 -7110 17140 18875 4628 -8305 -7950 2676 11768 6490 -15595 -27015 -2799 30420 27722
1803 27722 -1812 -18815 -18638 -16911 -7372 9309 10752 -8339 -18733 2572 34191 27244 -22241
1816 -22241 -52230 -19533 32746 39766 6125 -25017 -26915 -2369 22387 11064 -29906 -47003
1828 -47003 -10541 39575 45727 1294 -39115 -27672 10294 19270 -1051 -12307 -7212 -1468 7697
1841 7697 15866 2787 -27160 -40192 -17698 17002 28751 8079 -16344 -14564 3337 11107 4080
1854 4080 -11782 -25840 -15730 20263 36967 6581 -32830 -34224 -7138 9742 2163 -10119
1866 -10119 -6201 6943 10147 6252 5476 -3220 -22721 -25428 2141 25971 19948 -3828 -21542
1879 -21542 -20147 -1966 12307 1195 -22236 -25232 5214 41257 38274 -10655 -48350 -24726
1891 -24726 23645 30639 -1829 -23764 -12295 13446 24283 6136 -23568 -34192 -15718 15213
1903 15213 32654 20335 -8203 -17320 2072 16114 6205 -9760 -15696 -8902 11018 29408 20763
1916 20763 -13054 -35025 -20742 13245 26497 4109 -18297 -2394 29270 28879 -1182 -22366
1928 -22366 -18267 -687 15647 16909 3705 -4193 359 4494 -1768 -10042 -9934 2217 14391 12406
1942 12406 6081 12650 16886 -1849 -21775 -13387 10324 18744 7426 -4187 -2260 8132 9012
1955 9012 -4748 -15390 -10503 4133 18878 24564 13163 -4205 -5330 3347 1540 -5397 -3080
1968 -3080 4161 7499 9408 9267 4126 -5824 -15098 -12505 7177 22387 14746 128 2915 13607
1982 13607 10711 -3898 -16140 -13419 5435 21092 14985 -2582 -6999 1872 5967 -1750 -12897
1995 -12897 -8584 14664 31024 16499 -7079 -8025 6619 9437 -4225 -16547 -9196 15298 28632
2008 28632 12159 -12758 -17578 -3704 9307 10225 527 -4914 6972 23906 21742 1978 -16281
2021 -16281 -19327 -6964 12845 19894 7502 -6951 -7118 3982 13883 8442 -13630 -24404 -697
2034 -697 34386 38563 8112 -23090 -23057 4912 23496 6831 -21052 -19022 10403 31529 21936
2047 21936 -9204 -30450 -18212 12329 24008 10479 -1728 287 6794 9494 4407 -7501 -14784
2060 -14784 -11958 -2022 12469 23024 12237 -11433 -21427 -8116 10590 15339 2371 -12544 -5981
2073 -5981 19817 29802 5159 -26245 -31827 -9596 16815 23318 4055 -14687 -11182 4724 13564
2086 13564 5892 -12538 -23230 -7513 21755 33058 14918 -14623 -30958 -19092 12211 24305
2098 24305 -1101 -29495 -19827 19377 40108 14343 -33705 -46312 -6788 37281 35442 -1151
2110 -1151 -27441 -17313 15254 29469 48 -39009 -36400 5334 36597 26241 -6438 -26317
2122 -26317 -16202 6381 14169 4246 -8436 -12079 -529 21254 25780 -1748 -31731 -29736 -2619
2135 -2619 18616 16935 -1490 -15418 -7594 12406 16523 -1680 -22753 -21816 5839 31361 22494
2148 22494 -7759 -19935 -8245 1250 -1574 -5664 -5362 -2278 4073 9847 9795 3580 -9295 -19075
2162 -19075 -10697 9259 18995 11418 -2472 -11583 -7570 6214 7840 -12751 -27569 -11234 20184
2175 20184 30135 8300 -20303 -23078 596 15983 4247 -11116 -7869 5555 14411 11964 -4758
2188 -4758 -22003 -21778 -5420 8509 10110 1599 -5967 -2010 5554 3256 -7104 -11912 -9694 -1792
2202 -1792 11789 17839 2636 -18846 -18268 -1219 4440 -7571 -17811 -6220 16472 19576 -2028
2215 -2028 -18539 -11923 6 2497 -1126 -5243 -4514 5725 13721 605 -22734 -26266 -5913 12268
2229 12268 6761 -9227 -9493 8614 14687 -2659 -17380 -13261 -4078 1116 8465 10734 -206 -12742
2243 -12742 -11084 -2187 -485 -8445 -12931 -4674 9727 14277 7885 -2228 -13913 -18690 -3674 15826
2257 15826 10636 -11287 -13075 7002 16621 395 -21022 -22759 -4656 10872 11489 6683 2494
2270 2494 -3827 -6495 418 4868 -3409 -9771 -2200 7728 10448 7580 -214 -13321 -20061 -10185 10812
2285 10812 21208 6017 -15541 -9178 19016 23868 -5416 -28883 -18647 9385 26764 18747
2297 18747 -4985 -21205 -13582 6189 14477 1133 -18732 -16487 12275 33166 18151 -11915
2309 -11915 -22567 -12869 2966 15065 13805 -3567 -17191 -7213 16471 21500 -6688 -36243 -26563
2322 -26563 15719 37851 16695 -14505 -20181 -4074 13449 14167 -5977 -25554 -16426 15084 30898
2335 30898 10612 -23073 -30965 -6897 14274 7746 -5898 -4551 2222 2879 5399 8165 -4636
2348 -4636 -22792 -20280 3431 20735 13362 -8893 -18887 -9785 1659 3072 -2288 -10179 -14455 -518
2362 -518 23298 22207 -9457 -30990 -17765 7071 11342 -1719 -10519 -6526 808 1730 378 -3429
2376 -3429 -14937 -22529 -5474 20636 21021 -2604 -17977 -12205 415 5639 -617 -12777 -17527
2389 -17527 -4698 15596 20244 -2969 -31748 -27942 7018 23910 3070 -18275 -9024 11326
2401 11326 14507 425 -14560 -18774 -10370 2476 11204 7976 -5259 -13692 -5267 5256 -685
2414 -685 -11629 -7071 4009 6221 5287 7054 2283 -10974 -16845 -5823 7767 5318 -7159 -7602
2428 -7602 6278 9565 -5133 -14973 -6279 2007 1274 1790 6715 6164 648 -3340 -5433 -7327 -6771
2443 -6771 -1263 5460 4151 -5228 -4822 7783 7752 -11889 -20285 -1171 17282 11667 -2890 -5920
2457 -5920 1056 3390 -2992 -8635 -6684 -2414 164 5609 8583 -610 -10478 -6200 2203 -492 -4241
2472 -4241 3426 9858 3871 -4448 -2419 3205 -1337 -12827 -11770 5370 13732 2810 -7004 -2342
2486 -2342 1910 -3871 -5231 1322 3926 1015 1512 5873 5239 -1668 -9130 -8489 -3529 -566 3074 9612
2502 9612 6036 -9105 -11046 6484 13421 -3935 -18400 -5722 17644 21989 3435 -14982 -13448
2515 -13448 -215 6572 3996 -2071 -8048 -4721 10944 18951 2129 -17999 -13948 5468 15158
2528 15158 9133 1314 -1190 -476 -127 1938 4738 -2107 -14207 -8754 14978 24417 5068 -14871
2542 -14871 -11822 3497 11429 7969 -1053 -5262 787 10789 14143 3388 -13912 -18132 194
2555 194 16929 10659 -3264 -2282 5236 3668 -690 1448 3180 -1364 -4511 4372 17463 15150 -4345
2570 -4345 -18017 -8617 6785 10051 3588 -2824 -5758 1003 14946 15146 -4667 -20795 -10547 13873
2584 13873 23291 7406 -11048 -9512 4249 7212 -41 -4388 -6334 -7268 2327 17805 15970 -4162
2598 -4162 -18216 -10264 7829 15095 4703 -8196 -7645 2813 11392 9663 -5017 -21726 -18078
2611 -18078 8819 25432 8961 -14993 -14491 4586 14092 4361 -10343 -12076 -382 9016 10193
2624 10193 5662 -4904 -15147 -10911 3280 8091 -61 -5416 -2707 2258 5606 6091 -424 -11012
2638 -11012 -13279 -1646 14616 15654 -4059 -18588 -7936 8951 6652 -7876 -12314 -5238 5276
2651 5276 11495 8004 -2820 -11071 -9461 371 8432 5627 -4801 -7141 598 5065 1372 -3195
2665 -3195 -7529 -11817 -5996 9797 16270 3170 -12364 -12099 3796 13190 1670 -14038 -11203 6108
2679 6108 13395 5350 -5622 -13206 -10791 1093 8660 3007 -6271 -4600 4665 8755 2209 -7478
2693 -7478 -8238 -1414 1548 1011 4204 4595 -4035 -10616 -3550 4604 825 -6707 -6173 2534 9304 6602
2709 6602 -2604 -7293 -5180 -864 2395 2883 -1715 -4929 652 5467 -1691 -10269 -6572 1528 2562
2724 2562 -1087 -584 3837 5531 -1168 -8593 -5625 2064 2264 -2241 -2006 460 492 -225 -1645 -6545
2740 -6545 -7138 -1022 3924 3226 636 -453 485 579 -3617 -6513 -1337 3907 -571 -5536 -870 4912
2756 4912 1408 -6713 -9850 -5060 4386 7941 1646 -4712 -2631 2593 3783 -70 -6482 -9026 -1467
2771 -1467 7596 5864 -2396 -5679 -4492 -2499 657 1821 308 -1450 -1434 1654 6544 7270 -3299
2786 -3299 -13595 -7962 6662 11659 3253 -8373 -10686 2 11043 6791 -8133 -13587 -2896
2799 -2896 12013 16384 4047 -11975 -11457 3105 10985 3893 -5817 -8056 -2450 6106 9654 2695
2813 2695 -7611 -11094 -4817 7427 14223 5958 -8359 -9892 2666 11426 7683 -5149 -15571
2826 -15571 -8795 10126 18477 4498 -14078 -15192 496 14443 11276 -5723 -13132 -2243 11615
2839 11615 13057 2816 -9501 -13284 -3348 9853 11088 332 -8507 -9025 83 9854 9079 -3685
2853 -3685 -13466 -7275 9224 18017 9012 -10755 -18213 -2867 14819 12297 -4825 -15539 -8673
2866 -8673 8874 17674 4656 -14612 -15366 836 14424 11944 -956 -10241 -6534 5677 10284
2879 10284 3010 -6319 -10824 -6365 7437 14054 4286 -10022 -12009 -716 10597 10907 -419 -11336
2893 -11336 -6814 8999 15471 4742 -11263 -15817 -1689 14257 11426 -5519 -12104 -2665 8009
2906 8009 8885 1849 -6717 -7310 1418 9478 8350 1148 -5764 -6367 318 6508 4366 -2840 -4645 -2555
2922 -2555 2984 8544 6533 -4893 -10590 -1208 10640 10570 380 -8048 -4891 6212 9187 -447
2936 -447 -8205 -5413 2024 6079 5393 -673 -5616 -1861 4029 4191 448 -1174 -583 1662 3419 1897
2952 1897 -603 -1388 -2573 -3671 676 5363 2180 -4631 -3461 3143 4764 569 -4427 -4035 2674
2967 2674 6278 1358 -3982 -3317 -7 965 276 -3093 -6355 -1309 5617 3234 -4596 -6348 212 4640
2983 4640 1899 -4491 -5326 1087 4374 -447 -4393 -3188 -3101 -3616 -540 2159 -1612 -5009 -3145 788
2999 788 2637 393 -3634 -5602 -1892 1642 3424 937 -6379 -10955 -3049 8265 4564 -9695 -12931
3014 -12931 -1445 8471 5857 -4918 -10208 -5262 3499 5416 1115 -5158 -8757 -4576 4779 6443
3028 6443 -3771 -11263 -6145 1613 3972 2105 -1960 -6501 -6071 531 7176 5789 -5113 -13425 -5282
3043 -5282 10092 10193 -5292 -14264 -7553 4110 9117 3749 -6840 -11126 -2783 9236 10105 -678
3057 -678 -11000 -8758 4800 11573 2564 -8095 -7160 -1590 2622 5204 3980 -4202 -9483 -3633 8296
3072 8296 11438 989 -11317 -8816 5971 13374 4708 -7054 -10046 -3493 7183 11974 2071 -12432
3086 -12432 -10758 4911 14944 6790 -8022 -11322 192 11210 8066 -845 -4776 -4883 -1673 5923
3100 5923 9245 428 -10512 -7230 5186 11478 4858 -5941 -9269 -1118 8664 9988 3231 -6434
3114 -6434 -9421 396 13576 9834 -7553 -14254 -1463 11920 9419 -2042 -7966 -4074 3856 7203
3128 7203 4743 73 -4798 -4733 3895 10337 3655 -7225 -6906 847 5074 4977 2173 -2919 -5037 -114
3144 -114 7219 8403 -244 -9923 -5162 9264 12919 215 -9385 -4134 3649 5328 2354 -1496 -4059
3159 -4059 -2092 3752 6741 3155 -3108 -5063 1053 6830 4075 -1568 -582 1188 -1215 -24 4732
3174 4732 2237 -5393 -5650 2774 8957 4498 -4737 -6192 2683 7402 2321 -2489 -849 461 1289
3189 1289 3984 2839 -3220 -5317 537 4977 2349 -2182 -1597 2483 3715 -354 -1953 2381 3313
3204 3313 -1939 -2418 3785 5149 -1174 -4886 -894 2433 1382 -941 -1133 835 1733 1252 883 1030
3220 1030 -1612 -1864 2485 4188 -1479 -3601 2159 3893 -1686 -5382 -1357 3737 3054 -2685 -3598 1991
3236 1991 4249 -480 -3399 314 1015 -357 669 2731 -389 -3804 -1725 1304 277 -2652 -2139
3251 -2139 590 1630 -402 -1217 1905 1365 -4707 -4720 3652 6364 -1343 -6516 -2383 3271 2518 -1973
3267 -1973 -5054 -3397 868 2945 2800 922 -3887 -4695 1733 5688 83 -6013 -2147 3037 2371 -372
3283 -372 -1262 -1745 -3055 -3125 1195 5154 2741 -4799 -5541 3229 6934 94 -5522 -3962 810 4219
3299 4219 5085 546 -5885 -6101 520 6332 3802 -4524 -6639 1186 8461 4064 -3420 -3959 -560 304
3315 304 1779 4310 1986 -3166 -3815 780 5393 2821 -4669 -6529 607 6706 5704 1451 -2555
3330 -2555 -5249 -1600 6438 7240 -2294 -7980 -1703 7841 7703 -1065 -8248 -4747 3276 5480 3110
3345 3110 1048 -988 -3288 586 6546 4071 -4352 -6568 -341 6262 6587 1064 -4859 -5786 -933
3360 -933 4426 6342 1066 -6666 -5477 6773 12237 1694 -9810 -8036 2283 8242 4972 -2252
3374 -2252 -5942 -2358 2762 4742 1938 -4740 -7947 -692 9047 7372 -2125 -5992 -3150 135 3071
3389 3071 2746 -1038 -5230 -3676 2972 7260 2280 -8100 -10176 429 9401 5174 -3472 -5349 -1450
3404 -1450 2901 4437 729 -5896 -6431 113 6081 5267 -1996 -7010 -4641 1968 3032 -713 -1851
3419 -1851 -968 -1404 955 4291 2765 -4636 -7679 -2562 4679 6289 -480 -6627 -4064 2807 3903
3434 3903 144 -3916 -5377 -1871 5394 7735 -202 -7351 -5154 1907 4258 601 -4530 -3850 1579
3449 1579 4017 1535 -670 -3261 -4773 -1792 4476 5663 -931 -4482 -1652 2698 3205 -745 -5417
3464 -5417 -4523 1133 4751 4125 -756 -5322 -4516 2381 5633 -324 -6211 -1788 5549 5649 158 -4967
3480 -4967 -4130 147 2209 1056 -596 -467 -415 985 2560 -163 -4227 -2861 1929 3201 1791 625
3496 625 193 -923 -808 1 59 -1057 -1714 -721 3451 4328 -1408 -5555 -2224 2650 1547 -212 -890
3513 -890 -210 2266 3258 690 -3288 -3950 -1206 1571 2712 634 -2086 -386 2172 640 -1873 -1769
3529 -1769 -294 177 1746 2920 2097 -621 -3032 -3135 157 3104 563 -2702 -1647 2481 3500 1392
3545 1392 -2592 -5157 -2270 4198 5975 838 -3488 -2760 1675 4610 825 -5445 -5377 1106 5908 4676
3561 4676 53 -3750 -4343 39 4571 3314 -2023 -3982 -452 5185 6570 225 -7280 -6722 963
3576 963 6488 5115 -970 -5925 -3660 5032 7462 -412 -8741 -6086 3371 9761 5880 -4025 -7915
3591 -7915 -1899 4512 4268 -1341 -5084 -4073 3006 7962 3962 -4128 -7287 -2655 2807 5652 2398
3606 2398 -2778 -4115 54 3537 3221 -1690 -6676 -5810 2842 8423 4292 -3525 -6229 -2187 3410
3621 3410 4967 -244 -5456 -3377 3179 6367 2879 -3367 -7313 -4021 2651 5384 1517 -2120 -3080
3636 -3080 -710 3223 3988 -1245 -6137 -4646 2015 7016 5548 -1756 -7762 -4737 3586 5852 248
3651 248 -5886 -5201 2430 9228 5285 -4996 -9328 -2902 5227 6932 1957 -4622 -4810 2359 6621
3666 6621 2328 -4617 -6810 -2183 5579 8133 2556 -4362 -4802 181 4123 3772 -752 -4996 -1946
3681 -1946 5766 7725 1861 -5570 -6710 -944 5986 5410 -962 -4003 -74 4943 5026 470 -4387 -4503
3697 -4503 1894 6571 4522 -579 -2210 -349 1310 1879 297 -1361 85 2480 3153 3270 1972 -1300
3713 -1300 -3388 -243 2756 3223 1650 29 -226 1648 2967 534 -2556 -2485 501 3892 4965 2408
3729 2408 -1675 -1496 1818 2010 -147 -1038 35 1837 3238 3104 199 -2064 -2239 -1088 1999 3434
3745 3434 1428 -1094 863 3699 2642 -688 -2940 -2665 1102 4849 4082 -673 -2911 -1258 2482
3760 2482 2650 -1527 -4735 -1171 5812 6083 -93 -3840 -2549 530 2397 1177 -1908 -2246 1321 4099
3776 4099 2840 -1473 -4949 -3609 1966 4203 947 -1860 -379 1456 1565 592 -1492 -3980 -2292
3791 -2292 2338 5148 2636 -2365 -4715 -1183 2930 1774 -2939 -3382 1123 3965 3929 660 -3551 -4847
3807 -4847 -465 3261 1828 -1248 -2142 261 3161 1836 -2578 -4083 -1052 969 1390 2514 2326 -313
3823 -313 -2258 -806 714 778 -141 -1523 -471 2233 3309 1046 -2035 -3623 -3242 1034 5181 2809
3839 2809 -2718 -2330 2131 3926 759 -3498 -4538 -1034 3719 4650 1791 -1595 -3931 -2236 2732
3854 2732 4490 -1206 -4919 -648 4927 5855 1875 -4333 -5997 -1908 4415 5321 649 -4009 -3586 3091
3870 3091 6912 1392 -7367 -6893 1970 7546 4838 -1594 -4549 -2449 2482 3653 -203 -3885 -3623
3885 -3623 993 6553 4760 -2298 -6091 -2235 2372 2612 1128 -121 -1097 -159 2197 2438 -582 -4400
3901 -4400 -3838 450 5505 3722 -1859 -3123 -486 734 119 -129 -956 -1709 412 3233 3139 -207 -3557
3918 -3557 -3537 -605 1830 1241 107 458 -380 -996 1385 2533 -1423 -5002 -2254 4397 6141 1581
3934 1581 -3686 -4765 -385 2980 1699 -1746 -3069 -1254 3431 6382 1625 -6053 -6197 1318 5689
3949 5689 2995 -1684 -2903 451 3362 2284 -1261 -4196 -3444 176 4939 5220 -875 -5277 -2551
3964 -2551 3186 2818 -1122 -3164 -1385 2453 5077 2702 -1943 -4200 -2921 1193 3780 1030 -3005
3979 -3005 -1391 3877 3817 -1326 -3893 -2155 1084 2155 1774 644 -47 -15 -575 -362 -502 -1597 -1527 1192
3997 1192 2541 428 -580 408 -687 -2566 -1992 461 2208 1013 -897 -787 1028 452 -2392 -2734
4013 -2734 -663 386 390 1629 1832 -1123 -2908 -1297 487 -125 -1036 -995 728 2521 965 -1513 -2637
4030 -2637 -2219 -1918 744 2438 258 -2991 -932 2734 1290 -3423 -5348 -1843 3220 3908 111 -3105
4046 -3105 -1419 302 363 -716 -2695 -3781 -174 4757 3805 -2465 -5167 -1886 1742 1595 -1678 -3419
4062 -3419 -224 2799 1987 -285 -2355 -3848 -2900 1346 3756 541 -2934 -1255 1938 2480 -566 -4344
4078 -4344 -3198 647 3640 2696 57 -2508 -3070 -235 2779 521 -3888 -2779 2707 4914 1656
4093 1656 -2452 -3511 -1064 1129 710 41 347 360 171 1485 1593 -1603 -3257 -1188 1383 1733 1850
4110 1850 1425 -253 -1751 -1604 450 1702 321 -2491 -610 3665 4085 -176 -3638 -2612 -554 1600
4126 1600 2791 1074 -1478 -1225 1428 3007 1175 -3488 -4495 90 5424 4262 -216 -2434 -2728
4141 -2728 -501 2730 2901 -1794 -4417 -570 5619 6217 -144 -6571 -5195 2261 6234 2230 -2772
4156 -2772 -3166 386 3863 4134 -1496 -6651 -4154 3803 7105 2916 -3196 -4239 574 3812 1955
4171 1955 -2653 -3384 -577 2617 5065 3084 -2624 -5361 -1672 3206 3309 -52 -2686 -1267 2705
4186 2705 3721 486 -2607 -3311 -1504 2020 4343 2330 -2649 -2850 1089 2611 211 -1784 -2043 377
4202 377 2780 2866 1050 -234 -1962 -2386 417 3121 2134 -1260 -1261 1288 2521 1623 -890 -2855 -2633
4219 -2633 1770 4555 4004 -169 -3475 -1545 3225 3882 -1295 -3926 -1040 3872 4898 2159 -2303
4234 -2303 -4295 -1136 2888 3630 646 -2160 -1637 2627 4836 1159 -4231 -3836 1085 4158 3809 859
4250 859 -2000 -2212 1422 3853 1451 -3040 -3504 1181 5828 5033 -1342 -4531 -913 2377 2677 651
4266 651 -1500 -2005 2047 4688 2319 -2545 -3684 -803 2807 3686 399 -1592 -209 2488 1446 -321
4282 -321 -1269 -1627 -677 1930 3352 1026 -1351 -1434 -250 1057 923 -567 -739 758 2222 1524 719
4299 719 -927 -2315 -1263 1713 2151 217 -697 142 1021 973 352 -1596 -1266 593 1500 1995 1794 -72
4317 -72 -1860 -1132 1153 1430 37 -1062 -482 1495 3052 1360 -2106 -3094 -707 2274 3533 1441
4333 1441 -2036 -2041 2195 3728 107 -3572 -3150 797 4339 3609 -454 -3247 -1629 1867 2768 751
4349 751 -2184 -2715 1300 4656 2821 -1889 -3463 -1872 1521 3248 1440 -2082 -2056 1181 3345 2257
4365 2257 -1655 -4093 -2147 3425 4809 624 -3212 -1925 917 2606 1386 -2250 -3369 -57 3660
4380 3660 3412 213 -2658 -2592 468 2503 1237 -1538 -1518 938 1512 1501 254 -2088 -2330 -268 1898
4397 1898 1797 623 -1108 -1415 146 1585 538 -1410 -1676 -549 1319 2637 1002 -2344 -2729 -658
4413 -658 1306 1137 -254 -1934 -1102 1339 2174 199 -2093 -2715 -1034 1780 3098 698 -2650 -2380
4429 -2380 272 2061 1457 -1710 -3605 -1161 2985 3395 249 -3554 -3127 -132 3418 2053 -2620 -3589
4445 -3589 -332 3140 2721 -762 -4291 -3525 1473 4015 1529 -2266 -2900 -341 2156 2457 -973 -3632
4461 -3632 -1820 1682 3461 1519 -1631 -3312 -1318 1961 2386 -344 -2164 -1354 1095 3234 1761
4476 1761 -1893 -3316 -705 2125 2322 324 -1761 -1595 1036 2329 553 -1882 -1678 -33 1537 2346
4492 2346 795 -1043 -1638 -45 809 698 412 -862 -735 1118 1903 983 -552 -2002 -1518 612 2542
4509 2542 1553 -1423 -1581 37 1573 1695 -686 -2687 -1333 2150 2822 834 -929 -2423 -1293 1535
4525 1535 2367 -451 -2092 -998 1153 2451 1419 -1958 -3160 -695 2051 2519 300 -1763 -2141 386
4541 386 2886 1296 -2557 -3730 -650 2579 2858 -113 -3010 -2368 1097 2377 592 -1910 -2252 -316
4557 -316 2419 2482 -871 -3284 -1698 1320 2082 614 -1136 -1686 -199 1428 855 -954 -1620 -1646 -156
4574 -156 1798 1157 -1086 -1901 -503 516 743 89 -1178 -1470 442 1389 556 -584 -1568 -1489 322 1784
4592 1784 348 -1264 -864 175 234 32 99 -1293 -911 302 1001 1026 187 -1352 -1508 213 1358 139
4610 139 -1036 -1135 -206 1017 1318 11 -1959 -1724 429 1827 662 -808 -1423 -71 2044 1176 -1474
4627 -1474 -1807 -644 976 1417 895 -1123 -1943 94 1262 850 -703 -1419 -623 1502 1930 -82 -1762
4644 -1762 -1161 267 1041 1176 -111 -1795 -786 1427 1776 -120 -2144 -1688 154 2195 909 -1287
4660 -1287 -1814 423 945 913 -382 -1955 -1439 917 2433 314 -1491 -1769 -23 1302 786 -508 -1077
4677 -1077 -271 673 650 242 -578 -2064 -909 910 1311 -107 -1431 -1072 -322 632 611 -784 -1661 -638
4695 -638 855 1546 858 -1345 -2627 -28 1647 1121 -948 -1461 -1028 255 1650 666 -1481 -2085 -543
4712 -543 854 2033 785 -1915 -2359 570 1921 981 -1048 -2088 -1034 1159 2944 615 -2385 -2376
4728 -2376 164 2417 2275 -718 -2998 -1039 2321 2655 126 -2032 -2647 -14 2880 2666 -595 -2856
4744 -2856 -1101 1349 2815 1135 -2026 -2624 592 3343 2242 -78 -2024 -1998 755 3276 1851 -1744
4760 -1744 -2776 -411 2828 3004 -115 -2952 -2208 1268 3279 1489 -934 -2095 -1241 1834 3236 354
4776 354 -2429 -2107 762 2598 2041 -918 -2164 -1232 1300 2093 870 -719 -2348 -642 2515 2833
4792 2833 -312 -2613 -1911 631 2865 1985 -1119 -3028 -885 1822 2565 838 -2082 -2973 302 2998
4808 2998 1956 -1251 -2348 -1335 1057 2321 994 -1707 -2399 -92 2278 2360 -67 -2300 -2017 1328
4824 1328 2809 1141 -1528 -2391 -448 1591 2626 110 -2601 -2054 688 2167 1649 -859 -2832 -721
4840 -721 1876 2145 -214 -1932 -1754 81 2135 1578 -791 -2069 -524 1215 1675 575 -1449 -1925
4856 -1925 222 2159 1253 -494 -1062 -813 276 1874 1232 -1218 -1590 153 1482 1366 117 -1019
4872 -1019 -844 710 1041 366 -342 -537 -320 823 1250 121 -857 -394 395 732 24 -43 -290 109 814
4891 814 371 -342 -170 -457 -46 984 541 -450 -909 268 486 129 -293 -640 -106 752 886 85 -894
4910 -894 -643 -141 606 634 -756 -983 261 1290 393 -615 -1015 -551 169 838 159 -935 -991 -138 587
4929 587 711 -367 -2071 -1119 1118 1196 224 -984 -1319 -465 1102 1004 -608 -2130 -1118 827 1535 765
4947 765 -1443 -2330 -203 1887 854 -893 -1651 -1091 700 1846 704 -2226 -2511 -424 1233 1657
4963 1657 -140 -2183 -2110 384 1741 598 -1344 -2132 -1495 1013 2464 548 -2426 -2353 -118 2030
4979 2030 1536 -849 -2940 -1625 1548 2495 624 -2013 -2881 -849 2128 2617 -526 -2848 -1768 580
4995 580 2477 1307 -1826 -3024 -830 2031 2317 593 -2513 -2937 -28 3080 2323 -1429 -2827 -1404
5011 -1404 1255 2777 1004 -2408 -3215 -409 2531 2676 -179 -3048 -2592 1063 3128 1104 -2105 -3058
5027 -3058 -723 2087 3174 373 -2927 -2897 191 2350 1847 -1308 -3576 -1657 1841 2964 447 -2441
5043 -2441 -2628 -456 2115 2628 -363 -3017 -2080 879 2782 1530 -1787 -3263 -785 2017 2240 -151
5059 -151 -2426 -2170 -229 2043 1934 -1368 -3316 -1617 1394 2228 691 -2024 -2933 -743 1831 1526
5075 1526 -337 -2198 -2235 330 2456 1312 -1801 -2639 -1073 1486 2019 38 -2257 -2644 -274 1852
5091 1852 1265 -527 -2421 -1936 978 2416 560 -2047 -1900 -359 1139 1744 107 -2008 -1701 239
5107 239 1754 1198 -773 -1957 -1280 1393 1728 37 -1544 -1183 -81 752 1447 -406 -1741 -1072 522
5124 522 1151 788 -661 -1340 -26 1180 897 -365 -742 -684 24 876 755 -150 -1003 -408 316 863 227
5143 227 -512 -568 -46 676 -77 -6 117 -509 -410 539 474 -121 -244 137 -204 -39 178 -61 -188 -31 -268
5164 -268 97 607 464 -629 -516 -127 183 685 457 288 -663 -151 643 489 122 -479 -1057 -149 977
5183 977 911 -312 -655 -588 -182 772 580 -378 -1548 -412 927 902 326 -1031 -1495 -130 1544 838 -177
5202 -177 -823 -1174 379 1721 959 -1175 -1817 -371 890 1537 483 -1731 -2148 -294 1823 1382 -309
5219 -309 -1623 -1629 575 2317 580 -1815 -2098 -431 1750 2184 346 -2243 -2139 390 2175 1079 -1076
5236 -1076 -2071 -942 1987 3181 601 -2395 -2438 116 2622 2277 -423 -2924 -1518 1565 2907 1237
5252 1237 -1816 -3026 -444 2839 3088 -144 -2483 -1964 456 2932 2042 -1150 -2830 -1326 2411 3330
5268 3330 1038 -2486 -3317 -150 3249 2538 -426 -2609 -1872 1714 3353 1419 -2096 -3118 -359 2519
5284 2519 3245 762 -2918 -2585 741 3402 2380 -1233 -2766 -1198 2050 3782 943 -2679 -2939 -239
5300 -239 2442 3251 69 -2970 -2512 1446 3238 1474 -2306 -3368 -864 2651 3469 108 -2750 -2944
5316 -2944 167 2864 2701 -1013 -3541 -1252 1958 3012 392 -2560 -3276 -583 2429 2595 -728 -2821
5332 -2821 -1741 634 2693 1311 -2327 -3453 -620 2604 2568 464 -2385 -2307 207 2215 1719 -1329
5348 -1329 -2192 -1131 1301 2608 866 -2229 -2631 -3 1595 1555 36 -1269 -1340 630 2050 313
5364 313 -1393 -2049 -734 1517 2286 446 -1651 -1022 -318 668 570 85 -1222 -410 1186 1629 440 -1295
5382 -1295 -1698 -897 933 1184 181 -586 -218 44 221 788 158 -1249 -599 925 1214 488 -367 -784
5400 -784 -376 55 350 209 487 321 -154 421 816 -199 -1200 -235 399 442 47 701 638 59 -814 -438
5420 -438 -59 421 -321 -480 137 644 425 14 -191 -1055 -987 264 1583 794 -657 -1223 -183 1128 609
5439 609 -931 -1259 -683 701 1325 1075 -635 -2467 -1593 1275 1912 -175 -1762 -1391 800 1818 498
5456 498 -1191 -2277 -1515 708 2022 1529 -1494 -2837 -407 2062 1166 -1197 -2238 -1145 1246 2295
5472 2295 1187 -1081 -2596 -1694 762 2468 723 -2258 -2292 1032 2502 1028 -1667 -2872 -1488 1126
5488 1126 2615 1582 -1054 -2483 -1329 1729 2555 -442 -3298 -2059 1853 2901 1569 -1150 -2998
5503 -2998 -2304 1168 3247 1182 -2061 -2943 68 3265 2491 -1985 -4214 -1953 1936 3115 1865 -876
5519 -876 -3275 -1384 2066 3162 -49 -3682 -2682 1807 4676 2026 -2469 -3739 -1075 1645 2428
5534 2428 1300 -1940 -3097 184 3554 2705 -1906 -4317 -1523 2449 3963 1002 -1711 -2166 -757
5549 -757 1442 2309 35 -2886 -2277 1552 4145 1426 -2131 -3054 -1154 1156 2178 634 -1084 -1663
5565 -1663 -429 1872 2059 -516 -3691 -2225 1895 2991 1375 -1070 -2010 -1030 467 1220 243 -1265
5581 -1265 -2255 -280 2797 2624 -1166 -3727 -2108 1132 1650 476 -215 -1222 -999 1019 1948 59
5597 59 -2486 -2924 192 3151 2295 -1026 -2441 -1126 728 713 418 -664 -1337 -18 2270 2266 -403 -2964
5615 -2964 -2523 614 1908 607 -713 -476 104 232 62 -96 -1337 -1971 61 2589 1817 -355 -1334
5632 -1334 -997 5 -170 -664 -64 853 220 135 950 514 -1164 -2016 -850 1088 943 648 637 121 -527
5651 -527 -861 -86 717 -462 -1537 155 2424 2221 -290 -1472 -1282 -396 178 1130 830 -206 -782 639
5669 639 1780 267 -2118 -2438 123 2055 1778 -20 -315 -731 -859 -102 574 -513 -1330 -126 1992
5686 1992 2484 286 -2292 -1978 108 722 67 721 897 -424 -571 1137 933 -1223 -2219 -644 1400
5703 1400 1782 900 -112 -874 -957 -933 208 934 -135 -1265 -32 2212 1532 -1376 -2553 -2122 -60
5720 -60 1462 1962 615 -910 -1466 211 1831 562 -2849 -2881 635 3419 2164 -592 -2243 -2132 -133
5737 -133 1403 1156 -705 -1932 -515 2635 3136 -357 -4061 -2993 669 2420 1697 -96 -1472 -897
5753 -897 477 1815 278 -2432 -2339 206 3420 2907 -534 -2781 -1503 430 857 749 99 -882 -508
5770 -508 1663 2644 278 -2805 -3210 -88 2556 2245 409 -762 -564 -273 590 991 -611 -2349 -968
5787 -968 2093 3582 1237 -2287 -2786 -741 1424 1591 685 -629 -1343 508 2309 2132 -1969 -4363
5803 -4363 -1782 2709 3573 1192 -1406 -2220 -498 1231 1493 -781 -2603 -1527 1934 4276 2071 -2997
5819 -2997 -4025 -591 2072 2264 61 -1460 -775 1094 2711 1178 -1986 -3633 -1761 2426 3864
5834 3864 908 -2508 -1996 214 1228 226 -1155 -1893 -817 1570 2905 1258 -1815 -3529 -1667
5849 -1667 1412 1645 51 -992 -194 665 987 451 -784 -2698 -2221 883 2931 2088 -624 -2327 -1222
5866 -1222 655 585 -370 -1412 -842 524 2112 2599 -709 -3354 -3007 388 2398 1108 -710 -1262 91
5883 91 1515 940 -1096 -2408 -2039 364 3282 2640 -561 -2684 -1077 867 930 -607 -1557 -170 1423
5900 1423 2457 984 -812 -2379 -2276 126 2185 1110 -477 -315 1122 1171 -434 -1434 -1609 -617
5916 -617 692 1765 1508 437 -730 -1290 -457 -122 -481 -380 750 1182 637 439 228 -781 -1433 -1349
5934 -1349 382 1425 1834 757 -42 -457 -998 -434 -27 -167 -555 -10 2034 1829 226 -1542 -2382 -888
5952 -888 700 1322 620 45 223 389 506 -92 -1724 -1955 -582 1974 2215 976 -757 -1086 -783 -222
5970 -222 253 -350 -436 -5 1161 1674 766 -1150 -2533 -1305 443 1230 1255 112 -509 -439 115 347 -906
5989 -906 -1692 -1624 287 2776 2579 13 -2202 -2007 -162 1109 1035 -332 -1372 341 2717 2536 -439
6006 -439 -3237 -2927 360 3109 2550 -452 -1948 -811 1367 1951 100 -2835 -2635 836 3965 3365
6022 3365 -387 -3461 -2597 905 2741 1010 -1934 -1708 780 3356 2468 -986 -4329 -3085 1320 3724
6038 3724 2319 -660 -2001 -742 1969 1805 -675 -3062 -1797 1382 3716 2847 -727 -2653 -1899 582
6054 582 1807 708 -1121 -1371 511 3040 2246 -775 -3461 -2488 182 2996 2644 -127 -2106 -1300
6070 -1300 716 1652 -315 -2233 -2630 449 3709 3182 44 -2977 -2899 -165 2269 1720 -922 -2345
6086 -2345 -307 2337 3000 -115 -3807 -3719 536 3548 2728 -20 -2086 -1440 642 2026 28 -2877
6102 -2877 -2610 925 3719 2932 -535 -3450 -2335 355 1722 553 -742 -1360 311 2427 1742 -1359
6118 -1359 -3496 -2248 797 2580 1720 -564 -1114 32 507 230 -763 -1467 -1074 997 2280 1657 -437
6135 -437 -1862 -1546 -285 513 121 314 381 778 627 -9 -304 -989 -1681 -423 1257 1763 994 186 -436
6154 -436 -996 -419 -54 93 -304 175 850 1638 1216 -1133 -2060 -1038 132 711 984 970 594 -106 245
6173 245 245 -698 -1577 -1112 1103 2192 1588 -91 -399 -370 -749 -590 296 516 207 739 851 755 -473 -1515
6193 -1515 -1014 -111 591 732 1166 1232 497 -1249 -1070 280 45 -686 -384 715 1352 1537 78 -1463
6211 -1463 -2000 -1333 674 1843 1316 -768 -907 1141 1621 -524 -2328 -1722 -296 1812 2518 712 -1476
6228 -1476 -2290 -586 1148 1103 -1358 -2346 489 3167 2233 -755 -2765 -2216 -413 1673 1793 225 -1748
6245 -1748 -396 1491 2059 -307 -3197 -2802 716 2975 2202 -343 -1065 -1471 -576 972 405 -1305 -1543
6262 -1543 212 2544 2473 -758 -2752 -2425 104 1275 1132 567 -745 -774 -24 1873 321 -2276 -2816
6279 -2816 -40 2434 2848 373 -1564 -1767 -985 652 950 74 -1602 -1425 1552 2959 713 -2772
6295 -2772 -3247 -687 1799 2109 455 -947 -1278 -251 1108 1211 -1450 -3395 -1441 2746 3806 632
6311 632 -2596 -2306 -369 980 601 -821 -1780 -531 1648 2709 822 -3066 -3856 -728 2285 1531
6327 1531 -144 -855 -214 496 571 279 -1521 -2230 -1072 1848 3146 639 -1962 -2133 -135 475 -135
6344 -135 -489 -254 -70 564 1587 969 -1120 -3045 -1595 943 1751 926 -793 -464 -180 -41 -206 -232
6362 -232 -1084 -1450 256 2388 2281 -922 -2495 -1304 242 537 150 -455 -235 33 1104 1398 -67
6379 -67 -2633 -2971 716 2612 1527 -799 -955 -19 451 166 -557 -1423 -963 12 2078 2074 -49 -2460
6397 -2460 -1716 559 1191 180 -541 164 670 886 541 -473 -1443 -1636 -140 1881 1839 -271 -1273 72
6415 72 608 -437 -753 -336 198 57 838 1259 980 -1206 -1892 -909 1013 763 -108 274 326 275 -291 293
6435 293 -117 -1509 -1349 780 2427 1068 -1009 -1616 -156 319 -240 -183 -390 -174 402 1261 1450 -427
6453 -427 -2309 -1315 864 1070 333 -303 -28 371 -60 -103 -610 -1050 -805 89 1968 1474 -645 -1590 -645
6472 -645 416 -121 -258 30 339 564 589 513 201 -1247 -1910 -493 1315 1175 297 -203 62 -738 -812 149
6492 149 396 -528 -614 580 1775 883 -595 -1966 -994 463 233 240 322 -350 -503 577 722 -365 -2100
6511 -2100 -1516 892 2003 1081 -484 -973 -753 217 279 58 -296 -1340 237 2353 1796 -1079 -2502
6528 -2502 -1184 792 1562 770 -296 -523 151 626 664 9 -1717 -1797 502 2895 1718 -583 -1742
6545 -1742 -892 388 548 217 -101 -316 -269 1407 2174 454 -2189 -2388 474 2018 1435 61 -820 -352
6563 -352 -43 1291 629 -1015 -1857 -258 2540 2653 266 -2204 -1833 780 1407 713 -328 -1020 -616
6580 -616 1270 2428 881 -2082 -2623 -402 2494 2642 -183 -1524 -909 1378 1443 299 -1291 -2286 -464
6597 -464 2336 3277 268 -2495 -2316 630 2185 765 -1475 -1418 196 1573 1737 212 -1891 -2220 -379
6614 -379 2160 2283 -277 -1747 -665 1002 1333 32 -1328 -1430 -196 1549 2227 894 -1758 -2481
6630 -2481 -112 1617 723 -884 -1031 -173 1463 1542 192 -1449 -1587 -1034 1147 2145 489 -1525 -1105
6647 -1105 810 1071 90 -1441 -1320 -91 950 2167 810 -1103 -1864 -717 1386 1321 -251 -1520
6663 -1520 -203 1291 1547 -30 -1270 -1888 -1082 970 1602 714 -1064 -939 209 1188 164 -1291 -1104
6680 -1104 67 870 1020 138 -663 -1015 -741 523 1038 -24 -694 -22 958 1113 -297 -1117 -832 30
6698 30 264 612 754 268 -183 -68 225 -286 -615 -196 431 577 481 155 417 -159 -768 -859 242 623 888
6719 888 9 -166 -66 -271 -32 74 -269 -443 -133 1005 1038 502 -781 -887 37 380 226 -64 -53 -48 97
6740 97 485 366 -1215 -1379 -251 822 1486 52 -539 -793 153 229 73 -193 -686 -368 819 1322 350
6759 350 -1000 -1413 -504 634 789 334 -605 -341 291 906 374 -677 -1670 -1015 1086 1903 710 -1127
6777 -1127 -1272 -556 1020 931 -486 -1211 -891 1016 1631 1195 -962 -2004 -1033 1252 1688 240 -1177
6794 -1177 -1129 152 1573 1174 -1157 -2215 -863 1371 2308 1061 -1140 -1814 -305 1726 1319 -546
6810 -546 -1900 -1034 1183 2387 1115 -1522 -2150 -587 1663 2084 374 -1647 -932 583 2130 988
6826 988 -1066 -2027 -1012 1390 2122 766 -1391 -1842 -101 1129 1462 -151 -1786 -1081 976 2391
6842 2391 852 -1097 -2105 -934 1352 1930 352 -1339 -1305 31 1520 1278 -800 -1657 -1070 1181
6858 1181 2068 939 -1081 -1487 -368 943 1027 65 -1056 -1038 515 1409 1240 -825 -2226 -1206 822
6875 822 1428 727 -1005 -1441 -212 1016 1006 -936 -1678 -1361 490 1706 699 -944 -1462 -629 658
6892 658 1248 300 -920 -1273 -16 944 759 -508 -1465 -1223 443 1189 558 -538 -1021 -268 633 759
6910 759 -141 -1028 -1190 462 1061 713 -551 -1407 -523 588 552 -31 -567 -387 -158 504 765 -101 -855
6929 -855 -624 -374 767 567 -203 -516 -138 41 406 445 -582 -772 -54 600 1144 466 -697 -901 -104
6948 -104 671 190 37 -241 -217 116 79 553 12 -750 -613 468 1082 761 -236 -559 -76 16 510 304 -38
6969 -38 -698 -269 672 1068 -111 -1079 -716 575 788 483 126 -273 -417 -82 635 255 -419 -824 -133 596
6989 596 1070 396 -885 -554 -261 232 700 13 -415 -819 580 1118 407 -898 -898 -36 779 1083 119 -500
7009 -500 -503 -216 583 1050 -281 -893 -950 595 1178 656 -581 -1020 -228 534 917 246 -71 -826 -519 903
7029 903 1314 -99 -1582 -881 652 1156 231 -623 -883 -346 537 1219 414 -945 -1131 56 1357 1231
7047 1231 -710 -1130 -599 322 591 404 -49 -1154 -522 554 1546 542 -986 -1542 -43 1611 1227
7064 1227 -675 -1269 -509 536 982 722 -504 -1501 -689 903 1613 253 -1250 -1219 636 1360 615 -466
7082 -466 -641 -542 402 1040 1015 -608 -1241 -476 1409 1596 194 -1504 -1005 342 1399 1055 -41 -1099
7100 -1099 -1082 405 2025 721 -1379 -1458 338 1581 888 -159 -965 -572 104 1058 1108 3 -1284 -869
7118 -869 860 1727 361 -1552 -1490 460 1211 1215 83 -917 -1088 121 1430 1347 -720 -1884 -336 1706
7136 1706 2006 -286 -1325 -893 419 1064 1019 265 -1235 -1437 514 1621 1275 -1007 -1763 -196 1324
7153 1324 1368 -70 -890 -636 -107 1051 1506 -66 -1724 -838 895 2137 589 -1430 -1478 438 1290
7170 1290 672 -54 -710 -845 -19 1118 1030 -502 -1589 -233 1375 1198 -262 -1105 -579 108 794 708
7188 708 367 -798 -855 336 1587 798 -1219 -1089 251 1228 487 -51 -664 -460 153 582 542 109 -1108
7207 -1108 -794 579 1304 256 -1006 -699 99 73 417 488 -205 -570 -350 776 1192 86 -1074 -384
7225 -384 573 929 13 -144 -126 -409 -164 111 549 -187 -758 -27 509 628 -367 -546 98 261 -49 391
7245 391 731 -222 -736 -562 653 714 -288 -720 -242 481 388 -153 -115 -287 -531 -28 519 655 -200 -562
7265 -562 -201 350 327 -217 -326 -113 28 492 658 739 -373 -1462 -51 1165 516 -726 -1193 306 689
7284 689 663 156 -482 -765 -321 595 1104 237 -1243 -735 799 1135 129 -1121 -934 -185 556 1055 812
7303 812 -726 -1445 -439 1115 1450 -203 -1588 -938 918 1537 367 -1225 -1223 -482 784 1685 508
7320 508 -1440 -1446 140 1844 813 -1051 -1666 -349 1325 1176 297 -599 -1253 -584 1046 1688 187 -1519
7338 -1519 -1050 899 1672 572 -1161 -1786 -637 647 1449 638 -519 -1783 -195 1764 1209 -982
7354 -982 -2048 -941 1345 2027 891 -1074 -1596 -612 999 1234 404 -1484 -1748 652 2150 1233 -1280
7371 -1280 -2142 -608 1014 1706 543 -911 -1363 -310 1316 1435 -631 -2195 -1486 1375 2311 726
7387 726 -1277 -1311 -335 851 1033 121 -1262 -872 564 1737 880 -1208 -2292 -996 976 1331 30
7404 30 -884 -732 -407 578 835 -166 -1584 -1412 445 1825 762 -980 -1759 -247 947 592 -172 -698
7422 -698 -477 183 1125 1267 -709 -1428 -605 839 1397 352 -554 -504 74 180 377 127 -552 -1134 -174
7441 -174 1564 1221 -380 -1148 -512 272 14 -81 -569 -244 285 590 549 -302 -873 -819 382 1022 490 -347
7461 -347 251 268 9 -429 -59 -158 -290 -84 283 887 468 -299 -804 -129 -15 41 -164 194 15 -188 368
7482 368 292 -173 -457 -359 258 392 607 124 186 -284 -347 -597 646 735 -104 -579 267 699 535 -575 -1045
7503 -1045 -268 455 819 313 -149 -611 -486 447 816 -544 -701 -338 663 1436 595 -378 -1054 -578 189
7522 189 402 377 -25 -633 -176 1179 1146 -424 -1550 -1023 254 1390 1164 -331 -926 -486 669 751 -118
7541 -118 -1306 -972 526 1560 914 -668 -1466 -639 27 1033 984 -334 -916 -212 739 1313 -157 -1501
7559 -1501 -1641 266 1818 1308 -54 -828 -967 476 1090 433 -1265 -1405 -46 2063 1750 -280 -1692
7576 -1692 -1515 188 1025 776 -436 -840 -356 830 1595 -191 -1414 -1422 138 1473 1311 163 -1357
7593 -1357 -995 539 1192 584 -599 -1190 -194 1930 1920 -54 -1674 -969 373 1409 808 -270 -983
7610 -983 240 1172 868 -32 -1124 -1275 -73 1194 1304 191 -902 -817 -192 815 739 -418 -719 -161
7628 -161 1098 1316 267 -1002 -1804 -411 1179 1111 398 -875 -532 869 1252 330 -1101 -1168 -12 1073
7646 1073 1237 1005 -611 -1218 -117 217 624 -402 -890 -422 1113 1609 839 -969 -1775 -483 708
7663 708 1471 271 -705 -350 724 774 115 -955 -1572 -244 967 1425 401 -653 -743 -399 202 306
7681 306 -71 -343 -27 508 662 250 -621 -1295 -915 -78 582 896 35 -295 -81 248 474 -639 -856 -612
7701 -612 271 931 928 293 -480 -582 -411 55 268 326 -247 34 665 682 -27 -647 -841 -705 64 1203 920
7722 920 -221 -587 18 599 541 -481 -1002 -92 1096 1317 21 -191 -874 -563 230 481 80 -128 -124 480
7742 480 651 -21 -860 -914 -291 581 563 736 487 -433 -695 -37 300 -4 -310 -335 831 1102 941 -40 -662
7763 -662 -622 -468 178 409 435 -157 -270 219 319 -64 -277 -748 -209 834 1027 721 -238 -1157 -803 433
7783 433 972 -317 -954 -474 1008 1262 420 -815 -1343 -718 522 1134 311 -543 -993 -41 974 206
7801 206 -1216 -1276 -380 840 977 701 -192 -1266 -546 305 880 310 -630 -591 506 1235 341 -963 -1390
7820 -1390 -818 98 896 793 -301 -772 -301 548 263 -503 -1261 -619 645 1152 569 116 -775 -1383 -660
7839 -660 384 1200 -65 -843 -228 1063 803 -226 -1750 -1346 -159 1097 1271 455 -755 -1210 202
7856 202 1693 343 -1567 -1451 594 1945 1263 -132 -1470 -1202 21 1033 915 -33 -1268 -407 1414
7873 1414 1652 -108 -1883 -1606 176 1280 1296 -83 -935 -577 193 1145 254 -1066 -1480 176 1979
7890 1979 1600 -761 -1331 -992 45 826 552 -188 -594 -212 967 838 7 -1189 -1685 -155 1194 818
7908 818 182 -153 -424 -115 506 669 -471 -1543 -467 1210 2057 314 -1492 -1470 -196 616 550 327
7926 327 -194 -505 281 1157 602 -1162 -1919 -727 1112 1194 134 -855 -904 -258 50 -15 -381 -903 -730 1123
7946 1123 1957 647 -1731 -1397 -506 856 734 4 -582 -42 639 870 132 -737 -1427 -391 1382 1163
7964 1163 82 -549 -272 -29 -80 -565 -109 -117 77 468 721 567 -298 -1433 -662 242 476 74 127 603
7984 603 -149 30 40 -738 -673 -573 -16 1142 1022 -167 -394 -289 -518 -663 -249 483 231 -406 423 1013
8004 1013 667 -765 -1415 -450 791 947 121 262 56 -85 -299 -17 -247 -791 -138 1030 1501 165
8022 165 -543 -677 -309 -145 -286 -98 589 535 -240 172 370 -332 -1077 -946 141 392 650 635 -309 -595
8042 -595 -682 -3 535 142 -751 -421 882 1087 1 -632 -1164 -879 -308 789 849 -30 -935 -114 834 802
8062 802 -706 -1595 -674 974 1916 1030 -569 -1538 -748 503 1073 -225 -1260 -829 1057 2188 826
8079 826 -1472 -2085 -766 1008 1139 361 -601 -733 -111 1095 763 -994 -1909 -776 1306 2027 638
8096 638 -752 -1291 -356 577 448 19 -842 -761 573 1980 1100 -906 -2051 -902 1165 1193 387 -372
8114 -372 -292 -126 401 795 -283 -1303 -1183 781 2122 1190 -1011 -1552 -686 228 707 436 -489 -822 -85
8133 -85 1574 1487 -424 -2419 -1433 981 2109 882 -856 -829 19 1057 659 -583 -1684 -1314 860
8150 860 2468 1587 -794 -1976 -926 1044 897 -467 -796 -335 575 1785 1195 -841 -2186 -1351 1092
8167 1092 1892 607 -1068 -914 449 1201 87 -1015 -1536 -594 508 1764 829 -813 -1551 -295 636
8184 636 310 -318 -788 298 873 473 254
8191B54
$$ Imaginary data points
##PAGE= N=2
##DATA TABLE= (X++(I..I)), XYDATA
0 0 0 0 0 -8 8 0 8 -16 16 -18 32 -32 40 -54 62 -71 91 -102 118 -146 166 -188 223 -252 289 -329 376 -422
28 -422 482 -540 602 -681 760 -841 944 -1051 1160 -1287 1431 -1581 1750 -1936 2144 -2373
44 -2373 2637 -2924 3256 -3641 4083 -4604 5234 -5998 6962 -8208 9895 -12297 15989 -22312
58 -22312 35206 -71852 409239 1174233 172819 -634246 -161923 622457 693866 243657
68 243657 -161502 -131891 288969 800844 848097 220876 -523091 -456740 341130 833697 554682
79 554682 196993 218239 318488 324934 415358 377837 -53425 -436694 -90702 737037 1027902
90 1027902 346785 -452367 -358436 342239 591770 203756 -105544 31706 375060 654321
100 654321 642772 204800 -312288 -342152 101853 441860 340436 71698 49536 217707
110 217707 207128 30235 25443 110912 -34698 -138180 258827 760589 603258 -86125 -462187
121 -462187 -164058 307553 323126 -76652 -290711 -15922 379312 448697 140366 -306923
131 -306923 -489143 -117633 447902 501751 53196 -179349 80565 323722 135448 -239083
141 -239083 -329908 -109555 60154 72150 159650 250700 10931 -349311 -269818 126126 213277
152 213277 -43001 -130914 93285 293400 228295 -25580 -261755 -333259 -202145 58580
162 58580 212197 42879 -209015 -85205 232129 109435 -351471 -383069 91312 342396
172 342396 102293 -111363 32693 201798 23176 -317676 -370952 -110022 93026 92477 42208
183 42208 -26088 -119573 -64927 90297 -3017 -285931 -243179 179341 410143 170546 -155455
194 -155455 -186011 -57003 -87177 -209508 -125074 76771 42387 -117445 -6218 220390 86419
205 86419 -287280 -362308 -57011 245940 283352 97710 -115274 -166564 -40225 79733 -7578
216 -7578 -281191 -399261 -69253 388875 347401 -135366 -363634 -124257 96639 29962 -70052
227 -70052 -5241 90980 74829 12007 22659 22075 -157590 -371679 -280084 66334 260337 154909
239 154909 -58106 -205816 -176445 47751 196501 -4747 -315091 -241228 218309 500845
249 500845 193359 -386217 -543601 -148447 196472 94334 -142876 -159941 -31448 90247
259 90247 164540 83645 -176448 -355468 -204274 157761 360884 192322 -154397 -297772
269 -297772 -151314 35088 63723 -82431 -304311 -315216 84935 500223 320552 -302867
279 -302867 -573120 -176427 329790 327113 -89432 -320419 -89338 229667 213224 -74048
289 -74048 -330468 -381615 -171320 164930 281559 67322 -150249 -122243 3769 39319 1228
300 1228 -48088 -92755 -91333 23657 214196 244203 -75032 -459485 -393543 64922 301047
311 301047 71058 -206006 -156163 109603 260763 119243 -183199 -322144 -146408 156283
321 156283 297283 157346 -121363 -239617 -100193 38449 -19806 -118691 -105013 -48481 28688
332 28688 176075 247786 59088 -252027 -327764 -41937 296089 267454 -92809 -284182 -60412
343 -60412 217744 155879 -161633 -381922 -268417 108104 373814 232879 -116174 -235772
353 -235772 -40564 157878 104005 -111348 -187474 -14744 165579 135287 6501 -73169 -155914
364 -155914 -224339 -128043 87259 178542 70737 -66731 -59801 78646 148010 2719 -201739
375 -201739 -203176 4779 204122 211623 4596 -223984 -211555 -4460 73549 -58323 -137444
386 -137444 -22353 133213 161019 69595 -29486 -66544 -87320 -112128 -40475 122825 160554
397 160554 -6638 -153221 -111704 13171 49068 -57936 -194464 -144175 125014 318082
407 318082 187281 -112298 -244334 -92687 132733 138364 -75525 -180001 -10552 172998
417 172998 117023 -74176 -185688 -159714 -47703 61574 99437 90861 70617 19355 -29998
428 -29998 -9854 24954 -14966 -82342 -77719 17004 137806 149332 -26395 -215364 -176964 22669
440 22669 117750 43077 -36254 7260 130731 167126 31193 -123469 -115165 -9388 33991
451 33991 24271 38475 60168 39007 -39166 -122446 -97532 37873 99058 7230 -49984 62929
463 62929 201402 166970 -37808 -212645 -155555 76496 189837 59242 -100578 -83690 47252
474 47252 111620 19742 -136125 -153957 16272 171111 161409 77565 22094 -21317 -51219 -31550
486 -31550 12740 30525 281 -46201 -18469 98039 134781 -16917 -183694 -154366 33421
497 33421 190895 182889 28270 -83552 -3105 134302 96645 -83100 -174121 -74014 99737
508 99737 161765 60677 -53110 -53947 -20919 -35453 -16664 71155 106952 47387 5088 48608
520 48608 117564 98704 -50101 -192744 -130994 96175 224785 116233 -91755 -168194 -22125
531 -22125 172880 144490 -86734 -181494 16124 255807 259910 54119 -134411 -139404 -3661
542 -3661 94974 76530 11359 -39378 -43976 43913 156065 117340 -67716 -173116 -63500 153984
554 153984 278457 183963 -49380 -164085 -29103 170969 170688 -51355 -237697 -120438 211671
565 211671 342328 84127 -218798 -192071 62084 212744 147873 2631 -51992 30540 143008
576 143008 154813 49022 -92103 -153396 -55101 120383 179828 85351 -23474 -63162 -34522
587 -34522 70273 162925 87047 -94546 -107029 121765 312335 195379 -119768 -258954 -65218
598 -65218 181472 172576 -11125 -103632 -36544 91723 173590 113056 -64833 -152280 -21872
609 -21872 173148 218378 101605 -32758 -69153 -16031 45869 68834 37700 -58915 -122534
620 -122534 8251 236916 236316 -44242 -241421 -104140 175441 263922 89609 -113881 -100540
631 -100540 93357 206790 97999 -114057 -212915 -85038 156471 236914 60648 -120102
641 -120102 -74699 80346 123833 49043 -18313 -18016 28486 80590 117803 109097 5632 -137125
653 -137125 -134955 46992 169403 75368 -67258 -57514 66357 146340 100682 -27708 -102493
664 -102493 -27905 123303 188465 96714 -55933 -92260 27612 107495 6889 -104356 -31838
675 -31838 102174 101853 27522 26447 63553 33071 -34631 -22525 77268 130203 61269 -15275
687 -15275 3268 41203 19009 -11397 -19998 -40559 -18324 89205 148671 51903 -60327 -21999
699 -21999 84844 78253 -25151 -40615 76379 133899 24964 -69991 -7448 59209 -12582
710 -12582 -86633 -28772 65052 84039 58729 27645 -10633 -22301 21150 66400 36931 -39129
722 -39129 -36886 69948 114332 -4842 -114700 -60350 25010 -4262 -38852 30364 85444 23969
734 23969 -50775 -15728 68366 57624 -51409 -100978 -8875 95397 81175 -13024 -95599 -119874
746 -119874 -48223 70856 72066 -72741 -143544 -5402 158996 119706 -71361 -168949 -64402
757 -64402 78366 75623 -19756 -59071 -45598 -45137 -24532 20858 -5147 -103308 -127538 -18506
769 -18506 102056 101394 -14174 -116671 -97663 7127 78131 48899 -62443 -157361 -97163
780 -97163 92878 152896 -48997 -253961 -175633 73401 168344 27984 -131044 -114451 19752
791 19752 90625 45981 -34808 -101293 -116183 -22955 104903 83550 -81783 -170265 -87294 30181
803 30181 60535 16266 -51258 -95380 -56082 69105 154083 50968 -168771 -212157 22025
814 22025 218026 92652 -162160 -197522 -20386 110747 77984 -41744 -130785 -105763 28934
825 28934 149869 118356 -49907 -158955 -63308 103769 109593 -24773 -93865 -56432 -18249
836 -18249 18505 71656 38407 -104911 -166298 -13928 178789 154457 -59300 -173777 -42011
847 -42011 137602 128298 -21918 -120703 -97878 6688 115250 101672 -60787 -175557 -79999
858 -79999 98621 125761 -3932 -94928 -38665 63162 74425 20430 -7566 -27716 -67815
869 -67815 -44553 65378 102349 -16811 -130696 -84915 44907 92326 16181 -77658 -74561
880 -74561 19633 100102 90535 -1402 -101153 -95277 34922 118473 20719 -116788 -90747 39154
892 39154 75045 -7767 -73405 -49061 3825 17101 15808 39958 39202 -25477 -61991 -1047 53220
905 53220 7788 -58605 -54008 -10460 18896 27372 1819 -54167 -78599 -20815 66630 70008 -25467
918 -25467 -79388 6089 98567 36866 -83784 -75219 17779 32245 -24277 -35994 1077 11681
930 11681 -18910 -36218 -12372 13046 8304 4176 17436 11550 -7071 15304 37235 -19872 -82715
943 -82715 -33616 54567 37776 -46698 -57388 12050 43136 -6945 -44950 -1548 46985 16767
955 16767 -22135 17123 58428 15402 -45710 -39267 -2152 14135 15008 736 -32030 -38089 12288
968 12288 63932 35388 -52427 -74573 27931 119957 58614 -60222 -58291 30268 51316 -1771
980 -1771 -32475 -22406 -12339 -5723 15489 35215 18366 -28000 -38961 13521 58710 41152
992 41152 4573 -10876 -19169 -2600 50252 56314 -35325 -108679 -43071 81509 95904 -18649
1004 -18649 -103826 -41883 76317 88469 2343 -46266 -20862 16641 41726 50731 11513 -52837
1016 -52837 -59730 -344 44759 27740 -20364 -43419 -22603 15345 42446 48258 12475 -55730
1028 -55730 -59666 47044 124370 38547 -100490 -100483 24615 99581 38715 -69509 -94476 -16824
1040 -16824 64099 68668 11626 -49096 -57863 11611 88663 65076 -31476 -66874 -13801 34094
1052 34094 32150 8716 -19968 -48854 -46988 7764 70498 56201 -41380 -95718 -7424 111750
1064 111750 93168 -28758 -88571 -33771 52678 80896 23256 -65094 -85333 -10128 70937
1075 70937 63733 -21426 -80289 -34214 59906 76815 12529 -26159 -10656 2783 10345 37381
1087 37381 40246 -14974 -66974 -40404 40401 75909 12501 -73641 -64763 27691 86561 54813
1099 54813 -16200 -57031 -25035 60723 95932 17213 -80184 -67845 26655 76775 29068 -45987
1111 -45987 -56843 -2446 37657 30340 14905 3870 -18913 -18336 33894 72696 32716 -38192
1123 -38192 -57672 -10080 50083 54689 -8144 -67161 -49819 24548 74649 44384 -42311 -79905
1135 -79905 -1574 97887 80373 -22442 -67312 -16202 44526 45056 -1871 -39276 -33269 -3147
1147 -3147 17861 25280 15736 -18525 -38134 -5685 41207 45563 16147 -15090 -27489 -1416 44447
1160 44447 43510 -20044 -69965 -40286 36087 67499 9719 -64545 -50230 31558 64003 16053
1172 16053 -28121 -19842 13379 36757 31207 91 -24032 -20902 -6847 3769 9887 4846 -8956
1185 -8956 -13143 -5576 7874 26242 24541 -13327 -34281 9889 62608 44214 -19982 -49424 -16554
1198 -16554 32071 32119 -17181 -44741 -12185 30327 30833 5088 -14802 -14139 9318 28904 18604
1211 18604 3095 10040 16246 -362 -12708 -3006 7764 1241 -17106 -21500 7996 40768 24534
1224 24534 -21415 -27360 10625 37111 26298 45 -12110 6349 30283 16943 -18483 -24976
1236 -24976 -3601 5656 -479 -2394 6422 18920 16097 -8745 -19013 11155 39276 20610 -14312
1249 -14312 -15838 13877 38642 21378 -31702 -54842 -12274 37464 30435 -9171 -25018 -4978
1261 -4978 24278 30144 4954 -17377 -8370 11209 18068 21253 17171 -7369 -31235 -26109 -1490
1274 -1490 19634 17307 -14348 -36601 -4808 49451 49728 -9124 -54985 -34202 34461 72628 27278
1287 27278 -47504 -53289 6533 43938 17373 -34043 -54460 -19527 35377 49569 14770 -20692
1299 -20692 -27519 -11154 18425 37278 18411 -19597 -31048 -5390 29509 37066 -6387 -65509
1311 -65509 -62247 11852 71218 47859 -26998 -66359 -18579 64059 70252 -14894 -75644 -35533
1323 -35533 44549 70173 22883 -45997 -67551 -23023 32150 37795 -347 -35446 -30098 15552
1335 15552 54642 37087 -16957 -45722 -30200 11085 53020 49093 -17249 -72752 -41078 38777
1347 38777 59748 -6960 -77849 -58529 36317 91299 41229 -43305 -65161 -17794 42607 57076
1359 57076 4907 -56518 -45589 23327 54278 11879 -45794 -58662 -23639 21793 38782 23579
1371 23579 -5342 -31513 -27974 19103 52970 11166 -59757 -57903 14517 64284 36361 -37291
1383 -37291 -80225 -46176 27457 54081 8504 -48427 -47571 16682 70117 37320 -48315 -74883
1395 -74883 -15848 40478 34711 -2919 -30904 -35491 -16200 7586 11127 -10023 -36266 -36200 7521
1408 7521 54383 40324 -23232 -56932 -30859 15589 36019 10018 -39123 -49364 -1025 43409
1420 43409 22096 -41947 -73254 -30477 41244 54025 -3211 -41520 -12452 24411 15194 -13952
1432 -13952 -25360 -19053 -5419 8168 11589 2293 -15575 -29303 -22588 -1505 6587 939 3438
1445 3438 7961 941 3685 16616 1357 -34164 -33006 9615 32279 6246 -26226 -18780 10707
1458 10707 9363 -24208 -31082 5405 28315 13521 1418 6842 5800 -2485 -3539 -9113 -18673
1471 -18673 -8481 18211 24352 -1763 -28074 -17197 12907 11411 -20635 -20176 22846 38446 8039
1484 8039 -8503 6675 7002 -17033 -24169 -2209 19125 14268 -6485 -14484 -3889 5364 2139
1497 2139 -4933 -14126 -16091 14639 53084 35409 -27334 -46987 -1772 32558 10571 -28536 -30465
1510 -30465 4658 29566 16005 -9994 -21687 -24776 -16213 14936 39503 18236 -18232 -18954 8618
1523 8618 21361 5494 -24089 -41199 -23014 19413 43351 21400 -33024 -62546 -20528 49114
1535 49114 46957 -27824 -62021 -4098 62792 52479 -15347 -62770 -46883 5536 35524 19468
1547 19468 -17408 -37876 -21070 22632 37982 -5973 -51754 -33456 18605 41671 27934 2292
1559 2292 -24273 -36123 -14958 21242 25938 -16852 -55359 -25937 46361 59605 -10440 -66745
1571 -66745 -41080 18192 43891 28407 -5541 -29001 -15681 22174 34160 -3035 -49342 -46379
1583 -46379 7990 47184 25602 -15058 -21982 -11674 -8843 7537 31076 16678 -26243 -27104 26438
1596 26438 59037 19032 -49953 -63927 -7922 45771 40040 -2431 -32432 -27334 11532 49566
1608 49566 28516 -38689 -57318 8394 71685 53185 -14129 -46660 -21337 14808 19516 2787
1620 2787 -9570 -15943 -10748 20370 47484 17966 -40739 -47770 6150 49672 39987 161 -25442
1633 -25442 -15292 14339 26854 4986 -33113 -46175 -6152 53071 52711 -12829 -51930 -14771
1645 -14771 31994 23721 -10281 -17647 4188 22193 18793 3411 -8435 -19260 -26923 -12675 13080
1658 13080 17472 1334 -2601 3008 -2474 -6815 2533 3798 -11917 -14073 13378 36354 18484
1671 18484 -26161 -42371 -10968 14702 -2240 -20815 -4344 16112 10689 -230 -1223 -7487 -18045
1684 -18045 -14108 5247 18721 13735 -1262 -8648 -7759 -12920 -16656 -6707 -2126 -14517 -8845 25240
1698 25240 33515 -6747 -39156 -19717 15948 16872 -7856 -14914 8694 23544 3972 -21549 -22326
1711 -22326 -13853 -9743 545 10996 5617 298 11632 13522 -10360 -27989 -9808 19759 20935
1724 20935 -3999 -12950 9651 22423 -6032 -34513 -22634 3642 9532 10009 16806 12167 -3661
1737 -3661 -8167 3020 8256 -1503 -12034 -2671 19643 25341 8158 -9021 -18467 -23693 -9115
1750 -9115 22532 27142 -5422 -19817 12905 43670 22232 -27126 -40991 -2473 37719 32398
1762 32398 469 -12206 -5217 1195 5757 2856 -13803 -20211 5451 34963 30502 4625 -9784
1775 -9784 -6158 -1166 -1611 3085 15395 15479 -4869 -11152 12074 22421 -9573 -37926 -19414 19781
1789 19781 35493 21949 -70 -11207 -4651 7412 11231 2426 -13616 -15081 10488 34110 18177
1802 18177 -17800 -28896 -13381 -893 8327 18549 14112 -4965 -10449 10192 29391 11452
1814 11452 -32473 -43278 2579 48394 34907 -12694 -36283 -21231 8247 24277 5398 -27841
1826 -27841 -27572 15807 51851 34216 -19256 -47107 -19159 24212 25751 -4322 -15928 -3480
1838 -3480 5487 7731 6869 -7091 -27491 -24122 7759 35674 30746 -652 -22601 -12874 8731
1851 8731 12434 -1176 -13204 -15809 -381 26901 28597 -9601 -41358 -25589 11915 24732 9665
1864 9665 -5015 -291 12092 10827 -62 -4808 -8995 -17501 -10748 16261 29960 10371 -17411
1877 -17411 -24868 -11586 9395 17521 2811 -15108 -8481 20715 39104 18124 -30416 -48965
1889 -48965 -9897 37419 30760 -11153 -27914 -6056 18621 17914 -6390 -28188 -22625 6909 31877
1902 31877 31208 6956 -21443 -22002 2539 14810 459 -15304 -12435 1271 15826 20992 2270
1915 2270 -27355 -33807 -5605 26883 27779 -1083 -20194 -1788 24379 14220 -20207 -32086 -13579
1928 -13579 9522 18262 10111 -6601 -13462 -6120 -416 -4942 -9415 -4341 7302 15154 7728 -3853
1942 -3853 -2535 -72 -14457 -25984 -9746 15159 15917 -2319 -13785 -8724 1759 863 -10855
1955 -10855 -15369 -3199 12364 17942 11585 -5095 -19958 -16372 -2504 -1594 -8082 -4241 3644 4475
1969 4475 753 -2501 -7869 -13385 -14279 -4418 12742 20094 5204 -12350 -9573 1818 -2164 -15780
1983 -15780 -19445 -7983 9950 18169 4208 -15007 -14999 -2128 2614 -4400 -10256 -1614 16842 21893
1997 21893 -365 -23731 -18460 803 3308 -9686 -15294 -2728 16935 19155 -3828 -26268 -19922
2010 -19922 1969 13118 8046 -2641 -6353 3498 13830 4408 -17594 -26808 -16543 2701 17449
2023 17449 15252 -2900 -15528 -9879 3090 8404 -384 -15673 -16516 9846 34000 21089 -17126
2036 -17126 -38180 -22424 10238 21511 -369 -23594 -13076 17591 26928 4376 -25081 -31250
2048 -31250 -6554 23989 25321 2041 -12918 -7291 1032 1310 -5895 -13667 -13318 -3340 8621 16145
2062 16145 14539 -1009 -20852 -20927 617 17520 14003 -2312 -13116 -3421 17030 16516 -12605
2075 -12605 -35374 -23379 8124 28075 20696 -4880 -19647 -8973 9610 12940 -66 -14145
2087 -14145 -13943 6057 27917 23381 -5385 -29893 -29214 -4905 23021 24254 -5257 -25987 -6887
2100 -6887 28443 32685 -3823 -40872 -32392 16434 48728 26878 -18176 -33977 -10636 20752
2112 20752 22411 -10107 -37180 -17773 27333 43891 15317 -21380 -29183 -6358 17729 18561 1795
2125 1795 -9879 -6619 6536 18557 12524 -15534 -34232 -17096 16495 29630 14901 -7674
2137 -7674 -15879 -2484 14878 12255 -7922 -20527 -8950 18010 30648 9984 -22103 -26606 -5187
2150 -5187 8096 3377 -2090 20 4009 7322 8027 3068 -5367 -13537 -13804 -317 16895 17510 1334
2165 1334 -13628 -15779 -6591 5524 4344 -12618 -18494 3127 27548 22983 -7044 -29639 -20293
2178 -20293 8083 19026 1595 -14398 -7415 7241 9709 -665 -15801 -23586 -12871 7046
2190 7046 17122 9984 -3008 -8942 -4279 2837 -572 -10298 -11116 -3003 5341 11115 8262 -9314
2204 -9314 -24895 -16538 4458 9165 -3878 -10808 2076 18779 12640 -12089 -23928 -9432 6639
2217 6639 6153 -708 -4352 -2684 3666 5844 -7619 -24121 -17267 7567 21027 8817 -9037 -7613
2231 -7613 8496 10500 -8695 -19866 -8122 6169 8706 7664 4510 -7074 -15679 -9029 2907
2244 2907 4156 -2950 -4830 4966 15238 11878 -1347 -11022 -14371 -10022 5780 19253 8319 -13298
2258 -13298 -12372 8368 13362 -5910 -21501 -12572 10461 21851 13322 534 -4165 -6684 -6400 586
2272 586 4995 -2109 -6900 1987 10551 7324 -1342 -8678 -13980 -11692 3138 19991 20345 82 -18102
2287 -18102 -7121 17523 15599 -15021 -29513 -7520 21933 26203 5732 -18446 -24406 -6852
2299 -6852 13577 14961 -1815 -15597 -6758 19345 27987 2753 -26505 -25542 -3479 13446 16255
2312 16255 6383 -10315 -17135 -2721 16577 12704 -14523 -31556 -9228 30922 37618 2495 -28167
2325 -28167 -22036 2674 15769 8231 -11819 -21833 -4816 22810 25765 -3523 -31518 -25072 7277
2338 7277 25213 11268 -7211 -4918 4639 4148 1429 471 -8912 -18296 -8281 15746 23965 6731
2352 6731 -15899 -18488 -2599 10706 8496 -123 -4796 -3041 9137 22440 11894 -18721 -30074
2365 -30074 -5626 20681 17560 -1423 -9240 -1317 6919 5410 426 -2708 -7442 -6980 10488 28226
2379 28226 18422 -10189 -20791 -5904 9648 10692 1332 -7863 -5742 8743 21423 15500 -9612
2392 -9612 -27157 -11296 23962 32323 3940 -17574 -3080 17893 14005 -5187 -15323 -9733 4432
2405 4432 15783 16456 6668 -6217 -9485 1576 11729 5075 -5110 1009 12943 12060 4106 2089
2419 2089 -2118 -10429 -9528 4860 15723 9120 -3792 -3705 9021 10711 -4476 -11343 1213 11919
2433 11919 8321 4353 6209 3524 -3149 -5857 -4404 -2253 855 5584 9134 5247 -3011 -2848 7553
2448 7553 6425 -9225 -12693 8319 22816 9834 -8782 -9260 545 3674 -2705 -6622 -1207 4813
2462 4813 6031 6767 5784 -2785 -10627 -3625 7126 4902 -745 4560 8584 395 -7960 -4811 2023
2477 2023 -1121 -8605 -4528 11296 15484 379 -10488 -3177 4036 -655 -2456 4130 6454 1584
2491 1584 0 2500 662 -6046 -9962 -4955 3298 5814 5959 6927 1516 -9863 -8616 8106 13017
2506 13017 -5224 -14982 1216 20550 15356 -8452 -21547 -11518 6546 10836 3368 -3414 -5206
2519 -5206 261 11504 12743 -5766 -20472 -8760 13428 17438 4193 -6702 -6633 -2811 -340 147
2533 147 1155 -2965 -9037 -1213 17720 18553 -5197 -21772 -10540 9331 13222 3917 -5701 -6669
2547 -6669 947 8084 5610 -6667 -17624 -12863 7392 19678 7410 -9338 -7074 3248 2252
2560 2252 -3535 -1708 1396 -1923 -3291 4075 11008 3543 -14701 -20675 -4457 12179 10155 -1077
2574 -1077 -6426 -4963 2181 10351 5480 -12489 -20667 -3548 18830 18354 -3767 -20096 -12461 4606
2588 4606 6681 -3354 -7248 -4129 -917 6502 14000 6194 -13562 -20222 -4448 13301 13264 -1525
2602 -1525 -13109 -7989 4681 8807 945 -11414 -18542 -7025 17664 24652 860 -21176 -13134
2615 -13134 8651 14076 -408 -13443 -8953 5585 11830 6083 -3000 -10322 -13299 -4331 10190
2628 10190 11475 -159 -5309 -43 4749 4929 1978 -4313 -9964 -6376 6539 16182 9479 -10374
2642 -10374 -19015 -3320 14101 8427 -7908 -8652 2921 12023 11726 2612 -8179 -11225 -3630 6800
2656 6800 10670 4279 -5970 -6450 2897 5969 238 -4735 -4951 -3625 3325 14555 13696 -2278 -14882
2671 -14882 -8069 8434 13557 -577 -13744 -5709 11421 13303 -121 -10727 -11141 -2844 8721
2684 8721 12444 3285 -5965 -2837 6664 7327 -1688 -9318 -5933 3100 6078 2893 1923 1695 -5469 -8825
2700 -8825 -295 7467 2829 -4372 -1813 6050 8982 2380 -7115 -8838 -2746 2889 3927 2092 -2002
2715 -2002 -4062 283 4259 -2476 -8910 -2901 6417 5826 372 -805 2455 2179 -4000 -8954 -3720
2730 -3720 4807 3671 -2421 -2490 589 532 -1406 -2321 -4282 -3108 3344 6775 3312 -1444 -2253 -1350 -938
2747 -938 -3720 -5001 100 4766 94 -5211 -905 4511 -343 -7173 -6283 1403 8216 7554 -838 -7016
2763 -7016 -3472 2818 2069 -2798 -6822 -5588 2617 8878 3832 -5748 -7318 -2326 1016 3107 3051 359
2779 359 -1552 -513 1914 3488 1401 -7037 -12297 -2793 11078 10842 -2320 -11268 -7861 3979 11534
2794 11534 3080 -10406 -10498 3505 14899 10716 -4852 -16538 -10113 7018 11377 145 -9241
2807 -9241 -6720 1787 7717 6646 -2379 -10274 -7785 2309 11230 11320 -559 -12707 -8896 5033
2821 5033 10573 2311 -10056 -12774 -1436 14689 15438 -3019 -17755 -11112 7694 16626 6833 -9890
2835 -9890 -12369 2157 13845 8331 -5669 -13240 -9225 3103 12969 9084 -4138 -10313 -4514 5053
2849 5053 10809 5901 -7147 -11448 2 14018 14735 87 -15625 -14719 4497 18342 9198 -9460
2863 -9460 -13952 -497 14908 15397 -932 -15944 -9578 10096 18654 8392 -6461 -11057 -2223
2876 -2223 9463 10104 -187 -7680 -6342 2508 12749 13299 157 -11330 -6710 7220 15060 9073
2890 9073 -3640 -10013 -1139 13283 13526 -460 -13358 -9688 7041 18612 10010 -7901 -10596
2903 -10596 3406 13404 9015 -459 -6034 -2494 6988 12060 6220 -2851 -6260 -2664 4947 9009
2917 9009 4494 -2281 -2479 2852 7024 8401 3954 -5489 -6606 4403 13562 8649 -3319 -8383 -1439
2932 -1439 9300 8704 -2419 -7860 -1085 7545 8548 4232 -2245 -4394 821 6795 4852 -359 -1187
2947 -1187 699 2663 2939 882 -2004 -1300 -267 -146 3099 5995 1970 -4064 -1415 4731 5106 -346
2963 -346 -4183 -1518 4334 5978 -593 -5395 -2346 1995 2510 677 -1556 -2734 2081 6903 3262
2978 3262 -4908 -4337 2766 6306 1296 -4482 -3415 3086 5384 -703 -5118 -1727 220 135 2021 3819
2994 3819 -259 -3375 69 4039 3335 -80 -3214 -3200 1394 4363 3278 -606 -5453 -6267 1980 10640
3010 10640 4168 -8956 -8667 5490 12207 4789 -6572 -8314 213 8320 7170 -812 -5988 -5447
3024 -5447 639 7644 6173 -4434 -8987 -408 8024 7119 1581 -2269 -4379 -1531 4971 7877 3375
3039 3375 -6204 -9533 528 13149 8699 -7846 -12855 -613 10820 10342 1276 -7984 -7173 3529
3053 3529 12177 7393 -4492 -11075 -3808 9036 11636 -888 -10448 -5451 3950 6205 4694 1086
3067 1086 -4919 -6629 1740 10714 8649 -3704 -12253 -5177 9379 12069 -1115 -11450 -8343 1846
3081 1846 9488 8242 -2910 -12762 -6642 9732 13904 1302 -11718 -9736 4059 12231 4135 -6828
3095 -6828 -7986 -3175 1524 5719 5696 -3831 -10999 -3958 8260 10198 -63 -9549 -8093 2395 9578
3110 9578 5602 -3694 -9749 -7464 3220 11749 4160 -12321 -13500 3203 13711 5751 -7449 -9997
3124 -9997 -1646 6154 6070 380 -4389 -5958 -2922 4291 7208 -1557 -10594 -6779 3265 6092 2260
3139 2260 -1871 -5212 -4206 1635 6759 4446 -4581 -10488 -2720 9633 8987 -5785 -12722 -3166 6295
3154 6295 4888 -876 -3731 -3818 -436 4599 4615 -778 -5434 -4874 1900 6206 1596 -4852 -3195 181
3170 181 -789 -778 2225 536 -5871 -4002 4217 7661 627 -7503 -5944 3522 7018 114 -5314 -2764
3186 -2764 814 950 1192 -182 -4748 -5011 1703 5413 1010 -3620 -2523 1902 2711 -1460 -2974 945
3202 945 2150 -2679 -3087 2735 3371 -4240 -5692 -291 3424 1079 -1989 -1524 379 1939 -210 -1115
3218 -1115 -610 -1863 -2048 1715 2955 -2516 -4619 783 3126 -2793 -5489 -297 4611 2475 -3270
3233 -3270 -3201 2035 3637 -1722 -4481 -344 1702 -135 -240 1282 -1516 -3899 -977 2249 256 -1990
3249 -1990 -828 1681 2282 -241 -1471 1050 718 -3692 -3259 4412 5868 -2768 -6644 -875 4887 2411
3265 2411 -2629 -3721 -426 3672 4028 1772 -1000 -3461 -2417 3247 6113 -647 -5909 -1049 5366
3280 5366 2593 -1633 -1866 -782 -798 537 3677 5000 1867 -4887 -3701 4930 7203 -1492 -6190 -1491
3296 -1491 3958 5246 3164 -1581 -5766 -3610 4039 7377 2547 -4701 -4397 4224 9157 2189 -6281
3311 -6281 -4413 1648 3104 2220 2920 157 -4267 -2960 2614 5304 1282 -4428 -3920 3831 8063 3570
3327 3570 -2378 -4454 -3393 997 6408 5033 -4380 -7667 703 8841 5223 -4888 -8705 -2050 6723
3342 6723 6504 845 -1899 -2524 -2327 1100 5424 1257 -6112 -5482 2520 6924 4104 -2592 -6997 -4301
3358 -4301 1933 6040 4569 -1479 -6468 -2927 7544 9776 -2861 -12749 -5449 6448 9049 1948
3372 1948 -5348 -5904 -213 4545 3998 -391 -4840 -4607 3084 10053 4669 -5566 -7557 -1026 3479
3387 3479 3544 1830 -1841 -4149 -770 4800 5984 -289 -7885 -6153 5142 11523 3714 -5635 -5362
3402 -5362 988 4457 3315 -928 -5257 -3218 4117 7993 3877 -3827 -6021 -1424 5401 5323 -114
3417 -114 -1158 1109 1564 2462 3712 1375 -4639 -4996 2285 8100 6349 -1560 -5884 -999 5854 5245
3433 5245 -102 -2764 -1453 3422 8165 6424 -2050 -7595 -2243 5903 6112 634 -3126 -1136 4637
3448 4637 5645 1439 -1662 -1329 -629 2626 7408 5952 -1216 -4222 283 4974 3433 -971 -3592
3463 -3592 -317 5377 6968 3183 -1921 -3697 -1015 5386 6986 140 -4515 1170 7576 5158 -2043
3478 -2043 -5117 -1694 3166 4743 1853 -245 607 1018 2218 2375 201 -2458 -237 4932 5175 1226
3494 1226 -263 -186 -700 206 1149 1214 610 173 1670 4174 3526 -1585 -4423 121 4853 3271 33
3511 33 -274 948 2341 2122 -831 -3413 -2144 1873 3999 3035 439 -1923 -35 2491 1088 -1997
3527 -1997 -709 1968 1977 1755 2188 342 -2020 -3063 -1544 1860 3459 980 -2513 -613 3241 3089
3543 3089 -859 -3616 -3694 716 5680 4944 -1322 -5252 -2271 2414 3373 -1177 -5461 -3476 3616 6497
3559 6497 1594 -3482 -5022 -2917 1685 4649 1410 -3607 -3554 792 4191 2955 -3571 -8500 -4502
3574 -4502 4087 6850 2178 -4503 -6503 -1948 5158 4913 -3749 -9342 -3294 6059 8428 449 -8597
3589 -8597 -8789 -333 5672 2423 -3650 -5496 -1979 3916 5777 -375 -7918 -7221 -149 4819 4075 -759
3605 -759 -5429 -4705 340 2897 354 -4407 -6309 -2858 5087 7316 190 -7766 -6931 -240 4033 3024
3621 3024 -2703 -6254 -2154 4209 4402 -1624 -6575 -6844 -1296 4858 4859 -657 -4590 -3486 45 2604
3637 2604 1684 -3305 -6384 -2085 4479 6207 1329 -5659 -8544 -2176 5654 5342 -1913 -6427 -2597
3652 -2597 4585 7458 1200 -8193 -8781 771 7711 5235 -1836 -6280 -3863 3373 5869 -646 -6642
3667 -6642 -4953 1778 7222 6124 -1404 -6957 -4317 1842 4467 2351 -2491 -4554 -311 6052 5389
3682 5389 -2410 -7770 -4853 2578 7082 3915 -3116 -4939 657 4397 2674 -2840 -5418 -2612 3714
3697 3714 6740 1814 -3957 -3985 -705 1520 1292 -595 -1923 631 2696 2074 481 -1167 -3207 -3085
3713 -3085 388 3460 2199 -370 -1276 -1388 457 1447 -1117 -3874 -1596 2025 3817 2743 -1041 -3965
3729 -3965 -2624 1135 1428 -1161 -1734 -53 1309 1916 310 -2604 -3576 -2060 321 2363 2673 -256
3745 -256 -2665 -898 2206 355 -3223 -3454 -1437 2163 4338 1463 -3456 -4196 -1122 2212 1394 -1824
3761 -1824 -3733 425 5750 3844 -3526 -5983 -2295 1596 2427 499 -2490 -1852 1908 3086 41
3776 41 -3934 -4854 -999 4003 4562 67 -2977 -527 1178 560 -874 -2241 -2573 -337 4235 4149 141
3793 141 -4381 -4092 -39 3676 1539 -2665 -1781 2744 4493 1616 -2123 -4722 -3280 2149 4576 1834
3809 1834 -1974 -1744 1090 2631 618 -3169 -2848 1036 3527 2137 1463 818 -1687 -2436 -434 1713
3825 1713 1205 82 -656 369 2568 2452 -710 -3055 -2828 -388 3329 5008 1480 -3495 -2145 2523
3841 2523 3085 -814 -4179 -2760 2067 4997 3521 -586 -3535 -3048 -244 3628 3596 -1451 -4029 777
3857 777 5640 3637 -1860 -6083 -4687 1187 6220 3924 -1939 -4593 -1942 4000 5245 -1344 -7959
3872 -7959 -4075 5489 8344 2038 -4604 -5710 -1250 3506 3136 -1254 -3687 -1649 3128 5580 1810
3887 1810 -4541 -6061 -29 4640 3367 68 -1260 -751 59 1729 1167 -2153 -3994 -1401 3162 5549
3903 5549 2061 -3328 -3714 491 1917 671 -1 -62 -138 1764 3084 1749 -2263 -3691 -1904 1848
3919 1848 3320 1985 366 -337 -298 -484 1216 1677 -1287 -3929 653 5925 5299 -1197 -5203 -3612
3935 -3612 1955 4257 1701 -2007 -1867 1162 4188 4168 -1430 -6543 -3702 4834 6906 2077 -2975 -2677
3951 -2677 1365 3576 1417 -2468 -3457 -548 3387 5744 3599 -2403 -5492 -749 4722 3317 -1623
3966 -1623 -2607 498 3992 4002 -117 -3906 -4246 -442 3399 4287 682 -3019 -900 4232 3019 -2618
3982 -2618 -4261 -140 2870 3196 1579 -162 -819 -666 -650 64 273 -310 45 2302 2929 113 -1269
3999 -1269 -97 -233 -1723 -315 2573 2841 755 -1391 -619 623 391 -1929 -1650 1178 2264 1456
4015 1456 1163 1191 -1741 -2655 307 2225 1313 -289 -14 2000 2178 257 -2300 -2235 -389 974 2352
4032 2352 3098 661 -2235 -48 2759 1114 -3418 -3236 1581 5220 3845 -1273 -3349 -899 2023
4047 2023 1396 -362 -1620 -986 2560 5474 2523 -3690 -4392 310 4230 2297 -1030 -1770 1377 4100
4063 4100 1859 -1543 -2840 -1925 456 3991 4665 480 -2836 -338 3086 2207 -1495 -3242 -956 3252
4079 3252 4699 2101 -1407 -2925 -1695 1130 3639 842 -2702 -854 4439 4604 -92 -3335 -2931
4094 -2931 710 2644 1882 298 527 294 35 750 679 -1732 -2605 688 3113 2318 787 -41 -1238
4111 -1238 -1948 -911 937 1441 168 -1834 -100 3519 2472 -2500 -4644 -1670 1480 2625 2020 67
4127 67 -2051 -1958 1110 1891 -886 -4188 -2941 2079 5307 2009 -3467 -4434 -2110 975 2339 1537 -2360
4144 -2360 -4141 663 5263 2816 -3880 -7622 -3604 4241 5986 -58 -5033 -3457 1277 3449 1258
4159 1258 -3732 -6573 -1825 5332 5991 -816 -6260 -4957 983 3809 114 -4215 -3221 536 2802
4174 2802 2527 -602 -4800 -5413 -218 4257 2900 -1882 -3715 -1098 2131 2086 -1657 -4146 -3090 349
4190 349 2506 2797 -403 -4400 -3715 674 1827 -927 -2599 -1367 932 2337 1318 -1479 -2646 -2579
4206 -2579 -1731 1177 2939 945 -2771 -2387 837 1150 -305 -2014 -3144 -1175 2856 3785 1014 -3468
4222 -3468 -4760 -1216 3084 2721 -2849 -4310 396 4157 2653 -1753 -4606 -4306 -115 3751 2432
4237 2432 -1425 -3549 -1645 2219 2763 -1482 -5744 -3408 2267 4316 1404 -1591 -3981 -2493 1075
4252 1075 2408 -641 -4196 -2623 1945 4742 1548 -4884 -5708 -853 3105 1642 -1434 -2577 -1391
4267 -1391 1755 2763 -246 -4692 -3781 216 3411 2295 -1301 -3125 -939 1360 430 -1860 -2214 -1158
4283 -1158 384 1655 2031 -822 -2918 -2208 87 1138 278 -777 -1094 787 1880 138 -1018 -1851
4299 -1851 -2308 -432 2035 1834 -479 -1602 -309 260 -135 -948 -1589 -647 1033 1599 782 124 -1092
4316 -1092 -2441 -825 1668 1317 -352 -1254 267 1428 1694 -314 -3172 -2725 674 3191 2753 -361
4332 -361 -3031 -1715 1981 2638 -1566 -4096 -1559 2485 3828 1542 -2391 -3858 -693 2694 2094 -435
4348 -435 -2717 -1549 2156 4025 576 -3886 -3796 -264 2944 3045 82 -2606 -1842 1887 2811 178
4364 178 -3061 -3500 135 4182 3839 -1411 -4437 -1716 1457 2233 7 -2694 -2769 1250 3840 1914
4380 1914 -2071 -3996 -1775 1667 2747 573 -2286 -1385 972 1077 202 -986 -2450 -1586 931 2337
4396 2337 1273 -595 -1706 -1640 446 1574 2 -1673 -1404 601 1573 1893 -636 -3139 -2427 838
4412 838 2364 1301 -739 -1566 -510 1341 1615 -1050 -2333 -1786 366 2496 2568 -696 -2975 -1687
4428 -1687 992 1992 699 -1829 -2149 628 3956 2817 -1866 -4087 -2217 1532 3337 1698 -3020
4443 -3020 -2891 1252 3766 1670 -2319 -3674 -1380 3332 4551 481 -3242 -2115 1007 2568 1607
4458 1607 -1652 -3132 -299 3497 3209 33 -2767 -2864 2 3269 2405 -1131 -2225 20 2061 2249
4474 2249 267 -2961 -2464 815 3459 1880 -674 -2462 -1047 1298 2196 -109 -2402 -1111 1317
4489 1317 2056 1831 -431 -2323 -1595 795 1277 762 80 -989 -503 1010 1480 -393 -1617 -1591 -564
4506 -564 1336 2357 317 -1837 -1969 434 1556 953 -1629 -2823 -520 2716 2499 -710 -2787 -2010
4522 -2010 -327 2123 1428 -1028 -2481 -395 1886 2027 -49 -3003 -2518 527 2916 1766 -1180 -2475
4538 -2475 -1293 752 2425 629 -3071 -2712 1188 3363 1803 -1661 -3796 -1682 1981 2684 -552
4553 -552 -2152 -1407 891 2259 1494 -1993 -3414 -603 2260 2250 -339 -1488 -1214 629 1505 206 -1392
4570 -1392 -1335 -104 953 1786 880 -1764 -2154 602 1109 486 -92 -972 -327 842 1625 328 -1440 -1092
4588 -1092 -350 1192 1720 105 -1421 -337 995 604 5 -115 -434 -414 840 1100 568 -435 -1358 -986
4606 -986 1069 1517 -14 -1195 -377 728 708 1086 -671 -2145 -909 1621 2194 469 -1362 -1364 540
4623 540 1883 751 -1721 -1586 639 1622 1212 277 -1660 -1870 549 1522 541 -1032 -1117 84 1656
4640 1656 1675 -1007 -2231 -643 908 1160 511 -651 -1769 -395 1615 1229 -1171 -1999 -1062 1214 1835
4657 1835 384 -1885 -1892 717 1639 156 -1014 -1413 -775 1369 1810 -482 -2344 -1228 509 1497 768
4674 768 -1107 -1347 26 861 415 -144 -970 -1514 -27 1999 1326 -1052 -1725 -731 550 850 511 -1329
4692 -1329 -1514 188 1434 1078 -307 -1651 -1802 286 2292 812 -1245 -1117 -105 794 1138 87
4708 87 -1908 -1443 341 1535 1508 -233 -2045 -1417 1262 2325 34 -1826 -1567 -33 1810 2128 -415
4725 -415 -2728 -2131 1097 2684 1476 -1868 -3094 -274 2915 1915 -1327 -2749 -1394 1470 2724
4740 2724 1456 -1910 -3240 -539 2184 2039 -619 -2851 -2119 1588 3037 486 -2169 -2652 -1086 1383
4756 1383 2631 163 -2818 -2608 932 2915 1594 -1968 -3617 -1619 2025 2698 -213 -2302 -2122 -196
4772 -196 2142 2113 -982 -3279 -1533 1235 2144 611 -1963 -3048 -515 1820 1627 -549 -2053 -2261
4788 -2261 73 2450 1643 -1714 -3321 -1136 1458 2225 666 -2477 -2906 -307 2246 1665 -1198 -2826
4804 -2826 -2020 1034 2964 822 -2890 -2771 -290 1660 1687 -638 -2623 -2312 860 2376 1285 -1184
4820 -1184 -3061 -1558 1559 2720 -540 -2984 -2162 172 1974 1833 -1068 -2686 -1383 1534 2260 257
4836 257 -2051 -2426 -195 2566 1385 -1431 -2190 -1055 826 1646 732 -1603 -2493 -31 1744 1176 -541
4853 -541 -1858 -1232 888 1792 595 -1640 -1336 -393 916 1339 25 -1977 -1444 747 1551 425 -838
4870 -838 -1272 -562 861 1045 -461 -920 -414 181 1078 627 -718 -1667 -125 680 468 -310 -805 -683 182
4889 182 508 162 -625 -625 -242 160 763 688 -1131 -971 242 366 -479 -634 -579 -168 449 432 -612 -1024 -536
4910 -536 -13 695 281 -1271 -1128 487 911 -99 -1368 -684 -369 634 1024 -422 -1026 -800 380 835
4928 835 -91 -794 -1640 -304 1504 1183 -538 -1504 -826 98 969 830 -1098 -1578 78 1669 1219 180
4946 180 -1710 -1405 672 2028 669 -1709 -1437 -138 908 1776 -131 -2214 -1694 858 2097 1209
4962 1209 -970 -2415 -883 1339 2197 135 -1972 -1596 45 1776 2318 -651 -2716 -1588 1564 2475
4978 2475 1010 -1593 -2380 -127 2595 2229 -468 -2577 -1728 544 3018 1949 -1034 -3070 -406 2414
4994 2414 2370 95 -2271 -2418 571 3095 2083 -830 -2652 -1770 1223 3264 1053 -2277 -2734 169
5010 169 2587 2478 -85 -2754 -2250 1277 3037 1821 -1247 -2828 -1148 2450 3433 -114 -3381 -2298
5026 -2298 534 2410 1912 -940 -3243 -1502 1630 3024 701 -2277 -3146 -562 2726 2448 -687 -3097
5042 -3097 -1731 1052 2698 1597 -1326 -3649 -1329 2004 2611 -98 -2870 -2746 561 2685 1795 -1495
5058 -1495 -2868 -1342 1191 2769 1357 -2042 -2963 -73 2247 2093 -553 -2428 -1829 926 2810 1294
5074 1294 -1255 -2487 -1078 1407 2774 623 -2559 -2169 363 2186 1476 -846 -2469 -1200 1386
5089 1386 2331 729 -1327 -1908 -756 1591 2246 -245 -2207 -1255 620 1789 1245 -524 -1837 -924
5105 -924 1259 1866 505 -1105 -1667 -357 1904 1393 -491 -1661 -656 935 1272 996 -673 -1328 -177
5122 -177 1232 1016 114 -1261 -1299 401 1363 598 -710 -885 -369 447 820 311 -505 -1047 98 638 393
5141 393 -376 -549 -551 179 639 130 -438 -175 -341 -286 216 269 -415 -470 -111 55 -69 251 61 -199 -201 -128 120
5164 120 235 196 -755 -868 28 590 24 -4 -244 -512 111 519 482 -247 -756 -573 423 956 457 -824 -1330
5185 -1330 -221 250 763 785 -761 -804 -159 1217 925 -286 -1179 -919 488 1383 818 -891 -1087 -499
5203 -499 709 1409 340 -1502 -1488 384 1408 1164 -52 -1812 -1239 835 2303 877 -1202 -1526 -504
5220 -504 1409 2243 -34 -2321 -1332 992 2339 1607 -899 -2243 -1062 1784 2406 651 -1552 -2077
5236 -2077 16 2847 2468 -892 -2667 -1491 1309 2818 1643 -1372 -2997 -664 2433 2497 -193 -2561
5252 -2561 -2459 947 3501 2197 -1568 -3052 -1374 1754 2987 950 -2336 -2840 554 3054 2281 -872
5268 -872 -2759 -2224 1273 3622 1676 -1879 -2796 -644 2342 2604 137 -3369 -2563 895 3306 1933
5284 1933 -1019 -3325 -2206 1559 3410 781 -2407 -3032 -213 2916 2819 -711 -3414 -2536 1325 3299
5300 3299 1804 -1367 -3290 -1674 2271 3015 -219 -2743 -3033 575 3282 2531 -1259 -3548 -1975 1214
5316 1214 2830 1086 -1930 -3342 -109 2866 2499 -463 -3381 -2210 1075 3305 1908 -1710 -2755
5331 -2755 -987 1769 2324 375 -2739 -2668 838 3283 1808 -1228 -2611 -1568 1143 2398 621 -1871
5347 -1871 -1806 179 2352 2080 -303 -3041 -1937 1350 2774 1010 -907 -1740 -881 1240 1678 70
5363 70 -1775 -1439 580 2040 1843 -744 -1932 -1034 773 1425 776 -576 -753 -280 1059 1267 -299
5380 -299 -1506 -1402 194 1557 988 -142 -1132 -236 158 49 403 -172 -1110 26 1205 1199 -190 -1346
5398 -1346 -896 -83 565 104 -213 -42 320 -424 187 155 -651 -1118 -99 1032 316 -109 86 18 -763 -724
5418 -724 -677 437 833 -167 -230 323 225 -295 -496 -415 -1013 -987 858 1383 305 -1444 -1367 -70 882 427
5438 427 -1260 -1132 383 1137 1025 398 -1638 -2117 -784 1699 1761 -373 -1601 -585 1300 1714 125
5455 125 -2360 -1643 -55 1802 2129 503 -2032 -2488 8 2255 1068 -2064 -2186 -136 1944 2169
5471 2169 38 -2229 -2081 -273 1920 2540 293 -2650 -1296 1614 2867 24 -2756 -2482 170 2432
5487 2432 2652 518 -2068 -2335 -400 2341 1887 -1110 -2565 -870 2893 3224 -211 -2700 -2433 -611
5503 -611 2617 2969 335 -2371 -2251 1143 3201 1178 -3052 -3629 -102 3491 2902 171 -2257 -2793
5519 -2793 -444 2477 2513 -1136 -3631 -1142 2919 3728 313 -3661 -3560 545 2573 2428 185 -2120
5535 -2120 -2206 1145 3685 1348 -3340 -4073 154 3693 3528 -529 -3176 -2270 450 1685 1296 -712
5551 -712 -2693 -1501 2500 3636 60 -3607 -2924 132 2578 2088 -232 -1577 -1208 -29 1549 1277
5567 1277 -1534 -3455 -915 2963 2978 -179 -2425 -1932 -508 1342 1415 -145 -1546 -1367 750 2634
5583 2634 1211 -2566 -3415 -670 2608 2218 -5 -937 -1372 -592 1267 1236 -751 -2660 -1246 1463 3747
5600 3747 1073 -2526 -2903 -147 1323 837 152 -952 -969 708 2043 1141 -1601 -2984 -890 1775
5616 1775 2334 121 -924 -359 564 -10 -338 -176 -763 -462 924 2235 948 -1231 -1835 -439 662
5633 662 554 -200 600 981 137 -197 -29 52 -1389 -1713 420 1845 1189 528 72 -399 -1299 -751 501
5652 501 888 -276 -862 461 1994 891 -1644 -2483 -649 599 952 1216 486 -397 -1154 294 918
5669 918 -570 -2082 -1725 1695 2881 1238 -1185 -1367 -500 -651 473 566 -258 -661 303 2056 1259 -1218
5687 -1218 -2879 -1648 946 1293 617 108 245 -856 -889 106 -163 -1566 -1876 261 2075 1470 -248
5704 -248 -1265 -1343 -928 -145 645 1039 -95 -1203 281 2024 484 -1856 -2874 -758 1688 1957 1429
5721 1429 -204 -1690 -1416 104 1683 -102 -2373 -1626 2031 3997 1094 -2294 -2504 -1073 876 2024
5737 2024 869 -1119 -1406 415 2355 1901 -1797 -4119 -1080 2698 3379 1297 -1059 -1719 -622 905
5753 905 1484 -217 -2174 -1267 1580 3859 1575 -1977 -3247 -912 1666 1346 502 -424 -368 96 1325
5770 1325 1218 -708 -2820 -1817 1397 3348 1770 -908 -1657 -698 94 488 930 -330 -1586 10
5786 10 2743 2561 -574 -3481 -2393 524 2335 1825 -270 -1192 -1049 641 1698 403 -2607 -3455 363
5803 363 3743 3117 -507 -2969 -2176 207 1679 654 -1359 -1835 -485 2745 3640 -83 -4141 -3489
5819 -3489 1018 3234 1710 -1075 -1991 -645 1360 2020 -287 -2801 -2832 425 3575 2837 -727 -3794
5835 -3794 -1950 761 1240 -175 -1164 -977 265 2287 1826 -376 -2956 -2743 -163 2665 2479 -328
5851 -328 -1463 -167 768 592 -239 -1269 -1851 -267 2369 2857 736 -2253 -2730 -775 1359 1246 -304
5868 -304 -711 -10 1105 1563 909 -1516 -3171 -953 2181 2997 390 -1348 -1103 99 1659 8 -1471
5885 -1471 -1907 -357 1867 3041 1652 -2007 -3223 -555 1941 1408 -602 -934 476 1976 1821 -234
5901 -234 -2111 -2160 -836 1575 2949 1049 -1467 -722 965 699 -795 -1227 -760 468 1736 1408 587
5918 587 -623 -1258 -1138 -184 614 497 -129 1205 664 -16 -600 -594 -635 -1242 -214 1062 1836 1103 -514
5937 -514 -1363 -794 -352 -284 236 337 2 392 1607 775 -1192 -2267 -1475 419 1468 1240 39 -407
5955 -407 -117 15 -188 -571 -1132 -957 1148 2308 1464 -420 -1762 -1178 -297 264 711 61 -28 417 1001
5974 1001 858 99 -1998 -2164 -17 1717 1962 834 -390 -1100 -754 -11 466 -574 -1160 -480 1518
5991 1518 2747 1035 -1621 -2749 -1378 973 2101 1064 -1054 -818 694 1914 1220 -1698 -3249
6006 -3249 -1368 2051 4058 1924 -1818 -2814 -530 1745 1364 -956 -2427 -1067 2719 4322 1253
6021 1253 -2930 -4019 -1054 2143 3109 249 -2288 -966 1724 2731 808 -2757 -3844 -914 3307
6036 3307 4180 704 -2423 -2325 -141 2049 1230 -1472 -2572 -86 2898 3294 780 -2676 -3672 -1151
6052 -1151 2160 1945 538 -1350 -1320 1068 2341 887 -2586 -3228 -1313 1902 3377 1763 -1355 -2603
6068 -2603 -905 1303 986 -615 -2078 -1321 1753 3373 1493 -2268 -3792 -1740 1224 2846 1599
6083 1599 -1276 -1896 259 2153 994 -1916 -3933 -1657 2282 3958 1566 -2036 -2824 -1196 1470
6098 1470 1784 -895 -2676 -1110 2242 3867 1313 -2661 -3971 -1373 2217 2348 162 -1412 -905 718
6114 718 1863 399 -2196 -3250 -596 2591 2970 1073 -1446 -1790 -149 767 214 -1019 -926 243 1632
6131 1632 1860 254 -1636 -2069 -562 688 1070 577 405 331 153 -14 -583 -644 -1009 -553 569 2070
6149 2070 1499 15 -622 -845 -665 -292 491 604 29 386 754 1243 68 -1612 -1903 -420 1638 1425
6167 1425 769 68 -439 -411 40 -471 -1054 -697 -135 1356 2034 466 -1677 -1502 -410 -138 -78 522 664
6186 664 296 164 343 -43 -1124 -1435 -720 580 1089 653 792 407 -814 -1428 -962 782 666 -124 -77
6205 -77 918 1106 101 -1049 -1938 -1474 -91 1700 2274 336 -1551 -1416 1075 1124 -1512 -2437 -654 1724
6223 1724 2441 1282 -813 -2677 -2105 147 1678 726 -1336 -1505 1098 2736 1217 -2395 -3240 -933
6239 -933 1156 2221 1467 -682 -1819 -365 1252 1263 -1502 -2961 -928 2595 3323 990 -1618 -2273
6255 -2273 -822 150 1113 374 -944 -1001 1079 2608 949 -1934 -3017 -1103 1523 2310 1113 157 -751
6272 -751 -879 -2 1047 -208 -1659 -1220 1150 3091 1575 -1133 -2520 -1363 413 1255 1224 -64 -972
6289 -972 -95 1948 2221 -1036 -3511 -2423 850 2888 2027 -456 -1623 -1236 353 1212 206 -1596
6305 -1596 -2358 814 3742 2563 -1464 -3927 -1810 958 1661 912 -685 -1106 161 1917 1957 -949
6321 -949 -3468 -2646 1359 3683 1624 -1368 -1634 -52 488 295 -527 -1496 -1328 460 2348 2466 -526
6338 -526 -3036 -1862 687 1018 137 -571 -118 354 477 676 -201 -2041 -2411 -122 2495 2104 -114 -1292
6356 -1292 -887 -57 -297 -259 -277 -841 -414 919 2155 812 -1978 -2613 -682 1130 1223 296 -591 -280 411
6375 411 522 614 -936 -2405 -1582 2029 3165 1230 -2089 -1876 318 619 37 -665 -619 -246 1081 1532
6393 1532 1084 -1244 -3092 -1109 1509 2032 -148 -923 37 528 3 -405 -787 -1423 -931 599 2239
6410 2239 1174 -1246 -1910 -297 563 -332 -903 415 702 262 330 947 -344 -1649 -1579 134 1415 640
6428 640 100 -261 250 -460 -602 -195 -157 -1141 -662 1221 1948 285 -1809 -1607 100 791 7 -437 -51
6447 -51 211 143 529 356 -909 -2205 -732 1465 1874 47 -984 -688 211 -307 -397 -275 -434 -612 842
6466 842 1686 778 -1514 -2269 -307 977 158 -252 79 222 267 -64 -175 -353 -1180 -1121 722 1562 1085
6485 1085 -440 -712 -458 -422 -389 384 431 -292 -512 769 1375 -199 -1754 -1879 -60 1440 1204 230 35
6504 35 -434 -294 123 625 -524 -1653 -313 1916 2160 72 -1460 -1474 -197 1010 431 420 -192 -438
6522 -438 775 1957 1069 -1681 -2696 -325 1914 1945 308 -711 -511 457 686 277 -164 -1405 -696
6539 -696 1686 2717 1073 -1846 -1809 -182 1048 740 279 82 157 491 1341 1137 -690 -2433 -1373 1461
6557 1461 2762 1052 -830 -922 181 439 495 65 -1164 -1217 739 2605 2023 -1010 -2960 -1113 1379
6574 1379 1555 480 -510 -744 163 1518 1470 -82 -2510 -1915 1143 3242 1663 -954 -1903 -519 1385
6591 1385 1290 -520 -1450 -1015 598 3007 2172 -1264 -3255 -1433 1537 2173 265 -1393 -1028 785 1946
6608 1946 801 -933 -2367 -1769 1027 2658 1613 -1274 -2170 -306 1186 911 -1009 -1858 -585 834
6624 834 2106 1459 -566 -2254 -1726 643 2267 792 -1265 -811 638 1386 712 -598 -1789 -989 480
6641 480 1514 1754 -42 -2045 -1196 671 1260 -297 -1335 -679 780 1817 1392 31 -1713 -1705 -72
6658 -72 1584 1238 -777 -1518 176 1349 916 -996 -1638 -912 514 1456 1421 172 -1548 -1370 730 1197
6676 1197 -150 -1220 -777 966 1449 718 -613 -929 -1083 -236 1105 893 -373 -586 340 690 392 -701
6694 -701 -955 -461 558 801 616 195 -240 -723 -203 160 99 -522 152 853 422 -113 -370 -211 -534 -511
6714 -511 -254 407 568 439 -356 -650 -172 -118 36 -112 -7 -180 363 874 479 -190 -1179 -882 230 530
6734 530 391 -79 -47 125 277 457 -317 -1120 -590 594 1102 732 -300 -1028 -800 454 495 -5 -243 -507
6754 -507 90 1112 1023 -385 -1589 -1454 520 1270 892 -71 -467 -143 612 642 -104 -932 -1131 84 1730
6773 1730 1674 -44 -1565 -1331 329 1162 690 -375 -1393 -9 1406 1276 -95 -1656 -1714 15 2037
6790 2037 1531 -512 -1515 -509 823 1491 409 -1430 -1697 208 2379 2088 -296 -1852 -1436 296
6806 296 1986 1198 -1195 -1729 -457 1490 1715 50 -2286 -1989 287 2085 1781 -415 -1972 -690
6822 -690 1031 1713 82 -1549 -1810 95 1730 1836 -370 -2016 -1731 506 1825 753 -607 -1423
6838 -1423 -217 1214 1749 -211 -2097 -1850 121 1804 1716 -604 -1591 -861 917 1505 433 -1255 -1925
6855 -1925 -241 1760 1389 -186 -1608 -1345 13 1310 940 -846 -1229 -458 1021 1534 356 -1802
6871 -1802 -1767 -314 1574 1640 1 -1386 -1018 213 1327 607 -1069 -1306 -327 1352 1619 -78 -1391
6888 -1391 -1494 215 952 829 -360 -878 -296 564 1077 459 -1135 -1162 -283 1102 1193 181 -1167 -883
6906 -883 102 533 565 -398 -1103 -601 906 1207 224 -998 -1123 -339 951 568 -211 -532 -215 142 473
6925 473 449 -294 -877 -664 285 1233 365 -215 -486 -376 -25 386 50 -171 -122 -71 1015 1114 -10 -976 -668
6946 -668 125 345 558 -70 -566 -98 332 535 168 -109 -627 -395 627 989 -14 -985 -650 -606 114 259
6966 259 -43 -527 -581 117 692 300 -272 -1162 -741 514 892 -37 -325 -654 -226 57 203 180 -793 -918
6986 -918 -19 1028 486 -338 -1247 -369 206 620 146 105 -880 -464 436 1015 -215 -1263 -1272 429 894 523
7006 523 -494 -1088 -396 14 479 105 -327 -1072 -501 995 1157 -108 -997 -808 291 433 453 -30 -941
7025 -941 -635 31 842 375 -828 -1660 -410 1359 1340 -144 -857 -764 -155 545 1028 -153 -820 -1065 142
7044 142 1150 754 -1045 -1475 205 855 895 37 -408 -815 -459 1074 975 -96 -1378 -765 692 1809
7062 1809 620 -1443 -1451 -20 835 981 376 -924 -943 -184 1356 1025 -520 -1690 -505 1269 1713 191
7080 191 -782 -595 -34 376 1129 221 -792 -1607 211 2023 771 -808 -1502 -243 1009 1113 214 -756
7098 -756 -756 -284 1156 1636 236 -1760 -922 1016 1446 628 -957 -900 -241 878 1050 436 -751 -1561 -621
7117 -621 1442 1692 -284 -1667 -806 1068 1474 580 -765 -1049 -343 1088 1602 436 -1228 -1485 -15
7134 -15 1964 1423 -887 -1643 -265 956 1084 486 -406 -1038 -551 1149 1687 453 -1400 -1289 460 1746
7152 1746 921 -1208 -1112 -532 727 1124 777 -465 -1518 -422 1462 1569 -241 -1797 -993 857 1261
7169 1261 386 -652 -1025 -150 294 956 565 -1191 -1201 594 1703 783 -354 -1378 -295 657 790 292
7187 292 -350 -644 -679 457 1325 464 -1333 -1130 489 1217 546 -580 -484 -263 493 631 737 -349 -701
7206 -701 -529 612 1186 -473 -918 -436 411 412 343 -132 66 -626 -116 602 609 -473 -1355 -372 1060 661
7226 661 -593 -793 -61 2 262 424 371 -316 -626 179 979 338 -784 -683 272 718 -45 11 121 -75
7246 -75 -701 -16 775 337 -646 -508 99 962 341 -443 -227 -193 -416 -187 317 411 -49 -777 251 483 -28
7267 -28 -418 -394 89 196 308 837 275 -380 -1142 77 1382 634 -1162 -853 209 708 416 -508 -943
7286 -943 -814 392 1160 692 58 -1235 -638 780 1202 -332 -1293 -752 609 827 752 -152 -894 -1508 -13
7305 -13 1489 1124 -537 -1435 -191 1608 1416 -496 -1401 -958 327 1066 1558 -67 -1717 -1112 899
7322 899 1706 74 -1637 -1430 558 1757 710 -600 -1298 -1015 -74 1562 1015 -349 -1707 -493 1619
7339 1619 1667 166 -1790 -1366 379 1531 1619 8 -1097 -1276 327 1820 793 -1536 -1996 200 2210
7356 2210 1334 -245 -1564 -1307 318 924 947 -410 -1263 -1057 943 1934 17 -1939 -1760 219 1765
7373 1765 1490 -302 -1399 -1129 182 1727 639 -1027 -1915 -429 1985 1921 -472 -2416 -1373 287
7389 287 905 886 -437 -1216 -468 913 1467 58 -1640 -1853 -38 1521 1279 -308 -1285 -572 503 734
7407 734 637 -772 -1582 -251 1262 1768 127 -1783 -1442 365 1298 566 -514 -557 -265 571 600 219 -1041
7426 -1041 -1123 -329 1212 1107 -99 -765 -452 195 179 37 -328 -526 -325 299 1330 603 -973 -1608 48
7445 48 817 325 77 -538 49 264 504 73 -414 -597 -391 499 1065 235 -682 -150 -172 -140 -498 -341 129
7466 129 21 -6 451 297 11 -804 -552 204 461 -200 21 -31 -255 -356 127 -212 4 -480 -43 402 502
7487 502 215 -374 -480 -476 -477 -3 499 476 -610 -620 281 536 -123 -1090 -858 -131 735 641 -57 -675 -740 -279
7509 -279 576 451 -301 -1005 41 885 543 -186 -630 -1011 -522 550 564 423 -361 -545 -289 813 488
7528 488 -1081 -1566 -272 950 1114 514 -756 -1083 -274 679 620 -453 -735 -295 814 1316 501 -1029
7546 -1029 -1411 -727 961 887 410 -652 -803 128 913 477 -599 -1823 -724 804 1766 678 -834
7563 -834 -1520 -715 997 1217 -146 -1392 -953 604 1840 811 -1258 -2124 -902 1137 1316 352 -1067
7580 -1067 -999 305 745 1105 -781 -1656 -841 952 1914 1039 -790 -1531 -744 967 776 -95 -1276 -512
7598 -512 488 1672 978 -1071 -2145 -769 694 1754 467 -996 -1260 90 1049 380 -792 -1470
7614 -1470 -468 615 1870 605 -667 -1208 -868 116 695 572 -622 -679 303 1296 963 -372 -1644
7631 -1644 -1216 232 1577 1014 -403 -1132 -294 451 541 -153 -1103 -985 349 1446 1134 -284 -1172 -1126
7649 -1126 79 1105 161 -711 -836 38 955 1015 -247 -1538 -1217 82 1260 750 -121 -1158 -428 715
$$ [...]
8191g82
##END NTUPLES=NMR FID
##END=
