##TITLE=1H_TG-2272
 CDCl3, 8 sc, 
 18.12.2019
##JCAMPDX= 6.0         $$ Bruker NMR JCAMP-DX V2.0
##DATA TYPE= NMR FID
##DATA CLASS= NTUPLES
##ORIGIN= UXNMR, Bruker Analytische Messtechnik GmbH
##OWNER= root
$$ XWIN-NMR		Version 3.5
$$ Wed Dec 18 14:39:42 2019 Russian Standard Time (UT+4h)  she@DPX200
##.OBSERVE FREQUENCY= 200.1315
##.OBSERVE NUCLEUS= ^1H
##.DELAY= (6, 6)
##.ACQUISITION MODE= SIMULTANEOUS
##.ACQUISITION SCHEME= undefined
##.AVERAGES= 8
##.DIGITISER RES= 18
##SPECTROMETER/DATA SYSTEM= spect
##.PULSE SEQUENCE= zg30
##.SOLVENT NAME= CDCl3
##.SHIFT REFERENCE= (INTERNAL, CDCl3, 0, 15.7039)
##AUDIT TRAIL= $$ (NUMBER, WHEN, WHO, WHERE, WHAT)
$$ ##TITLE= Audit trail, XWIN-NMR		Version 3.5
$$ ##JCAMPDX= 5.01
$$ ##ORIGIN= Bruker BioSpin GmbH
$$ ##OWNER= she
$$ F:/spectra/data/she/nmr/H-F/1/audita.txt
$$ ##AUDIT TRAIL=  $$ (NUMBER, WHEN, WHO, WHERE, WHAT)
(   1,<2019-12-18 14:38:16.76 +0400>,<she>,<DPX200>,
      <created by zg, POWCHK disabled, PULCHK disabled
       configuration hash MD5:
       00 E9 B6 7A A2 85 ED C7 34 08 36 98 17 FE 4E 26
       data hash MD5: 16K
       B6 CB 2C 61 4F 8B 17 CD 96 41 18 C7 BE D9 00 0F>)
$$ ##END=
$$ 
$$ hash MD5
$$ 76 29 81 47 3F CC 90 D0 20 9B 26 29 19 0A 16 49
##$RELAX= 
##$RELAX= 
##$RELAX= 
##$RELAX= 
##$RELAX= 
##$RELAX= 
$$ Bruker specific parameters
$$ --------------------------
##$DU= <F:/spectra>
##$EXPNO= 1
##$NAME= <H-F>
##$PROCNO= 1
##$TYPE= <nmr>
##$USER= <she>
##$AMP= (0..31)
100 100 100 100 100 100 100 100 100 100 100 100 100 100 100 100 100 100 
100 100 100 100 100 100 100 100 100 100 100 100 100 100 
##$AQSEQ= 0
##$AQ_mod= 1
##$AUNM= <au_zg>
##$AUTOPOS= <>
##$BF1= 200.13
##$BF2= 200.13
##$BF3= 200.13
##$BF4= 200.13
##$BF5= 200.13
##$BF6= 200.13
##$BF7= 200.13
##$BF8= 200.13
##$BYTORDA= 1
##$CFDGTYP= 0
##$CFRGTYP= 5
##$CHEMSTR= <none>
##$CNST= (0..31)
1 1 145 1 1 1 1 1 1 1 1 1 1 1 1 1 1 1 1 1 1 1 1 1 1 1 1 1 1 1 1 1 
##$CPDPRG= <>
##$CPDPRG1= <>
##$CPDPRG2= <>
##$CPDPRG3= <>
##$CPDPRG4= <mlev>
##$CPDPRG5= <mlev>
##$CPDPRG6= <mlev>
##$CPDPRG7= <mlev>
##$CPDPRG8= <mlev>
##$CPDPRGB= <>
##$CPDPRGT= <>
##$D= (0..31)
0 1.2 0 0 0 0 0 0 0 0.06 0 0.03 0 0 0 0 0.0002 0 0 0 0 0 0 0 0 0 0 0 0 
0 0 0 
##$DATE= 1576665496
##$DBL= (0..7)
120 120 120 120 120 120 120 120 
##$DBP= (0..7)
150 150 150 150 150 150 150 150 
##$DBP07= 0
##$DBPNAM0= <>
##$DBPNAM1= <>
##$DBPNAM2= <>
##$DBPNAM3= <>
##$DBPNAM4= <>
##$DBPNAM5= <>
##$DBPNAM6= <>
##$DBPNAM7= <>
##$DBPOAL= (0..7)
0.5 0.5 0.5 0.5 0.5 0.5 0.5 0.5 
##$DBPOFFS= (0..7)
0 0 0 0 0 0 0 0 
##$DE= 6
##$DECBNUC= <off>
##$DECIM= 24
##$DECNUC= <off>
##$DECSTAT= 4
##$DIGMOD= 1
##$DIGTYP= 9
##$DL= (0..7)
0 120 120 120 120 120 120 120 
##$DP= (0..7)
150 150 150 150 150 150 150 150 
##$DP07= 0
##$DPNAME0= <>
##$DPNAME1= <>
##$DPNAME2= <>
##$DPNAME3= <>
##$DPNAME4= <>
##$DPNAME5= <>
##$DPNAME6= <>
##$DPNAME7= <>
##$DPOAL= (0..7)
0.5 0.5 0.5 0.5 0.5 0.5 0.5 0.5 
##$DPOFFS= (0..7)
0 0 0 0 0 0 0 0 
##$DQDMODE= 0
##$DR= 18
##$DS= 0
##$DSLIST= <SSSSSSSSSSSSSSS>
$$ [...]
##$SUBNAM2= <"">
##$SUBNAM3= <"">
##$SUBNAM4= <"">
##$SUBNAM5= <"">
##$SUBNAM6= <"">
##$SUBNAM7= <"">
##$SUBNAM8= <"">
##$SUBNAM9= <"">
##$SW= 24.9337058887773
##$SWIBOX= (0..15)
0 0 2 0 0 0 0 0 0 0 0 0 0 0 0 0 
##$SW_h= 4990.01996007984
##$TD= 16384
##$TD0= 1
##$TE= 0
##$TE2= 300
##$TE3= 300
##$TEG= 300
##$TL= (0..7)
0 120 120 120 120 120 120 120 
##$TP= (0..7)
150 150 150 150 150 150 150 150 
##$TP07= 0
##$TPNAME0= <>
##$TPNAME1= <>
##$TPNAME2= <>
##$TPNAME3= <>
##$TPNAME4= <>
##$TPNAME5= <>
##$TPNAME6= <>
##$TPNAME7= <>
##$TPOAL= (0..7)
0.5 0.5 0.5 0.5 0.5 0.5 0.5 0.5 
##$TPOFFS= (0..7)
0 0 0 0 0 0 0 0 
##$TUNHIN= 0
##$TUNHOUT= 0
##$TUNXOUT= 0
##$USERA1= <user>
##$USERA2= <user>
##$USERA3= <user>
##$USERA4= <user>
##$USERA5= <user>
##$V9= 5
##$VALIST= <valist>
##$VCLIST= <CCCCCCCCCCCCCCC>
##$VD= 0
##$VDLIST= <DDDDDDDDDDDDDDD>
##$VPLIST= <PPPPPPPPPPPPPPP>
##$VTLIST= <TTTTTTTTTTTTTTT>
##$WBST= 1024
##$WBSW= 4
##$XGAIN= (0..3)
0 0 0 0 
##$XL= 0
##$YL= 0
##$YMAX_a= 371274
##$YMIN_a= -593332
##$ZGOPTNS= <>
##$ZL1= 120
##$ZL2= 120
##$ZL3= 120
##$ZL4= 120
##$ABSF1= 10
##$ABSF2= 0
##$ABSG= 5
##$ABSL= 3
##$ALPHA= 0
##$AQORDER= 0
##$ASSFAC= 0
##$ASSFACI= 0
##$ASSFACX= 0
##$ASSWID= 0
##$AUNMP= <proc_1d>
##$AZFE= 0.1
##$AZFW= 0.1
##$BCFW= 1
##$BC_mod= 2
##$BYTORDP= 1
##$COROFFS= 0
##$CY= 11.3945322036743
##$DATMOD= 1
##$DC= 2
##$DFILT= <>
##$DTYPP= 0
##$F1P= 16.9975609425685
##$F2P= -3.02152046262296
##$FCOR= 0.5
##$FTSIZE= 0
##$FT_mod= 4
##$GAMMA= 1
##$GB= 0.15
##$INTBC= 1
##$INTSCL= 1
##$ISEN= 128
##$LB= 0.24
##$LEV0= 0
##$LPBIN= 0
##$MAXI= 10000
##$MC2= 0
##$MEAN= 0
##$ME_mod= 0
##$MI= 1.114404
##$NCOEF= 0
##$NC_proc= 0
##$NLEV= 6
##$NOISF1= 3.799351
##$NOISF2= 2.8
##$NSP= 1
##$NTH_PI= 0
##$NZP= 0
##$OFFSET= 15.70392
##$PC= 1
##$PHC0= -9937.007
##$PHC1= 2.200809
##$PH_mod= 1
##$PKNL= yes
##$PPARMOD= 0
##$PSCAL= 0
##$PSIGN= 0
##$REVERSE= no
##$SF= 200.130013532006
##$SI= 16384
##$SIGF1= 3
##$SIGF2= 2
##$SINO= 400
##$SIOLD= 16384
##$SREGLST= <1H.CDCl3>
##$SSB= 0
##$STSI= 0
##$STSR= 0
##$SW_p= 3612.71676300578
##$SYMM= 0
##$S_DEV= 0
##$TDeff= 0
##$TDoff= 0
##$TI= <>
##$TILT= no
##$TM1= 0
##$TM2= 0
##$TOPLEV= 0
##$USERP1= <user>
##$USERP2= <user>
##$USERP3= <user>
##$USERP4= <user>
##$USERP5= <user>
##$WDW= 1
##$XDIM= 8192
##$YMAX_p= 0
##$YMIN_p= 0
$$ End of Bruker specific parameters
$$ ---------------------------------
##NTUPLES= NMR FID
##VAR_NAME=  TIME,          FID/REAL,        FID/IMAG
##SYMBOL=    X,             R,               I
##VAR_TYPE=  INDEPENDENT,   DEPENDENT,       DEPENDENT
##VAR_FORM=  AFFN,          ASDF,            ASDF
##VAR_DIM=   8192,          8192,            8192
##UNITS=     SECONDS,       ARBITRARY UNITS, ARBITRARY UNITS
##FACTOR=    0.0002004,     1,               1
##FIRST=     0,             0,               0
##LAST=      1.6414764,     0,               0
##MIN=       0,             -593332,         0
##MAX=       1.6414764,     371274,          0
$$ Real data points
##PAGE= N=1
##DATA TABLE= (X++(R..R)), XYDATA
$$ [...]
3657D580p397n252K955Q421O814n60q854j0873k204R082J0301K513o448p673Q4
3672d511O652K938n400n882Q54N722M341N0k772k288l92j103j664M01K139J941
3688A026J980K422p23m836o418k288N247R250L501p083q014Q81Q031M749m573
3703C152r834m631O332J1016N312l270q422q401q20P445P341M86n489m458K070
3718b171O945K469p284q798M67Q530O407j423n593j822L811K459m957o699P9O968
3734f12P383K542m676q069l981K258N581M121j129n937l326N452Q434J185q791
3749D35j0683k080R217J1487J855o351o265j759R95K367J541p71j230K92K004
3764A054L113J321m396o805j310M990N153K33k839p02L506K342n290q977j524
$$ y = [4580, -2817, -8069, -5114, 3307, 10121, 9561, 707, -10166, -12370, -3288, 7013, 9526, 3078, -4595, -4511, 2141, 5079, -321, -6203, -5349, 373, 4714, 4764, 1992, -296, -688, -1791, -3455, -3054, -915, 1026, 3006, 5428, 4705, -131, -6549, -8837, -3590, 5660, 9161, 2078, -5936, -5055, 2976, 7725, 3152, -6682, -11313, -4981, 6035, 11347, 8077, -345, -8746, -9566, -2121, 5220, 5706, 217, -4241, -2171, 4774, 7243, -41, -8839, -8372, 158, 6565, 5142, -451, -2273, 1538, 3997, -960, -7659, -7580, -612, 6771, 9313, 4637, -3432, -7413, -5155, 426, 4547, 3418, -2519, -5845, -393, 8041, 9226, 435, -10248, -12328, -3111, 8376, 10231, 3880, -2385, -4144, -3149, -782, 759, -12, -1242, -950, 1054, 4167, 5488, 1092, -5713, -7023, -2033, 3120, 3353, 514, -188, 3318, 5660, 370, -8607, -10131]
3779a0131Q303R425K070o104q006j651M866M826m01m688m749K92Q238Q944n05
3794A0729j1168j1301q06J0213J1089M96q740n324L237N332m41n543m437K187
3808d477O182L567j492k328j191j466j146n9l3K08K407L756K643j083o624p739
3824h875j81Q493P793p40o569m772K708O336J543n997o557j182M918P480N571
3839I969j676q478p990j191O452P828J198o240m396M122O484m58p503o579J361
3854g097P788N263k170m116J44K475k59m003m316l78N468P475K730l594p761o078
3870h429J322Q411N475l778p538j668P117Q728n45j1164j0063J727J0254P750
3884G599N27m657n235j669J068J173P86M41p82m01L165L660j337n453m610K81
$$ y = [-10131, -1828, 7597, 9667, 3563, -4443, -6094, -1228, 3598, 3197, -1491, -6240, -5948, 2290, 11234, 10729, -439, -11740, -12546, -2333, 8756, 9252, 512, -4812, -1575, 3757, 3316, -2227, -6664, -4477, 1705, 5272, 3780, 1452, 261, -1205, -2351, -2410, -2443, -2235, 172, 3928, 6571, 5488, -1136, -8875, -9056, -563, 7230, 6490, -79, -4851, -2143, 4193, 5736, -261, -6818, -8000, -3082, 4398, 9969, 8293, -185, -8175, -9366, -2914, 4914, 6112, -128, -4524, -402, 6082, 5624, -1879, -8458, -7097, 691, 5954, 3784, -332, -188, 2287, 2028, -1975, -6291, -6669, -1201, 6274, 9004, 5410, -2351, -8429, -7107, 1304, 6779, 3001, -4537, -6205, 912, 9640, 9095, -2069, -12132, -10405, -151, 7599, 8126, 3469, -1766, -3435, -2367, -1194, -408, 33, -749, -1150, 2015, 5675, 4338, -1115, -5725, -5444]
3900e444M515L462j212j820K464L701j655o715n637Q69O869P155J054m759m993
3915b146k058J532M288J939m227n585N13Q245Q697n59j1483j1808Q83J1422Q653
3930H306j204o873l750K675M190j081n407k638K631M306L248O12k681l673j125
3945b464O43M79m89j097J300N710N181l020r863o892K835Q972O215k607p011j912
3961d020M496M074j177m659m862j064M636P100M607j552p661q245n80P485O361
3976D939j046m805j749L715M346j593p000m266K985N464K678o34j422q99K86m58
3992E41k574k892m54L499O405N028k754r515o929K875Q645N173m281q432p08R069
4008B696P753l248j0864p462K052R044P387M6m454m086k196K24K581J185j855
$$ y = [-5444, -929, 2533, 1321, -499, 1965, 5666, 4011, -2704, -8341, -7472, -603, 6552, 7606, 2847, -2146, -4204, -2672, 1616, 3555, -672, -6257, -5744, 2501, 11198, 10639, -844, -12652, -11769, -347, 8306, 7102, 229, -3521, -846, 3344, 2263, -3144, -5782, -3151, 1155, 4403, 5015, 2334, -1339, -2464, -1821, -1342, -1831, -2928, -1628, 4082, 9263, 6243, -3620, -10512, -7677, 1295, 7510, 4903, -2108, -4020, 476, 4550, 3373, -1286, -6148, -7212, -2576, 4524, 9131, 7579, -82, -8327, -8907, -1422, 4939, 3893, -912, -2661, 1054, 5400, 3807, -3193, -7459, -4474, 990, 3668, 3034, 1612, 713, 999, 541, -2033, -4925, -5379, -1880, 4525, 9553, 6799, -2716, -9645, -6770, 1875, 7048, 2767, -5665, -6373, 2696, 10449, 7201, -3663, -11125, -9073, -29, 7358, 7404, 2950, -1136, -3332, -3108, -527, 658, -1197]
4023a197j402K335M167J763k674n968k868K936L854m03j681J403L745K108l367
4038B751p122m115L112O149M255R70k377m971l140J844M293J398l808n228N70
4053e419Q747Q247k869j1556q425J682R375P386j131n682k356K135J451p54k650
4068a819k659K88M339M688P88l131m514j664K505K314k698l400K718P572M683
4083A0010m385j0558o462M902R812L766m295n026o00L578L461r41m921m526m74
4098f659M255P273M911l242q937n614J808N853L828j517l238N67L933J022l487
4113G56m248j286J663K980K165O80n8n79j680j531l80j935j990K976P240M644
4129I417l411r038o511L338R269L544n540o681J298P435N798k674r741o459K100
$$ y = [-1197, -2599, -264, 3903, 5666, 2992, -2976, -5844, -2908, 946, 543, -1138, 265, 4010, 6118, 2751, -4371, -8486, -5374, 775, 5030, 6000, 3623, -1348, -4488, -2644, 1649, 3047, -761, -5989, -5419, 3328, 11575, 8706, -2850, -11275, -9593, -218, 7168, 6037, 355, -2001, 134, 1585, 831, -1819, -4478, -4190, 149, 4837, 5625, 2494, -2020, -3684, -1179, 1135, -1563, -4963, -2245, 5327, 10010, 5625, -4933, -11395, -6493, 3319, 7085, 2790, -2236, -2836, 742, 4203, 3262, -1659, -6185, -6659, -2404, 4869, 9780, 6538, -2399, -8013, -6205, -352, 3476, 1959, -1279, -712, 3221, 4243, 756, -3492, -4778, -3115, -135, 2030, 2710, 2652, 2073, 393, -1138, -1518, -3453, -5443, -2467, 4773, 9417, 6006, -3032, -9543, -6205, 3064, 6608, 1068, -5613, -4315, 3120, 8918, 6244, -3497, -9956, -7856]
4144g856P462O555J771l985o475k392K945L267n91l160j351L796N986O47o144
4159D75n541P05L843J944j905k032K464N596J351n500o661k093K565N294M765
4174E270P61l301m521k362K039M536N34n347m138L305Q020N056l599r446o383
4189i576K585P079M363j85k206k521p66J489P21j736k603r33L157N784K098m609
4205B141n619j79L666J351l221l108K471Q098M728n686j0436m255M722P907L756
4220F336k977n270j062L106L475P8l832o148k135O402Q898K918n545q009l690
4235g455L637N399N40k980l38K834K367j124l619l038L94J945R73J149J990M16
4251C090j882j050q8j602k501r04L300O779L867m391q815l842M203O421J869m011
$$ y = [-7856, -394, 6161, 7932, 3947, -2528, -4920, -1975, 1292, 701, -2459, -3810, -14, 5972, 6619, 475, -5066, -4361, -518, 1426, -479, -2511, -47, 5549, 6900, 1400, -5261, -7354, -4789, 505, 5270, 6031, 2730, -1791, -4153, -2114, 2422, 2956, -2391, -6529, -3224, 4796, 9852, 6253, -3193, -9576, -6991, 88, 4451, 4266, 2060, -461, -1227, 262, 983, -753, -3356, -4289, -1132, 4652, 6750, 2141, -3478, -3657, 9, 1360, -1861, -4969, -2498, 5600, 10328, 4642, -5794, -10049, -5327, 2580, 6336, 3359, -1911, -2973, 133, 3608, 3686, -146, -6294, -8429, -2027, 6871, 9789, 4244, -3765, -7455, -3818, 1581, 2121, -859, -1197, 1637, 4004, 2880, -739, -3777, -3383, -1438, -465, 684, 2674, 3090, 1208, 158, 70, -1532, -4033, -4937, -1637, 5142, 9009, 4618, -4197, -8039, -3836, 2585, 4454, 443]
4267D43m597J165O168L607k715o101n251n30N725Q049K506m604o633k609L517
4282a860M453j297m910p04N559N250q50o030m726J137M592J190l278j187L306
4297F45M252Q29l864n988l230K280N686N199R16m570o357n89N290L643k627n796
4313d281k155M852P937K488n790p291k482K123L931L445Q18j308j981j351L70
4328f75J338p01l219j153M237N084O7l824l849J36L105M55l796k210M299O684
4344E978J794m677p765l575L609O457L218j511l798k922J159N152K294n009p366
4359f962j417O679R202K470p193q223j090M891L538q46k269L0L141K290j969l727
4375a455j574J81J094J863J823oq98k88N42k8k339m253q01N990P168R04o137o671
$$ y = [443, -4154, -2989, 3179, 6786, 4071, -2030, -7281, -7811, -2086, 5963, 8469, 3865, -2768, -5377, -1860, 2593, 1296, -3614, -4318, 1241, 6491, 5641, -389, -5115, -3978, 614, 1804, -1474, -2661, 645, 4897, 5726, 1862, -4126, -7356, -5076, 610, 5809, 6725, 2155, -4202, -4791, 499, 4142, 1515, -4281, -6436, -1584, 6353, 8841, 3051, -4240, -6722, -4599, -668, 2777, 3595, 2287, 306, -1045, -675, 663, -38, -3257, -4410, -173, 4911, 4978, 1154, -2695, -2559, 546, 1001, -2795, -5005, -706, 5978, 7772, 3095, -4670, -8245, -4636, 1821, 5039, 3528, -270, -3192, -2033, 3119, 5413, 404, -6962, -8379, -1700, 7502, 9972, 2779, -5444, -6534, -1643, 1895, 1049, -1220, -1190, 1951, 4241, 2272, -1455, -3029, -2848, -1754, 109, 1932, 1926, 1028, 740, 1282, 1254, -1085, -5338, -6139, -149, 7019, 7923, 1786, -4885]
4393d885j611M713N095m27m056j915J969L400K427o16n134n523o03N252P240K796
4409H122m783p012j193M418K887k163l545J34M470M459j374n687k675J787K183
4424B8L74j026p80J780L093J247k594m841l847L32O198P113J21o771n690R73N793
4441A503L606l619p008r43O399O454M69m621n731k468K155L643K596Q72j260k689
4457f42m96J871N87k764k396Q53M116L387q03m555j733K392J744k124l276J10
4473c729M157N076P42m806n506j988K220M352M057l36m903l174J995N148J911
4488E216m582p458j407P540Q102M91o268o017p48L827K858j022j697Q67J865P00
4504B267l33j945k650j089K028K706J414q11k243O2K989O85m578n055R56O580
$$ y = [-4885, -6496, -1783, 3312, 2885, -1171, -3086, -1117, 2283, 4710, 4094, -1040, -6563, -7166, -1914, 5326, 8122, 3339, -3673, -4866, -448, 2439, 276, -3269, -3135, 1335, 5794, 4420, -1267, -3942, -2155, 28, 402, -624, -1404, 376, 3469, 4716, 2122, -2719, -6566, -6234, -36, 7077, 7198, 427, -5263, -4290, 1503, 5109, 1490, -5518, -6461, -62, 6392, 6861, 2240, -3491, -5959, -3804, -161, 2435, 3307, 2047, -642, -1138, 733, 1320, -1444, -3840, -2987, 1129, 4516, 3713, -842, -2575, -183, 1561, -563, -3839, -3729, 428, 5504, 6246, 1440, -4066, -6054, -3834, 518, 4575, 4239, -664, -3838, -1843, 3305, 5216, 634, -6824, -8231, -691, 7411, 7902, 1634, -4383, -5131, -1304, 1554, 532, -1165, -298, 1567, 2267, 1934, -11, -2661, -3750, -1722, 984, 2398, 1587, -656, -594, 2395, 3080, -1498, -6553, -5597, 983]
4520I83O211j76o774n898P52M774K814q28k528k038J091L675K549r99m490n392
4536f274o67O113P028J96n341m323L78L244J657k744k928J923M304J549k123k812
4552h20j429N11J562K94q67R4R32J699J870o16n243n017J094O934O152p74o865
4569d89n655K428O742J783m667n017j97M921N504P30m195m886j920J031L687L648
4585C448Q0l223j754J226J951l01l457k375K349M916J489l426k773O31K182P65
4601A728k643l299R09M797L271l47l047m281k767K016N021L624j440m923l283
4616d664K946O164R85o205o348R90O614N981k41n748m389N06K480J195L80l94
4632B52o07P29J487Qj583k622j318J960L901Q40l183k239K514L428m44n030m719
$$ y = [983, 7194, 7018, 244, -5654, -4902, -128, 2686, 1858, -670, -2708, -1617, 2058, 4607, 3608, -882, -6274, -6941, -828, 6200, 6396, 1055, -3268, -2890, 354, 2011, -733, -3661, -1738, 2566, 4115, 1992, -820, -2249, -1738, -176, 118, -749, -655, 277, 1976, 3846, 3230, -2013, -7030, -5936, 998, 7150, 6376, -489, -6144, -3716, 3026, 4809, 142, -4875, -5072, -151, 5353, 6083, 1888, -2998, -4918, -3887, -200, 3448, 3528, 305, -1449, -223, 1728, 1427, -2030, -4405, -2056, 2860, 4349, 923, -1850, -1219, 963, 1728, -915, -4214, -3305, 1492, 4763, 4416, 1369, -2912, -5679, -3663, 1358, 4982, 3542, -1381, -4664, -1718, 4446, 5431, -774, -7122, -6132, 482, 6463, 6222, 474, -3915, -3409, -929, 266, 646, 252, -355, 374, 1861, 1869, 286, -2336, -3654, -1694, 2207, 3047, -136, -2375, 139, 3567, 3123, -1907, -6626]
4649f626J539P302M865k216n861l601O87L898K824n05l018j997O99L301L594m49
4665D436o232n015J471O263M758j030n043l019K159K877q86k463m34J742K519
4680B103Q23j622k311m97L98N13Q92K9j288l34L070K759j420n413m795J820P385
4697B112N428k907o980k884L166N004J236l988m490J2M274L823J010k354m857
4712b395k961J916M649K420j343l047j442K691K499k106m091l98L596L200l42
4727B846l130k008J873K552p16l036j683J109K786L252P12l258m465k079J915
4742c330N386L482k814n952j616M684M929n36n427m921J377N974L838j115l600
4757C59k740o43J596K394L14r95j065K11J776J421j815l803o21L564L138j119
$$ y = [-6626, -5087, 2215, 7080, 4864, -997, -4598, -3911, -13, 2811, 2306, -712, -2709, -2010, 1291, 4885, 4436, -1796, -6811, -5340, 923, 5681, 4651, -392, -3411, -1252, 1625, 739, -1724, -2158, -416, 2103, 2926, 1304, -1007, -1504, -1106, -593, 299, 328, -960, -1294, 1776, 4535, 3115, -2298, -7093, -5273, 2112, 7540, 4633, -2347, -5231, -2065, 2939, 4175, 187, -4303, -4291, -17, 3806, 4816, 2462, -2395, -5356, -3440, 1209, 3629, 2286, -761, -2203, 488, 2987, 881, -3210, -3608, -12, 3188, 2846, -284, -2292, -419, 2133, 1417, -1619, -3302, -2193, 593, 3845, 4557, 1299, -3166, -5245, -3330, 2056, 5538, 2724, -3228, -4844, -160, 4769, 4233, -1194, -6115, -4738, 1236, 5074, 3959, 359, -2381, -3024, -1428, 966, 1280, 285, -780, -569, 1207, 2628, 813, -2990, -3611, -47, 3091, 1972]
4773A972l417j477L136M146j152o078l258K751N713L371j689m929l411J030L413
4788A21K644Q5l017l630O00N033L842k086n942m039K351O327L008k959l907m40
4804b009J874J202q33j694k19J873J520k10r26p26j231Q5J654R45j399j945J23
4821a916L448L280j509o478l639L568O662K548l171n459j950L344M305K79l129
4836A83k937r84K370M217K139k711m778k550K043N110K164k972l852P69L458R84
4852B653k742l015L69L620K410j787l125j47J905J612k42k074k347K32K852K955
4868C129J179k675n159k655M121O169J297m621n154JN213M247j893n498k563K010
4884b852L686K596l06k838k532k11J319K056J073j442k484R10K949O70k783k835
$$ y = [1972, -1445, -2922, 214, 4360, 3208, -2870, -6128, -3377, 2336, 5707, 4018, -911, -4322, -3292, 121, 2765, 2850, -167, -3797, -3197, 1836, 5678, 3592, -2350, -6389, -4038, 2289, 5297, 2338, -1569, -2009, -135, 1067, 234, -1460, -1679, 194, 1714, 1504, 578, -148, -1379, -1294, 360, 1305, -94, -2039, -1916, 1532, 4812, 3303, -3175, -6814, -3246, 3416, 5964, 2793, -2666, -4616, -1272, 3033, 3312, 183, -2754, -3738, -1368, 2849, 4988, 2277, -2501, -5051, -3008, 2102, 4266, 1294, -2558, -1789, 1669, 2653, -89, -3104, -2735, 885, 3295, 1508, -1617, -1764, 141, 1753, 1511, -563, -2910, -2678, 174, 3129, 4308, 1633, -3526, -6181, -2060, 4109, 5406, 785, -4369, -4368, 845, 5092, 3199, -2299, -4862, -2852, 834, 3430, 3124, 286, -2246, -2457, -1138, 918, 1991, 549, -1935, -1025, 1924, 2594, -189, -3024]
4900c024N83L536K259k395l939M23M131K302j900m150k535J893M808K536j548
4915B980l496k969l37L683M215k43m715l785J196N459M015k756o529k275L683
4930a874M666Q12k571k627k23J760J073j010q39J39M71Q65P14l53j912r30J276
4947e63J968P67k412l367J261N189K468l478n685j711L884N609J154m130m075
4962c121m48K870K986J055k176l583j490K406L908K238k329n209k014L629M491
4977C213j64l427k247J382K911M08k808j850J699K157L66j255j592m61J610J720
4993A662O9j826j926j029J987M314J643l867n624q31M752N572J79n736m496J647
5009c510N271K403j624l961k280J198L216K134m85k092k487m51K539K622p74k728
$$ y = [-3024, -2441, 1095, 3354, 959, -2980, -2557, 1574, 3876, 1976, -2174, -4709, -2816, 1992, 4528, 2980, -516, -3485, -3822, -139, 4076, 3833, -882, -4667, -3471, 1988, 6003, 3247, -3282, -5557, -1874, 2792, 3604, 1033, -1594, -1817, -57, 1016, 6, -833, -694, -223, 642, 1356, 1003, -909, -1839, -563, 1405, 2172, -240, -3607, -2346, 2843, 5311, 1833, -3852, -5563, -1679, 3930, 5084, 954, -3121, -3569, -699, 2287, 3342, 1166, -2417, -3907, -1501, 2407, 4645, 2316, -2893, -4907, -1278, 3213, 3049, -378, -2625, -1243, 1668, 2076, -732, -2582, -883, 1274, 1640, 385, -1207, -1668, -58, 1662, 1731, -95, -2021, -3050, -1063, 3251, 4894, 1027, -4597, -5428, -676, 4896, 5075, -661, -5157, -3510, 1761, 4164, 2540, -1421, -3701, -2503, 713, 2847, 2362, 270, -2217, -2668, -129, 2493, 1719, -1009]
5025a009j269J864K778k40l382k140K644L715l86l554k175J241L636J909k018
5040A614l784j284J632K927K523n39l785l543O80M488L738q03n316m134K525O163
5056C102K107l597m505r35K797L370K86k437j696M64P05Q71M33n30j308JJ237
5073C65J054o45k027j317K442L468p87m368k564K482M919J817l598n255n35M307
5089b42M056j43l066l421j003K652L805J238k185l944k212K596M994J508l933
5104G00m258M8L833L129j160l919r86K520J794q55j619m12J030J256J45j478j257
5121a489N8J057J746J301j486l714j478L240M263P40m076m977K92N665M393k098
5137C437n070k854J514L954K733j133l100j974J39K081K706K63k953k714P33L188
$$ y = [-1009, -2278, -414, 2364, 2124, -1258, -3398, -754, 2961, 2575, -979, -3154, -1913, 1723, 3632, 1614, -2170, -3454, -1822, 1105, 3628, 3089, -696, -4239, -3559, 929, 4667, 3864, -1452, -5586, -3061, 3102, 5209, 1612, -2893, -3828, -1031, 2339, 2625, 188, -1508, -1044, -339, 532, 965, 435, -873, -872, 365, 1419, 774, -1253, -2570, -128, 3340, 2553, -1815, -4379, -1897, 3022, 4839, 1241, -4014, -4549, -242, 3814, 3671, 605, -2816, -3819, -1167, 2638, 3876, 1691, -2253, -4465, -1869, 3125, 4633, 700, -3558, -3510, 323, 3452, 2292, -1627, -2613, -93, 1701, 846, -773, -1185, -155, 1101, 1246, -232, -1489, -1431, -374, 1372, 2673, 1187, -2527, -4005, -765, 3498, 4238, 162, -4815, -4523, 1142, 5535, 3437, -1633, -4487, -2973, 981, 3714, 2581, -519, -2493, -2354, -273, 2433, 2696, -257, -2971, -2238, 950]
5153I50K239j623l515q43L092K309j731l074j3K973K263r57l600j961J846L361
5169A716J288j422k454j982M42L378K711r79m024l333J230N654L789k868o329
5184c183k206L390M769J345l308l341J29K602J382k94j132j252n17J169J698K73
5200A524r32j515l68J730J261j709k697R03L603K185k103m443k016L402M651K12
5216C688l767l021K24K872K998K70l014l206j003K453M148K254k784n300j589
5231d777L577M337L08l641l368J426L844J615k701k380j38J468J380j03r82l06
5247d41P53N67j25p15j479j250J690L454J422k694m184j346L910M558k21n367
5263a468l439K130N189K571k315m769k436J861L393K223o3k333l004j77K745K382
$$ y = [950, 3189, 1566, -1949, -2792, 300, 2609, 878, -2196, -2209, 764, 3027, 2070, -1530, -3491, -1645, 1716, 3004, 1582, -872, -2854, -2412, 966, 3677, 2698, -1326, -4659, -3429, 2225, 6014, 3146, -3183, -5389, -1999, 2770, 4115, 807, -2534, -2405, 197, 1579, 1285, 153, -1099, -1616, -447, 1251, 1524, 592, -923, -1291, 439, 1700, -9, -2706, -1803, 1800, 3985, 1882, -2561, -4577, -1175, 3476, 3688, -79, -3100, -2876, -4, 2994, 3264, 250, -2956, -3959, -1506, 2642, 4896, 2112, -3188, -4777, -1200, 3137, 3445, -196, -3564, -2138, 1706, 3321, 620, -1760, -1898, -430, 950, 847, -135, -441, 312, 879, 754, 39, -1440, -2690, -1000, 2454, 3876, 1182, -3002, -4348, -438, 4120, 3899, -1468, -4907, -2777, 2412, 4983, 2668, -2101, -4537, -2676, 717, 2940, 2877, 544, -2460, -2637, 108, 2490]
5279B490o69k938k076J729L951J052l338k804Q81K441P07j657j864J092L017R84
5295B998k218k801q87J127K416K126l77k735k310K72L185L042j095n192l019L254
5311b214N902K173l537n664j825L469M291L54k338j856j73J180J653J84j613j740
5327a754l72J499K671O74k426k220R12K459j72k612j922J923M554J564l637m933
5343c792l32L580L281R3k692k628K59K677K283J64k578l756j424L661N139J212
5359E147l737m788q30L713L603j066l597q76K148K265K28j839j948j17J126P75
5375B07J64L18l06m28N43O66j255k173q83K330M023J579l886m856j26M443L359
5392C719j369m247k390K622M547J676k500l907k353N74L697L718K8l299l144J31
$$ y = [2490, 1821, -1117, -3193, -1464, 2487, 3539, 201, -2603, -1722, 719, 1426, -231, -2095, -1003, 2014, 2998, 780, -2021, -2908, -1781, 635, 2761, 2384, -351, -2661, -2389, 796, 3838, 2743, -2449, -5468, -2214, 3688, 5861, 2324, -3340, -5165, -1696, 2595, 2949, 611, -1245, -1418, -238, 1415, 1599, -14, -1754, -2126, -627, 2044, 2718, 292, -1928, -1016, 1443, 1271, -1341, -3263, -1340, 3214, 4778, 1141, -3792, -4124, -544, 2737, 2830, 138, -2490, -2231, 446, 2729, 2893, 315, -3441, -4865, -1204, 3935, 5147, 1410, -3378, -4208, -495, 3108, 2042, -1555, -2431, -283, 1982, 2210, 371, -1577, -1694, -568, 207, 371, 689, 383, -45, 498, 1164, -91, -2264, -3147, -817, 3206, 4785, 899, -3957, -4083, 360, 3719, 2350, -1897, -4287, -1665, 2882, 4558, 2058, -1849, -4202, -3628, 69, 3787, 3815, 516, -2628, -2497]
5408b497K895K423j752l686o73L593L056n93l197k056J291K285l08k156m43K149
5424C31K141O5j741k707j612J390K816K243n4k997l117P72M280K085k793m683
5440c581j351M038N406J116m474m632l48K416K491J081q94j624o29R21J034N26
5456A496j461k602l09L081K842n32k751j636J276K135q21l218j063L486M174k4
5472D073l529l696o39K765L069L92j904k110n64K059L207M44l897m321l56M667
5488c40N357M72m852m810P32L892J683j521k092O5K058J664o95j745j153l89J62
5505a512J498J247m33p42K92Q33K07j961k806n27M072M607m27m537l689Q29L914
5522H65K398k102l571n70K500K982J372j432m047l065P33M118L713J64l621l692
$$ y = [-2497, 398, 2821, 1069, -2617, -3290, 303, 3359, 2766, -431, -2487, -1196, 1089, 781, -1375, -1818, 331, 2472, 2537, 796, -1911, -3523, -2133, 683, 2926, 2872, -125, -3242, -2470, 1810, 3895, 1102, -3581, -4932, -894, 4512, 5628, 1154, -3478, -3826, -1410, 1081, 2162, 1268, -356, -985, -64, 970, 1496, 35, -2567, -2876, 205, 3047, 2515, -236, -1872, -596, 1539, 718, -2500, -3563, -77, 4097, 4073, 544, -3152, -3791, -1026, 2043, 2435, 531, -1579, -2143, -84, 3123, 3567, -330, -4651, -5007, -340, 5017, 5489, 637, -4173, -3441, 451, 2134, 613, -1479, -1414, 644, 2308, 1613, -132, -1285, -1674, -1512, -14, 1233, 800, 58, 350, 1183, 1390, -571, -3377, -3904, 168, 4775, 4348, -189, -3878, -3049, 865, 3263, 1161, -2410, -2980, -480, 2502, 3874, 2442, -1605, -4670, -3937, 181, 3894, 4058, 437, -3255]
5538c255J116L513Q95k567k773O34L572K452j312l194r82J411O56m86o63P8J284
5555C79J954M63j704k801k122N89L823L715p43m480k627J779M045J580l712m822
5571d684L4N331M223m54l628l607r84J974K529J033n36r80j215P35J829j79k694
5588a273j921R31L337K134j204l034l90K180O55k470k347R99L300L113k42l521
5604B47k880n45J731K398J662j269k895p64K447L322n3m136m826K83N897M969
5620E588q79m764l245N62K852J224j412j266Q56J384P72L9j236k105j064J205
5636a489J958R40p28j122N75J822K5l535l252J336M822L643q52n023k951J752
5652b079L221O14j464k116m99J989K770J687j955l931l181P43M754M077j126l912
$$ y = [-3255, -2139, 1374, 2269, -298, -3071, -2437, 1135, 3587, 2275, -919, -1901, -490, 166, -320, -983, -905, 379, 2333, 2796, 1092, -1709, -3831, -3242, 581, 4296, 3553, -927, -3554, -1775, 2270, 3850, 138, -4684, -4650, 681, 4904, 4450, 822, -2785, -3769, -1795, 734, 1767, 1231, 251, -964, -229, 1600, 1421, -1273, -3194, -2263, 1074, 3208, 2004, -1030, -1420, 760, 1415, -1055, -3402, -2403, 897, 4010, 3768, 247, -2633, -3178, -1447, 951, 2613, 1344, -1551, -2315, 132, 3454, 3401, -735, -5561, -5278, 619, 5588, 4709, -55, -3300, -2738, 114, 1338, -74, -1340, -484, 900, 1672, 1711, 475, -1630, -2694, -1489, 469, 1409, 681, -441, 134, 1956, 1981, -1554, -4806, -3470, 1352, 4995, 4143, -880, -3831, -2079, 1142, 1756, 292, -1824, -2323, -334, 2436, 4123, 2168, -1763, -4944, -4201, 553, 4630, 3504, -408]
5668d08j914J352K341L2k653j942J924L388P70j521j756p43J97N75l07l27M83
5685e09J264J247Q60j064l741k979J462M794L249j355m464k462K812M111k98m420
5701a493l053J326M196L584l78l513l194j052J146K792K057p16k189m80J880R84
5717A897j050l022j584K216L933N50k402j544P95J530o27k494j829J719L645K143
5733C876p80k553k893j342J647L444J427j644k830p23K980L667j076n320l738
5748e858J927N309L802j280m132k477R42J610K71k07k71k30J054J479P0j629k275
5765a895j211J718K721N53j936q34J996J770j362m105k670K052N447L010k231
5780C023m171j643J054K106J124j173j876n20J599K981J920j975n240k886K190
$$ y = [-408, -2322, -970, 1371, 1403, -1250, -3192, -1268, 2120, 2890, 1369, -387, -1130, -933, -358, -665, -992, -509, 755, 2002, 2862, 1798, -1943, -4922, -3460, 1334, 4583, 3228, -1236, -3698, -886, 3225, 2927, -1493, -4546, -3220, 976, 4560, 4182, 669, -2525, -3577, -2431, 361, 2418, 1702, -487, -967, 913, 1897, 847, -2175, -3759, -1543, 2390, 2940, 538, -1006, -211, 1319, 692, -1802, -3631, -1912, 1733, 3876, 3096, 543, -2350, -3692, -2045, 1399, 2826, 1182, -1648, -2371, 609, 4276, 3200, -2120, -5858, -3931, 1378, 5180, 3900, -232, -2709, -1767, -157, 114, -93, -364, -594, 460, 1939, 2009, 380, -1895, -3106, -1388, 1333, 1886, -50, -884, 1112, 2882, 1520, -2585, -5255, -3203, 2244, 5254, 3023, -1148, -2791, -1737, 369, 1493, 320, -1556, -2076, -477, 2504, 4424, 2449, -2791, -5677, -3487]
5795c487M904K826j413l411j359J899J554j535k319K14J978J941N57r21j564p67
5811i03j92J4N54J25k47O44K411J333k185m274k690K098N408K940k542m579p82
5828b867L042K476q79l519k566J538M042K619N9k647l683j994J944L427J376j308
5844A060j651N4K017R25k455l404K86L239K397m12k031o87J206J022j724k636
5860b794l83K010K747K039j01k795l383j232J781L550J676k202l466O26L848K303
5876D224k176m890k715K530N018K597j576k686j815n48Q52J193K70o05j86R50
5892D37J642M52k232l294k71K910K170p10j779p0K427J779k427m627j772L308
5908b057M748J843j637l621j901P57K052R61o55j727j317J954M113J318l286n029
$$ y = [-3487, 1417, 4243, 2830, -581, -1940, -41, 1513, -22, -2341, -2127, -149, 1792, 2349, 1428, -136, -903, -1095, -1081, -527, -402, -649, -5, 2406, 3739, 1554, -2720, -5410, -3312, 2096, 5036, 2494, -2085, -2867, 175, 2651, 1772, -1747, -4313, -2775, 1267, 3886, 3945, 1298, -2385, -4379, -2435, 992, 2368, 1060, -591, -537, 1480, 2405, -50, -3454, -3168, 71, 2468, 2056, 25, -662, 544, 1566, -158, -2794, -3177, -1167, 1580, 3619, 3518, 723, -2660, -3892, -2111, 1439, 3115, 913, -2553, -1927, 1921, 4224, 2048, -2842, -5557, -3027, 1991, 4588, 3012, 326, -1489, -2037, -1185, 8, 278, -327, -513, 437, 2079, 2531, 299, -2995, -3266, -356, 1814, 1104, -675, -745, 1682, 3461, 1034, -3593, -5365, -2057, 2691, 4534, 2897, -724, -2625, -1868, 184, 1145, 490, -1237, -2554, -600, 3513, 4831, 1545, -3484]
5924c484j923K674M681J768k282k079K55J107k37j502j229M73K127J378J20n35
5940A312q60j429p64Q91Q53n71l69J175K494J304k632n003k126L479M966J589
5956D309k470l339p45K393K024j026k795j568P37K894L604P44l489m265j563K330
5972b225L603J306k179j891J574K427m97l282k469R90L282J894j113j706K67J083
5988A064M3j696j680q18J606L137K207k10l051l959j157L289L786R6l060j944
6004b347J427L330J411l171m265p80K572L329J896m22k134k078q09N02J312R12
6020F85q60p37J612K066m99l021k461N31K677J910j226j886J187K684K67k825
6036A04l580j082K717M169J963j516l013k216q4K298K522j254k995j192K973M253
$$ y = [-3484, -5407, -2733, 1948, 3716, 1434, -645, -390, 717, 480, -1022, -2251, -1778, 349, 1727, 1847, 1312, 452, -977, -1741, -850, 3, -568, -937, 238, 2732, 4036, 1404, -3599, -5725, -2246, 2720, 4309, 1839, -1500, -2245, 148, 2172, 1146, -1649, -3217, -2480, 414, 4018, 4762, 1273, -2992, -4555, -2225, 1378, 2684, 505, -1386, 188, 2615, 2118, -1164, -3633, -2643, 639, 2533, 1420, -286, -19, 1064, 1107, -589, -2269, -3087, -1481, 1656, 3863, 3653, 602, -3357, -4514, -1225, 2561, 2657, -403, -2347, -920, 2410, 3821, 650, -3615, -4395, -1823, 1506, 3402, 2980, 846, -1232, -2041, -1539, -227, 685, -175, -912, 700, 2766, 2267, -754, -3215, -2684, -7, 1903, 677, -1209, -22, 2662, 2929, 104, -3476, -4558, -1841, 2328, 4291, 2775, -238, -2454, -2538, -240, 2282, 1028, -1967, -3159, -186, 4067]
6052D067P75l877n348p58L736L840R2j642j153L33P40q35j546m38R78J361J124
6069A449O31p08j628j083K98P45J98j098m70K217L406P0m052m243m69L487L937
6086B687Q33k589k207K59J293P90l35j779j814K70L095L380P37l167m680j273
6102d500L188L278j60k019o11J699J518r00l107j803J608K691Q18m80r41k83M85
6119D81K26r04j589j002P83L262L356j76m522m210P0L842L370p09l355j579K757
6136A01L176k59l356k978m45K064L229J674m42j668k254j077J061J387k67r87
6152a041P07J998J121j215l007j635J466K459j19j250pJ516J531k65k844k926
6168c511j04K371K906K016l76l206l215L31L042K166j361l314j055L547M418l18
$$ y = [4067, 4842, 965, -4383, -5141, -1405, 2435, 2527, 885, -268, 65, 805, -30, -1576, -2014, -1036, 325, 1449, 2080, 1372, -256, -1339, -1041, -296, -98, -1196, -1666, 551, 3957, 4027, -25, -4268, -4737, -1250, 2687, 3520, 931, -1276, -1017, 276, 1066, 731, -1048, -2862, -2592, 503, 3883, 4620, 1453, -3227, -4500, -1312, 1966, 1806, -213, -824, 875, 2393, 1493, -1614, -3417, -1809, 882, 1700, 1220, 279, -4, 481, 707, -197, -1786, -2788, -2005, 1257, 4613, 4437, -85, -4295, -4225, -383, 2987, 2278, -1077, -2656, 101, 3277, 3018, -338, -3316, -3761, -1697, 1532, 3206, 2764, 1096, -1158, -2235, -1174, 213, -54, -1041, -334, 1664, 2785, 1570, -1437, -3072, -1606, 853, 734, -516, -523, 993, 2524, 2259, -585, -3511, -3615, -1244, 1662, 3678, 3302, 96, -3119, -2788, 254, 2420, 1059, -2255, -3310, 237, 4655, 4337]
6184D337m517l982j61L162L295K27j585p61L22J8o67o65p22K56J440K054N31j378
6202A204k281q91J354J650j240k262O06L467K873r59m363l913P91L955K780m85
6218B286j613j289m15J182J004m82j812j631K04L270L711k92m054l743L19K556
6234g99K094k77j233J78J795K13j889j962l86R76J611J046k19n39m10j90L23K7
6252C59j569k139Q89M075L272q85m618m142Q54M416K673j684k987l42K104K438
6268B714k02k781k695l15J811K675K093k27k959k167M06J498L73q81q29J437K600
6285B551M13k635k837J70K031J123o20j066J83K258J130j155k538j765m01J568
6301a590L453K213j223l449k563P70L263J697k434l113N27L704K735p28l820l089
$$ y = [4337, -180, -4162, -4323, -1161, 2134, 2361, 776, 15, 337, 355, -312, -977, -1699, -1443, -3, 2051, 2582, 1204, -1077, -1968, -614, 1036, -204, -2466, -1860, 1607, 4480, 3521, -842, -4755, -3964, -9, 2771, 2286, 673, -616, -1031, 151, 1155, 673, -1139, -2770, -2566, 704, 4415, 4123, 69, -3674, -3355, -799, 1295, 1018, -215, -37, 1758, 1971, 82, -1880, -2266, -1290, 321, 1367, 1148, 609, 199, 9, 332, 359, -1210, -3349, -2460, 1615, 4887, 4002, -616, -4758, -3904, 512, 3185, 1501, -1486, -1828, 276, 2714, 2512, -269, -2964, -3279, -1468, 1207, 3300, 3073, 114, -2053, -1647, -149, 224, -657, -1486, -49, 2551, 2964, 329, -2508, -2338, -307, 816, 196, -870, -687, 1571, 2701, 1546, -992, -2757, -3158, -1590, 1863, 4076, 2853, -596, -3159, -2389, 874, 2571, 137, -2976, -2449, 1255, 3990, 3262, -558, -3647]
6317c647M90K439J904O36l76r35p37L0N8m82r07j37J512K400Q46k334k894M57
6335a677K177O74j786j895Q92L696K546j893m496k424J024L021K531K43j799j811
6351i77j91J184J360j45k525k329J377M168K464j500l687k546J093K270P07r06
6367a83qJ181P37n00j521j492N2R77J035O14M35q60r64K22J326l96k352j738J458
6386a977M220K903j980n003k598J856L457J613j400k362k59K041J693l92j814
6401bk294j178J645L580J919j210k927j721R22J866k54j871j34K591J941q23k574
6418e24j744O69J828O15j154o50P93J423Q80n20k115k435m82K146L376K176j737
6435B545m188j821K170L060j39k407j718Q40L360J948j490l165j590R6J370K040
$$ y = [-3647, -3157, -718, 1186, 1822, 1446, 511, -226, -196, -138, -620, -1527, -1664, -152, 2248, 3094, 760, -2134, -1677, 500, 1174, -612, -2507, -1615, 2081, 4627, 2734, -1762, -4186, -3162, -141, 2390, 2633, 834, -977, -1168, 16, 1376, 1231, -1294, -3623, -2246, 1922, 4386, 2886, -801, -3347, -2254, 16, 723, -183, -191, 990, 1727, 1227, -294, -1786, -1734, -757, 278, 892, 1327, 467, -497, -275, 1051, 655, -1697, -3435, -1977, 2243, 5146, 3166, -1837, -4435, -2579, 878, 2491, 1091, -1271, -1530, 511, 2204, 1812, -2, -2296, -3474, -1829, 1751, 3670, 2460, -467, -2188, -1266, 600, 346, -1525, -1659, 932, 2873, 2050, -524, -2268, -1599, 229, 844, -310, -960, -167, 1256, 2136, 1616, -499, -2934, -3416, -1270, 2106, 4282, 2545, -1643, -3464, -1294, 1766, 1627, -780, -2498, -1658, 1702, 3650, 2160, -1005, -2595, -2499, -1129, 911]
6451I11J015l31j312o68kO07n15j546j53K534K233n17k530j765J026K157%k574
6469a430j464J907L478J278j782l356k324R38K735K282L36j579k370p16K369K031
6485B333j076l300j484J915M023J726k300l392p79J081J191J89j83J75R20M22
6501A461q20j301m93k19L42J349J226k86j475m62R74J123o72k863j671K524M482
6518C219J309k727l819j720J939K925P32j141j476k56R03J663P06j756l040q10
6534c349J962L499J450j845l118m97J759Q68j268j250Q46K291J300j166k630r11
6550b059J285J144J42n27o65K08J308J160l72j858k646p57K581M135J112k973
6566A218l503n32K416K403n68k761j058J696K345P11q64j959j748j30J507J683
$$ y = [911, 1926, 1595, 283, -385, -387, 220, -295, -1841, -1994, 540, 2773, 2256, -274, -2039, -1013, 1144, 1144, -1430, -2894, -987, 2491, 3769, 1987, -1369, -3693, -2755, -20, 2262, 2598, 1019, -1351, -2067, 302, 2333, 1257, -2043, -3527, -1612, 2411, 4137, 1837, -1555, -2334, -1253, -62, 127, -56, 119, 1039, 1461, 641, -660, -1153, -1372, -1030, 319, 1545, 1259, -216, -678, 296, 1419, 747, -2116, -3787, -1263, 3219, 4528, 1801, -2018, -3738, -1799, 1126, 1858, 717, -759, -1015, -112, 1551, 2257, 501, -2539, -3349, -1387, 2112, 3562, 1717, -1401, -1898, -139, 729, -539, -1789, -943, 1348, 2648, 1482, -1148, -2059, -774, 370, 512, -15, -680, -472, 836, 1996, 1624, -234, -2880, -3637, -1056, 3079, 4191, 1218, -2285, -2817, -401, 2002, 1434, -1327, -2385, -689, 1656, 2367, 1503, -456, -2204, -2334, -827, 856]
6582H56J002l66j778n22J168L08j511j369R95K450J375j225k630n91J797J575
6598A534j035k083o93J722K711R85j550k922j778K81K597K902K29k648k550L74
6614a924K811J651j602l349j121L038L292J89k198j989l49P28Q76j42r1P10M77
6631A007k48k28n92j151m19R55J712N95r94j870K39K229R63k232k720l62K859
6648b57L441M55k726l095n21J597J712R16m81j654p61J001J831O64j704l018p63
6665c363K521L608J71k347j910J86J311M56j317r63J414J809L63j439j284o44
6681a428N24J156N59o07q57j33P75K077M09k705l348R3L414L563J0l333k967M72
6699b326K946J239j176j793n42J181J733P78q72j471j519l48J469K185K89j401
$$ y = [856, 1858, 1492, -286, -808, 360, 668, -843, -2212, -1217, 1233, 2608, 1383, -1247, -1838, -41, 1534, 499, -1584, -2277, -555, 2156, 3141, 1591, -1331, -3109, -2828, -231, 2671, 2900, 252, -2298, -1924, 887, 2538, 936, -2413, -3534, -496, 2796, 2985, 787, -1202, -1551, -823, 53, -89, -180, 530, 1007, 759, 531, -61, -1212, -1631, -676, 1036, 1631, 637, -1233, -994, 1235, 2198, -34, -2754, -3116, -257, 3184, 3639, 913, -2182, -2703, -1106, 606, 1522, 1041, -613, -1374, -373, 1458, 2122, 418, -2600, -3363, -842, 2766, 2937, 590, -1320, -1134, 177, 633, -684, -1647, -233, 1576, 1939, 500, -784, -1428, -904, 252, 811, 204, -653, -786, -11, 2066, 2475, -230, -3578, -3485, -71, 3492, 3502, 169, -2798, -2326, 620, 1859, 683, -1110, -1652, -471, 1262, 2040, 1168, -303, -1822, -2170, -701, 1484, 1773, 372]
6715C72j011N99Q83l53j758p50J420K629K02k150j442L18J497O01r36j629m08
6732a916J689J738Q44p19k481k247L78K801K778k14l011k241R11L206J190k383
6748C23k789N2K346K263L0j749j627O8N91J92O54O8l21Q6O32l5o61j498m91J524
6768c42K191jk332j495J436K486J51k356k734J92L189K620l92k243j988n86J061
6785a143K040Q02j004j488j038J246K425N37k367k806L61K588K064l30j982r84
6801a079P82R13p53r60L42J132O98P6p69j117l42M53Q60O59k85j601o58J751K324
6820B426p0k847k945L33L766K904j094l266j707J104J981R95p31j708o94Q62J334
6837F43J233l42j970j878N04K101J401n81j610m42J369R42j422j797R0K286J358
$$ y = [372, -639, -40, 843, 490, -1268, -2018, -598, 2031, 2233, 83, -1359, -1041, 456, 1057, 121, -1508, -1916, -227, 1511, 2355, 1636, -845, -3092, -2714, 87, 2865, 2651, -360, -2601, -1690, 1516, 2706, 323, -2466, -2414, -68, 2195, 2225, 476, -1151, -1083, -492, -300, 354, 422, 101, 187, 819, 784, 123, -1375, -1866, -342, 1849, 1848, -484, -1979, -543, 1943, 2094, -262, -2996, -2804, 385, 3005, 2613, 370, -1618, -2204, -1143, 897, 1699, 695, -793, -1831, -585, 1840, 2377, 10, -2796, -2435, 153, 2217, 1887, -95, -1079, -297, 616, -137, -1097, -755, 377, 1075, 1151, 382, -735, -1077, -624, 236, 895, 610, -991, -1649, 102, 2426, 2356, -491, -3436, -3103, 663, 3567, 2473, -793, -2500, -1396, 585, 1580, 849, -859, -1553, -691, 643, 1876, 1534, -436, -2314, -1810, 291, 1692, 1111, -499, -941, 428, 1370, -52, -1849, -1759, 527, 1885]
6854A885n96j855j075R62J733J43j187j188k70Q33J863J308j139k457j922P55
6870b207L226K172j336l143j321K038K363J14j956j930L79J959J040k53o30r29
6886d14o38L27P96N63m05n36J47R08M99j246j805K36K178J542j041k257r44K040
6904e0K243j98k604j947Q35K109J724J75j804k103o81J460K018R91j283k565n93
6921b273K320K286l70k638j858J008K342R98j264j212J89N67J37m21m65J5R18
6938B79P00k71n58o75o05M68J623M85j318j955M0K252K202o15l218k215J632K940
6956A191J519j243k346j302J021J824N69k49j153j287J77J859J492o51k125j262
6972a966P29K153O57j321j479O91J547Q0j544j208P11J770J063j339j511k74R52
$$ y = [1885, 1289, -566, -1641, -679, 1054, 1197, 10, -1178, -1448, -615, 1248, 2556, 1417, -1040, -2962, -2207, 1019, 3191, 1855, -1288, -2609, -571, 1792, 1906, -50, -1980, -1601, 358, 1398, 1145, 515, -414, -1052, -725, 71, 634, 229, -307, -160, 748, 1247, 1, -1804, -1568, 610, 2152, 1111, -1146, -2090, -50, 2193, 1995, -609, -2556, -1721, 388, 2112, 2287, 483, -1620, -2301, -841, 1177, 2168, 885, -1680, -2273, 47, 2333, 1963, -675, -2533, -1525, 817, 1815, 551, -661, -472, 95, 232, -189, -654, -639, 279, 979, 708, 150, -525, -1130, -662, 961, 1446, 128, -1827, -1787, 465, 2667, 2052, -1166, -3381, -1749, 1191, 2710, 1467, -879, -2181, -1160, 664, 1233, 984, -169, -1456, -1279, 580, 2072, 1421, -704, -1966, -1237, 916, 1573, 252, -1227, -536, 1011, 1091, -453, -1661, -950, 820, 1883, 544, -967, -1241, -289]
6989b89R81N89o27j426j096Q73K138J292p43l129j882J932L283R72k175k559l74
7006b240J972K184n48j632j062L22Q75R69L92p58r95m75O42O98N45r52q27O70
7024b20J421k07j775j034J111K058Q18j994k282L80K327J317n50j846j312K48
7040a540J729J607j1j360j978o84J618K509N20k352k197R2K353K041q79k559p04
7057a795J324J340Q2q41m92j0O91o6k58k16R2N2L88N79n62j255m80J329J682K30
7077A814k095k251P27K918J721j509k688j249J539K459Q59j429j801o56O59J323
7093C41J350m01j734j362O26J779J304q36k256n76J618J478n77j444m98J192J091
7110A095l92j334o35J170J131j06q10j074k52O96J328Q04p44j616j372P11K768
$$ y = [-289, 692, 1281, 654, -772, -1868, -995, 1143, 2435, 1692, -1437, -3319, -1387, 1896, 2868, 693, -1866, -2240, -268, 1916, 1368, -264, -1326, -1004, -129, 840, 1232, 474, -521, -996, -354, 344, 889, -63, -890, -220, 1201, 994, -781, -1815, -704, 1354, 2172, 178, -2104, -1724, 603, 1920, 1370, -476, -1788, -1540, 189, 1796, 1785, 425, -1553, -2237, -619, 1890, 2410, 58, -2139, -2047, 306, 2347, 1468, -1091, -1795, -471, 869, 951, 110, -382, -392, 299, 233, -25, -241, -149, -97, 291, 870, 308, -947, -1427, -98, 1584, 1814, -281, -2532, -1805, 1113, 2834, 1325, -1363, -2612, -1073, 1386, 2245, 816, -985, -1641, -982, 341, 1691, 1290, -444, -1806, -1180, 599, 1903, 1067, -1189, -1765, -147, 1331, 754, -690, -1188, 4, 1095, 703, -631, -1266, -96, 1035, 929, 119, -955, -1207, -511, 817, 1621, 877, -739, -2111, -1400, 1368]
7127A368J277j730k804q22K219K714R9k162k148L35J752J187n6r99j062k97Q56
7144b73R06K36m63j127l92J218J073o45j554j31J291J199o68j722p02J915J966
7161B127n62k116j494P55J846J328m31j603j311J59J186J606M84j881k166m2K319
7178B04K167l08k514k062R52K366R66j246j177l35R58O83k79p23p4L69j1J93L34
7197D63m43o80M01P45K58o78j372o3J735J870o62k790j354J359K411J110j434
7214H76k205l58J216J597K95q01j426j012P27J833J332p31j956j510Q28K280O23
7231A608j402j405L73J465N87j040j295J51J335N59q35p46J38N50O16K63r85r08
7249i71k89O74J543J296j045k696j151J736K588O14j951k409j4K653J595n86k165
$$ y = [1368, 2645, 915, -1889, -2711, -492, 2222, 2321, 159, -1989, -1654, 98, 1285, 1229, 230, -832, -1129, -273, 633, 869, 406, -721, -1113, 105, 1178, 533, -1021, -1152, 139, 1338, 670, -1052, -1754, 161, 2127, 1565, -551, -2045, -1290, 556, 1884, 1453, -150, -1461, -1302, -116, 1490, 1974, 93, -2073, -2115, 204, 2371, 2063, -451, -2513, -1561, 805, 1771, 525, -652, -987, -29, 654, 375, -348, -422, -53, -64, 129, 463, 20, -660, -259, 486, 744, 66, -1306, -1369, 366, 2236, 1574, -1216, -2570, -1211, 1200, 2310, 876, -1329, -1687, -471, 1126, 1421, 620, -806, -1818, -1091, 742, 2074, 1343, -613, -2123, -1295, 985, 1608, 206, -1199, -826, 639, 1226, 186, -1109, -958, 377, 936, 101, -645, -507, 43, 659, 922, -63, -971, -1260, -586, 957, 2253, 1208, -1488, -2639, -903, 1685, 2299, 348, -2061, -2075, 578, 2173, 1587, -578]
7266e78j128L27J217J346J5p94q50n64N23J072K28j003q41P33J249J69j002j168
7284a049J18J573N53j322j194N34J462R90o46j875j082P85J610R98J19j220j686
7301a332m98J606J908N8k038j939N62K756J639j397k484j077J203J762O09p90
7317E48r93M4N83R0k54k31k71j24Q04N48n0r30n49M42J030K53j543j276R24K428
7337A473R78j435k529j144J742K263M51j401j263l13P89J180N25o56j716p57Q22
7354i91K118J211j139k364q45J398J378K00j121o64P99J004l02j104o34O03O32
7371A79K43n7m87r8K78M65J53m93j155p99J108K349P27j707k500o71J877K500
7389A912j4k244j508Q61J732R87o73j639j004J35J295J158N20p44j553m28J035
$$ y = [-578, -1706, -1379, -162, 1184, 1199, 405, -445, -1009, -486, 586, 814, -189, -1030, -297, 952, 1121, 119, -1049, -931, 642, 1195, -127, -1321, -787, 675, 1665, 1019, -856, -1938, -1153, 457, 1455, 1574, 354, -1332, -1830, -224, 1684, 1742, -296, -2235, -1673, 1083, 2722, 1325, -1159, -2236, -1033, 729, 1338, 548, -445, -401, 182, 272, 18, -213, -484, -608, 196, 744, 694, -236, -785, -343, 687, 940, -603, -1879, -955, 1473, 2451, 1016, -1513, -2657, -915, 1348, 1799, 398, -865, -1178, -389, 791, 1316, 660, -1056, -1813, -991, 1127, 2338, 1199, -1165, -2010, -612, 766, 966, -155, -819, -20, 984, 682, -422, -1056, -453, 179, 422, 365, -122, -220, 58, 523, 676, 183, -972, -1771, -663, 1686, 2413, 706, -1794, -2465, -588, 1912, 1898, -346, -1854, -993, 739, 1726, 1053, -586, -1590, -1455, -160, 998, 1518, 774, -779, -1207, -172]
7406a72R26m16j058j76J095J359m84j674p57J030J163j42j094o78Q44J399M25
7423A590j289j274o34K20J410J426L66j513j741k35J571J798n06k292j145J450
7439g98K244R31j504k070p31J171J285J72k21j60l22k06L53L9n82m21J12R81R20
7458A193k82j516o41J117J258o53j629n71J474K075O33j970k244k66J367J567
7474I12N97p96j438k59O92J110M65q89j862p35J770K271M15j675j960l25J444
7491b63J041m29r50L52R55J32n92p45l13K69O71J56n7N7k55o8L87N39j029j495
7511a637k25J745K166L75k036k451j02K194J372l35j484q09P19J397M77o66j221
7528e21j050r8J443J771K63j269j530m0J232N43p93j140N60J787N03j263j170
$$ y = [-172, 754, 338, -720, -896, 199, 1558, 1074, -600, -1357, -327, 836, 694, -400, -1078, -234, 1165, 1590, 301, -973, -1607, -1387, 23, 1449, 1815, 302, -1439, -1674, -103, 1695, 1189, -1103, -2248, -798, 1446, 2377, 873, -1197, -1928, -757, 528, 700, 479, 319, -3, -209, 144, 183, -399, -820, -708, 273, 1193, 911, -605, -1246, -129, 1129, 476, -1153, -1724, -250, 1825, 2458, 488, -1756, -2022, -655, 912, 1509, 713, -725, -984, -292, 818, 1283, 394, -1468, -2203, -433, 1838, 2253, 578, -1382, -1707, -263, 778, 349, -601, -249, 706, 838, 246, -499, -812, -543, 128, 284, 227, 284, 29, -39, 348, 887, -142, -1637, -1862, -117, 2049, 2424, 388, -2063, -2165, 29, 1401, 1066, -418, -1227, -508, 889, 1366, 700, -521, -1571, -1669, -226, 1545, 1808, 539, -991, -1031, 201, 744, -49, -1189, -629, 1158, 1661, 398, -772]
7545g72m77J053Q21k75j122n5J046Q76R2p69j279j043N69J649J512K36k068j719
7563a725J96K067J089j326j698l27J613J961Kj694j405j50O57O80P91J07n12l47
7581b1q8K56q3o08o39N13J601N95r60j470Q9R56P39q77j528LJ981J660k91j606
7601B22j677l83J030J522O16m99j069r02N40J539M64j530j842J21J954J918r5
7618A929j882j486M51J070J17n14l2O17N71Rq34n93j87J35K53R55K05n68n82L24
7638d2P53J00j187j716J71K401K037m82k401j329K43J450R64l59r75j43L56O30
7656D71O81p2j616j413L63J765J548p3j454j318O16Q66k6j162k62J059J270K58
7674A501j230j276J13Q87L94m07m02O8N50Q74J62o93j530j155M78K185J834o07
$$ y = [-772, -1249, -196, 625, 350, -772, -827, 219, 1095, 1187, 418, -861, -1904, -1335, 314, 1826, 2062, -6, -1725, -1529, 538, 1627, 301, -1397, -1724, -111, 1850, 1852, 158, -1247, -1397, -740, -60, 731, 838, 326, -21, -109, 147, 64, -544, -1183, -670, 931, 1526, 566, -904, -815, 141, 880, 3, -1525, -1522, 459, 2119, 1828, 222, -1455, -1838, -808, 714, 1330, 831, -238, -1140, -600, 939, 1403, -127, -1969, -1848, 106, 2024, 1929, 47, -1439, -988, 82, 199, -315, -347, 270, 841, 850, 16, -577, -764, -629, -376, 579, 784, 216, -366, -42, 711, 811, -376, -2092, -1921, 480, 2517, 2035, -366, -1695, -1452, -2, 962, 603, -372, -515, -159, 471, 1152, 1080, -536, -1949, -1586, 179, 1727, 1654, 200, -1118, -502, 364, 338, -824, -1086, -27, 1243, 1501, 271, -1005, -892, -5, 389, -18, -420, -352, 198, 1072, 1234, 541, -989, -2144, -1666, 519, 2353, 1746]
7692A746k236j261R25J512M44j407j214L00J716J055l15j004j058n63M66P57P78
7709F41K64m48o81J67N28l79r97l42J249J227K06j244j048K96J006J72j281p71
7727a435N94J516J177k37j526j431m72P58J505J178m58j720p07J184J289j36j670
7744e91j434N17K333J389j026j465q66M28N33J51l56K88P04K26k29m59n45p08
7762a110L5J124P62l2q89m11O51J002l83j908j087J044K292J306p78k053j113
7779a548N03R79N78j06m08l20k6R25P27m58j692j073K81K060J486o38j439n29
7797f98M88L71l79q02K44J131J027k07j117o86q3L31M08K08l58o0K47P88N39n95
7817G97j972j446J320K372J316j034k086q34J113J355l03j223o75O74J328P51
$$ y = [1746, -490, -1751, -826, 686, 1130, -277, -1491, -1191, 525, 1580, 1265, 261, -797, -1360, -894, -137, 641, 905, 457, -224, -57, 471, 92, -905, -1247, 2, 1229, 1435, 191, -857, -561, 445, 617, -664, -1435, -841, 675, 1852, 1615, 89, -1342, -1814, -1056, 449, 1627, 1169, -551, -1258, -74, 1215, 1079, -591, -2025, -1508, 825, 2214, 1188, -277, -1143, -715, -182, -31, -387, -99, 605, 831, 602, 143, -402, -1110, -1075, 49, 811, 779, -110, -521, 130, 1132, 749, -1159, -2246, -1202, 1090, 2396, 1618, -435, -1548, -1045, -66, 512, 406, -2, -322, -348, 577, 1304, 846, -846, -1919, -1638, 422, 1908, 1270, -169, -698, -210, 161, -218, -1020, -776, 355, 1382, 1175, 58, -628, -711, -380, 28, 236, -122, -182, 65, 853, 1392, 797, -1175, -2621, -1301, 1071, 2387, 1353, -733, -1567, -454, 901, 598, -625, -1300, -626, 702, 1453]
7833A453k95j013q79n77L20J047Q93j04p72k6M27l7p34j045K82J433J129m45j385
7852c28j61N48L28l89q32l13P74J190O56k28r49j562o92Q42J894R29r41j466l92
7871a092J096J316o41j812r26J255J676R07o72j265o64K39K22j0L15J96M1M62
7889F43K98l15j273o69J16J325J079m34j219j76J354O23j016j715q91J471K236
7906A437P07r36j651p38J93P31P80l6o57k79L97P04O88p74j803q47J273J666N73
7925A428n31j060p7M28j39p71l12Q48P55L82k29n27p51k08K06M48L32l4n10K9
7945b93J279O52j099k037r89J509K286J054j402j788k90J051O25k38q36n10M41
7962e85J192P15j10q52j473o08R14J227M79p42l82M96P22l70j692p32J126J652
$$ y = [1453, 1158, 145, -734, -1311, -991, 56, 949, 845, 73, 47, 474, 437, -297, -1342, -1060, 373, 1502, 1057, -328, -489, 59, 387, -2, -834, -1147, -373, 817, 1473, 1245, 296, -1266, -1958, -1116, 778, 1707, 766, -700, -1092, 4, 1320, 679, -1133, -2059, -804, 872, 1779, 1107, -158, -822, -583, -361, -371, -56, 140, 181, 643, 941, 626, -647, -1316, -1200, 125, 1204, 770, -449, -625, 729, 1352, 336, -1379, -2270, -799, 1437, 2144, 1208, -443, -1181, -988, -257, 523, 487, -170, -449, -52, 652, 1340, 566, -1237, -2084, -811, 855, 1428, 897, -163, -240, 188, 49, -722, -1034, -186, 569, 951, 722, 195, -556, -764, -558, -110, 222, 188, -322, -293, 986, 1638, 539, -1498, -2487, -978, 1308, 2362, 960, -828, -1118, -67, 558, 320, -516, -1026, -585, 607, 1322, 1212, 360, -1113, -1721, -807, 420, 899, 157, -225, 271, 993, 623, -1069, -1801, -675, 977]
7980I77L14p89r13K1O00K20p33o60L6O26R45P11nj059j522q42J135J771O02r39
8000D96j211J11J043O08r36j316l41R81J464N63m45p84q04m60L15O57J86r5R4
8019A26M99J96j62j386r79O64J734N79r34r26K34J101N71j248j921p4J516J607
8037A197O58p38j539q87K25O22R69l8o12n75O57J453k1j332j651r0J267J520P3
8056A158q57k90K73j70o23n65L35O44P33K40j73l57n49n88P6Q18K81n45l60N51
8076C2J132M01j465j833m25J518J941K70q29j083m15N03N27j36m63l88J25R07
8094C19J093J32j422j652L0R87J334%q60k80J008M54j021j411k46R36J537L14
8112A252r18p28J53M68q2l87n12j00L54J155R65j13j586j603l85J776J484j66
$$ y = [977, 1291, 502, -411, -390, 210, 430, -303, -963, -927, -301, 644, 1355, 1350, 291, -1231, -2073, -938, 833, 1435, 496, -715, -604, 439, 1047, 111, -1205, -1546, -565, 899, 1462, 1017, 233, -571, -1031, -716, -59, 127, 32, 126, 625, 821, 659, -727, -1706, -1042, 692, 1271, 337, -589, -355, 746, 1317, 69, -1852, -1926, -410, 1197, 1855, 1117, -422, -1309, -1084, -462, 507, 469, -143, -718, -61, 1392, 1371, 39, -1612, -1702, -435, 1085, 1158, 301, 11, 284, 114, -509, -1074, -739, -95, 638, 878, 705, 348, -201, -789, -713, 105, 386, -159, -519, 32, 1164, 1565, 100, -1733, -2158, -640, 1301, 1571, 742, -341, -756, -253, 274, 138, -325, -713, -588, 319, 1412, 1544, 122, -1530, -1500, -513, 821, 821, -39, -319, 689, 1143, 122, -1289, -1535, -599, 938, 1252, 334, -394, -241, 227, 145, -242, -754, -854, -500, 655, 1620, 1507, -79, -1682, -2067, -291, 1193, 1027]
8130A027r80o93N42R38r2j049q86J67R10O86M19L0p45q93l99M62M99L27l04kP83
8151G47M63q58j559m14R85J415L79j002p13O08Q04r8j005j080k31J005J590P25
8169A761n07j426j141j19J275J153m69j178j38J096J229k55j772j278M80J409
8185A20P73l08m70%K08r9
$$ y = [1027, 47, -646, -104, 834, 742, -307, -1193, -1026, -116, 570, 989, 1019, 274, -619, -1018, -556, -57, 270, -34, -36, 747, 1210, 352, -1207, -1621, -636, 779, 1158, 156, -557, 51, 855, 757, -248, -1328, -1559, -554, 1036, 1761, 1254, -172, -1313, -1432, -157, 996, 527, -651, -789, 307, 1536, 1281, -491, -1769, -1289, 120, 893, 585, 115, 115, 323, 224]
8191B24
$$ Imaginary data points
##PAGE= N=2
##DATA TABLE= (X++(I..I)), XYDATA
0@%%%%%%qJ6j6K4l2L2m0N6o5P4r2J09j31J56j81K12k46K83l25L73m23M80n47O20
30C29o96P81q76R79j095J221j359J510j675J857k056K275k519K791l094L429l810
47b008M247m741N318o001O815p818R081j0722J2966j6230K1437l1079N4861k17612
61a81486m11846L42697M51020J70889k20622k60146o3663J82273J44858o0199
71I3775k05028j16332O5740K17266J71193j8177j65472j33119m1842M1291O6954
82b3751R420m6895O2184J81063O2454j94448k55397o4256J69002K14623M7262
93A61261j25842r7792L6554Q5048L6252m2968j31477j34700J3716J90631K34770
104B25453J06131j50572l38710k09005J50201L23866J34876j52463k14380p679
$$ y = [0, 0, 0, 0, 0, 0, 0, -8, 8, -8, 16, -16, 16, -24, 32, -33, 41, -51, 58, -73, 83, -98, 114, -132, 151, -174, 199, -224, 256, -291, 329, -367, 414, -462, 517, -578, 643, -716, 794, -881, 976, -1080, 1195, -1324, 1467, -1627, 1802, -2008, 2239, -2502, 2816, -3185, 3630, -4188, 4893, -5829, 7137, -9093, 12344, -18735, 36126, -181486, -593332, -250635, 200385, 371274, 150652, -109494, -173157, 9116, 153974, 93775, -111253, -227585, -161845, 55421, 226614, 208437, 42965, -90154, -131996, -90705, -23751, -14331, -61226, 958, 182021, 244475, 50027, -205370, -269626, -100624, 113999, 161261, 35419, -62373, -25819, 59229, 95481, 52513, -78964, -213664, -199948, -9317, 225453, 331584, 181012, -157698, -366703, -216502, 107364, 242240, 89777, -124603, -132282]
114a32282K08021J48949j15365k42355j13606Q1426J86881J62083P705j39251
124E2206j14270Q027M3877j6925o9436l5487J03186K12562R7015j73268k85805
135a78318j01241J83431K60936K4599k47194j74923J62573K99560O9030k28004
145G0449k96064j08915J68267K88582J47653p9960j82258j34390o000J07068R0843
156F5275l2680r8078l0699Q9994J46125N0563j36461j87814l4026J00013P4033
167F245J5593K2481L7083J5970l5940r3313r0545j1785O0837R2247R9274L6514
179A54661r0520j40019m3774Q3959J11137k003j55957j27313J29289K98116J18117
190C35693k16442l33422j31857J77257K94008J18283j26148j77695m9977Q1752
$$ y = [-132282, 75739, 224688, 109323, -133032, -246638, -165212, 21669, 183752, 191457, 52206, -62064, -54037, -10160, -27085, -96521, -132008, -28822, 183740, 280755, 107487, -178318, -279559, -96128, 164808, 189407, -57787, -232710, -70137, 229423, 298453, 70449, -225615, -334530, -166263, 122319, 269972, 190012, 7754, -126636, -132636, -25568, 65275, 32595, -65483, -96182, -6188, 139937, 190500, 54039, -133775, -167801, -67788, 6245, 21838, 44319, 81402, 97372, 61432, -31881, -122426, -134211, -73374, 18873, 118147, 154661, 64141, -75878, -119652, -35693, 75444, 73441, -82516, -209829, -80540, 217576, 335693, 119251, -214171, -346028, -168771, 125237, 243520, 117372, -60323, -110300, -28548]
200b8548J10884J0465j34205j38168L4472J82415J51535p776j55100j54311N102
211a23235J21262L9526q9254m9897J07995J70846L3508j85059k29747k0687J89044
222c5698J60178q580j04571p6216K0977R9309O0278o6202j38298r4263K8777J69130
234A4821K00013L3748j84143k24201o2791J29071J77368M2609j11191q9889M8651
245b5934R8161K6549n7971j02495p9841K3288J18172J09530K3682o5149r7732
256b9740l5817M5549J8519o6562m1517R1320J62940O6702j32291k26918p1441
267b19256J69864J88202k1195j70170r4871R5145J93877Q1996j43696k36917j01385
278b58406J09659K18490J57253l6628j94347j48398L4537J38061P3912o5795j27189
$$ y = [-28548, 82336, 92801, -41404, -179572, -145100, 37315, 188850, 181074, 25974, -128337, -123235, -1973, 37553, -51701, -101598, 6397, 177243, 210751, 25692, -204055, -224742, -35698, 124480, 115900, 11329, -64887, -43910, 55399, 115677, 49475, -88823, -183086, -154309, 14821, 214834, 248582, 64439, -159762, -222553, -93482, 83886, 126495, 15304, -74585, -25934, 72227, 98776, 40805, -61690, -141531, -118243, -71, 109459, 133141, 67992, -29740, -65557, -20008, -1489, -68051, -109568, -18248, 144692, 211394, 79103, -147815, -219256, -49392, 138810, 117615, -52555, -147426, -52281, 141596, 223592, 79896, -157021, -258406, -148747, 69743, 226996, 190368, -3979, -152377, -117840, 20221, 94133, 28338, -98851]
289i8851j8952J45423J40883l4859j51436r5932J9232P0482L5942j5961L408O3610
301F2989M3154m9507r2793o3736j4236M9574J02432P9209p871q5590r9062j7817
313i3254R6715Q6675o1167j42552l4269J37401J85415M8677j59610k24724p0246
324b30939J24012J73195Q6555m2555j24254p9925M8887J02890K1763r1881j16352
335a28604q173J46576J59566j3507j59241j09659L4454Q9441J6749p3951m2339
346h8688R7505J45317K474j57882j50014r108J20252J33094K1497r4415q6737
357f6705J1469Q3012P3278k1189j38047j31573L9889J96729J64437j9642j81715
368I943j71751J612J41792R8986k7277o7262j8900L5789N1234J1270n0795o7642
$$ y = [-98851, -117803, 27620, 168503, 133644, -17792, -113724, -94492, -24010, 11932, -4029, -621, 62989, 106143, 56636, -36157, -99893, -114129, -64555, 37877, 117086, 109215, 23625, -75437, -93254, 3461, 90136, 28969, -113583, -147852, -10451, 174964, 223641, 64031, -160693, -230939, -106927, 66268, 152823, 110268, -13986, -93911, -45024, 57866, 79629, -12252, -128604, -136777, 9799, 169365, 155858, -3383, -113042, -78588, 10853, 27602, -46349, -88688, 8817, 154134, 156608, -1274, -151288, -160396, -40144, 92950, 114447, 20032, -66705, -55236, 27776, 101054, 79865, -58182, -189755, -149866, 46863, 211300, 191658, 9943, -161808, -160196, -18404, 80582, 53305, -13957, -32857, 2932, 54166, 65436, 14641, -53001]
380e3001l5077J0714O5385R1122K6931o5359o7249k117K3214j3084m9693j6657
392h4871Q8370J35657J7490j43114j44374J167J19860J03404j9865j16447o4671
403a07394P7242J33190M9094q4206j63510j11026O5284K01222J42873m5840j74237
414a7308j29488M0217J50444O3351j01715j15556K6466J30397Q7194m1419j20726
425b8143o9570L6867N9542N246j4334J6742L6273K5693j1976o5745p9069k1639
437a10113N5538R8908P6534k4904j19322q0319N2737J07228K4453q9572j08699
448a17531M310J39113J32812j3754j32828j26944l6927P1882J27315P3140l8843
459H1745r5803n9868K9148Q8406L4265q7312j07538J8352J29856R7426k9029j14185
$$ y = [-53001, -88078, -77364, -11979, 79143, 106074, 40715, -26534, -28651, -5437, -18521, -68214, -84871, 3499, 139156, 156646, 13532, -130842, -129675, -9815, 93589, 73724, -42723, -107394, -30152, 103038, 152132, 67926, -95584, -206610, -141326, 59896, 202769, 156929, -17308, -146796, -106579, 43865, 107216, 5501, -110055, -83589, 46808, 134002, 92583, -28143, -97713, -60846, -1304, 3942, -10392, 6350, 42623, 68316, 56340, -9405, -88474, -110113, -54575, 44333, 120867, 95963, -23359, -103678, -50941, 56287, 80740, -8832, -117531, -113221, 25892, 158704, 144950, 12122, -114822, -151749, -79867, 47448, 120588, 81745, -14058, -73926, -44778, 43628, 77893, -9419, -116957, -98605, 31251, 128677, 99648, -14537]
471a4537p1589M0703O8708j6213o4433L166Q5259P9952p494j03916j14036j1417
483a25847R6094J02598K4699o4914r5822j8907R9013J01964l3538j49084j12826
494a76570N0087J86453J40244n7518j81448j04260M7404J05071N3294k8468n5840
505b1551q407M1230L2290k678k8099n0303m0148K3468P1889M6616j0681m0554
517A3072k6823J1341J4226l9731n8079K4738J08392P7248l4440j11237q2418K5062
529g8649R6071N2143l6721o6514l0161L6221R0425O0739n8580j42874q9355N5839
541a11416J62281J22499m6466j66143r4557O8293J20216K6063q3718q4828K3052
552f4724J08069O0595m8553q1149l4401J4220L4934K5442o656j3814J8293L5681
$$ y = [-14537, -86126, -45423, 23285, 7072, -57361, -54195, 31064, 111016, 103522, -394, -114430, -125847, -29753, 72845, 97544, 32630, -63192, -82099, 16914, 118878, 85340, -63744, -176570, -126483, 59970, 200214, 142696, -38752, -143012, -95608, 9463, 62757, 34289, -21551, -29958, 11272, 43562, 40884, 12785, -37518, -77666, -54198, 17691, 64307, 53626, 13072, -13751, -2410, 11816, -27915, -85994, -61256, 47136, 124384, 89944, -21293, -103711, -78649, 17422, 69565, 32844, -33670, -63831, -27610, 62815, 123554, 64974, -77900, -167255, -111416, 50865, 173364, 126898, -39245, -133802, -65509, 54707, 80770, -2948, -87776, -64724, 43345, 103940, 55387, -25762, -60163, -45943, -11009, 14433, 7777, -6037, 12256, 47937]
564D7937O764m4208p8020m6518N7398J25648N9969p0101j17868m1986P5008J05978
576H0001J212j14898q6718M5458J18941P7018j9708r7250r8804k0949O4534R3283
588D2120N3478l1965q9859m4993N1900P1353l384p1758o0224K2090R3089O1110
600I2957m0837p7106j7079L2469J4597k0726k3601J3598N5210M6278j4208o4240
612b688o6893k3344N4245R9953L8023p4016r7624o556R2950R3980k1827j41132
624e4929j07136O3130J68776R2762o3913j39044p6764M3571R1970L6941k8120
635B7244l9182j7311J7726M6199K0929m3745o3043j4387M1669N5247J9025l3371
647A7000l4630J8778L5925k0324o7324l4384M8682R7654M7496o0207r8833k8839
$$ y = [47937, 54701, 10493, -67527, -114045, -56647, 69001, 128970, 58869, -58999, -100985, -25977, 80001, 81213, -33685, -120403, -74945, 43996, 121014, 101306, 4056, -94748, -115697, -51163, 42120, 95598, 63633, -26226, -71219, -19319, 52034, 48650, -23108, -83332, -61242, 31847, 92957, 52120, -24986, -42065, -9596, 5001, -15725, -39326, -25728, 29482, 75760, 61552, -2688, -69581, -92925, -38680, 61273, 99296, 25280, -72344, -78900, 14050, 108030, 86203, -54929, -162065, -98935, 69841, 162603, 98690, -40354, -117118, -73547, 18423, 55364, 27244, -11938, -29249, -11523, 34676, 55605, 11860, -51183, -65570, -23901, 31346, 50371, 17000, -17630, 1148, 37073, 16749, -50575, -84959, -36277, 61377, 108873, 48666, -50167, -79006]
659g9006M7352N5955K3003k0959n4550l3263L7578P9509M2800m8241j14514p2965
671a37301N9640J38783P1897n8305j15380n4918N2748Q8846J1381o8913m5860
682e7382K8696N3672K6875j1669m1754l9489j127L0804K7169k19k1733m884L9846
695B8805L5203m1655r0817l5646O5855J08607M5086p4903j18924k0118J00432
706A925Q8743k6065j00129o4537L3826R9603O9366j9979q3177q1439j9467O8370
718c2960R7678K2813o8377o9580J001N5864M5540k1036o9717k9580N1009O2678
730D5333L343m0753k8739Q295K1738n275l1558r183K9393L5606K0682k127m4425
743B330o6830j5031O4501P9457J3558o9089q3559K745R8582P7967m2561j18469
$$ y = [-79006, -31654, 24301, 47304, 26345, -28205, -61468, -23890, 55619, 98419, 50178, -64336, -137301, -77661, 61122, 133019, 74714, -40666, -95584, -42836, 46010, 57391, -11522, -57382, -28686, 24986, 51861, 40192, -1562, -41051, -42178, -11374, 15795, 15576, -6157, -11041, 28805, 64008, 22353, -68464, -104110, -38255, 70352, 115438, 40535, -78389, -98507, 1925, 90668, 64603, -35526, -100063, -66237, 33366, 102732, 82753, -424, -81863, -101330, -32960, 64718, 87531, 19154, -50426, -49425, 6439, 51979, 30943, -38774, -68354, -17345, 45333, 48676, 7923, -20816, -12521, 9217, 3942, -27616, -36799, -7406, 28200, 48882, 46755, 2330, -64500, -79531, -15030, 64427, 77985, 8896, -74663, -71918, 26664, 104631, 62070, -56399]
755e6399o7828N4824J25333O7792n4997j04313m7511K6839N9685M7885m358n6094
767i142m0866K5592N9352K3177m1730o6387j4360N8579N5580j4068n0086j4178
779b8537L6555L7785j9897p2781l6602N9440Q9692J8705n7572o8389k5849L3416
791c4034O2881L1402l1147o3799l5665L9400R0707M2411o8016j09922l5128O9504
803d1406J04014M0270o2674r1743j6421N7849M6153p579l3397k2658N479K7969
815E856K3181l11k1574l0497j2223K7264L1384j2579l1402Q337M3060K0410l6748
828A4158o9471k8399O2556R4188J4772q0018p9025L477P3974O3358j5719p5277
840b1426n1427J7595O4517O4418Q767p2833r1331j0391P9522Q1211M456o8629
$$ y = [-56399, -124227, -69403, 55930, 123722, 68725, -35588, -83099, -56260, 3425, 51310, 46952, -9142, -50008, -24416, 34936, 58113, 16383, -50004, -64364, -5785, 49795, 35727, -14359, -28537, 8018, 45803, 25906, -46875, -83477, -24037, 65655, 84360, 26788, -41601, -67450, -34034, 28847, 60249, 29102, -34697, -70362, -30962, 59745, 102156, 34140, -75782, -110910, -41406, 62608, 102878, 40204, -51539, -67960, -10111, 36042, 28463, -4934, -27592, -22113, 5856, 29037, 28726, 7152, -23345, -35568, -8304, 23080, 10501, -20901, -12564, 30496, 50906, 14158, -55313, -83712, -21156, 73032, 87804, 7786, -71239, -67762, 6212, 69570, 53851, -21426, -72853, -55258, 9259, 73677, 82444, 9611, -81720, -92111, -12589, 68622, 73078, 4449]
852D449o4354J3572O9522L1244m1284n2895l852M1453L7203q250l5975r390K3117
865D560J0886j5314j7596p863O895L2233L5995n809n3100n4348K61O7622P1623
878G6045j1647q7352n9428L5318Q7854M6815m6816r5973l8612N9400Q3522K7290
890G6416l5207o0672m2246J2817N6808M2012j1339m9252l5951K1126N7396J8710
902E0618m6506m7925Q668M4446K5599k0284l9137n75M6618K6216l8510n5581p375
915e3728M4581N3970J5733l9677n7781k2076L0441N8501L7707l1290q1923l8210
927h3752N8187R1216K4538o8149r3930k1056P7318Q6531K292o6821n4168K238
939d5556M1728L5884m325l0649j9253L049J8228K3661L874k9867k7064J4836L2819
$$ y = [4449, -59905, -46333, 23189, 54433, 13149, -39746, -43598, -2145, 35058, 26808, -9167, -18557, 4560, 15446, 132, -17464, -25327, -18432, 13801, 49796, 43987, -9113, -63461, -63200, 4422, 76045, 64398, -22954, -82382, -47064, 40790, 87605, 40789, -55184, -93796, -34396, 49126, 76416, 41209, -19463, -61709, -48892, 7916, 49928, 38589, -10663, -46614, -25488, 31908, 50618, 4112, -43813, -35145, 9301, 34900, 14616, -24521, -25096, 21522, 47738, 9228, -46353, -53728, -9147, 44823, 60556, 20879, -36902, -58978, -28537, 29964, 67671, 36381, -45542, -83752, -25565, 65651, 90189, 22040, -71890, -92946, -15628, 70903, 73195, 6374, -47794, -45556, -3828, 32056, 27731, -2918, -22171, -19122, -894, 22767, 26641, -3226, -30290, -15454, 17365]
952A7365L311k9203k3836J8898N1006J8098n3804o6248K822O8999N9731r045o8638
965a0544n6187J7333O5836M1472j4272n1222n0212k136O1195O7155n6o8707o9948
978g0293r09P3348O8364j5329p2823l9131K8516N0364J7230k9164l6943J539L0639
991E408J3173j2783j1810j766N159J1959M779j7342k2529N44L0298L8124K289
1004D5503n5433n8688J5340P8632N2028l1187q1236m5862M2672Q5533L0219n2393
1016B5128o9404k0784L6089N9590L1229k7173n7147l2350J8312N2971L8733k1922
1028C3272o0253k2970L8268M4791l24l7143k7309J6763L8179K891l7688k1302
1040c2825K4370L5621O039k9054l7214n510L5684L8807O071k8553m4940k5488
$$ y = [17365, 20676, -8527, -32363, -13465, 37541, 55639, 1835, -64413, -61591, 7408, 67139, 58094, -10544, -66731, -49398, 16438, 57910, 43638, -7584, -57796, -59932, 1263, 68418, 68362, -345, -70293, -71202, 2146, 70510, 55181, -17642, -56773, -28257, 22107, 39337, 10173, -26770, -25231, 5408, 18581, 5798, -6012, -7778, -2619, 9340, 14119, -3223, -25752, -25208, 5090, 43214, 45503, -9930, -68618, -53278, 25354, 77382, 46195, -35041, -80903, -38231, 47302, 77521, 25128, -44276, -65060, -28971, 30619, 61848, 34675, -22472, -54822, -36510, 16461, 55194, 33272, -26981, -49951, -11683, 33108, 32784, -4359, -31668, -14905, 23274, 26165, -11523, -32825, -8455, 27166, 33205, 4151, -33063, -38573, -2889, 35918, 41989, 13436, -31504, -56992]
1052e6992L1934O8276K8244m8433p5202k3668N6500Q1931J4551p0846p0849M593
1064e9961O0860N0189l180m7016m0630M164L3787K6513M768j9379l1449q849K7907
1077b276K6977p902k7775j1660K0766K9821n904m4557k1828L7973M9808r85n0330
1090g872m4941J0464N9693M2984k2904n8652l4219J4328M9707M7096l194n7368
1102d878n4475K950N8585N9854l107p0471n8355K3129P1300L5623l0035n5608
1114b5488k2385L0314M0902L236k4287j3164L597P107N097k909j0986k371J2971
1127A634J4907K472j7545k9811n494M0280M1754j4793n8369l5335K9294O9249
1139C8243L4394m5601p5833k0784M8182O0257J9795l2481n4116k4374K6938M7010
$$ y = [-56992, -25058, 43218, 71462, 23029, -52173, -75841, -19341, 62590, 77141, 6295, -64554, -59961, 899, 51088, 47908, 892, -39738, -35574, -1787, 24726, 29494, 10115, -21334, -30183, -2276, 24701, 16799, -10976, -22636, -1870, 27951, 22047, -22510, -44338, -6365, 43443, 42458, -7872, -52813, -42349, 17344, 60328, 37424, -21228, -55447, -41119, 8588, 55684, 52490, -4878, -59353, -56403, 2182, 62036, 58929, -11542, -69897, -46768, 24532, 60155, 30120, -25488, -47873, -17559, 23343, 26579, 2292, -10872, -7275, -168, 4929, 2020, -8966, -11337, 1634, 16541, 19013, 1468, -28343, -33837, 6443, 48197, 33404, -24965, -60300, -31006, 38243, 72637, 27036, -48797, -69581, -21399, 38858, 58653, 26172, -27944, -52318, -25380, 21630]
1151B1630K5677j7694n0746l4675K7317O1299K2594l7439n0135j0831L5792L7248
1163C0037p286l5069p629K6193J7184j4330k6785j0208K0050L1641O082k5185
1175D695k6187n515J7692L3450J7914k9766n3740j5214M5747O5315J7092n8418
1187A3065p7445p732O9015O3107n561n6336m6252P863M9257L3295j3708l5987
1199g419k4341N07K7340L4148M816l0183k9096O78K3614J7927j1615k5791M121
1212a5294L5770J4739l0851l8496j922L7281L7503p120m6312k8119K2707M2192
1224B2078J9410j6943m2384l3678J1398N0882M4620k441n3601n8927J149O5639
1236G202N2942j9421o1440l2991K6724N6068K2550l5123m7127p801K5253K5547
$$ y = [21630, 47307, 29613, -21133, -55808, -28491, 32808, 55402, 17963, -32172, -43003, -7211, 30037, 22751, -12318, -19947, 6246, 23430, 9100, -17685, -27893, -7843, 23798, 29880, 4695, -21492, -27007, -9315, 24135, 42049, 12283, -41457, -56671, -10924, 54391, 71483, 13065, -64380, -72112, -3097, 60010, 54449, -1887, -48139, -40276, 8981, 42276, 28568, -7419, -31760, -31253, -3913, 30235, 35051, 4868, -24228, -23550, 64, 17991, 6376, -19415, -15294, 20476, 35215, 4364, -34132, -36054, 1227, 38730, 31610, -14702, -42821, -20114, 22078, 41488, 24545, -17839, -51517, -40119, 10763, 55383, 52942, -659, -59586, -58437, 7202, 60144, 40723, -20717, -53708, -26984, 29084, 51634, 16511, -30616, -38417, -13164, 12383]
1248A2383R389q275j6120n412O415L955l729q824o406J2856L0601P428l6535l8326
1262d0600Q856M6260L1103k2509n7143k2858M6168O2291P981n0755n6973j2524
1274f0703M2268N5732J5747l0809m2109k1921J5595M4610K6422k7148n0184j2822
1286d5322L7247M6966P259m0692m1298M561L2907J4533j0399j0782L888J4143
1298A3011N285j7877k3605P9J9887J7551P493p292k4146j7605J5459L4756J3154
1311C6150k9822m9426j1801N3862O5246l48o5334n8646J938N4641N1805k742m7832
1324b309l3675J0404L2032K3166m028l1672l0819M666L6468L2410j614l4444l0660
1337c0075R362L1164K724k6088r292K5483K9991j157l6980l6175P872M3047K4717
$$ y = [12383, 21772, 13497, -2623, -8035, -1620, 2335, -1394, -10218, -16624, -3768, 26833, 34261, -2274, -40600, -31744, 14516, 45619, 23110, -34033, -56891, -10723, 51568, 59549, 8794, -48179, -60703, -18435, 37297, 53044, 22235, -19874, -41795, -26200, 18410, 44832, 17684, -32500, -45322, -8075, 38891, 46150, 5458, -35840, -31279, 1628, 16161, 5762, -5020, -1132, 13011, 18296, 419, -23186, -23107, -3220, 14331, 21824, 14532, -9614, -27219, -11760, 22996, 36150, 6328, -43098, -54899, -1037, 64209, 63861, -1473, -60119, -58181, -3540, 48265, 45523, -2309, -35984, -25580, 6452, 29618, 25590, -6082, -36901, -32235, 4233, 36643, 35029, 585, -30075, -20713, 10451, 13175, -12913, -22205, 3278, 33269, 32112, -4868, -41043, -33171, 9876, 34593]
1350C4593j7235l2336j3931J7638L4044J5167k2349l9911k4874J2314N0492M8155
1362F1767j0512o3980m5983J7955N3696L1131k0762m5932j5447L0928L6062L437
1374C2360k4719k8884j1073J5334K5092J2046l146j0889j3212k295J1402r7j9683
1387a7764n816K8186L2445l549m0314l5471J3018M8384K1968l2910m4663l688
1399d0174M1180M7119M248m8725n3288o040L9374M6741K1394k2530m9507k5060
1411d5268K6681M4563J0937l4354m1914J892M8158L6444j6148m0590j8995J0069
1423a8525J8868P094q125m183J3977J3250r271k0856j3827j063J4264K3745J2259
1436B7607j2430k5901j5569J5536L6371Q920m1458m4360J0726N6616M4496j0077
$$ y = [34593, 17358, -14978, -28909, -11271, 22773, 37940, 15591, -24320, -49194, -36880, 13612, 61767, 51255, -12725, -58708, -40753, 12943, 44074, 23312, -22620, -38067, -7139, 28923, 32360, 7641, -21243, -32316, -16982, 8110, 20156, 17010, 6121, -7091, -9386, 2016, 1919, -17764, -23580, 4606, 37051, 33502, -6812, -42283, -29265, 19119, 41087, 8177, -36486, -40174, 1006, 48125, 52373, 3648, -49640, -55680, -16306, 30435, 51829, 29299, -20208, -45268, -18587, 25976, 36913, 2559, -39355, -37463, 10695, 47139, 30991, -9599, -28594, -18525, 343, 7437, -688, -4871, 9106, 22356, 13085, -7771, -21598, -22661, -8397, 15348, 27607, 15177, -10724, -26293, -10757, 25614, 34534, -6924, -51284, -40558, 16058, 60554, 50477]
1448E0477n5979m9475N261M7435L7457m33k8221k8713k346K7290K5447n628l1936
1461i364k9672M560M3431L8115j3441m4515j8075J9190J9132o465k0383j945K9516
1474A0084K9054j0985m0289k5225J0752L1427K2437r347k9175j3005J7003K6866
1486A9597J3823j5474m4029l2447K3690O2938L6699k5080n8948l3778K2422M7048
1498A6461J5333k4879k5645n11K0042K1938K402k1535k3661p066Q815J9926K1176
1511B2796J280j9911j3363O079O040r932j5957K360L0979L0651j1243m4037k3026
1524c7284K0475L3186R205k3340l1271o20L7024L5799l014l7265m2736j4886L1535
1537b3192N4071K4218k7553m8597k1211K7210M3333L076m2491k9842K0292M1862
$$ y = [50477, -5502, -54977, -49716, -2281, 35176, 34743, 6522, -22191, -24537, 2753, 28200, 22572, -9364, -39036, -34476, 8955, 47070, 33629, -10886, -28961, -9771, 9361, 2896, -17487, -19432, 10084, 39138, 28153, -12136, -37361, -26609, 4818, 27255, 17908, -11267, -24272, -7269, 19597, 33420, 17946, -26083, -58530, -34840, 28098, 64797, 39717, -19231, -53009, -30587, 16461, 31794, 6915, -18730, -19241, 801, 22739, 25141, 3606, -20055, -27121, -18306, 1620, 22796, 24076, 4165, -9198, -3119, 2921, -7011, -22968, -20608, 10371, 41022, 29779, -14258, -37284, -16809, 16377, 25582, 2242, -29029, -29649, 7375, 43174, 40160, 2895, -39841, -54727, -23192, 30879, 55097, 27544, -21053, -42264, -15054, 28279, 31355, -11136, -40978, -20686, 21176]
1549B1176J7888j7369l1682j4552J1050J2945j341k692Q241J1455M545o909j9594
1562f839j8802l38J8176K4579J4097j4417l3868j0289K9956K9205j1614m0835
1574b0989k5716J9841N1487L1834k0145m7865l1241L786L1080L3240O582k2866
1586I028k4656l473J9372K4010k175l6484k9456J7986M5690K2185j8682l3451
1598a0106j1962J5757J3114j2421j6052J1031K9184J6256j2027l2484k5209P527
1610b7392L0300J9733n834k1181j7157Q860L4099J9966k7247n1999k2609L4326
1622b6135O2349K8492l5345n6487j6440K7387K9560M565j6712j6369L964J9456
1634H285J1988m293j3873j8547j1779J0523K5050J4515n355j2984o525M180L93
$$ y = [21176, 39064, 21695, -9987, -24539, -13489, -544, -1885, -4577, 3664, 15119, 19664, 12755, -6839, -25641, -25979, -7803, 16776, 30873, 16456, -17412, -27701, 2255, 31460, 19846, -20989, -46705, -26864, 24623, 56457, 36312, -11553, -42794, -39008, -7928, 25312, 31894, 9028, -15628, -19101, 271, 24281, 22106, -14378, -43834, -25848, 19842, 42027, 23345, -10106, -22068, -6311, 6803, -5618, -21670, -10639, 18545, 34801, 22774, -9710, -34919, -27392, 2908, 22641, 16807, -4374, -21531, -12671, 21428, 41394, 14147, -37852, -60461, -26135, 36214, 64706, 29361, -27126, -43566, -16179, 13381, 17946, 1234, -15135, -11171, 8285, 20273, 15980, 2107, -16440, -28219, -17696, 7354, 21869, 16514, 3530, -2995, 1185, 1578]
1647A578j6856j4853J6578L6476J5053j9699l2000j4536J4851K5770M376k0037
1659c299j7827L574K3186K8075O206l2898m7278j6166L2650N4682K6639k9989
1671B7555n3761j4119L5806L3193r390l5662j9268K0211L8954J4327k1621k6985
1683a0760q460N492Q494N024o69J796J1349R402o239k0162k2811o687K5058L7491
1697B8318P653l0182k9936M170L0639J9851j9980m1333j2526L2447M1797J4470
1709D5388j8725l6154k6891K018K5681K6272R806j3588k5350o712K2203J9872
1721B3820j2014l1419j6231J8006L6467J7091j7700k5128m654O724kn889k202
1734a3131R225J9777J3451j0003k5624k0354j613K0884K8382M148k7376k3494
$$ y = [1578, -15278, -30131, -13553, 22923, 37976, 18277, -13723, -28259, -13408, 12362, 16738, -3299, -21126, -17552, 5634, 33709, 39915, 7017, -40261, -56427, -23777, 30905, 57544, 27555, -26206, -40325, -4519, 28674, 19284, -16378, -35646, -15435, 23519, 37846, 16225, -10760, -19220, -13728, -5234, -210, -879, 917, 12266, 21668, 15429, -4733, -27544, -34231, -9173, 28318, 35971, 5789, -24147, -19977, 10662, 30513, 10533, -30800, -43326, -10879, 30918, 45388, 26663, -9491, -36382, -34364, -8683, 17589, 27395, 13807, -11543, -18255, 3948, 23820, 11806, -19613, -35844, -17838, 18629, 35720, 18020, -7108, -11762, -5038, -5040, -10929, -13131, -3906, 15871, 29322, 19319, -6305, -26659, -28272, -7388, 20994, 25142, -2234, -25728]
1746b5728J2698L6641J8101k9352n4991j9368M4675O0901J4057l7689m5221j2492
1758c7768K3975K7053J73j7488q498P277J4191J2005l396k1503k0202j36J6538
1771g779J8004N928q072o302O755K395j8665k2132K295K7450K8308L922k3823
1784H284k5119j228J4905R006j148p984j0108N11J9431K3384L189k7003m1926
1797c5806j7902L2899N3690J7685l1098m0355r084K5011K5655o797k9401j2290
1809b7793J8630K7001J2374j0013k4891j8396L451J5124Q905q48l397M397J4833
1822A9377N004k4890l5666l782L5535L8434K560l5095l1204J1915L7502J1149
1834C0839k9738l5200m099L1399L9463J1990k4006l4764j9367L943K3666K5632
$$ y = [-25728, -13030, 23611, 41712, 12360, -42631, -61999, -17324, 43577, 57634, 19945, -25276, -37768, -13793, 13260, 13433, -4055, -12553, -5276, 8915, 20920, 17524, -3979, -24181, -24317, -7779, 10225, 16153, 8081, 1779, 8534, 10929, -7736, -29868, -27573, -123, 28185, 32107, 8284, -16835, -18063, -3158, 5848, 4700, -3284, -13392, -12881, 6550, 29934, 33123, 6120, -35806, -53708, -20809, 32881, 50566, 19468, -20887, -29971, -4960, 20695, 13898, -15503, -27793, -9163, 17838, 30212, 20199, -4692, -23088, -19637, -4513, 4392, 3544, 147, 4544, 19377, 24381, -509, -36175, -39957, -4422, 34012, 36572, 1477, -29727, -17812, 19690, 30839, 1101, -34099, -38198, -6799, 32664, 44654, 20648, -14116, -33483, -29540, -5874, 19758]
1846A9758K930j9028j4453N652J5210N268j5368k2591k582K1697K0081K244p248
1859A1570p640o974n644m411j792P041J3688R662L325k995j5856k3392o153K1485
1873h086K6778M600k2749k3175R968L6696J4804l3542m7162r763L8010N0527J5312
1886E2218l1961m1911j1958J8196K2899P721j2167j7384J734K2726J7210q441
1898A8882k7028k2240N309K7414J6470j0086j2854P090J4856l476k5742k4933
1910c6338O914L6957K7838p732k7074j7197J537J2974J0545l993j3061o417P183
1923g864J8811J9902j672l2767l5508k215L2541L6326R151k3092k7351l159J5137
1936a760R167m420j0510p609N405J9237J5874l884k0538k0959m700J6298J8069
$$ y = [19758, 22688, 3660, -10793, -5141, 10069, 15337, -31, -22622, -25204, -3507, 16574, 18818, 11570, 3930, -3044, -8688, -13099, -14891, -7850, 5838, 15500, 18825, 15830, -26, -23418, -29571, -8086, 18692, 23292, 543, -22632, -12664, 24032, 38836, 5294, -41868, -51631, -13621, 36906, 52218, 20257, -21654, -33612, -15416, 7483, 15204, 3037, -14347, -12613, 10113, 27323, 18882, -8146, -30386, -25077, 2337, 18807, 8721, -4133, 2957, 17813, 14337, -11405, -36338, -29424, 7533, 35371, 27639, 565, -16632, -15095, -2121, 8424, 4431, -8630, -15047, -7864, 10947, 30849, 29177, -3590, -39098, -41313, -8772, 27554, 36705, 13613, -13738, -16897, -1760, 7407, 2987, -7523, -15132, -9727, 9510, 25384, 21500, 962, -19997, -24697, -8399, 9670]
1949I670j725j1083M570J7763L945k3709l2957n558L5100L8828j367l4935k3427
1962b4885J1061K7769J1187k1173l2849p198K8063L6708J4907j8565l9408k6396
1974d0779J0990L3457K0214p239k0564q518J4593J7168p792k5456j1592J2310
1986a3208J8320Q125k790m734Q62j131j1675j2404J259J1734J2232J0135L959
1999B0684q894j7862j5104j103J7899K1649n54k2317j1976J6146K4266K908k6529
2012g87l3301n320L0447L6257J2186j7066l2014k1826Q602K6901J4022j1358j8965
2025a2222k786K0494K3146n581l3808k3534J2136K8475J2004j1217j2775O968
2037A300J7628l344k8776k1883J0141L0760K4078j318k4125k2714j24J6519J2728
$$ y = [9670, 7945, -3138, 1432, 19195, 23140, -569, -33526, -39084, -3984, 34844, 33477, -1458, -24885, -13824, 13945, 25132, 3959, -28890, -36088, -8025, 28683, 43590, 25025, -14383, -40779, -29789, 3668, 23882, 16643, -3921, -12439, 2154, 19322, 11530, -13926, -25518, -13208, 5112, 13237, 10447, 5713, 6575, 5444, -6231, -18635, -17376, -5642, 6590, 16725, 20684, 11790, -6072, -21176, -22279, -4380, 17269, 16715, -5602, -17578, -1432, 22834, 25742, -787, -34088, -39408, -8961, 27296, 39482, 22416, -9598, -31424, -22822, 4079, 18101, 6743, -12222, -15008, 5486, 28632, 23051, -10757, -34291, -22155, 6320, 18324, 7107, -5668, 1300, 18928, 15584, -13192, -35075, -24934, 5826, 29904, 28586, 4461, -18253, -18377, -1858, 10870]
2050A0870k499j5948j3898R283K9991J9403j4036l6216k6440P594L3919K4895
2062B6918m615j8119r563Q8K779K126j460m345j918M029J0014J2351J094j7545
2076A834j9807j830J3197J0667K24l572M825J3240L19k5238k6717M142L0217K4688
2090B6189k026k2753j8248N655K0202Q668j3050k3679j2674J6729L8161K2333
2102D5507j9067m2141k5583J2132L5723K1855j4199k6325j269K1878J2745j3442
2114G814k4068q845J4786J9353M114o569k476J309k532o503q234n469N684J6639
2128E003J5381L066j2284k2980j5070R707K4034J0814j1680j6889j262J8558J7374
2141B3772o962k6086j9276K200J9386K5910J4378j2095k8130j9243M587K2088
$$ y = [10870, 8371, -7577, -21475, -12192, 17799, 37202, 23166, -13050, -39490, -31896, 2023, 26918, 22303, 4184, -5379, -5291, -2512, -386, -1846, -6191, -8109, -4080, 5934, 18285, 19379, 1834, -17973, -19803, -6606, 4061, 4285, 713, 5538, 18778, 19097, -6141, -32858, -28716, 1501, 26189, 24163, 1410, -16838, -11183, 9019, 17687, 4637, -19042, -31716, -14987, 23174, 45507, 26440, -15701, -41284, -29152, 6571, 28426, 14227, -12098, -13367, 8511, 21256, 7814, -16254, -25099, -10313, 9040, 13154, 6585, 4109, 5418, 2886, -3617, -11851, -17320, -11636, 5003, 20384, 23450, 11166, -11814, -26884, -17177, 6857, 17671, 5991, -10898, -12160, 6398, 23772, 16810, -9276, -28552, -26352, -6966, 18944, 33322, 21227, -6903, -26146, -21559, 529]
2153E29J5931q175k0280k347K1837J8092q542k7116j8206R641K4445R294j0632
2166D471p230Q115Q305n890j7721j5423L342K3480K3310K424j8654k3547q009
2179b3027J6453K2045q69k3330j6657J2391L2229K0223j7668m1179k1157J7688
2191b2858L1073J4089o513j3055o669J609J720j753j543j233j974M212J1929P720
2205A6754n320j3011j0314r62P657N366j821K141J2468Q020j1660k2272j3134
2218b6088P894K2147J5538l728j4413r872N63J0248J0627n764k2126j3415J4960
2231a3429L2922K0891j4661m0542k5608J5527L4524J4696j4475j9680l85J7691
2243G471J0687j2623k0386m880J1074J3104P279j557o915l448J802j115p718q184
$$ y = [529, 16460, 8285, -11995, -14342, 7495, 25587, 17045, -10071, -28277, -18636, 5809, 15103, 4471, -2759, 5356, 13661, 7771, -9950, -25373, -22031, 1449, 24759, 27183, 8529, -15018, -23027, -6574, 15471, 14602, -8728, -25385, -12994, 19235, 39458, 21790, -19389, -40546, -22858, 8215, 22304, 15791, 2736, -3933, -2324, -604, -2357, -3900, -5133, -7107, -2895, 9034, 16754, 11434, -1577, -11891, -12853, -5196, 170, -1651, 490, 12958, 20978, 9318, -12954, -26088, -18194, 3953, 19491, 15763, 1350, -8522, -7959, 2289, 12916, 7152, -14974, -28389, -13429, 19493, 40384, 25723, -14819, -40427, -24900, 9624, 24320, 9845, -9835, -10220, 7471, 18158, 5535, -14851, -19731, -8657, 4447, 11726, 10169, 3254, -194, 1608, 493, -7225, -15409]
2257a5409K25J5056K2571O722k0689k8239p725J7802K3046M039j8334j5791Q858
2270g868K1469P644j1992j9715j3471K581J8164K0485Q996r434k2855j6952O013
2283a6935K0090Q888r268j1584J735J5221J1547r291k1416r103R584J2501M360
2296F329j447j505K411L057m467j2820j0440J166J5095K1821Q789j7237k7242
2309a6490p492J8683K1906l92k4194j9882J3836L5825J6046k1752l5286j5521
2321c4713J5116K7482J3328p453j2582n714N27L753K693m519p702R57J0739J0660
2335A2572J661r345j1884k021O787J246o639k35J1812J4333J737j6236k1213n380
2349b2805J3388J5689O861k133q571r594o0J0529P996o070j7818j2465J2357L1507
$$ y = [-15409, -15184, -128, 22443, 29165, 8476, -19763, -27488, -9686, 13360, 17399, -935, -16726, -7868, 13601, 21245, 9253, -10462, -23933, -21352, -3188, 17297, 26293, 16859, -5996, -22948, -16935, 3155, 12043, 2775, -8809, -7074, 8147, 19694, 10403, -11013, -20116, -10532, 1969, 6329, 4882, 3377, 5788, 8845, 4378, -8442, -18882, -17716, -2621, 19200, 27989, 10752, -16490, -23982, -5299, 16607, 16215, -7979, -27861, -14025, 21800, 37846, 16094, -19192, -34713, -19597, 7885, 21213, 13760, 1178, -4536, -4009, -256, 2437, -2082, -9784, -8827, 1912, 12572, 14233, 4888, -6996, -9017, -2230, -984, -7623, -7858, 3954, 18287, 20024, 3788, -17425, -22805, -9417, 6272, 13133, 11000, 2429, -7165, -7225, 3304, 11300, 5230, -12588, -25053, -12696, 18811]
2363A8811J7760j7467l3817j7288J2657K6465J2343j1164j5333N09J1239N727
2375A0442n002j1775r232L397J3877J0755n89q539p532J384O489l324j4541n031
2389a9221J7404K4922N981k1394k9303o645K2568K3063k640j9129j0644Q212J8048
2402A1222Q917j0348k0236j2181L621J6788K0232O929j4382k0937p172R118J2295
2415C866K612q192o167P514J1651q7r893q438k191K752M510L082K077L491J442
2430H029l194m453n844q429j992J3505J9882O241j5141k3389p429J8100K1627
2443A7513l391k3988j3702J3770K7247J3250j6087k9923j3996J1719K1819J3884
2455A8115j454j3978j2180K295J0543L423p977j0710J77J4574J4344l782j5984
$$ y = [18811, 36571, 19104, -14713, -32001, -19344, 7121, 19464, 8300, -7033, -6524, 4715, 10442, 5440, -6335, -15567, -12170, 1707, 12462, 11873, 3334, -4198, -2814, 3675, 351, -14190, -19221, -1817, 23105, 29086, 7692, -21611, -28256, -5688, 17375, 14735, -4394, -15038, -6826, 11222, 20139, 9791, -10445, -22626, -19005, -2217, 18015, 24944, 10562, -10375, -17547, -8429, 3866, 6478, -1714, -7881, -367, 11284, 11197, 1304, -7134, -9325, -6573, -2063, 1019, 3096, 6587, 8029, 4835, 382, -5462, -13891, -15883, -2378, 17504, 23745, 8604, -14785, -22214, -4114, 17513, 14122, -9866, -23568, -9798, 17449, 30699, 14612, -15311, -29307, -17588, 4231, 18115, 16661, 2683, -9497, -7202, 3341, 6764, -1213, -11923, -11746, 2828, 17172, 13390, -2594]
2468b594p414O549P107l488j0111j552J4881J7480j746j9529j6772j430J1169
2481g450J4634P147n597j0917o269L101J1028P316r684j9617n961J7471K4200
2494A9402Q020j6121k5187r787J2319J6335N363m145o218l282L466N646q33p885
2508b907p825q56R646J3031J887j1357q118N085O699m663j3107n114J5034K3943
2522B1378M597k2159k4096j628J7952J7668K09j5588j2255N290J6040J0065n036
2535A2437j7942j7622J573K2092K1227N62j8094j8145j248J3965R450o417r306
2548g468K547R809N434l874q725m803K683K777r75N02M446L043Q90Q7m047r306
2564f980p880K020J3582J6816K342j7921j8759J804J7757J1626o490j7621q592
$$ y = [-2594, -10008, -3459, 3648, 160, -9951, -11503, 3378, 20858, 19112, -417, -17189, -18619, -7450, 7184, 14331, 8734, -2183, -8452, -5351, 5677, 12993, 3309, -16308, -22269, -4798, 19402, 27422, 11301, -13886, -23673, -11354, 4981, 10344, 6199, -19, -3301, 165, 5811, 4978, -2907, -10732, -11588, -1942, 11089, 12976, 1619, -6499, -1414, 5285, 622, -12485, -17599, -2565, 21378, 25975, 3816, -20280, -21908, -3956, 13712, 13921, -1667, -13922, -8632, 7408, 17473, 12437, -5505, -23127, -21554, 538, 21765, 22327, 4233, -13912, -15160, -1195, 8255, 1838, -7468, -4921, 4888, 10322, 6448, -2277, -7080, -4397, -1620, -2595, -2093, 2353, 5396, 6286, 6373, 2326, -6980, -14860, -12840, 742, 17558, 19900, 1979, -16780, -14976, 2781, 14407, 7917, -9704, -18296]
2577a8296J2536K0770O860j1846j8913j2520L937J8639J6269j005j4621j2442
2589a0632J394J2670O842r859j3760K456J5957J0193n790j3302n656P473P831
2602E817n337j0809P76J3398J1844k34j3329j6100m604J0971J5012Q220n316j5202
2616d893r663R104J7429L289j5424j8283j320J9269K1180O44j8320j6093j780
2629a4861Q334R543M193k848m556j596J469L197J574n344q750N31J0741P788k962
2644F453p679k674N496M639p426j2950K86J7049J5628j481j6975j6628m60J4941
2658a781J2974r05j0071r925m90J2346J4428j646j9406j7572K224K1052K0345
2671B1573j413k0796j4879M901J3119M378o040p110J586R087M468n305o282j343
$$ y = [-18296, -5760, 15010, 21870, 10024, -8889, -21409, -17472, 1167, 17436, 16431, 1810, -10632, -9238, 3432, 10274, 415, -13345, -10889, 5068, 15261, 9471, -3831, -9487, -2014, 5817, 480, -10329, -9553, 3845, 15689, 15455, 2126, -13974, -18578, -7607, 7405, 15625, 10309, -4893, -14556, -5452, 11977, 15266, -158, -18441, -19761, -492, 20688, 21332, 3012, -13081, -14861, -6527, 3016, 7209, 4361, -195, -1791, -322, 2875, 4449, -895, -9645, -9114, 1627, 9415, 6453, -1226, -3900, 1596, 6235, -1191, -14141, -13855, 3194, 18822, 17341, 366, -16262, -16722, -1781, 11193, 10288, 217, -9708, -10198, 2148, 16576, 14930, -4476, -22048, -19824, 1228, 21573, 20160, -636, -15515, -10614, 2505, 6883, 843, -6267, -4681, 4406, 8874, 3569, -2713, -4056]
2685d056N81J428K083N54j449J317M383L002k725j1082j0994L955J9208J3972
2699B0177o608j8428j1511O290J6839P427j0708j4732j925J0856J3156N539p788
2712H584j5844j0573M437J4983J3614j021j4990j0959N938J2229J081r740p925
2725a0186L697J1651O190p121r364M79O644J624n192n856O70R086R518l9r627
2740B174j1673o257O469J7020J0573r393j8400o231J2042J7062K620j7204j7861
2753a9059K756J9222J4419j958j3850j2657j118Q352P593K315j905n008l663M073
2767d88O441j677q521m550M428Q911L119o541o810M345Q863j179j1344q943M146
2782i800J4960J1759m558j5803j0330K939J0362R891J453j0314j2081K55J3767
$$ y = [-4056, -3475, -2047, 36, 590, -859, 458, 4841, 7843, 5118, -5964, -16958, -13003, 6205, 20177, 13569, -4859, -16370, -10080, 6759, 14186, 3478, -11254, -13179, -2323, 10833, 16372, 8584, -7260, -17833, -13396, 1587, 15201, 14180, -810, -11769, -5831, 6398, 7479, -2261, -10186, -6489, 5162, 11352, 4231, -5133, -4654, 1990, 3614, -1578, -7434, -6764, 2322, 11840, 11801, 2174, -9499, -15756, -9287, 7733, 18306, 8913, -9487, -15718, -3676, 13386, 16006, -1198, -19059, -16303, 2919, 17338, 15380, 1530, -11127, -12245, -3893, 3700, 6015, 4110, -898, -4561, -488, 5953, 4276, -4245, -8795, -4367, 4544, 7663, 1122, -5688, -1343, 7520, 6341, -5003, -13946, -9800, 5160, 16919, 12361, -3442, -13772, -10833, -471, 9420, 10873, 559, -11522, -11267, 2500]
2795B500J3481k006j8355j6880N124K1744J3570o671j5809q969M718J0704L170
2808F321o428m629K835M224J748p90l577l695K2L329K724m74l674j916O419Q701
2824A1140l671j5448r288P936J7690J0173q409j8427p722J0422J4313L080q671
2837C118j1648l803Q559J2594N556o417j3728j0746M661J7352J0217p494j3815
2850e594m237P531Q965q01r387m907O631P900m68n582l786J646M493J195n206
2865a607m520J514N667O255L216o107j3815o668R751J6834O264j1317j7582l669
2879a5784J5464J5408k393j5842j1942K835J4267J1650k188j1304q377j018M830
2892d394Q507M317n266q116m45O349N283k763q278l070P524P523l366q412q69
$$ y = [2500, 15981, 13975, -4380, -21260, -16136, 5608, 19178, 12507, -3302, -12271, -7553, 3151, 6321, -107, -4736, -1901, 2323, 4071, 3281, -296, -3991, -3969, -640, 2084, 1610, -2064, -3980, 2439, 11140, 7469, -7979, -17267, -9331, 8359, 18532, 10123, -8304, -16026, -5604, 8709, 11789, 3118, -8530, -12333, -3774, 8820, 14376, 7959, -5769, -16515, -11854, 5498, 15715, 8221, -5594, -9831, -2300, 6665, 5864, -3523, -8430, -1799, 6101, 5633, 51, -3735, -2089, 2404, 3599, -1607, -6127, -4613, 1054, 7309, 10525, 4418, -9397, -16065, -6314, 10520, 16784, 5467, -12115, -15784, -320, 15088, 12695, -3147, -15089, -12254, 2013, 13663, 11475, 171, -8206, -9224, -4394, 4113, 8430, 3164, -4952, -5397, 952, 6235, 3472, -4806, -7876, -352, 7171, 3805, -4607, -5476]
2907e476P060O516k425j1034p544O429J3092N841m902j0407q379R38J0913J0290
2921A0912m14j1170j2070M17J6004J3819o028j8993j0256P910J6301Q366o932
2934G866j3332m003O208O268P15k594l171q03K824K867j77k448l243n44M665M323
2950E421m530q096J488J0711O969o122j4248p415R862J6985M702j1603j3594l153
2964a2623Q921J1992L389q515j0653l432N775J1669P779o612j5902p080R158J4257
2978H123M519r002j1253n20R682N402m810o058L6M152L713j299m824j387L732
2993B06L202o72k516m034k756M469R488L562p785j3034m692J1145J6837K273j5743
3008e0j4500J921J4636J1551k412j3969r937L590J1090P382k40p541r400j804
$$ y = [-5476, 1584, 8100, 5675, -5359, -12903, -6474, 6618, 12459, 7557, -2850, -11229, -10291, 622, 10912, 10498, -672, -12742, -12325, 3679, 17498, 11470, -7523, -17779, -9869, 6432, 14798, 7866, -5466, -9469, -3261, 3007, 3722, 1128, -2043, -2846, -22, 2845, 2668, 220, -3023, -3567, 1098, 5421, 891, -7205, -5717, 4994, 11963, 5841, -8407, -15822, -5960, 11025, 15727, 4124, -9470, -12623, -3702, 8290, 11679, 3164, -7489, -10921, -5146, 6523, 14302, 7690, -8212, -15292, -6134, 8123, 12642, 3640, -7613, -8133, 1549, 6951, 2141, -3917, -3881, 271, 3984, 2685, -2139, -3526, 206, 3408, 2736, 220, -3814, -6570, -2101, 7387, 10949, 3164, -9870, -14562, -3417, 13420, 15693, -50, -14550, -12629, 2007, 13558, 11146, -2823, -12760, -9170, 1920, 9302, 9062, 1521, -7879, -9683]
3022i683P953Q884P02p249p655J184Q980M183o687p076K710P464K288n697p102
3037f801R87R185N949n384r395l593M405Q516O071l104j0032p416J835J0436J0937
3052A2596j037j5193j2174N552J6428Q947o967j5228p061Q569J2804K724o970
3065B990p183k232L009N850K413k392l798j902R86M046K063m260m726L592O967
3080E423K20p740o701K969J1694O620q401j3739k479J0411J1445J839r394j1661
3094i494j799R004J0099L236n692j1873o981P305J4231N309q685j3152l808J0107
3108b193J2291p61j1020o242L692O292K451k769l921N65L516K28l004j661M50
3123b086J570L500K339l474o738k753N234R583L779r276j3560j23J4204J1705
$$ y = [-9683, -1730, 7154, 7856, 607, -7048, -5864, 3116, 7299, 612, -6464, -3754, 3710, 5998, 301, -6801, -5814, 3371, 9320, 3936, -5459, -9052, -4647, 3869, 9940, 6836, -3196, -10612, -8777, 1659, 12596, 11559, -3634, -15808, -10256, 6172, 15119, 8152, -7076, -14137, -5568, 7236, 9960, 2990, -4193, -6425, -3416, 2434, 4847, 2455, -1343, -3245, -2259, 1787, 3850, -410, -5136, -1544, 5423, 5643, -2097, -8798, -5829, 5865, 12485, 4084, -9655, -12134, -1723, 9722, 11561, 2167, -9494, -11293, -2289, 7810, 11046, 5354, -6519, -13500, -6195, 8036, 13345, 4660, -8492, -12300, -2193, 10098, 9337, -1683, -7925, -4233, 2059, 4510, 1741, -2180, -1615, 1901, 2129, -875, -2536, -2086, -516, 2984, 5323, 1849, -4889, -7642, -2408, 7175, 10954, 1678, -11882, -12005, 2199, 13904]
3137A3904l058j3978j0871L654J3858Q693l922r890o798R2P657Q482M85q260p958
3152g910r5Q353Q851j648j0777n640N716P554K77n742l526L758O639q87q221m977
3168h275M352P607L531k929p190m819K897P822N035j752r095r288L196J4440R799
3183A5331o487j5544q898P084J5697O762r120j1896j999O778P048J644m443o129
3197d172j326L256M510L140j592n880l380L805M784j323m599q91N176O159k236
3212E431j0632n819P226J1365J984p824r300j158Q727Q940o16q504p916k014O573
3227c537J1777N353q122j3563n193P906J3403M425j0322j1834J185J0944O331
3240H753l586q079l975L303O066R93k364j025L09l15L5l22k353j214L071N257
$$ y = [13904, 10846, -3132, -14003, -10349, 3509, 12202, 8280, -1610, -8408, -8316, -659, 7823, 8308, 48, -7910, -8005, 348, 9199, 7551, -3226, -8866, -3150, 4404, 4681, -1061, -4587, -829, 5810, 4923, -3298, -8275, -3923, 3684, 7215, 4286, -2904, -7723, -4826, 2996, 8031, 6279, -2816, -12104, -8908, 5532, 15331, 8844, -6700, -15598, -8514, 7183, 13945, 4825, -7071, -9070, -2292, 4756, 6400, 1957, -4172, -5498, -2242, 2268, 5408, 3816, -2064, -5444, -1639, 3145, 1822, -2777, -3668, 1508, 7667, 5431, -5201, -11020, -3794, 7571, 9555, 1731, -7569, -8727, 0, 8940, 8324, -180, -8096, -10110, -3537, 8240, 13593, 5471, -8092, -13285, -5379, 8024, 12449, 2127, -9707, -8522, 2422, 8753, 5167, -2912, -6887, -3584, 2482, 3475, 1111, 86, 395, 80, 115, -207, -2560, -3774, -703, 4554]
3256D554K639m102r084m321Q126J1414O0j1136r261L146J2753Q704n783j3913
3270f204o614N256J0124P346p57q675q410j2O909P473O58p970q166K831J0833
3285D622N230o011q880k369N491O005j432n419J81N795K532m127n924k877L134
3300d049P133M185k473o152m838K49P123P623k768j1564o961O499J4197P291q719
3315F776j6130n892R924J2430K887o127p857k402M675N415N60l333m402k492L127
3330b841P390L004m953o415r97M133L275k227n040J591Q629L989p220r728k198
3345i608P081Q997J637p291o925P26O064N538P96o584r445j996Q993J1975M123
3360A4081r270j4402m387J0890J2033l57r566o364L073Q184L514n027o712j112
$$ y = [4554, 7193, 3091, -5993, -10314, -2188, 9226, 9286, -1850, -11111, -7965, 4788, 13492, 7709, -6204, -12818, -7562, 2562, 9908, 9151, 476, -7934, -7946, -1037, 6436, 7094, -876, -9042, -6211, 4622, 9852, 3841, -5039, -7408, -1917, 4088, 2656, -2763, -2582, 3213, 5745, 1618, -4306, -7183, -4049, 3084, 7269, 4796, -1356, -6194, -5945, 1178, 8801, 6033, -5531, -12492, -5993, 8204, 15495, 6776, -9354, -15246, -5322, 7108, 9995, 3868, -3989, -6391, -1716, 3699, 4259, 926, -3476, -5968, -2841, 4549, 7553, 2600, -3815, -4812, -679, 2596, 369, -4671, -3080, 5549, 9538, 2318, -7410, -9608, -2527, 6470, 8107, 816, -6109, -5383, 681, 6219, 7015, 431, -9014, -11010, -2017, 9958, 14081, 4811, -9591, -13978, -3088, 8945, 8588, -978, -7342, -4269, 3915, 7429, 2402, -4310, -5422]
3374e422K928L216K184M18k150j597N19K43j302k519j469L803Q160K957q118j0482
3390h631p51R303Q751j730j0614o693O434J1207L576o390r762n821L124R844P842
3405I689n23p552q474j825P684Q210j994q993m250N535Q903K426p177q228N02
3420f067O011K235k282j223J782L178J259l755o152k051L018N909N290M4p441
3435b45p508J516Q921O202m760j1680n277R713J5160K606j2103j2724k250Q180
3449d249R964K678n235n783j269K520L561J878l682n785n67N765O190Q51n348
3464A489o065N54N318L53n258j396N964O988J15p571q623l97P376O059M90l768
3480A628m561j511M352O097K71o917q662j905R571J3918K336j2281j3236o59J0129
$$ y = [-5422, -2494, 722, 2906, 3324, 1174, -423, 96, 339, -963, -3482, -4951, -1148, 7012, 9969, 1851, -8631, -9382, -79, 8672, 6942, -3672, -10365, -3931, 7276, 10852, 4462, -5300, -11121, -7997, 1847, 9689, 9166, 1614, -6860, -8685, -1001, 7209, 5215, -3778, -8028, -2493, 6410, 8836, 1659, -6569, -6067, -56, 2179, -103, -1326, 456, 3634, 4893, 1138, -5014, -7065, -4047, 1862, 7152, 7196, -245, -7753, -6237, 2684, 8886, 4126, -7554, -12831, -3118, 12042, 14648, 2545, -10179, -12429, -4249, 5715, 8393, 3158, -2625, -3894, -1374, 2187, 4065, 383, -5402, -5969, -204, 5986, 6837, 1489, -4576, -4022, 1296, 1649, -3609, -5005, 959, 7947, 8062, 491, -8132, -8529, -1153, 4906, 5396, 1628, -2933, -4444, -92, 6005, 6276, -641, -9303, -11208, -1637, 12281, 14617, 2336, -10900, -11559, -1430]
3495a430Q726j010q035l956M428N848N41l552m713k898J977N416L079q48k589
3510I84k094P49K191k046o050j017Q274R298j46j0161j0242J270J1006O590n216
3525C390q766j764N995P935K837o143r837m537L519Q871Q258K59q979q602O64
3540f900P431M831l006p060j780P172O854j551o602l674M86K002J454M11M15J876
3556B359J573j231k652l380l444R33P318O939o48p905p658J299R702O015p086
3571B134j1732j242J1141J1445Q14j0720j1706j750P657Q302K914k678o040l101
3585d562L382N006l94n337m990J211P726O442k755p587k627M015K252l206m206
3600e630J224Q010O361l091r089n514J235M865N464J333l417m472m85L759M685
$$ y = [-1430, 7296, 6286, -1749, -5705, -1277, 4571, 5112, 1560, -3153, -6051, -4074, 1342, 4421, 3573, 984, -1110, -361, 1830, -216, -6266, -7283, 991, 10289, 10143, -18, -10260, -8990, 2016, 8606, 3390, -5376, -7140, -1145, 6790, 9627, 3484, -6353, -10890, -7371, 1500, 9758, 10017, 1038, -7564, -6900, 531, 5362, 2356, -4704, -6484, 688, 7542, 5991, -611, -4285, -3799, -1797, -343, 68, 483, 2359, 3932, 2701, 49, -3331, -6775, -5842, 1476, 8415, 7767, -138, -7796, -6497, 3205, 9220, 2134, -9598, -10840, 301, 11746, 12560, 1840, -9866, -11616, -3959, 4343, 7257, 4579, -1461, -4562, -1180, 3826, 3432, -1905, -6895, -5684, 2042, 8484, 5729, -1858, -4485, -470, 1782, -1424, -5630, -4406, 3604, 9965, 6874, -2215, -7729, -6494, -1629, 3835, 5168, 1751, -2721, -3206, 553, 5238]
3615E238N22p473r216Q38J2021J0497n74j1038j0305K76Q389N466j511l559j476
3630a905J288K974K234k582n385l096J679N574N107p17n461j989L308J821m520
3645a670o167L56R585R908j739j2251q655L712R124M326l934p087k114O033P861
3660G288J857n824r828n939M348J1919P830l334r583o200K834P241J483n886m413
3675f207L710O591K442l208m519k217O06R03j43J449K822J177n5n43k560m712
3691d464l160K242P335O951r95r401o515M107Q259J859o874p783N25R520R237
3706A0843o98q721q868l424M647R469N545l549p107k907L578N665k21p842n874
3721i464M854R841L729n108o778j187M355J841m735m031L592Q242M089k927p696
$$ y = [5238, 5760, -1713, -10929, -10091, 1930, 12427, 11853, 815, -9490, -9214, -825, 4641, 3130, -429, -1905, -617, 2357, 4591, 2009, -3376, -6472, -4793, 781, 5888, 5171, -290, -2279, 1029, 2850, -1670, -7837, -7481, 2104, 12012, 10273, -1978, -10633, -6921, 2203, 6529, 2595, -4492, -6606, -573, 7288, 9145, 3321, -6507, -12446, -8098, 3821, 11651, 8317, -1266, -7466, -4632, 2609, 4092, -1794, -6207, -2497, 4094, 6536, 3328, -1191, -3408, -2802, -1899, -2042, -593, 2229, 3406, 3351, 2808, 248, -4464, -7624, -5382, 1953, 8904, 7909, -1492, -8007, -3900, 4359, 6218, -656, -8439, -7914, 1606, 10843, 10145, 1424, -7444, -10868, -6221, 3248, 8793, 5244, -1863, -4770, -1192, 4473, 4252, -3590, -9464, -4610, 5231, 8960, 3852, -2926, -4113, 242, 2083, -2652, -6683, -3091, 5151, 9240, 6313, -1383]
3736a383o599P2O062O066J618l612n402j064O086N828l006j0095o411M440J2037
3751D637Q207l980j0342n865J513M099L178O39j182j258O84J584J298j110m717
3766b615m446K056P012M113k029m285j018K390Q22n162n667L117J0248O414l626
3781G324r225o248J935O886M143k697m782k034L342P284M234o035j1915o046O263
3796g571J2767P559m926j1311l934N594N475j975n481j746M645O349P89m074l983
3811a823r40n1L00J228J227R73J868J782p29l905n626l463M337R799M738n034
3827D681p974k612M482N525m87o828m413L373P278N219K73o272q896l963M394
3842f220Q806N776k424p663l304N089N128k943p458l042N154Q504K841n325n636
$$ y = [-1383, -7982, -7910, -1848, 4218, 5836, 2224, -3178, -4242, 1844, 7672, 4666, -5429, -11840, -7400, 4637, 12844, 8864, -1478, -7343, -5830, -1731, 1447, 2086, 904, -354, 330, 1914, 3212, 2102, -2615, -7061, -5005, 2007, 6120, 4091, -194, -1212, 1178, 2000, -3162, -8829, -5712, 4536, 10950, 7324, -1901, -8149, -6214, 672, 4815, 2118, -2664, -4698, -1356, 5928, 10162, 4127, -7788, -13834, -7571, 5196, 12755, 7829, -3482, -7416, -1822, 3653, 1678, -3803, -5549, -904, 5445, 6234, 2160, -1823, -2763, -2814, -2514, -1286, -59, 914, 2782, 4564, 3835, -70, -5696, -9159, -4822, 4977, 9715, 4681, -3293, -5905, -1423, 4102, 3615, -3213, -7626, -4253, 3025, 8244, 8517, 2245, -6651, -10614, -6220, 2586, 8362, 5938, -1725, -5029, 60, 5188, 2245, -5213, -8255, -3101, 5403, 8244, 2919, -2717]
3857b717M87K643p13l004j560K539O309M531j944p248o657j519N460Q553K797
3872G957o293o990J201P617N012m716j1309n231P731J2178M225n092p848m462
3886f020R57L446K145N91J6n56j56J959J451l189n383j742L491N526K400k313
3902B623k991J239K159k996n998j694M763P946M132l342p571m162J073L738L811
3917B730K26m280l552L299P652L685n793j1843o310P326J3678N278o479q933k232
3932e548M265L964k090m754k76M748M379M94k406l895k927L71K324J215L34j22
3948G6J356L516J177n804q717j982P591R471K630o245p489l10N778L112l312m875
3964d027j948K640O381N053m58o032p689m020M080R332M689m020n903q69M059
$$ y = [-2717, -2230, 413, -300, -3304, -4864, -2325, 3984, 8515, 6571, -677, -7334, -8853, -3393, 5160, 7957, 1664, -5326, -4125, 3492, 8504, 3788, -7521, -12752, -5021, 7157, 11382, 6290, -1558, -6020, -5063, -1617, 528, 1119, 1135, 579, 423, 2382, 3833, 644, -4739, -6481, -2990, 2536, 4936, 2623, -368, 871, 3030, 34, -5964, -7658, -2895, 5051, 9183, 5841, -1730, -5892, -4819, -1081, 2730, 2956, -1324, -4876, -1577, 6075, 9760, 3967, -7876, -14186, -6860, 6818, 12096, 5617, -3316, -5548, -1283, 2681, 591, -4163, -4439, 309, 4688, 5182, 2776, -1119, -4046, -3675, -1351, -136, 198, 76, 1432, 4948, 6125, 321, -8396, -10378, -2787, 6684, 9314, 3069, -4420, -4730, 1048, 4160, 848, -4027, -5975, -3335, 3046, 8099, 7641, 1609, -6080, -10100, -6020, 3312, 8001, 3981, -1922, -2791, 1268]
3979A268K484l167o158j243N706O207K86l093k702j033M11k49j702n75K399M204
3995C043L713L04o048q871k477P396R204J484o678p114J944R012M115p242j0629
4010h844k225P619J0077L877m872p579l355O73K441L048J002j598j215K445K752
4025D246q25m540m612P3N013M222j045k320Q58K247m99m528n262j19O406O715
4041F030J067k992m690m040o19L787M062K11m127k813K628P833L420p360j1428
4056i031l371P816J0663M041n212p453j575L390J734j506j956n43K023M488K486
4071E994k319m962l522L77L840K439j981k255L383N718P8p508q713j000Q973R867
$$ y = [1268, 3752, 585, -5573, -6816, -1110, 5097, 5383, 2290, -412, -1445, -1034, -1283, -2985, -3560, -1161, 3043, 6756, 7060, 1012, -7859, -10336, -2940, 6264, 7748, 1070, -6044, -4100, 4912, 9027, 1785, -8844, -11069, -3450, 6627, 10504, 5632, -1947, -5302, -4629, -2188, 860, 1862, 264, -951, 1494, 4246, 3421, -1119, -5731, -5658, -645, 3577, 2532, 212, 1070, 3317, 2818, -1710, -6972, -7091, -685, 6030, 7097, 4105, -585, -4625, -5244, -1457, 2605, 2816, -1311, -4124, -1496, 6337, 9757, 2397, -9031, -12402, -4586, 6077, 10118, 4906, -2547, -4122, -732, 1002, -504, -2460, -3003, -980, 3508, 5994, 3675, -1287, -4809, -4432, -592, 1847, -134, -2389, 994, 6712, 6790, -718, -9431, -10431, -1458, 8409]
$$ [...]
8191e27
##END NTUPLES=NMR FID
##END=
