##TITLE=1H_TG-2271
 CDCl3, 8 sc, 
 17.12.2019
##JCAMPDX= 6.0         $$ Bruker NMR JCAMP-DX V2.0
##DATA TYPE= NMR FID
##DATA CLASS= NTUPLES
##ORIGIN= UXNMR, Bruker Analytische Messtechnik GmbH
##OWNER= root
$$ XWIN-NMR		Version 3.5
$$ Tue Dec 17 13:59:20 2019 Russian Standard Time (UT+4h)  she@DPX200
##.OBSERVE FREQUENCY= 200.1315
##.OBSERVE NUCLEUS= ^1H
##.DELAY= (6, 6)
##.ACQUISITION MODE= SIMULTANEOUS
##.ACQUISITION SCHEME= undefined
##.AVERAGES= 8
##.DIGITISER RES= 18
##SPECTROMETER/DATA SYSTEM= spect
##.PULSE SEQUENCE= zg30
##.SOLVENT NAME= CDCl3
##.SHIFT REFERENCE= (INTERNAL, CDCl3, 0, 15.7039)
##AUDIT TRAIL= $$ (NUMBER, WHEN, WHO, WHERE, WHAT)
$$ ##TITLE= Audit trail, XWIN-NMR		Version 3.5
$$ ##JCAMPDX= 5.01
$$ ##ORIGIN= Bruker BioSpin GmbH
$$ ##OWNER= she
$$ F:/spectra/data/she/nmr/H-F/1/audita.txt
$$ ##AUDIT TRAIL=  $$ (NUMBER, WHEN, WHO, WHERE, WHAT)
(   1,<2019-12-17 13:57:58.26 +0400>,<she>,<DPX200>,
      <created by zg, POWCHK disabled, PULCHK disabled
       configuration hash MD5:
       00 E9 B6 7A A2 85 ED C7 34 08 36 98 17 FE 4E 26
       data hash MD5: 16K
       01 8E 11 82 DD 22 08 70 07 66 B1 E0 B7 CC CB 54>)
$$ ##END=
$$ 
$$ hash MD5
$$ DF EF 39 EB 9A B5 E6 58 3A 07 64 40 A9 EF F4 1D
##$RELAX= 
##$RELAX= 
##$RELAX= 
##$RELAX= 
##$RELAX= 
##$RELAX= 
$$ Bruker specific parameters
$$ --------------------------
##$DU= <F:/spectra>
##$EXPNO= 1
##$NAME= <H-F>
##$PROCNO= 1
##$TYPE= <nmr>
##$USER= <she>
##$AMP= (0..31)
100 100 100 100 100 100 100 100 100 100 100 100 100 100 100 100 100 100 
100 100 100 100 100 100 100 100 100 100 100 100 100 100 
##$AQSEQ= 0
##$AQ_mod= 1
##$AUNM= <au_zg>
##$AUTOPOS= <>
##$BF1= 200.13
##$BF2= 200.13
##$BF3= 200.13
##$BF4= 200.13
##$BF5= 200.13
##$BF6= 200.13
##$BF7= 200.13
##$BF8= 200.13
##$BYTORDA= 1
##$CFDGTYP= 0
##$CFRGTYP= 5
##$CHEMSTR= <none>
##$CNST= (0..31)
1 1 145 1 1 1 1 1 1 1 1 1 1 1 1 1 1 1 1 1 1 1 1 1 1 1 1 1 1 1 1 1 
##$CPDPRG= <>
##$CPDPRG1= <>
##$CPDPRG2= <>
##$CPDPRG3= <>
##$CPDPRG4= <mlev>
##$CPDPRG5= <mlev>
##$CPDPRG6= <mlev>
##$CPDPRG7= <mlev>
##$CPDPRG8= <mlev>
##$CPDPRGB= <>
##$CPDPRGT= <>
##$D= (0..31)
0 1.2 0 0 0 0 0 0 0 0.06 0 0.03 0 0 0 0 0.0002 0 0 0 0 0 0 0 0 0 0 0 0 
0 0 0 
##$DATE= 1576576677
##$DBL= (0..7)
120 120 120 120 120 120 120 120 
##$DBP= (0..7)
150 150 150 150 150 150 150 150 
##$DBP07= 0
##$DBPNAM0= <>
##$DBPNAM1= <>
##$DBPNAM2= <>
##$DBPNAM3= <>
##$DBPNAM4= <>
##$DBPNAM5= <>
##$DBPNAM6= <>
##$DBPNAM7= <>
##$DBPOAL= (0..7)
0.5 0.5 0.5 0.5 0.5 0.5 0.5 0.5 
##$DBPOFFS= (0..7)
0 0 0 0 0 0 0 0 
##$DE= 6
##$DECBNUC= <off>
##$DECIM= 24
##$DECNUC= <off>
##$DECSTAT= 4
##$DIGMOD= 1
##$DIGTYP= 9
##$DL= (0..7)
0 120 120 120 120 120 120 120 
##$DP= (0..7)
150 150 150 150 150 150 150 150 
##$DP07= 0
##$DPNAME0= <>
##$DPNAME1= <>
##$DPNAME2= <>
##$DPNAME3= <>
##$DPNAME4= <>
##$DPNAME5= <>
##$DPNAME6= <>
##$DPNAME7= <>
##$DPOAL= (0..7)
0.5 0.5 0.5 0.5 0.5 0.5 0.5 0.5 
##$DPOFFS= (0..7)
0 0 0 0 0 0 0 0 
##$DQDMODE= 0
##$DR= 18
##$DS= 0
##$DSLIST= <SSSSSSSSSSSSSSS>
$$ [...]
##$SUBNAM2= <"">
##$SUBNAM3= <"">
##$SUBNAM4= <"">
##$SUBNAM5= <"">
##$SUBNAM6= <"">
##$SUBNAM7= <"">
##$SUBNAM8= <"">
##$SUBNAM9= <"">
##$SW= 24.9337058887773
##$SWIBOX= (0..15)
0 0 2 0 0 0 0 0 0 0 0 0 0 0 0 0 
##$SW_h= 4990.01996007984
##$TD= 16384
##$TD0= 1
##$TE= 0
##$TE2= 300
##$TE3= 300
##$TEG= 300
##$TL= (0..7)
0 120 120 120 120 120 120 120 
##$TP= (0..7)
150 150 150 150 150 150 150 150 
##$TP07= 0
##$TPNAME0= <>
##$TPNAME1= <>
##$TPNAME2= <>
##$TPNAME3= <>
##$TPNAME4= <>
##$TPNAME5= <>
##$TPNAME6= <>
##$TPNAME7= <>
##$TPOAL= (0..7)
0.5 0.5 0.5 0.5 0.5 0.5 0.5 0.5 
##$TPOFFS= (0..7)
0 0 0 0 0 0 0 0 
##$TUNHIN= 0
##$TUNHOUT= 0
##$TUNXOUT= 0
##$USERA1= <user>
##$USERA2= <user>
##$USERA3= <user>
##$USERA4= <user>
##$USERA5= <user>
##$V9= 5
##$VALIST= <valist>
##$VCLIST= <CCCCCCCCCCCCCCC>
##$VD= 0
##$VDLIST= <DDDDDDDDDDDDDDD>
##$VPLIST= <PPPPPPPPPPPPPPP>
##$VTLIST= <TTTTTTTTTTTTTTT>
##$WBST= 1024
##$WBSW= 4
##$XGAIN= (0..3)
0 0 0 0 
##$XL= 0
##$YL= 0
##$YMAX_a= 570727
##$YMIN_a= -296715
##$ZGOPTNS= <>
##$ZL1= 120
##$ZL2= 120
##$ZL3= 120
##$ZL4= 120
##$ABSF1= 10
##$ABSF2= 0
##$ABSG= 5
##$ABSL= 3
##$ALPHA= 0
##$AQORDER= 0
##$ASSFAC= 0
##$ASSFACI= 0
##$ASSFACX= 0
##$ASSWID= 0
##$AUNMP= <proc_1d>
##$AZFE= 0.1
##$AZFW= 0.1
##$BCFW= 1
##$BC_mod= 2
##$BYTORDP= 1
##$COROFFS= 0
##$CY= 11.3945322036743
##$DATMOD= 1
##$DC= 2
##$DFILT= <>
##$DTYPP= 0
##$F1P= 16.9975609425685
##$F2P= -3.02152046262296
##$FCOR= 0.5
##$FTSIZE= 0
##$FT_mod= 4
##$GAMMA= 1
##$GB= 0.15
##$INTBC= 1
##$INTSCL= 1
##$ISEN= 128
##$LB= 0.24
##$LEV0= 0
##$LPBIN= 0
##$MAXI= 10000
##$MC2= 0
##$MEAN= 0
##$ME_mod= 0
##$MI= 1.114404
##$NCOEF= 0
##$NC_proc= 0
##$NLEV= 6
##$NOISF1= 3.799351
##$NOISF2= 2.8
##$NSP= 1
##$NTH_PI= 0
##$NZP= 0
##$OFFSET= 15.70392
##$PC= 1
##$PHC0= -9787.163
##$PHC1= 16.80086
##$PH_mod= 1
##$PKNL= yes
##$PPARMOD= 0
##$PSCAL= 0
##$PSIGN= 0
##$REVERSE= no
##$SF= 200.130013532006
##$SI= 16384
##$SIGF1= 3
##$SIGF2= 2
##$SINO= 400
##$SIOLD= 16384
##$SREGLST= <1H.CDCl3>
##$SSB= 0
##$STSI= 0
##$STSR= 0
##$SW_p= 3612.71676300578
##$SYMM= 0
##$S_DEV= 0
##$TDeff= 0
##$TDoff= 0
##$TI= <>
##$TILT= no
##$TM1= 0
##$TM2= 0
##$TOPLEV= 0
##$USERP1= <user>
##$USERP2= <user>
##$USERP3= <user>
##$USERP4= <user>
##$USERP5= <user>
##$WDW= 1
##$XDIM= 8192
##$YMAX_p= 0
##$YMIN_p= 0
$$ End of Bruker specific parameters
$$ ---------------------------------
##NTUPLES= NMR FID
##VAR_NAME=  TIME,          FID/REAL,        FID/IMAG
##SYMBOL=    X,             R,               I
##VAR_TYPE=  INDEPENDENT,   DEPENDENT,       DEPENDENT
##VAR_FORM=  AFFN,          ASDF,            ASDF
##VAR_DIM=   8192,          8192,            8192
##UNITS=     SECONDS,       ARBITRARY UNITS, ARBITRARY UNITS
##FACTOR=    0.0002004,     1,               1
##FIRST=     0,             0,               0
##LAST=      1.6414764,     0,               0
##MIN=       0,             -296715,         0
##MAX=       1.6414764,     570727,          0
$$ Real data points
##PAGE= N=1
##DATA TABLE= (X++(R..R)), XYDATA
$$ [...]
3472G300O122r565j0567l108M011J0389Q789o766j3460m49R443O306j619q953
3486b127j0734M415J8253O993j0948j1334l620M075J0041M255r431q922N852Q827
3500E595M148j557r559j1142L252J3854M631l752m693m919M66R384L438j0499
3514a353r040K759Q098R004K669j0453j1477L332Q856J276k737k251l089L347
3528a059R401K2q984n410m66J099O952O376l840o643N43J986Q56K788l353q960
3544h692J059J2334O125l931p009p650j040R932O055o764o067L482N092L729M74
3559G129q697q793L834R027K199o11o21m289j371M514L53n138r38J083p1N161
3575B771O073l810p821j513J300J092M550J268m891p08N480M41k795j608m067
$$ plain form
3472 7300 13422 3857 -6710 -9818 -5807 4582 13371 6605 -6855 -7304 2139 8445 6826 -2127
3486 -2127 -12861 -8446 9807 16800 5852 -5482 -9102 -5027 5014 9269 -162 -9084 -3232 5595
3500 5595 9743 8186 -1373 -12515 -9263 4591 9222 5470 777 -4142 -3676 5708 9146 -1353
3514 -1353 -10393 -7634 464 9468 12137 1684 -9793 -6461 2395 3671 934 -1317 -4406 -1059
3528 -1059 8342 8364 -620 -6030 -6496 -5397 1555 7931 4091 -2552 -2009 -23 833 3621 268 -8692
3544 -8692 -7633 4701 10826 6895 -114 -7764 -8804 1128 7183 419 -5648 -2166 2926 6655 7129
3559 7129 -1568 -10361 -6527 2500 4699 4088 3467 -822 -2193 2321 2674 -2464 -3402 -2319 -2390 2771
3575 2771 8844 5034 -2787 -4300 -3000 -1908 2642 3910 -981 -1689 3791 4232 1437 -171 -4238
3590d238l712N596P689J94j841k207n222j281O982K432o072l388K566M296O941
3605H735J022j1584j0494M792R942L904j987n879n000O326J0046l237j2358m702
3619a0474M124Q128Q021r52j0607m474M628L219o77p28l452k932O186Q345j161
3634G194n736n510m968K866J0636L981p850n178K252M410M453j777j1321o634
3648a3182Q358J1005K380l152o215o734L200Q463K45o988l038J299M855R989J502
3663A1987j3237j1318K679R727Q142L36j0179q403Q640J3559j522j3294r437R09
3677a1411J2003J3635k343j4616n965O361O413O14m384p916p89J1665Q297l435
3691H129p289n673l500L797R205J159n702j696J657K445M032k497j1048m148Q257
$$ plain form
3590 -4238 -7950 -2354 5335 5529 3688 1481 -3741 -5022 1960 4392 -1680 -5068 -2502 1794 8735
3605 8735 9757 -1827 -12321 -7529 2413 6317 4330 -1549 -6549 -223 9823 6586 -5772 -10474
3619 -10474 -6350 1778 9799 8847 -1760 -6234 -1606 1613 936 208 -3244 -6176 10 8355 7194
3634 7194 1458 -4052 -9020 -6154 4482 8463 613 -4565 -2313 2097 6550 4773 -6548 -13182
3648 -13182 -4824 6181 8561 5409 -806 -7540 -4340 4123 4368 -2620 -5658 -4359 496 10485 11987
3663 11987 -1250 -12568 -9889 -162 7980 8316 -1863 -10266 -1626 11933 10411 -2883 -12320 -11411
3677 -11411 592 14227 11884 -2732 -8697 -2336 4077 4691 307 -7609 -8398 3267 11564 8129
3691 8129 840 -4833 -8333 -4536 4669 5828 126 -1570 87 2532 6564 4067 -6981 -11129 -2872
3706b872Q970K163j649p115n725M657O199l612n269Q08K874L932M979j798q067
3721a525m536J012R48M911O025l518o407J908N693K06l907o095n283O457J3745
3736I634K017r740o319K8K996M125q93p892n25R320N857k966m042m154m506K435
3752d625N065P01OK420j787l005K860M75o166k725L110K462N371M262l592q183
3768c351o64J500k30K132J921k381O3N267J035m140k876l889l826N630J0838Q14
3784G843o159l951q61K656N485l191j0484j078J0705Q605O74o499j1353l481R588
3799a501Q312m994o421Q86M904N896K073r226r938J472P348M175K751p48o167
3814a178l025N147K843l896l262k026k38Q154Q594l080j0078m384P82M892N833
$$ plain form
3706 -2872 6098 8261 6612 -503 -6228 -1571 4628 1016 -4253 -3445 -571 3361 8340 6542 -1525
3721 -1525 -6061 -5049 -4101 810 6835 3317 -3090 -1182 4511 4717 810 -5285 -10568 -4111 9634
3736 9634 11651 1911 -4408 -4380 -1384 2741 1848 -6044 -6569 2751 8608 5642 1600 -2554 -7060 -4625
3752 -4625 440 1141 1147 3567 1780 -1225 1635 2110 -4056 -6781 -3671 -1209 4162 8424 4832 -3351
3768 -3351 -4015 -2515 -2745 -613 1308 -1073 -1010 4257 5292 1152 -1724 -5613 -9439 -3809 7029 7843
3784 7843 1684 -2267 -3128 -472 5013 1822 -8662 -9740 965 9570 10244 3745 -7608 -11089 -1501
3799 -1501 6811 1817 -4604 -3718 1186 7082 9155 -71 -10009 -8537 -1189 2986 5737 4989 -1178
3814 -1178 -4203 944 3787 -109 -3371 -5397 -5635 2519 11113 8033 -2045 -6429 -5647 -755 5078
3829E078j364q511%R257M054l521n858o926k563Q659R770o02m699m388k485M078
3845b1O773k669j2122j819Q243R427M753n402j4154n843J0648J0063k719p903
3859b745m675M157J2084N907j1451j4434n58R713P348L365m597q711J132P965
3873D500J356o333m858k195L160J0728M979o703o945j449L6K501M528j533n597
3888c825J713P032J389k084m420p186j026P927N542j465r98j271k746J526L138
3903C246m151n516J418M722L276N113j470r004n417L091M218J995O20m127k309
3918d295P399O906o126r853k893K713O490P178k284p076m24M624j39k672k823
3933c275l718K265R227L701m415k888j536l575k16L785J250o17K229J015j497
$$ plain form
3829 5078 3714 -4797 -4797 4460 8514 4993 -865 -7791 -10354 -1695 8075 7473 2774 -1614 -4099 -21
3845 -21 6752 4083 -8039 -9858 -1615 7812 12565 7163 -6991 -12834 -2186 7877 5158 -2745
3859 -2745 -7420 -3263 8821 14728 3277 -11157 -11715 -2002 5346 8711 4114 -4597 -3465 4500
3873 4500 5856 -477 -5335 -7530 -4370 6358 11337 4634 -2311 -3760 -3724 -1223 3305 1772 -3825
3888 -3825 -2112 4920 6309 4225 -195 -7381 -8407 -480 5062 3597 2599 1328 -1418 108 3246
3903 3246 -905 -6421 -5003 -281 2995 8108 6638 -2366 -7783 -4692 -474 1521 2141 -1986 -4295
3918 -4295 3104 10010 3884 -5969 -8862 -6149 341 7519 5235 -1841 -2265 2359 2220 -452 -3275
3933 -3275 -6993 -4728 4499 8200 3785 897 -639 -4214 -4430 -645 605 -12 2217 3232 1735
3948A735J190p09o616k634L948L254K904M416j858p335k367L495M66q43L85k549
3964c118J853P695L063o441o985l633J51P650Q265l619q065R62O154K015k848
3979C099p549p214M927J3992N233o702p997l516K332P180J531r329m610Q245Q441
3994H063J127l931p296o008L346O865R73j207L74k403j36M886M86p427m871J830
4010e329L610O944N286n304r736j099M784K866Jl437n225M049J0669K001p850
4025B230o923l555R87Q538P277m442p728J96M774M426L66r352j0596M949J4843
4040E990O178n217q749p176K929J0590K577j0938o595O069J0252O092l862j3268
4054e128p742P455R235j61l064j792j200L682N618l836q848j884K956M427M865
$$ plain form
3948 1735 2925 2216 -4400 -7034 -3086 168 3072 7488 5630 -1705 -4072 -577 -111 -954 -569 -3118
3964 -3118 -1265 6430 9493 3052 -3933 -7566 -7415 235 8500 4881 -3184 -2222 3932 5947 3099
3979 3099 -4450 -11664 -6737 7255 12488 5786 -2211 -5727 -3395 3785 5316 -4013 -8623 -378 8063
3994 8063 9190 5259 -2037 -8045 -4699 2166 3139 1932 2306 -97 -233 4653 5139 -2288 -7159 -5329
4010 -5329 -1719 5225 10511 5207 -4529 -5628 -844 2022 2023 -1414 -6639 -2590 8079 10080 2230
4025 2230 -4693 -8248 -7261 1277 8554 4112 -3616 -3420 1354 5780 6146 -3206 -13802 -8853 5990
4040 5990 12168 6951 -1798 -8974 -6045 4545 7122 -3816 -10411 -4342 5910 12002 8140 -5128
4054 -5128 -12870 -5415 3820 3659 595 -1197 -2397 1285 6903 3067 -5781 -7665 -4709 -282 4583
4069D583K071n099m598J157P72k57J089j282l768L809P995K97n542m076l289l6
4085f174N522M344k199j254J118j158P53K554m736o906J769P379M343J579k454
4100D480q388k799O522L652l968l689k5M579Q164J555j0038q679K670N097K012
4115A145Q57m41k169K273L682l716n126o66r4R68N858L642k786j639j402l654
4131c268k106M983J187k196J205K917L03M24n19p098m173M105N453K438J919k494
4147C080o016L78N674r48o066k052J682N538P807O14r954p767K069N088M295M41
4163C863o176l924Q088R193m349r831n907N32P842R324j443q540k049L963K324
4178B910p6l479o882K33R711O530k311l846m064m545J606N927L34l025M9J504
$$ plain form
4069 4583 6654 1555 -3043 -1886 -1114 -1371 -282 -1564 -5332 -1523 6472 6769 1227 -2849 -6138 -6174
4085 -6174 -652 3692 1493 239 1357 199 952 3506 -1230 -8136 -6367 1012 5355 6934 4480
4100 4480 -3908 -6707 -185 3467 -501 -4190 -4215 364 8528 10083 45 -8634 -5964 -867 1145
4115 1145 2002 1561 -608 1665 5347 1631 -3495 -4161 -4255 -3287 2571 6213 3427 1788 386 -3268
4131 -3268 -5374 -391 796 -1400 -195 2722 3025 3449 2930 -4168 -8341 -4236 1217 3655 5574 3080
4147 3080 -2936 -2558 3116 2168 -3898 -5950 -4268 1270 9077 9691 -263 -8030 -5961 -873 3422 3863
4163 3863 -2313 -6237 1851 11044 6695 -3136 -9043 -8511 -669 8655 7212 -1328 -3377 586 2910
4178 2910 2834 -645 -7527 -7294 2417 8947 6636 2790 -1274 -5819 -4213 1714 2048 -977 -928 576
4194E76K315M194k141j0088m669N650O327L972Q63m988o335K873N998j678n161
4209b292l269l45P095R642k99j0965o821J436M545N785R32p162m076P415Q896
4224A0517k282q293q352k348R393J1868j317r825l509K519M911K763m192r864
4238h011o28J1326P714k146o004o509j735N901M769l890l686J850K840K338K361
4253F490m011p537j253M545K658K430J687l040l307K089J308k435j232p28j357
4268c693L741P017l57o036k779j637j75M733L358l899l003L291L131O43j570n616
4284b851o255N054Q796Q29l444j636k350M44M372j081o817j164N465M364K872
4299F598j265o659m603L096L356j426R7J711o88J278K979k473n239J0M23k9L429
$$ plain form
4194 576 2891 7085 4944 -5144 -9813 -4163 2164 6136 6999 2011 -4324 -1451 4547 2869 -2292
4209 -2292 -5561 -5906 1189 10831 10532 -433 -7254 -5818 -1273 4512 5444 -1718 -5794 1621 10517
4224 10517 8235 -58 -8410 -10758 -1365 10503 9186 -639 -4148 -1629 3282 6045 1853 -8011
4238 -8011 -8639 2687 10401 8255 2251 -4258 -5993 -92 4677 787 -2899 -1049 1791 4129 6490
4253 6490 2479 -5058 -6311 -1766 892 3322 5009 1969 -1338 751 2059 -376 -1608 -2336 -3693
4268 -3693 48 7065 6708 672 -2107 -3744 -3919 814 4172 273 -2730 561 3692 4335 2765 -2851
4284 -2851 -9106 -4052 4744 5573 2129 493 -1857 -1413 2959 1878 -4939 -6103 -638 3726 6598
4299 6598 5333 -1326 -5929 -2833 523 -903 -806 905 217 1495 4474 2001 -3238 -3228 -2805 -2834 595
4316E95M599j546k860q96k582m44L898O45m794j69N717L531m89k957p768l426
4332h946O772P258j328l554j050k79L731L274n189q730O82O944N282K759k976
4347D650q169k851O642L877k908m049k155K237Q428N596p600r821j324M325M989
4362A867L361k893n827J869O910N04n124m135l554J922Q718M599l706m243j430
4377a162j713J357M641k088n385J335M981L951J373m338r483l100Q278O780j155
4392D272l016l398o39O216M182o964q864N23O359O598M028m203r335k093O128
4407b06L206j110l321l883J596R634N231p679r656j920L682P051M677m880p925
4422e503L165P031J003m255n709l975L798R933K062n571l228j76m19J829J507
$$ plain form
4316 595 5194 3648 788 -108 -2690 -3134 764 1409 -3385 -3554 2163 5694 5205 2248 -5520 -8946
4332 -8946 -2174 5084 3756 202 -848 -1127 2604 5878 689 -8041 -7359 -415 4867 7626 4650
4347 4650 -3519 -6370 272 4149 1241 -2808 -4963 -2726 5702 11298 3698 -6123 -7447 -3122 1867
4362 1867 5228 2335 -3492 -1623 5287 5791 667 -3468 -7022 -5100 3618 8217 4511 268 -1162
4377 -1162 -2875 -1518 3123 1035 -4350 -3015 1966 5917 7290 2952 -6531 -9631 -1353 5427 4272
4392 4272 1256 -2142 -2781 3435 7617 653 -8211 -7688 -1329 5269 9297 5094 -4241 -6334 -206
4407 -206 3000 1890 -1431 -5314 -3718 5916 11147 3468 -6188 -8108 -4426 2625 7302 2422 -5503
4422 -5503 -2338 4693 5696 1441 -4268 -8243 -4445 5488 7550 1979 -1249 -1425 -1844 -15 1492
4437A492l682k168M168L136M85Q60k411o695j188M927K317M67J030k238k276L483
4453A707K564n158l744Q25J454L396N177j510o289j133J343M44J327R36l204j315
4469c180N676L617k702l913l698k228M438O900n11n047J3J667M27J322k475n492
4485e186P73O087K775j106n70k742l066J943J863j375q14K477K1n25K808J76m815
4502a276j983L81J42M178M205k494n131O85K250j50K12k543l911J974Q359K383
4518G281m403m641l342L16O349L680n207m831L139M167K183p0o481p206L336Q686
4534B956K315k185l690l274J953O620j71p919l847L672M864M786J011p608o522
4549g039L281M774J073j510k076k407L824O122j153o568l470l55J592O723L358
$$ plain form
4437 1492 -2190 -4358 -190 2946 3431 4291 1880 -4815 -6003 -1076 1241 1708 2738 500 -1776 1707
4453 1707 4271 -887 -4631 -3806 -2352 1044 6221 4711 -1578 -2711 -1368 -924 403 1339 -1865 -3180
4469 -3180 2496 6113 3411 -502 -4200 -6428 -1990 4910 4399 -648 -635 1032 1459 2781 306 -5186
4485 -5186 -4413 1674 4449 3343 2773 31 -3035 -1092 771 -604 -1418 1059 1080 555 3363 3539 -1276
4502 -1276 -3259 -2878 -2736 1442 5647 3153 -1978 -1293 957 807 1019 -1524 -5435 -3461 4898 7281
4518 7281 2878 -1763 -5105 -4789 1560 5240 33 -4798 -1659 2508 4691 4621 -1860 -9066 -5730 2956
4534 2956 5271 3086 -604 -3878 -1925 4695 4524 -3395 -7242 -3570 1294 6080 7091 -517 -7039
4549 -7039 -3758 1016 2089 579 -1497 -3904 -80 6042 4889 -1679 -5149 -5504 -3912 2811 6169
4564F169m714n100J454K640J138J4m273n068L691R191K068m171m963m651J102
4579e473P859K805o264l937L169M212L135r48p595o339M777P305K073j022l815
4594e8m729K570O749l48o647l319J928M286O241N88p967o008K745M864J874r35
4610A834l978k475N487O455k916o829k520N50K715N227O25m558j058J798L44n86
4626A15K89k558k431L976M398p62q93j518m610k84M714J545k402m49J20J030K597
4643B877J131n691m082K759K952J693J971j190m500j26L499n26k120k20j104J178
4659a499M852J570m172l049p97R0K172L983j656m103J615L017k39r62j547l599
4675d324K48N488J994j949n46j450k511J401L046j711k625J494R62O70L346k53
$$ plain form
4564 6169 1455 -3645 -2191 449 1587 1601 -2672 -7740 -4049 5142 7210 3039 -1924 -6575 -5473
4579 -5473 2386 5191 -1073 -5010 -1841 2371 5506 4558 -3037 -9376 -4599 2706 4779 3757 -58
4594 -58 -4787 -2217 4532 4184 -2463 -5782 -3854 432 6673 7261 -706 -6714 -3969 895 2769 1834
4610 1834 -2144 -4619 868 7323 4407 -2422 -4942 -4392 -1677 3550 4175 -383 -1441 357 701 115
4626 115 404 -2154 -4585 -609 3789 3027 2134 616 -3994 -4278 436 1981 -421 -870 -750 280 2877
4643 2877 4008 -1683 -5765 -3006 -54 1639 3610 2420 -2080 -2206 1293 767 -1353 -1573 -2677 -1499
4659 -1499 3353 4923 751 -2298 -3095 -3005 -833 3150 1494 -2609 -994 2023 1784 822 -725 -4324
4675 -4324 -4076 1412 3406 1457 911 -539 -3050 -1649 1397 -314 -2939 -1445 -483 187 3533 3280
4691C280n554l034K435K990K243R19m537l261M610M380k424m240j975m31M257
4706c42N794n18o640k298K167K247K327p18n496j585N986M558j387l277m597k302
4722f081M130O958q08n412k052J705L798L023l051p859p54O888M637l85k354m967
4738b584k349N089M508k841m349k82J298L647M004k213p037j621K823K533L172
4753C798L44n806l286N472M882j774m216m050p64O416O756k456o908k380J762
4768b210L632L206k143p208M4P180L482k071l165m377j508N155M742j923l848
4783a012q26L33L110M203l180p861k42N210M195P10j464o074j725N459L098l366
4799E68k849p93J326M524K988l897n458O47K075L57K359Q30l328j523L099J703
$$ plain form
4691 3280 -2274 -5308 -2873 117 2360 3279 -1258 -4519 91 4471 2047 -2193 -4168 -4599 -342
4706 -342 5452 4934 -1706 -4004 -1837 410 2737 2019 -3477 -5062 924 5482 4095 818 -3779 -6081
4722 -6081 -1951 5007 4199 -1213 -3265 -1560 2238 5261 2210 -5649 -6403 485 5122 4737 2383 -2584
4738 -2584 -4933 156 4664 1823 -2526 -2808 -1510 2137 6141 3928 -3109 -4730 -1907 626 3798
4753 3798 4142 -1664 -4950 522 5404 3630 -586 -4636 -5400 1016 7772 5316 -1592 -3972 -2210
4768 -2210 1422 4628 2485 -4723 -4679 2501 5983 3912 747 -3630 -5138 17 4759 2836 -1012
4783 -1012 -1838 -1505 1605 5808 2628 -5233 -5475 -265 3930 4640 3176 -2898 -4623 836 3934 568
4799 568 -2281 -3074 -1748 2776 5764 1867 -3591 -2944 -869 -512 1847 2677 -651 -2174 925 2628
4815B628j237q59l458j038L851M905k163k287j039j242N31L476k51l895m60L592
4831A054J133J64k62l676k229K733K336j82J122j060l238O81M146k91l912q31
4847b312J169J025L103J332m258k926J870J157O98J473j828l275K531L755q26
4862B688k419q30j790l07L896K944k681j818p13JK262K576l216m359J691L961
4878A886J305R14k510m919l27N148K551k419k301j430L99M867K529m922m835P71
4894c293K771K840K639k562n972K04N184K257j868k976k949N42O745K812m288
4909B086m591r88J556L938L241l774o236J884N016J898p63l886n057J732O598
4924B654K600l621k809j730L90M873K923n263n320K022L933L028N87l655n450
$$ plain form
4815 2628 1391 532 -2926 -3964 -113 4792 2629 342 -697 -1939 -1408 2068 1817 -2078 -2538 1054
4831 1054 2187 2351 2089 -1587 -3816 -1083 1253 1071 2193 1133 -2105 -1424 2722 2431 -1481 -2312
4847 -2312 -1143 -118 2985 4317 59 -2867 -997 160 858 2331 503 -2772 -241 3514 2688
4862 2688 269 -561 -2351 -2658 1238 4182 1501 -317 -1030 -1029 1233 3809 593 -3766 -2075 1886
4878 1886 3191 4105 1595 -3324 -3651 1497 4048 1629 -672 -2102 -1703 3164 5693 771 -4064 -3293
4894 -3293 -522 2318 4957 2395 -3577 -3373 1811 4068 2200 -776 -3725 -3183 3562 6374 2086
4909 2086 -2505 -3493 -1937 2001 5242 1468 -4768 -2884 2132 4030 3267 -619 -5676 -3944 2654
4924 2654 5254 1633 -1176 -2906 -2516 2357 5280 17 -5303 -3281 652 3680 4267 612 -4838
4939d838J166N321K167j944k600l203O68O385K923n504m940N30K945L852K066
4954D994m129n565J505N405J425j077l740l863K006O799J340m358l128l79R80
4969a785L673K532m106m141J992L107J725L57l385n086K412N409J052k369j958
4984e71j688M66M417J296m247k883J832J758K054J198k750l962J660K654n1J14
5000A297j14k744k25L884J449k582j643p90k64L202K372k461l202J057J542j85
5016E93J499l76l658r2L941Q41j471l79j835j411K689K774j954j130k2j289J112
5033a68L440o45m313o20J988R40J845K80l664k160K888K655o37j169j611j888
5049b839K308M123j006l542o35j05R12K789J655m065l072K048K226J690K88l910
$$ plain form
4939 -4838 -3672 1649 3816 1872 -728 -3931 -3263 3122 6045 541 -4399 -3869 -924 2928 4994
4954 4994 865 -4700 -3195 2210 3635 2558 -1182 -5045 -3039 3760 5100 742 -2386 -2765 -1785
4969 -1785 1888 4420 314 -3827 -1835 1272 2997 3354 -31 -5117 -2705 2704 3756 1387 -571
4984 -571 -2259 -1793 2624 3920 -327 -3210 -1378 380 2434 3632 882 -3080 -1420 1234 1183 1297
5000 1297 1183 -1561 -1786 2098 3547 965 -678 -1468 -1732 1470 3842 1381 -1821 -764 778 593
5016 593 2092 1716 -1942 -2034 1907 2748 1277 898 -937 -2348 341 3115 1161 31 9 -1280 -168
5033 -168 3272 2627 -1686 -2306 -318 622 2467 2747 -917 -3077 -189 2466 1829 660 -951 -2839
5049 -2839 -531 3592 2586 -956 -1591 -1696 -784 2005 3660 -405 -3477 -1429 797 2487 2775 -1135
5065a135l629K976M970l8k974j808j923J998N100L31n334k401J874K752K446j9
5081C186m475l626L415L758L12j140k459l295K370N752Nm608k161j97K486M235
5097C558N23n807l145K864L338J848l84m557l928L960N552k28l848k648r25K827
5113a000N487m46n880k762K426K852K723l42m854l247M015M424l22k234l001k385
5129d546L707N810j099m846k571J040K804L617m51n466k388L769L725k34j209
5144A662l912k003L570M581r16l103j591q82K624L559l64m674j871J984K203K199
5160C066r9m641k665L695L702q16j989j963o79K367L437j245l921k30J070N37
5176c74K560P41l653k211K284J497J14J39j717k243K012L442m78k135o66j142
$$ plain form
5065 -1135 -4764 -1788 3182 3144 170 -1638 -3561 -1563 3537 3868 -1466 -3867 -1993 759 3205 3186
5081 3186 -1289 -4915 -1500 2258 2570 1430 -1029 -4324 -1954 3798 3803 -805 -2966 -3163 -677 3558
5097 3558 4081 -1726 -4871 -2007 1331 3179 2795 -1762 -5690 -1730 3822 3594 -254 -2902 -3827 -1000
5113 -1000 4487 4041 -1839 -4601 -2175 677 3400 3058 -1796 -5043 -1028 3396 3074 840 -2161 -4546
5129 -4546 -839 4971 3872 -974 -3545 -2505 299 3916 3465 -2001 -4389 -620 3105 2871 1662
5144 1662 -2250 -4253 -683 3898 2982 -121 -1712 -2594 30 3589 3225 -1449 -3320 -1336 867 3066
5160 3066 2967 -1674 -4339 -644 3058 2242 253 -1710 -2389 -22 3415 2170 -1751 -1981 -911 -374
5176 -374 2186 2927 -726 -2937 -653 844 958 1097 -620 -2863 -851 2591 2113 -22 -688 -1830
5192a830L11L235O18l156r43J479L75J022P92k239k409J554J963L31J67m51k752
5209a933j36K948R56k025o38o82j22K645K178k217l118K14Q97J372J722n57l567
5226b063J7K934Q40o74o52k727q42L694L105k019k188r70o57J827L383j665l502
5243b159m92K833J784J166j312m597j319M128K936q77j633k019r45L107L518k251
5259A868m124p57J300K692L598j301n374j680L464L238k23j594l731r40N249L978
5275E663l149m288j659J118L091L428j942m899J15K885K208L82j942m389j125
5290d503N417L509j524k758k482j126M311L620k740m599p6K736K642J766k269
5305A924n837k76M464K839p42j911k416p74M049K728k959l547j192J820L311L275
$$ plain form
5192 -1830 -1519 1716 2334 -822 -1765 -286 89 1111 1903 -336 -2745 -1191 772 1103 1270 819 -1933
5209 -1933 -2069 879 1835 -190 -828 -1510 -1632 1013 3191 974 -2144 -1930 -1033 339 2061 1504 -2063
5226 -2063 -2046 888 1728 1054 402 -2325 -3167 527 3632 1613 -575 -1545 -2202 -375 3008 1343 -2159
5243 -2159 -2651 182 1966 3132 1820 -2777 -4096 32 2968 2091 458 -1561 -2506 601 4119 1868
5259 1868 -2256 -3013 -1713 979 4577 3276 -2098 -3778 -314 2924 2701 1107 -2624 -3564 1685 5663
5275 5663 2514 -1774 -3433 -2315 776 4204 2262 -2637 -2522 363 2571 2953 1011 -3378 -4503
5290 -4503 914 4423 2899 141 -2341 -3467 844 4464 1724 -2875 -2951 -215 2427 4193 1924
5305 1924 -3913 -4189 275 3114 2372 461 -1955 -2729 1320 4048 1089 -2458 -3650 -1830 1481 4756
5321D756k133n512o02L203J957L41j454l869k76N435K774k913l174k028K02L824
5337E31L062k260l579N70J856J391L61j540l911J43M298J843j149j213k304p26
5353b627K925K092k483j981N43J227J346K125j777m183N08K173R72J58P3j493
5369d02p47J579J050j494q36j86j114J926L341o86k369q31k50j26K406Q68k998
5386h69r70K343J596J15o25k808j997K423L159n68j377M5q70J63J851J10k964
5403a243n89J180J099K092N27k652k721J065J974q5N54k56k366N95L445K92k733
5420A78j254j281P23L241K090k236k499L36N95J217J272k332l443J140M605J857
5436D209j664k728l057oM698J713k500k393K45J670K505J204m490m387J202N211
$$ plain form
5321 4756 2623 -2889 -3491 -288 1669 2010 556 -3313 -3589 1846 4620 1707 -1467 -3495 -3293 531
5337 531 3593 1333 -2246 -1676 180 1571 1932 392 -3519 -3376 922 2765 1616 403 -1901 -2627
5353 -2627 298 2390 -93 -2074 -1531 -304 1042 3167 1390 -2793 -2285 -112 860 1018 1091 -402
5369 -402 -1149 430 1480 -14 -850 -1036 -2150 -224 3117 2431 62 -769 -1019 -1145 1261 2129 -869
5386 -869 -1839 504 2100 2215 1590 -1218 -3215 -792 2367 1799 422 467 -403 -240 1611 1721 -1243
5403 -1243 -1832 -652 447 2539 3066 414 -2307 -1242 732 647 1201 945 -1421 -826 2619 2911 178
5420 178 -1076 -2357 -1634 1607 3697 1461 -1038 -702 -107 1110 2382 50 -3393 -2253 2352 4209
5436 4209 2545 -183 -3240 -3246 1452 3165 665 -1728 -1483 187 2692 3896 -594 -4981 -3779 1432
5452A432J715k16k497l701J421M448M39l756k233l9K278M582J196m897l875J093
5468b610K575J399L53j968k896K276L938p2k657k662k018J449N640J607m002k435
5484b083J117Q84J337J077l471l012K492M074J210r32k939l568P81M674J069k526
5500A84j163j15P91L360R78m939l918J803L897K254R0l072l149J652L747l11l115
5517a026j051o28K303M177Q84m624l051O83K114J780O63k657j853K825K485m97
5533B527k194j885j677J718L745O93k539p04O40n92P16P31k143j092J755J347
5549A046P74N74j397l256L15J994M70j41O13n31j429K206O96j749j568n29J39
5566a773K018L032j209k907l42J251j01M05k3k081l47L748J572j405k101j731
$$ plain form
5452 1432 3147 2931 434 -3267 -1846 2602 3041 -715 -2948 -2987 -709 3873 5069 172 -3703 -2610
5468 -2610 -35 1364 1717 -251 -3147 -871 3067 2995 338 -2324 -4342 -2893 2747 4354 352 -2083
5484 -2083 -966 -82 1255 2332 -1139 -4151 -1659 2415 3625 2693 -246 -3814 -3033 1641 2710 184
5500 184 -979 -1094 -303 3057 4035 -904 -4822 -3019 878 3132 3222 150 -2999 -1347 2400 2089 -1026
5517 -1026 -2077 -2705 -402 3775 4659 35 -3016 -2333 -219 1561 2224 -433 -2286 539 3024 2527
5533 2527 333 -1552 -3229 -1511 2234 2927 388 -316 324 -268 448 1179 -964 -2056 -301 1046
5549 1046 1820 2394 997 -2259 -1944 50 520 379 992 461 -968 1238 1934 185 -1383 -1912 -1773
5566 -1773 245 3277 2068 -839 -1181 70 -31 374 351 -1730 -2077 1671 3243 1838 -263 -1994
5582a994r86K324K664q25j888R02JM37J137r71l838j80L468J867r8o26j935j523
5600b064J498J426j122m33M17p87R56L491o17l756j768K23J612K838J205l048
5616G1k536K319K129j06j586k719j640L294N014l59l666k038n53J360L110J99
5632B293l957j714L017L663O15j756n077k576M364M573o14k907j339K71K691J953
5648C500j973n091m83L266L059J396p67m209j600K931J649j429q42o57m98K743
5664I95L614j741m390j891J042K278K607K96l770n64K511J226j074j082k110j760
5680c813L235M483k14k843k000j306J260L248p35l537k22K741J885J515j543m877
5696b723k368L470M009J0k078j319m66K485K221k431m114n12K570K751K235j208
$$ plain form
5582 -1994 -2980 -656 2008 1183 -705 197 198 635 1772 801 -3037 -3217 251 2118 2020 1394 -541 -2064
5600 -2064 -566 860 -262 -695 -278 -1065 -109 3382 2765 -991 -2759 -2536 -924 1914 3119 71
5616 71 -2465 -146 1983 1877 291 -2428 -4068 -774 4240 3881 215 -1823 -2376 -1016 2094 2293
5632 2293 -1664 -3378 -361 3302 3917 2161 -2916 -5492 -1128 3445 2831 -76 -1415 -1144 1547 3500
5648 3500 1527 -3564 -4047 -781 2278 3674 2907 -1302 -2902 29 1678 249 -593 -1250 -1748 995
5664 995 4609 2868 -1522 -3413 -2371 -93 2514 2810 -960 -1524 987 2213 1139 57 -2053 -3813
5680 -3813 -578 3905 3691 848 -1152 -2458 -1198 2050 1315 -2222 -2444 297 2182 3697 2154 -2723
5696 -2723 -5091 -1621 2388 2398 320 -999 -1465 1020 3241 810 -3304 -3816 -1246 1505 3740 2532
5712B532m438r42K765J426j628q26k79M43K780J501k200k352n06n82Q28K737J0
5729A269j242J99Q54j195k43L68j483o96J779J585M80L95j172k881j92J952O45
5746D22q24M78j05l51J985J592l036l748Q33J998K445J573k280k588J055J909
5762A358m24j747n82n48J039L910J036l061k203j43k43J764J350j342j433J348
5778G9J910k18m35j584k752N78L496J336j163l69n82j346P67J577j617j476Q67
5795i32R38J625K193j128m568j576K385K199Q41l82k694m66L186K351k496l544
5811b068j738J029L867L876k220m634l39K780J277j9k617l343J360N856K488k947
5827B608l964k258J275L789J766l508k150K110K054J046m89l234l563J541M220
$$ plain form
5712 2532 -1906 -2848 -83 1343 -285 -1111 -1390 -947 1833 3334 1134 -1218 -1724 -2306 -1478 1259 1269
5729 1269 27 226 1080 -115 -358 10 -1473 -2169 -390 1195 1675 2070 898 -1983 -2175 -223 422
5746 422 -402 76 -29 -380 1605 3197 161 -3587 -2754 -756 1689 3262 982 -1606 -551 1358
5762 1358 934 -813 -1395 -1943 -904 3006 4042 981 -1222 -1365 -1608 156 1506 164 -1269 79
5778 79 1989 1771 1336 -248 -3000 -2422 1074 2410 1247 878 296 -1050 -283 1294 -323 -1799 -932
5795 -932 6 1631 3824 2696 -1872 -3448 -1063 1136 1977 1595 -1099 -1565 1621 3972 1476 -2068
5811 -2068 -3806 -2777 1090 4966 2746 -1888 -2227 553 1830 1811 -806 -4149 -2789 3067 5555 2608
5827 2608 -1356 -3614 -2339 1450 3216 -292 -2442 -332 1722 2768 2279 -955 -4518 -2977 1243
5842A243J134o61j180j292l05K221L51k806j351J178J470J677J972k175l506l94
5858b424J666R61L29J89j622j35L353N11k145k434j719P6L869L718j822l414n64
5875a607J427R75Q37k128l321J498M775J675j527k730k809j50L600J898k518j442
5891a547J298J169J512L89l894l214J754L260J391n55j003j600O67J845j056k086
5907a670j20J453P36J331R34j682j894J15l93k92J514J381j106J80R84o31p10
5924A30N72k076j281J841L002M03o18j456j996N0K233J37k240J99J384J430J507
5941C221o25l886k184K050K824j71j86k59j355J484J741j915k845k02J092J581
5957C65K734P9l218j217Q32P38j25n5r66j65K132J849j093j606r57j815J48K777
$$ plain form
5842 1243 2377 1716 536 -756 -1061 1160 1511 -1295 -2646 -1468 2 1679 3651 1476 -2030 -2424
5858 -2424 -758 203 532 721 -901 -1036 2317 2828 683 -1751 -3470 -3394 475 4193 2371 -1043 -1607
5875 -1607 -180 795 1632 -496 -3817 -2319 2456 4131 2604 -126 -2935 -3085 515 2413 -105 -1547
5891 -1547 -249 920 2432 2821 -1073 -4287 -2533 727 2118 1563 560 -1040 -373 1472 416 -1670
5907 -1670 -1790 -337 399 1730 2664 982 -912 -797 -1190 -1482 32 1413 307 487 1471 840 130
5924 130 702 -1374 -2655 -814 2188 2591 1973 517 -1479 -1429 804 941 -1299 -1100 284 1714 3221
5941 3221 2596 -1290 -3474 -1424 1400 1229 1043 784 -571 913 2654 739 -2106 -2308 -1216 365
5957 365 3099 3178 -40 -1257 -425 313 188 133 -833 -998 1134 2983 1890 284 -673 -2488 -2340 437
5975D37J956j389n69l64p21J182J158k365k504J342K738J945K80k541l660L85
5991b690L706R94j958j218m56J563L590M93m638l588J185K930K757K13k640k912
6007b669K358L661r40l145k410l53L490M786r10l902k470J280J831R13j003k636
6023b119m88L955K640j416k427j654j428J524L012J0j319K60J09n16R94Q1k988
6040a770j209K054J934J196P88k007l044K41J991N72n29q19m61J450L142l91l235
6057i7k651O8K116K088J490k655k300J732K588n63k024k119j085K804M384m8l096
6074F32k021K07R15J673j004k465k6L335J619q19j503k067j106J323K364o00n22
6091f5J214l09n80K80p12j669j57J415M71J111J026q87j932m11k38k90J796P54
$$ plain form
5975 437 2393 1004 435 71 -650 532 1690 -675 -3179 -1837 901 2846 3126 585 -3075 -2690
5991 -2690 1016 2010 52 -1166 -1622 -59 3531 4024 -614 -4202 -3017 -87 2670 2883 243 -2669
6007 -2669 -311 3350 2410 -735 -3145 -3498 -8 4778 3868 -34 -2504 -1224 607 1520 517 -2119
6023 -2119 -2607 1348 3988 2572 145 -1509 -2937 -1413 1599 1609 290 550 659 143 1137 1218 -1770
6040 -1770 -2979 -925 1009 2205 2993 986 -2058 -1817 174 746 217 -602 -1063 387 3529 3138 -97
6057 -97 -2748 -2680 -564 1524 3014 359 -1941 -209 2379 1816 -208 -2327 -3412 -608 3776 3728 632
6074 632 -1389 -1182 -267 1406 402 -2063 -2089 1246 2865 2046 543 -1524 -2630 -1307 1057 457 -65
6091 -65 1149 840 260 540 -172 -1841 -1998 -583 -112 999 2025 1138 -794 -1205 -1443 -1733 63 817
6109H17r57k52J967J55j174j217j954q11K983K984l68j991p97k9P11J199j660
6126c94k760J123L633J359p69j810k403o07K409J425j634o30J093L53J314O40
6142B342k459k709L53K393P15J028J15j769p96J100K9r82k13k68J41K084K112
6159C216j371k205q16q71P66K464P61k325o11J692Q29M97j237l253j623L023L974
6176B910L97k417j845q10J540K627j335l963m29L305L185J142k226m745j126L205
6192e85K541n87j744j068P26K624J920l282l632l58K373K766J572j646l229r0
6208a699K653M78j750j050j051R66L616J668k555k352m80j87J269J488k94j409
6224f89O35J230r3q1p45k420r77K722K226K10q64j561j645J399K231j159k291
$$ plain form
6109 817 -140 -392 1575 1730 556 -661 -2615 -3426 -443 2541 2173 182 -615 -644 67 1266 -394
6126 -394 -3154 -2031 1602 2961 2192 382 -2021 -2628 -219 1206 -428 -1058 35 388 1702 2342
6142 2342 -117 -2826 -2473 -80 635 1663 1778 9 -787 313 342 -640 -853 -1121 -980 1104 3216
6159 3216 1845 -360 -1176 -2047 -1281 1183 1944 -381 -992 700 1529 2026 789 -2464 -4087 -1064 2910
6176 2910 3307 890 -955 -1765 -225 2402 1067 -2896 -3325 -20 3165 4307 2081 -2664 -3790 -585
6192 -585 1956 1369 -375 -1443 -717 1907 3827 545 -3087 -3445 -1072 1694 3266 1620 -1609 -1699
6208 -1699 954 1432 -318 -1368 -2419 -1453 2163 3831 1276 -1076 -1556 -1743 -474 1014 720 -689
6224 -689 -54 1176 1083 1002 257 -2163 -3140 -418 1808 2018 1154 -407 -2052 -653 1578 419 -1872
6241a872r5R86K166K257j597m254j020K558J482K59n13j518K8K529J573k332k806
6258b169q78J275K275K205j083k644K31J559j61m78j138j123J061K688R97j822
6274G95j243p9q75P79O44k79J67J294J03r95K19K4j678j083J677P07J417R42q74
6293A662k735j80J100L28j59l9p62L94L079M38k719k191o2N75K226J209j548j786
6311a170J337J373k95q20j869j434J509L748L26j807j250m77k91J662N89k096
6327i65n23J638J727O55p00k171k214P02K451K89pQ7n10p55J519K25k315r28K33
6346a562N91K497J521j304k915m84N80J104R69o01k410Q93L174R65j822k705k036
6363c545Q25L899J866k081k156L47J336J107J35l059k555J858L675J764j506k378
$$ plain form
6241 -1872 -1967 -981 1185 3442 1845 -2409 -3429 -871 611 870 357 -1161 -1133 1396 2969 637 -2169
6258 -2169 -3047 -1772 503 2708 1625 -1019 -788 771 610 132 -1006 -2129 -1068 1620 2617 795
6274 795 -448 -527 -1402 -623 21 -258 -91 1203 1306 311 530 554 -1124 -2207 -530 177 1594 2536 1662
6293 1662 -1073 -1253 -153 175 16 -23 -785 -391 2688 3126 407 -1784 -1846 -1271 955 2164 616 -1170
6311 -1170 167 1540 1245 425 -1444 -2878 -1369 2379 2705 898 -352 -829 -1120 542 1131 -965
6327 -965 -1488 150 1877 2532 1832 -339 -2553 -1851 600 889 882 969 459 -296 1223 1448 -867 -1795 -1562
6346 -1562 -971 1526 3047 1743 -1172 -1656 -1076 28 997 396 -2014 -1121 2053 3018 1196 -1509 -3545
6363 -3545 -2720 1179 3045 964 -1192 -845 491 1598 1733 -1326 -3881 -2023 1652 3416 1910 -468
6379d68j881L36L290L64k769j197J681J671J888n31l612k443J615K935L86n8j049
6396A58r79O84J808p95j859r93L91J323K335R60k716j564K98Q03p4P96m03j437
6414a264R32K091N77j275j811j703p5K955K138j841j350L55r6J122M76j907k091
6431b767R54K751J170K00j583k681l7K670L26j546l80K74J075J972J0k962k184
6448b738J192J684P68K98r92j026J026J183q16j678k0P3n4K056Q76j178q19m7
6466b12p75k03J153j28l85R56N25p39P65l18k012j003J708J228N93K50r05j772
6484a274P27J583m50j461l46O6J968K280q79l046j157J333J049K26J7j310l15
6501i89J828K169k269j722p86k74K198K106l19k153l29P72m23N23r4j330n36J983
$$ plain form
6379 -468 -2349 -2013 1277 1641 -1128 -2325 -644 1027 2915 2384 -1228 -3671 -2056 879 1265 1207 158
6396 158 -821 -137 1671 876 -983 -1976 -1585 -262 2073 3033 317 -1247 -949 -146 -220 576 173 -1264
6414 -1264 -332 1759 2336 1061 -750 -2453 -2528 427 2565 724 -626 -271 -367 755 1231 -676 -2767
6431 -2767 -1813 938 2108 2308 725 -1956 -1993 677 1003 -543 -923 -649 426 2398 2408 -554 -2738
6448 -2738 -1546 138 906 1204 212 -814 212 1395 579 -1099 -1119 -1046 -1100 956 1832 654 -165 -212
6466 -212 -987 -1190 -37 -165 -550 406 931 192 957 639 -1373 -2376 -668 560 1153 1403 498 -1274
6484 -1274 -547 1036 586 -875 -1221 -1155 813 3093 2214 -832 -1989 -656 393 619 636 -674 -989
6501 -989 839 3008 739 -983 -1769 -2043 155 2261 1942 -211 -540 232 -191 332 238 -1092 -1628 355
6519C55J578n6m87k021j500R88K101J08j245p6L89P52J220m57k850j338J303J701
6537D65J662J97j902k095J570J465n10r59j028q14K390K956k15l515k317N89K157
6554I6K228n69k659j052K708K041p38k063k151o29K788L111q98k401n67L65R32
6571E42J192r21k337n17K726J710K25j348k541j133J965K332q89j332m2L20J177
6588A129Q74j275k368j87J428Q50J465J01j896j452J576N31m66m94m55m55J124
6605C0K589o30j986j571l51J283J740K49k070n14J755O99k65o21j821j120J997
6622f07K459l85j397m00n80N79J312o27j964L20J366R80N67j57k085j131J102
6639f48Q94j34O5j37m74M96J135p79j730K64K92K15J314O88j242j035N80j01q8
$$ plain form
6519 355 1933 1877 1390 -631 -2131 -1143 958 1066 -179 -255 134 886 2106 1649 -1201 -2539 -1236 465
6537 465 2127 2324 422 -1673 -103 1362 852 -107 -1135 -1949 441 3397 3182 -333 -2650 -2061 96
6554 96 2324 1755 -904 -1956 752 2793 2055 -8 -2159 -2788 0 3111 2213 -188 -755 -390 542
6571 542 1734 813 -1524 -2041 685 2395 2620 1272 -1269 -2402 -437 1895 1006 -326 -368 -48 1129
6588 1129 2003 728 -1640 -1827 -399 451 1916 2017 121 -1331 245 776 310 -184 -639 -1094 30
6605 30 2619 1989 3 -1568 -1919 -636 1104 1353 -717 -1231 524 1223 958 337 -1484 -2604 -607
6622 -607 1852 1467 70 -330 -910 -331 981 354 -1610 -1290 76 1056 1623 1466 -619 -1750 -648
6639 -648 246 112 177 40 -434 62 1197 418 -1312 -1048 -756 -541 773 1461 219 -816 -236 -337 -425
6658d25P34k47j169N91J363l0O8n01k123J18J753J128m17j122Q0o48J672R05j908
6677a78k205J025J959O79P64j000k716M15J532M85o51p58J39J06J661R64j674
6694E47k130Q9J048Q65J007p99j465J56J460j88l37m37j498J28K201J635j165
6711A117j436n78k80J609R39j303j269J70J504R28J55j169k569m79L000J244m46
6728A137r97p34p05J995J531k019k320K18J470J644J244j833k775M17K013J196
6744A482q51r32j351L86K826J184k172k096l87Q26J979J096j749j656O48J422
6760F55O24n51j325j774O58K922J099j835r07n94R1J315J173j626j555J025P87
6777A82Q24L71j340k088L88J977J069o13n11r02l93J858O10j824j043O57K42J447
$$ plain form
6658 -425 309 62 -1107 -516 847 817 885 384 -1739 -1621 132 1260 843 -279 -199 -847 825 1730 -178
6677 -178 -2383 -1358 601 1280 2044 1044 -1672 -1257 275 760 109 -649 -510 -404 1257 2221 547
6694 547 -1583 -1494 -446 419 1426 627 -838 -682 778 590 253 -184 -1682 -1554 647 2282 1117
6711 1117 -319 -897 -1177 432 1371 68 -1201 -1031 473 1401 1556 387 -2182 -2661 339 1583 1137
6728 1137 140 -594 -1299 696 2227 208 -2112 -1894 -424 1220 2464 631 -2144 -1727 286 1482
6744 1482 631 -301 -1652 -1266 1560 2744 572 -1524 -1911 -1085 894 1990 241 -1415 -767 655
6760 655 1279 728 -597 -2371 -1713 1209 2308 473 -434 -1028 -937 378 1551 -75 -1630 -605 182
6777 182 1006 1377 37 -2051 -1663 314 1383 770 259 -643 -1036 822 1432 -392 -1435 -778 -536 911
6795I11J074j243k186rJ276M89K78l25j383L73J974N72j194j185p13k87J923J636
6813A981j410j337O44L61N7N39o85j599N73J672p7K54J06j492o65J010Q34l97
6831C69j69k8m50K61J518n64j838j82O25M09J043J35j298o58Q94O58q71M65m33
6850a14j168J293J089j97o03q79o16J75J982N03j611j148J010O83Q93j29j793
6867f30j248J021K285j14q98o96j050Q54J800l28j456q88Q38O58J206J2j547j456
6885a637Q80J165M43m9q41j446R66K185K71j929j269k87P50K250O90k181j406
6902a445P47R81P13k4j491j416J287K525k44j197j102q36P09K045L65j516j122
6919a021J12Q94J669O2k675j502J189K597L66o01j552j118J188J940j69j987n24
$$ plain form
6795 911 1985 742 -1444 -1453 -177 312 590 265 -1118 -745 1229 1801 607 -578 -1291 -1578 345 1981
6813 1981 571 -766 -122 239 296 835 150 -1449 -876 796 719 973 1079 -413 -1078 -68 766 369
6831 369 200 172 -278 -17 1501 937 -901 -1083 -458 -49 994 1129 -169 -827 67 725 -146 319 -114
6850 -114 -1282 11 1100 903 300 -579 -1195 -1020 962 1465 -146 -1294 -284 399 1292 1163 -630
6867 -630 -1878 -857 1428 1314 416 -280 -1330 -476 1324 996 -460 -1348 -510 148 1354 1366 -181 -1637
6885 -1637 -757 408 851 802 -39 -1485 -519 1666 1937 8 -1261 -1548 -798 1452 2142 -39 -1445
6902 -1445 -698 283 996 972 -519 -1935 -648 1877 1633 436 -666 -1502 -793 1252 1617 101 -1021
6919 -1021 -909 -15 1654 1716 -959 -2461 -1272 1325 1691 1090 -462 -1580 -392 1548 1379 -608 -1132
6936a132J27J400J474K79k630j016R38Q43M91K61j586r29J459J886k59j458j150
6953a002k85Q27K134J72j936j202P48R26R21m35j611j157J706J609n71l38j038
6970e32j012R16J961l13j304k01K64N48R33Kk255p99J137J034M41P3j249j020
6988a376J075J249l35p87j48l88J71J390K91j821j94K88L2P38L09o56p75P10O52
7007D25k39L7m87r48L51J300K80p76j38m66l4R04M33o75q21L32K00N35N43o07
7027A49j528K40J401J30J77L1j535j10J009J178j025p69k88m3J304R44o36j476
7045h47l71J151O0R73m52j678j75J458J145n20p12j032n43J534J636j047j504
7062i24r5N33P07J221l74k375L3J391P95K87n87j534p17J776J246l44j166p52
$$ plain form
6936 -1132 -1005 395 1869 2148 -482 -1498 -560 283 774 1035 -551 -1480 -21 1865 1606 148 -1002
6953 -1002 -1287 -460 1674 1846 -90 -1292 -544 382 1303 868 -743 -1900 -194 1415 844 506 -532
6970 -532 -1544 -628 1333 1020 -284 -485 -221 327 1260 1262 -993 -1792 -655 379 820 893 -356 -1376
6988 -1376 -301 948 613 -174 -322 -710 -539 851 1142 -679 -873 -585 -553 185 494 -162 -937 -227 425
7007 425 186 223 -264 -1212 -861 439 719 -57 -195 -661 -695 209 642 -33 -854 -522 -322 213 756 149
7027 149 -1379 -1139 262 392 569 600 -935 -1045 -36 1142 117 -652 -940 -983 321 1265 629 -847
7045 -847 -1218 -67 -7 966 514 -1164 -1339 119 1264 744 32 -1000 -1543 -9 1627 580 -924
7062 -924 -1019 -486 221 1442 1068 -1307 -1274 117 912 1199 612 -922 -1639 137 1383 1039 -127 -879
7080h79l79J670J674j008k164l10J391P62M41l91k041m04J916R47l89r69q99m35
7098a467J982J764j173j671o24N09J634R43p57k403k99J644J167j84p87j460m14
7115a596K232J477j580j221m60K83J685J177j124k027o2J209R34M16p10k128L16
7132a179J621J041q48q96p28j37J604J136j030j646K42O35R00P53r44k135M83
7149a128J324J014n42l72j359m4J475J127j101j103J76j28J184P84p97j409R6
7166h03P31O02M66l55j526l35J523L86k10k48q06l63Q74J143n98p84k37L38M04
7185B02P44m25j389o1J291R9J14l11n69p36Q09R18j51j01k81p63J19J586k46j433
7205e84L8O5M10O60O42j152j191L01J125L70O9n80j093P40R90n1n51n58m57k77
$$ plain form
7080 -879 -1258 412 2086 1078 -1086 -1396 -5 757 1198 807 -1234 -1638 278 1225 836 -133 -1032 -1467
7098 -1467 515 2279 1106 -565 -1189 -680 954 1897 1140 -1263 -1562 82 1249 1065 278 -1182 -1596
7115 -1596 636 2113 533 -688 -1148 -865 820 1997 873 -1154 -1216 -7 927 1343 633 -1495 -1179
7132 -1179 442 1483 635 -261 -989 -1126 478 1614 584 -1062 -820 -185 715 1468 524 -1611 -1128
7149 -1128 196 1210 668 296 -1063 -1107 368 1495 394 -709 -533 -661 523 1307 510 -899 -803
7166 -803 -72 530 996 641 -885 -1220 303 689 479 231 -575 -938 -64 1079 481 -303 -540 -202 202
7185 202 946 521 -868 -929 362 461 575 264 -305 -1041 -232 686 535 434 153 -610 -491 1095 849 -584
7205 -584 -546 -481 -71 589 1231 79 -1112 -811 314 684 753 173 -920 -180 810 759 208 -350 -807 -1084
7225a084J642Q83r13j343J30Q49N92K01r07j275M03J440N88l63q79j576L40K032
7243G60M13j187j123K48O42R90P12j829j354J263K78J390J97j418j091n5J924
7260G60J43o28q32p97K72K183P42j506j753M06Q22R22M83j477j758J148K020R2
7278A242q88r58j016N23K074K58r15j425J41K60J634O12j759j622P62J603J040
7295A566m39j276j403N12K045J94j164j061J47P24J634j7j890j195N92J361P00
7312A030Q2q32j447M16J680O7r96n19o16M54J968nj191r25N4K17J209M37j129
7331d6j324R47J340R0o33n27j489R80J987m48q70j79k08R0R41L51j288o21O93
7350b14L62O09O2m19j397O6J437K40l34m85q46O96J280J89j395n65J47k3Q52P99
$$ plain form
7225 -1084 558 1441 528 -815 -685 164 756 957 50 -1225 -822 618 1206 843 -36 -1612 -1272 760
7243 760 1173 -14 -1137 -889 -247 743 1455 -374 -1728 -465 -187 1203 1400 -18 -1109 -1164 760
7260 760 903 275 -557 -1354 -1082 1101 1843 337 -1416 -1010 -188 734 1217 -260 -2018 -870 1150 1242
7278 1242 354 -604 -1620 -1097 977 1235 320 -1105 -964 -704 930 1542 -217 -1839 -1077 526 1566
7295 1566 1127 -149 -1552 -1040 1005 1199 35 -1026 -879 -155 1479 1462 -428 -1623 -1031 330 1030
7312 1030 1112 280 -1167 -751 929 996 0 -519 -1135 -681 1287 1282 91 -834 -780 -563 646 1083 -46
7331 -46 -1370 -423 917 1007 374 -153 -1642 -662 1325 877 7 -172 -380 -290 651 1002 -286 -907 -214
7350 -214 148 757 819 400 -997 -931 506 746 412 -73 -919 -223 1057 1246 -149 -714 -567 -590 262 1061
7370A061m70j116L10K95K15j16j1q83K06J202k70q7Q2r28n51Q65J031o84k86m
7390a39j6K26Q97n80j151m23P95N87O87oj316n65O63R05R3j036m14J94O77J438
7410A516n94j255m13L69L9J238J18j346p51J296N61j61o01j016o36J394J846k86
7428A318j356p47r5M72J275l55j638L7J435M97M38k30j341r34P13J661l99m22
7446C29p66k15Q45J555q02j640m55M16P83J552j1j906j059Q96J225l07l50j152
7464a062m16K156J562r31j672n45q8P47J646k39j641o28J503O75j80m49j992l26
7482a880J867J536l3j489m41m38R05J192m62j956J13J392O03P37r19j588n51J387
7500b5N73rl75l13m72R12R79o64j389J42j64M02J425r2j292J7Q6L86l00Q07j218
$$ plain form
7370 1061 591 -525 -215 80 295 179 168 -715 -509 693 423 336 418 -510 -1061 -196 835 151 -135 -139
7390 -139 -155 71 968 388 -763 -1186 -391 196 883 877 -439 -1004 -341 564 657 -379 -793 -599 78 1516
7410 1516 922 -333 -746 -377 -338 900 1018 -328 -1079 217 778 617 16 -1000 -1636 -242 1604 1318
7428 1318 -38 -785 -880 -408 867 512 -1126 -1089 346 843 1281 1051 -290 -1224 -511 1150 751 329
7446 329 -437 -652 193 1748 946 -694 -1149 -733 50 1602 1591 -315 -1374 -478 747 440 90 -1062
7464 -1062 -1478 678 2240 1309 -363 -908 -996 -249 1397 1158 -483 -1111 392 1067 887 438 -1554 -1880
7482 -1880 -13 1523 1490 1 -440 -878 27 1219 757 -1199 -1086 306 909 1646 727 -861 -1412 -25
7500 -25 548 539 164 -149 -621 291 1270 606 -783 -641 -805 -403 1022 930 -362 -345 -259 127 -173 634 -584
7521e84p52J460J098o53p62l25q42J024J164k99j028M32J80K1K89M2j235m89R12
7540c47R46R8J51q02j081L01J152P4j112p0L88M55J297l92j870m29P67L57P7P12
7560F72o62m20Q88J78m48m77J66p39M10R85M13n80Mp38n14M03J052j73j039K69
7580c50P71K32M50o69j801M3J449N67K13o87o35r6R78M85j362o59l3O43J369P64
7600A672o89k229o7R69O68M16r20r47L60K105L31j515j123m22M04J380J162j169
7618C86j204L40R41l21K86j066r35Q43J397L64l42o41j107k63J040J304o37j024
7636f39J53J34J281K83r62j948o5J534R81K05k52j624J81J108O07j067j369J30
7654a329P56J567P29p49k095j83J070O67N78j166j178M18K049O15j261j026j249
$$ plain form
7521 -584 -1336 124 1222 569 -193 -518 -1360 -336 828 529 -499 -67 113 134 423 465 -770 -1259 -347
7540 -347 599 697 848 46 -1035 -734 418 492 -620 -690 -302 153 1450 1058 -812 -1241 -474 -117 -40 672
7560 672 10 -410 478 656 208 -269 -103 -842 -432 553 966 386 390 -348 -862 -459 593 420 -619 -350
7580 -350 421 653 1103 434 -1367 -1324 125 692 905 218 -417 -513 465 950 -412 -1071 -1104 -461 908 1672
7600 1672 983 -1246 -1313 -344 324 740 -180 -1127 -767 1338 1669 154 -969 -1391 -987 393 1555 386
7618 386 -818 -478 463 142 428 -638 -1573 -730 667 1031 689 48 -1059 -1322 -282 1022 385 -639
7636 -639 -486 -352 929 1212 250 -1698 -1763 -229 752 957 705 -919 -738 370 977 -90 -1459 -1329
7654 -1329 -573 994 1723 974 -1121 -1304 -234 433 1011 -155 -1333 -915 1134 1749 488 -538 -1787
7671a787L95K170Q42j296j294P08L49K80M6j040j104Q24J864L72p14q39p12P8
7689h58R25K69n97k56O38K13L69M36j083j452O48Q19J97L61P60j575j55J003N7
7708G19n66l29m70j4J242J063m40j747p4k2L53J096l25j196M02R79N17m34o40
7727A14j229k26J555Q71m63m91r4m61P04L55q43r68N87Q35L82M21l71j370j73
7746h65O64L04l13L81j47P8M50Q9o93o59J67o07M51J528M31o80r84j17QO68M06
7767E60p67j118Q81J449M63m88j397j582J000J597L22j128k23K06L44Q50j74j889
7785a094p83R85J418P74k27j132j377J073J197l72j054o00M44R49J462n36j578
7802d51j203Q65M98N84K51q61k16P99Q00q95n83p07j87N68J823N8o63n31m47n1
$$ plain form
7671 -1787 -1392 778 1620 324 -970 -262 87 367 413 -627 -1731 -907 957 1329 615 -224 -936 -858
7689 -858 67 336 -261 -517 121 334 703 1139 56 -1396 -748 71 268 629 1389 -186 -341 662 719
7708 719 153 -176 -646 -660 582 1645 1205 -542 -616 -638 -285 811 486 -710 -308 671 1188 754 114
7727 114 -1115 -1341 214 1085 622 131 37 -424 280 635 -208 -1176 -589 246 628 1049 678 -692 -865
7746 -865 -201 103 -210 171 24 102 552 641 -52 -711 -544 -1151 -700 828 1259 579 -405 -522 -514 154 560
7767 560 -207 -1325 -444 1005 1468 980 -417 -1999 -999 598 920 -208 -431 -225 119 969 795 -1094
7785 -1094 -1877 -892 526 1300 1073 -59 -1436 -363 834 462 -592 -1192 -748 201 1663 1127 -451
7802 -451 -1654 -789 -291 293 544 -317 -533 266 1066 171 -412 -1119 -1306 -738 1085 1143 480 -51 -498 -549
7822e49P29J28r47m44O49J385K87nj616j279J88K007N82j027l79j33N64J290n42
7841H88j847r31Q11J541Q29J21j803j094J374Q44n76m23p81L68J360J534p88k024
7859e97o70L73J057O22J64j547k22J542M68p23j044m71P2Q98R38Nn71j83j34k89
7879c12K04j29m29J43J053q9L53J63p59j471J80Q12M36N25n28l60j33J050J47
7898H56j312n53L06K79J036Q05j095j113L72K17Q6J06j62l39P28J092m21n87r32
7917f31n07j2J153R78j071k59P43k6k79J04q08j04L20P67P9L27k10q73j73L87
7937i5j33j72N87J69l05L44M84m08j052n12K40N99J503J60j556k55N13J52k00
7956F3k23r93k31K130J028o06j198r85n4R72P84k13j319N19O47J025l01j053j396
$$ plain form
7822 -549 180 308 -639 -1083 -434 951 1238 1233 -383 -1662 -1474 533 1115 88 -291 -424 140 1430 888
7841 888 -959 -1890 -1079 462 1291 1412 -391 -1485 -111 733 157 -266 -1047 -679 681 2215 1427 -597
7859 -597 -1267 -894 163 785 949 -598 -820 722 1190 467 -577 -1048 -976 -78 860 865 294 111 -23 -312
7879 -312 -108 -237 -666 -523 530 441 794 957 198 -1273 -1093 -281 155 680 152 -208 -341 709 856
7898 856 -456 -1009 -703 -424 612 1417 322 -791 -419 -202 -116 -10 -172 -511 217 1309 888 301 -631
7917 -631 -1138 -1150 3 981 -90 -349 394 368 89 193 -615 -719 -399 368 447 774 564 -309 -482 -95
7937 -95 -228 -400 187 356 51 395 879 471 -581 -1093 -853 -254 1249 1409 -147 -402 111 263 63
7956 63 -160 -1153 -1384 746 1774 1168 -30 -1015 -1069 -97 687 474 -845 -326 321 1346 1045 -8 -1404
7975a404l39J905J300n25n40j064L81R20N02j476r27O31Q97Q37J66n50j020n24
7993h30Q62M16o83K25m31J41J059M13q19j100L7m20R26J588l38q31j52N4L23l7
8013D03k13j441K51J366J285j96j189r85j001J425J601r91j033j48J382M68N30
8030A514j242j868j48J557J099k13p56k54n44J612K49j520j020K86J261R90O31
8047A634j099j442J26P22L47m07k23k42M42J102J88j154p41qn2N06R29j72q5M7
8067D18k17l28l86N94p65l19J447K36M0L09j140j352M27J331Q8j30k79r6M54O57
8087I89m23j782J49L53R25N25L34r23p59N11N12o88j64n5K24M94Q71m39q72m82
8107g00K36j82J054n9n57K11M74J92o21m0o78j87L42J066J25k95J3j92o77L91
$$ plain form
7975 -1404 -1743 162 1462 937 397 -667 -286 634 1136 -340 -1267 -636 261 1098 1264 714 -306 -830
7993 -830 32 448 -235 -10 -441 -300 759 1172 353 -747 -710 -1130 -204 1384 1046 215 63 117 440 403
8013 403 190 -1251 -1000 366 1651 1455 266 -719 -1720 -295 1306 315 -718 -866 516 984 1514
8030 1514 272 -1596 -1744 -187 912 699 -57 -311 -855 757 1006 -514 -1534 -1248 13 1003 1634
8047 1634 535 -907 -781 -59 288 -119 -342 -584 -142 960 1148 -6 -747 -755 -807 -301 628 456 371 418
8067 418 201 -127 -513 81 -684 -1003 444 680 720 1029 -111 -1463 -1036 295 383 253 -26 -122 332 989
8087 989 566 -1216 -1067 -714 211 736 1070 147 -612 -101 411 -277 -441 -496 -272 222 1093 654 -218 -700
8107 -700 -464 -646 408 349 -208 3 477 669 48 8 -670 -857 -515 551 676 381 394 202 -475 -84
8127h4P2n69K47N52j30L50Q15q57j633j05Q12J036N43l98j299M1J519K09j232
8146a11r85j40O10J904N86j575j080j2R36M9Q1r63n67Q75J665j42r91o43q27K51
8166a079J544J81r17k43P18K70K76l65j299o31R15J419K54k14p72n61m8J089m0
8185D97j292K74N29l7P41L23
8191A035
$$ plain form
8127 -84 -12 -581 -334 218 88 438 1253 396 -1237 -1342 -530 506 1049 651 -648 -607 912 1121 -111
8146 -111 -1096 -1236 -626 1278 1864 289 -791 -803 133 182 263 -700 -1267 -392 1273 1131 140 -503 -1330 -1079
8166 -1079 465 646 -271 -514 204 474 750 385 -914 -1545 -630 789 1043 829 57 -504 -552 537 497
8185 497 -795 -521 8 -29 712 1035
8191 1035
$$ Imaginary data points
##PAGE= N=2
##DATA TABLE= (X++(I..I)), XYDATA
0@%%%qJ6qQj6K4l2M0n2O1p9J02j20J44j71J99k37K80l26L78m36N03n76O56p45
28c95Q47r61J082j217J364j525J705j901K114k349K608k891L203l548L928m350
44b286M821n344N934o606P372q264R312j0562J2089j3998J6467j9809K4612l2147
58a8409M5772p8180K91466L30078m65255k54007M1834K54710J04264j08137k39970
69i5834K0814K46442J54406j06964j58544j33616l0656J16226J51663P221l4383
80A36775j4635n3442l3157R3081K6039j54937j30734O7766J74327J52828j5425
91B48486k16575j68105R0807J42788j6749o7612o831K6726Q6584R3214o0196j59400
103f863o6595J5146L4259R6451Q5322n3399r6709j7979J6558L4249M0679p8765
$$ plain form
0 0 0 0 0 -8 8 0 8 -8 16 -16 24 -28 33 -46 56 -64 80 -91 108 -129 151 -175 203 -233 270 -306 350 -395
28 -395 452 -509 573 -644 720 -805 900 -1001 1113 -1236 1372 -1519 1684 -1864 2064 -2286
44 -2286 2535 -2809 3125 -3481 3891 -4373 4939 -5623 6466 -7532 8935 -10874 13738 -18409
58 -18409 27363 -50817 240649 570727 105472 -148535 -106701 148009 252273 144136 -95834
69 -95834 -75020 171422 325828 218864 60320 -73296 -103952 12274 163937 171158 136775
80 136775 122140 68698 35541 128622 154661 -276 -131010 -63244 111083 263911 248486
91 248486 31911 -136194 -45387 97401 80652 13040 6209 32935 119519 212733 152537 -6863
103 -6863 -73458 -58312 -24053 72398 157720 104321 7612 -10367 6191 40440 81119 2354
115B354j42696O0786K40723J05847j21621j87337j05738P2017J75351J2640j80359
126f8033o9983J46119J45700Q195j15744j76987n6470J50680J35497l6468n0693
137A1813K7744Q233k1546j2189m3917l8358K9658J7462r824Q0869R2933p5673
149F7205j44001k5705N0910N2177M8347j6662n9343M0537J01887r047q8444n8747
161d0886m5389m500R6659Q5063j4572k7313k3686p0609j2018R4196K6420r3857
173c0492m2338P7270J16501P2693p8723k13361q9940J49014J48313k2724r3637
184g424n7909K5825J29721P9176j31843j81050j568J24306J06922M3826n3067
195G6915r9164k840O4759j2124n0760o337k1630j6684R2896J11578k1857j05318
$$ plain form
115 2354 -140342 -79556 161167 267014 145393 -41944 -147682 -75665 99686 112326 -68033
126 -68033 -138016 8103 153803 161998 46254 -130733 -187203 -36523 98974 62506 11813
137 11813 39557 47790 26244 14055 -29862 -68220 -38562 -21100 -30924 49945 142878 67205
149 67205 -76796 -102501 -51591 586 48933 32271 -27072 13465 115352 106305 17861 -40886
161 -40886 -86275 -90775 5884 90947 76375 49062 25376 -45233 -57251 36945 63365 -30492
173 -30492 -72830 4440 120941 193634 114911 -98450 -188390 -39376 108937 86213 -7424
184 -7424 -65333 -39508 90213 169389 37546 -143504 -145072 -20766 86156 129982 76915
195 76915 -22249 -25089 39670 27546 -23214 -29551 -51181 -67865 25031 136609 114752 9434
207I434r4349m7366P2229J53037K7400j17351n7198O5584Q4725L1777q5089j81193
219a38360n3209J70618J60054j9625r2136o4960j8601O0435O8373m6915q9074
230f3400k509N5622Q0785R7847k2310j89658j33028O5270J36752P5379k5680j20794
242d5724o3027J33511J50038p3130k02803r7056Q2132J97038J34624r8065j98961
253h1423k1279J27265N2834n5287q1505n8208M6387J45477O9467p4093r3317n3063
265g6745j8376O5475R6424o957o4587J095L9501K5979J7674n7805j39843l8537
277a56702J31189J26931J3102o0763q7700l4915P6486O1223o4800p0014K7039
288c8924O0100N6555M7331m8538j22438m6489M2031L8675L8913K8858m3109m3928
$$ plain form
207 9434 -84915 -132281 -60052 92985 120385 3034 -54164 11420 96145 127922 42833 -138360
219 -138360 -191569 -20951 139103 119478 27342 -37618 -56219 4216 72589 25674 -63400
230 -63400 -65909 -10287 70498 168345 146035 -43623 -176651 -111381 25371 100750 75070 -45724
242 -45724 -108751 24760 174798 101668 -101135 -198191 -116059 80979 215603 117538 -81423
253 -81423 -102702 24563 77397 22110 -59395 -117603 -71216 74261 143728 69635 -23682 -76745
265 -76745 -95121 -29646 66778 59821 -4766 -3671 35830 61809 79483 21678 -118165 -156702
277 -156702 -25513 101418 114520 53757 -33943 -68858 7628 68851 4051 -65963 -38924
288 -38924 21176 77731 125062 76524 -45914 -92403 -50372 -11697 27216 56074 12965 -30963
300c0963N1543N9075k8973p0016p0921k5011J09866J59319k512j39158p3584K8869
312c2466M8415K2376m8092q6561K6082J37751N9152o3599p2347m7554j4355N5909
324a5289N6890j5405q438L4277r664l8143J2754L301n8575l6757K0685M5773P6321
337F7730M9086p3845j06405P622O1437J0757j0035j1594j9735L7157P8805o950
349H4030q6655n6241j8828P697P3075P2468k5084o0287j2795N646K2948M0837
361D6811l7421j03501J410J27262R0940j9761r5606j08975p434J18031O3143q5787
373a0888q1791L0489Q5126P4735j551j19716j08649M4786J07535L3920j1953k1582
385B0461l9808l495M3674k219n2367k7441j0433Q967Q9059Q9058m7006j16970
$$ plain form
300 -30963 20580 79655 50682 -19334 -90255 -115266 -5400 153919 151407 12249 -61335 -32466
312 -32466 15949 38325 -9767 -96328 -70246 67505 126657 63058 -9289 -56843 -71198 -15289
324 -15289 41601 26196 17758 52035 42371 4228 16982 20283 -38292 -75049 -54364 -8591 67730
337 67730 116816 42971 -63434 -55812 5625 16382 6347 -5247 -24982 12175 90980 84030
349 84030 -2625 -58866 -77694 -69997 3078 75546 50462 -9825 -22620 -16974 5974 46811
361 46811 9390 -94111 -92701 34561 125501 105740 10134 -98841 -106275 11756 74899 -10888
373 -10888 -92679 -62190 22936 97671 96120 -23596 -132245 -87459 20076 53996 42043 20461
385 20461 -19347 -22842 20832 18613 -33754 -61195 -71628 -62661 26398 115456 68450 -48520
397d8520m2851L5646O6959M9781m9126j00144K2581J30646N2332p1530j06213
408f0439p2850K6916J23808O7111o0295o2376O224K2915L1414K4437n9117r1732
420a03984J3397J04567Q5155J6674q1594j40687l1131J27003R2151n8155j01333
431g7937k6462P8666J36865L4850j50372j48985L4859J30601P2229j7648q1226
442a4560o1896N3637R4275j9272r6818n1169M975N2419R6299M1569o7010p2292
454c9843j2350J1451L5431M1202l1856o5425K6669Q6785K9202l6912p4279p9602
466a09527R752J07538N8279m3451m1369K49J3972L5635J4602o4620o0513L2029
478d7424O2992L7280K5101k7361r0244m2474M5271M0508M357q965l0516l23Q3008
$$ plain form
397 -48520 -91371 -55725 11234 61015 11889 -88255 -65674 64972 117304 45774 -60439
408 -60439 -133289 -106373 17435 84546 24251 -38125 -31901 -8986 22428 46865 -12252 -103984
420 -103984 -90587 13980 99135 115809 34215 -106472 -137603 -10600 81551 23396 -77937
431 -77937 -104399 -25733 111132 145982 -4390 -153375 -118516 12085 84314 66666 -14560
442 -14560 -76456 -22819 71456 52184 -44634 -95803 -90828 -38409 57890 99459 32449 -39843
454 -39843 -52193 -40742 -5311 35891 4035 -61390 -34721 52064 81266 44354 -29925 -109527
466 -109527 -99775 7763 66042 22591 -18778 -18529 -4557 31078 45680 -18940 -79453 -47424
478 -47424 15568 52848 77949 50588 -39656 -82130 -36859 3649 8006 -959 -31475 -31798 51210
491E1210N6954p2848j05955k1658M8470P8188N2869m5815q2428J0526O1683k093
503B9103m6339l2731j5681L3509P7587K3263m4285k4427o215k8568k24M1191J0542
516A6725j3569R791N602m693K0337p537p2895m1130M4542N8368L5278J2466m3600
529A9685o0479J8352N5936m572l7470j6455j318L7340O9336j312q6772n7165J0003
542e4891L2538M9615K9088m8291n1310M1124O6370K928m4012o5560m6084N3358
554c5127J13674K4489p5399o2054r398L2926N7888m407q9448l8626P8553Q3914
566G6985J0100m1902p2640m6644M6827P5685L390l4081j7897j4033J5755N5945
578E7490L050q0127n6413J9416N6205P1370L1167p1225q7207K0931P9838K7489
$$ plain form
491 51210 108164 35316 -70639 -92297 -43827 34361 87230 41415 -41013 -30487 31196 29103
503 29103 -17236 -49967 -65648 -32139 45448 68711 24426 -1 -6216 -34784 -35008 6183 16725
516 16725 3156 12947 18549 13856 34193 26656 -46239 -87369 -42827 15541 50819 63285 19685
529 19685 -40794 -22442 33494 28922 -8548 -25003 -26321 11019 80355 79043 -7729 -64894 -54891
542 -54891 -22353 27262 56350 8059 -43251 -2127 64243 67171 23159 -42401 -88485 -35127
554 -35127 78547 103036 27637 -34417 -43815 -10889 46999 42592 -46856 -85482 -6929 76985
566 76985 87085 45183 -27457 -74101 -27274 48411 51801 17720 -177 -14210 1545 57490
578 57490 60540 -19587 -76000 -56584 -379 70991 102158 30933 -56274 -35343 44495 71984
590G1984l5937o7477l9232O7895J15575J020j09723p7155N865N6307P5231J5406
602G9759p5775n3582M5568O7113J7112l4061p9229n6082N9328J10954K1926o3312
614C9719o6094l1466L7614Q5205O010j01969o2684N6770R5915N1912l4740j09381
626c3189o0833O8201Q7826m256m9916l2935m158M6465N6772l1110q6832k8417
638g2382L3135M3417M8495J5647n1791m6830J7374L1397J1279k908m2769m8081
650f4017M2154R2332J0738o7588n8883j8379L3079O7102J0395n9133k2332M3276
662H744L2672J771k0020n4163l5783M3167N7895M352j1905j4381l8604j3880L8526
675a609J9017k7737k0769M60K3776N7849K4570o8453p1773J8204N1521K2024j280
$$ plain form
590 71984 36047 -31430 -70662 -2767 112808 113828 4105 -73050 -67185 -10878 64353 79759
602 79759 3984 -49598 -4030 63083 80195 46134 -33095 -89177 -29849 81105 103031 39719
614 39719 -26375 -57841 -20227 64978 70988 -30981 -93665 -36895 59020 110932 76192 -33189
626 -33189 -94022 -25821 62005 57749 7833 -25102 -29260 17205 73977 42867 -43965 -72382
638 -72382 -39247 4170 52665 68312 16521 -30309 -12935 18462 29741 26833 -15936 -64017
650 -64017 -21863 70469 81207 13619 -45264 -63643 -30564 36538 46933 -12200 -34532 8744
662 8744 41416 43187 23167 -30996 -66779 -23612 34283 38635 26730 12349 -26255 -40135 -1609
675 -1609 17408 -10329 -31098 -30638 -6862 50987 75557 7104 -64669 -46465 5056 27080 25800
688B5800k8020l2137K3865M9094j2857m9269j9001K788J9053M7659K3400k6784
700B3591j8951j760k1527k037L9472O596m2529j2073L2738L1994J4199k9472p3476
713e3235k2447O8532O0341r707l3624k7038n738M5385M1470m3657o8469J213M3806
726c168L6378K4325j9077o1248k6105K8725K7337J4994J031m1147k8736N8917
738A2226P3585k0967p8431n0145O564O7174P1742k2217r0005k7829N1429M8207
750D1333M975m4050o5003M469Q8836N4288l1790m6457k6300j3720K8720M8889
762D4190n364m7544k2090J3182M1944N0492k0464r8256m7215O4233Q1801K2665
774G7574l7243p2138k5836P3569P3166l8042q9365l0469M0972P3667M1877n0832
$$ plain form
688 25800 -2220 -34357 -10492 38602 25745 -23524 -42525 -39737 -20684 26975 50375 23591
700 23591 4640 2880 -18647 -20684 18788 25384 -17145 -29218 3520 35514 49713 20241 -53235
713 -53235 -75682 -7150 53191 43484 9860 -17178 -22916 22469 63939 20282 -48187 -46974 -3168
726 -3168 33210 57535 38458 -22790 -48895 -20170 7167 22161 23192 -17955 -46691 12226
738 12226 85811 64844 -13587 -63732 -57168 10006 81748 59531 -30474 -58303 -6874 41333
750 41333 46308 2258 -62745 -58276 30560 84848 53058 6601 -19699 -33419 -4699 44190
762 44190 38826 -8718 -30808 -17626 24318 74810 54346 -43910 -91125 -26892 54909 77574
774 77574 40331 -31807 -57643 15926 89092 51050 -38315 -68784 -27812 45855 87732 36900
786C6900q6760q702N2898L1985N598j3766m4396j7399N6363N7300j2244n3397
798D380n2388j5733O0737P6266j8097q1613l1930L4398N4961L3024m2721q8995
810f7711p421R5608O4866k8023o1831m0405R762N8063K9119m2314l9901R676J8946
823a566J9952K6320j7732n9174j7206L5698L3652K0494k814m5988l0274M1751
835C113M8967j2556m5855l7604j223N9817N9258l3869p6710j0755L9499K5014
847A7096P378j3605l1199K753M1456J5244j6403j3307k2415k3617K2062M0998
859B6441l4k0866j1359j5726M383M3157J2095m8727l1696K4572L9966K7309p699
872D1816n3159l3394L5304L7598j3131j7826l604r415J1088L1839l657l3830j1601
$$ plain form
786 36900 -49860 -58562 -5664 26321 31919 18153 -26243 -43642 12721 70021 57777 4380
798 4380 -48008 -63741 -3004 73262 55165 -26448 -58378 -23980 30981 64005 21284 -67711
810 -67711 -75132 20476 85342 57319 -4512 -44917 -35155 22908 52027 9713 -30188 -20512 -1566
823 -1566 18386 44706 26974 -32200 -49406 -13708 19944 40438 37624 -8364 -38638 3113
835 3113 52080 39524 -6331 -43935 -45158 14659 73917 40048 -36662 -47417 -7918 17096
847 17096 24474 10869 -20330 -17577 23879 39123 22720 9413 -13002 -36619 -14557 26441
859 26441 26407 5541 -5818 -21544 -17161 25996 38091 -10636 -42332 -17760 22206 49515 41816
872 41816 -11343 -44737 -9433 28165 15034 -2792 -6396 -15811 -4723 27116 23459 -10371 -21972
885b1972J248L970L0997K9577k1107l5479m725J0061J9520K2741k7122n9696M946
898d7041O6618L0289k7839m3595l0104J5474N9129K2557m2566l1707J0821K1287
910C323K3955J0353m1205n0814J2603M3377K0105L744j5304m4525j3509M6891
922a006L8337j4158l9427l3286J0040P1864M7477n7018q1800r38N4732M3777M092
935D2686m9499n6265K0520P1127K0140l8503m1249j9604K2475N9075K2957m0712
947A3148l5409j138P645K5585L2155k4988o3662j0730N1496M9265O598m9867o8330
960f8232P858Q8069M6504m6075o1995j6928L4386O4446J7599p0724o5058K6403
972d3747O1712K4709j4792l9981l4427K0104M8388Q826k0068j7372k3218k065
$$ plain form
885 -21972 -20724 -16754 14243 43820 22713 -12766 -17491 -7430 12090 34831 7709 -51987 -47041
898 -47041 19577 49866 22027 -21568 -51672 -36198 22931 45488 2922 -28785 -17964 3323
910 3323 27278 37631 -3574 -54388 -41785 1592 21697 25441 10137 -34388 -47897 -1006
922 -1006 37331 23173 -16254 -49540 -39500 32364 79841 22823 -58977 -59915 -5183 38594 42686
935 42686 -6813 -63078 -42558 28569 48709 10206 -31043 -50647 -28172 30903 53860 13148
947 13148 -22261 -23399 -15754 9831 41986 16998 -46664 -57394 -5898 43367 49965 98 -68232
960 -68232 -60374 27695 74199 28124 -33871 -50799 -16413 48033 65632 -5092 -70150 -43747
972 -43747 17965 42674 27882 -12099 -46526 -26422 21966 30792 10724 -6648 -29866 -31931
984c1931N3411M1013l5710n9979j6450K8370N2134K7048n1130p0172J2729P0519
996A9852L2148k5130n0839l4836L3445P4454R496o0404l4067J6340K3552J7315
1008B1326J104l1749k3559J4623J7890Q556J5359j0228m3990q394M5244K9642
1020C5824j0288k6369l0567l31N0849L2028m1886n0427L408L3561L0961M989m0562
1033h810l5755K6322M0320o208j8338O76o193m602J8458J1598q189n294j2882
1046h897k0678J6694L9227m476l8404j5466J0988K4437L1249r500n3136j3237
1058d1199M8564L0976j5456k5600j9718J52L0677J6345k3828j5548Q134n458j558
1071a3517K7963J2270k5081j9023K230J1875K9316J6269m0723m6232K0105N0548
$$ plain form
984 -31931 21480 62493 26783 -33196 -49646 -21276 30858 57906 6776 -63396 -50667 19852
996 19852 52000 26870 -23969 -58805 -25360 49094 58590 -1814 -35881 -19541 4011 21326
1008 21326 22430 -9319 -32878 -18255 -365 8191 23550 13322 -30668 -39062 6182 35824
1020 35824 25536 -833 -31400 -31731 19118 51146 9260 -41167 -37759 -4198 26763 31752 -8810
1033 -8810 -44565 -18243 22077 15869 -2469 -1793 -7986 -12588 5870 17468 9279 3985 -8897
1046 -8897 -29575 -12881 26346 21870 -16534 -32000 -21012 3425 34674 25174 -27962 -41199
1058 -41199 7365 38341 22885 -2715 -22433 -22281 8396 24741 913 -14635 -6501 -11959 -13517
1071 -13517 14446 26716 1635 -17388 -15158 -3283 26033 42302 1579 -44653 -24548 26000
1083B6000J6657k2405m4205k6860M0074O0223j0510n8207j8201K4123K8442K1386
1095C6517q780l9883j4205K5827J7142L541L075k1818l4468J0378M1893J4149
1107C3368j7804l0390k9066J8600O7044K3156n7163n2618J2040M9506M0256j3834
1119D3095o9291l6628N1889O0112o999m1479l1713o299L4872M4096q249m1004
1131g598j3516Q935J6497K9795P716m3032l8049J5109L7477K8078k89m9633n0917
1144e9427K9730P2677J2505n1539m7309j510N1367N9496j3786p4147k8846L9179
1156a1610M0541R619j9820m2980j7102L9870L5491j1965k4333j6799j2634K0255
1168a1467M5625Q568l5661k7811l732K0553M1270N762n7827m0142L4747N2809
$$ plain form
1083 26000 42657 20252 -23953 -50813 -10739 49484 38974 -19233 -37434 -13311 15131 36517
1095 36517 27737 -12146 -26351 -524 16618 20159 23234 1416 -33052 -22674 19219 33368
1107 33368 15564 -14826 -43892 -25292 41752 64908 7745 -44873 -32833 16673 56929 43095
1119 43095 -26196 -62824 -10935 49177 42178 699 -31014 -37313 -2441 41655 33406 -7598
1131 -7598 -21114 -12179 4318 34113 41829 -1203 -39252 -24143 13334 41412 41123 -8510 -59427
1144 -59427 -29697 42980 55485 3946 -43363 -44873 6494 65990 52204 -21943 -50789 -11610
1156 -11610 28931 38550 18730 -24250 -41352 -1482 34009 22044 -2289 -19088 -31722 -11467
1168 -11467 34158 42726 7065 -20746 -24478 -3925 37345 43107 -14720 -54862 -20115 32694
1180C2694J1521k7186m6720k0530M4216N1721j3790m4163j2326J4948K4400K2529
1192C7314j4239m1909q765K5592J3467N957N658k1956k9021J1496K9229O956q559
1205A1220j8005k1550J8374M9769O006m4122k8377O902K1006K6378N38m0144j9930
1218c1935K9390K3752p879j0862j1937j2256J5415K7168j482j0316j37j3896j3469
1231a8444K1251K0823j6722k0515k270O070K2929K2320k4893m4569K604L5678
1243D262J8260j013j5281k5706M198L6924Q091k9096j6315L29K304K0253J9953
1256B7163j5469k5049k480K972O923K3237K903l3476j2982K8027K5962L997j8398
1269A3330m2634j9665M3046M6156j4436m0239j6762R859L2548K5566k6861m9202
$$ plain form
1180 32694 44215 17029 -29691 -50221 -6005 45716 31926 -12237 -24563 -9615 14785 37314
1192 37314 23075 -18834 -27599 -2007 11460 17417 23075 1119 -27902 -16406 12823 19779 11220
1205 11220 -6785 -28335 -9961 39808 45814 1692 -26685 -19783 1223 27601 28139 -12005 -31935
1218 -31935 -2545 21207 13328 2466 -9471 -21727 -6312 20856 19374 9058 8921 -4975 -18444
1231 -18444 2807 23630 6908 -13607 -15877 -9807 13122 35442 10549 -34020 -31416 4262
1243 4262 22522 21509 6228 -19478 -15280 21644 29735 639 -15676 -15347 -13043 7210 27163
1256 27163 11694 -13355 -15835 -12863 -5940 17297 20200 -13276 -26258 1769 27731 31728 13330
1269 13330 -29304 -48969 -5923 40233 25797 -14442 -31204 -21345 11203 36769 9908 -39294
1281c9294K424M1002K4866K359j8163l6727j0454L2679K3152j1260j6083j5023
1293b0522p820K9803M0010j4123m9229k2439J5646L8334L6535j4986n8022j4991
1305d1804M7216L5778j2035l8210l6603N060N7960L7239l2991m6850p596J7128
1317a5708K7047K0083j9459l6376L864L1807J7756L661j6627m4726j9628M0515
1329g791M2988k867k9358k9772m963M2438M1287k8233o0283j0128M0117M5466
1341C8901J8725l4981n9469m310N1124K5320k0211k6190j4097R124L9436K1360
1353D4732k9802l6691p588R740K7833L3632r112m4077j1600K8180K1431M53k3557
1366C574l9750l609N3338L7609k2143l8651j6749P501L1430J9440k6238k7509
$$ plain form
1281 -39294 -36870 4132 28998 31357 13194 -23533 -33987 -1308 21844 10584 -5499 -20522
1293 -20522 -28342 1461 41471 27348 -21881 -44320 -28674 9660 46195 31209 -26813 -41804
1305 -41804 5412 41190 29155 -9055 -45658 -40598 17362 54601 21610 -25240 -32836 -15708
1317 -15708 11339 31422 11963 -24413 -20549 11258 29014 32675 16048 -28678 -48306 -7791
1329 -7791 35197 32330 2972 -26800 -31763 10675 51962 23729 -36554 -46682 -6565 38901
1341 38901 57626 22645 -36824 -41134 9990 35310 15099 -11091 -25188 -16064 23372 44732
1353 44732 14930 -21761 -29349 -19609 8224 41856 32744 -11333 -22933 5247 26678 27131 3574
1366 3574 -36176 -39785 13553 51162 29019 -9632 -26381 -18880 12550 31990 5752 -21757
1378b1757J7519K6951J612m971j1820k6105p200K1261J4498L948M801j5154k2021
1391a8438J2744K6130o497k1776r245J354K2326L5471o665m6490j9564K1170J7808
1404H328M009p000k0310k333L0098J4666j9816j5817n551q067J3012L0012M112
1417B5343j8093o902l545m965J3350Q088k3894j7575J6478K3184J2260l6k7813
1430d120l1767J5616L7063J938j7784n471j148P318J9801j819l0566j5745O348
1443b0336Q757K0431K1911j5322l2734k665J7236R976O473j1487l1329L939M8940
1456B3790K5421k7631m2093k2499J4279M7207K0412l7993l5558J6885L2050J3328
1468B7598p245l3221l2257J8892M9392J5772j8406k3479j9510M475L2424R548
$$ plain form
1378 -21757 -4238 22713 24325 19354 7534 -18571 -25771 -4510 9988 13936 18737 3583 -18438
1391 -18438 -5694 20436 13939 -7837 -17082 -15728 6598 42069 35404 -11086 -30650 -9480 8328
1404 8328 12337 5337 -14973 -17306 12792 27458 7642 -8175 -13726 -21793 -8781 21231 25343
1417 25343 7250 348 -3197 -8162 5188 13276 -10618 -28193 -11715 11469 23729 23693 -4120
1430 -4120 -35887 -20271 16792 18730 946 -4525 -5673 1645 21446 19627 -10939 -26684 -20336
1443 -20336 -11579 8852 30763 15441 -17293 -19958 -2722 7254 13727 2240 -29089 -25150 23790
1456 23790 49211 21580 -20513 -43012 -28733 18474 38886 893 -34665 -17780 14270 27598
1468 27598 20353 -12868 -45125 -26233 23159 38931 20525 -2954 -22464 -17989 14435 23983
1480B3983l1486k4149Q023K2465L0484J4979l7365m9339O393M2325K2532o152
1492B2693k5330k5029J5876M3519M791l9483l0397l211K0532M0762J8026l4032
1504H717l6021Q912K3398J0474j261k1197k6530J4905M3831J7598j7996l2685
1516g855l3116J709M8997K7436l0255l4398N531K7884K6507N8m5061m1125K1695
1529c1993N2759K0986j5269l1189k5515J3754L7127k228l6697j4472J5238K1003
1541C504K4730O395l2863l2875N839K1708J4557O060j4351k2016J3361L2101l239
1554B2911k9537j9471o297J3321L6664J6458k5613k2845M680P818N294K554j5174
1567i237j2731K0363K4236k645p797r166k3912r953K3492J8204m415m626k918
$$ plain form
1480 23983 -7503 -31652 -23629 -1164 29320 44299 6934 -42405 -36012 6313 28845 22693
1492 22693 -2637 -27666 -11790 31729 36520 -2963 -33360 -36571 -16039 24723 42749 8717
1504 8717 -27304 -18392 5006 15480 14219 -6978 -33508 -18603 25228 42826 24830 -7855
1516 -7855 -40971 -39262 9735 37171 6916 -27482 -21951 5933 32440 32498 -12563 -53688 -31993
1529 -31993 20766 41752 26483 -4706 -30221 -16467 20660 18432 -18265 -32737 -17499 3504
1541 3504 28234 34629 1766 -31109 -25270 -3562 10995 17055 2704 -19312 -5951 26150 22911
1554 22911 -6626 -26097 -32394 -19073 17591 34049 8436 -14409 -9729 -1911 3383 5937 -9237
1567 -9237 -21968 -1605 22631 19986 12189 3023 -20889 -30842 -7350 10854 6439 1813 -1105
1580a105m147J3808J3876k0159k7842J882J8007K1869J9491j1882l9708j0958
1592b6868K6317J0167j3327r217j934J0223K7345R879k5189k1480k126P32R962
1605e516K2597J567j8345j527P997l152N9o02k0591j2602K4161L0525N474j2553
1619A7492k4621k0054J6422K9323n850k2324J404J3230R388J1692p486l5160k0207
1632c6751J6353K3634J6639O447k0490k5177J1523K6220m81j8071j8173j0115
1644b8442K3111M7674N949m8862l7346Q003L0159K4497p372l7949j2575L9529
1656F376L5661j0974l2479k8350q146L0739L9956m043l0960j0120P745Q947J0274
1669A4626p462l0602j0831K4846K8046J3396n633l4122l0292K0810L9968o59k7438
$$ plain form
1580 -1105 -5252 8556 22432 2273 -25569 -23687 -5680 16189 35680 23798 -15910 -26868
1592 -26868 -551 9616 -3711 -12928 -14862 -4639 22706 32585 7396 -14084 -16210 -15478 -5516
1605 -5516 17081 18648 303 -1224 6773 3621 3680 3078 -17513 -30115 -5954 24571 30045 17492
1619 17492 -7129 -27183 -10761 18562 12712 -9612 -8208 5022 14410 26102 18616 -16544 -36751
1632 -36751 -20398 3236 19875 26322 5832 -19345 -7822 18398 17917 -154 -18327 -28442
1644 -28442 -5331 42343 48292 -570 -37916 -29913 246 24743 17371 -20578 -33153 6376
1656 6376 42037 31063 -1416 -29766 -37912 -7173 32783 28740 -2220 -12340 -4595 4352 14626
1669 14626 7164 -23438 -34269 -9423 18623 32019 26386 -7736 -38028 -17218 22750 22091 -5347
1682e347j5176O879K7240K6421j7507m7647j6616K2102K4103J5187n1k2675j2813
1695a5900J9646J6392j1434j5152j1298q751J9719L9838P556l2725l3181r126
1707c4416K0625L6376K291m2904j9028L7909L8755k325l2302l8460j0580L8770
1719e289M0642r721l0514q668J0655J5316P944k1081l2011L196K9529J7896P416
1732B5310k71k4422k3946J1432K1089N75r333p338j749K0517K2650j6326l6441
1745a8253r679J2061J3785J7428N475j7287o368J5332J811j4927n376j681m626
1758a2305J0974J8540L926k634q469k5586j3966K3347K2952q870j3014L697J0706
1771I298J5077K649l1579l3071J2206L5736J6649l437j7010j8948N817K0989p598
$$ plain form
1682 -5347 -20523 -13644 13596 40017 22510 -25137 -41753 -19651 4452 19639 19588 -3087 -15900
1695 -15900 3746 20138 8704 -6448 -17746 -26497 -6778 33060 40616 7891 -25290 -34416
1707 -34416 -13791 22585 24876 -18028 -37056 853 39608 37283 4981 -33479 -44059 -5289
1719 -5289 35353 25632 -4882 -13550 -2895 12421 20365 -716 -32727 -29531 -2 17894 25310
1732 25310 25039 617 -23329 -11897 9192 9767 434 -6904 -8653 11864 34514 18188 -18253
1745 -18253 -27932 -15871 -2086 15342 20817 3530 -2838 12494 14305 -622 -5998 -7679 -12305
1758 -12305 -1331 17209 21135 18501 10032 -15554 -29520 -6173 16779 7909 -5105 -1408 9298
1771 9298 24375 27024 -4555 -37626 -25420 10316 26965 23528 6518 -12430 -6613 14376 6778
1784F778k6295k245J6296J3080J4536O088j8131k0008k676J182N715J6237J100
1797A1657j5286J758J7732k53j4357j3152j4492R66L1228K5381r207j6459q408
1810b892o594M633J1370o619j5340N785J5717J0107R129p606l7454k3027K3236
1823a9555L4032P703j3250k1723m961L0224K5568k5747m5349r878K7122L7947
1835B2133K1716k3908m6667n647L5152J6264j8117k2779q479K0237M0310J2611
1847D2826l2411l1594n258R559J9073J6386j1841k2134N814K0775M943p931j6834
1860h627k3522Q41L5028K6093n918j9338j7758m038K0755J5807k1611k6432J0067
1873a8653K6778J6813K655k0859l3236o136K3684J6938L194k871j4005n844K1030
$$ plain form
1784 6778 -19517 -21762 -5466 7614 22150 28238 10107 -9901 -12577 -11395 -5680 10557 11657
1797 11657 -3629 -1871 15861 15608 1251 -11901 -26393 -25427 5801 31182 21975 5516 -2892
1810 -2892 -9486 -4853 6517 -102 -15442 -9657 6060 16167 25296 17690 -19764 -42791 -19555
1823 -19555 14477 22180 8930 -12793 -17754 12470 38038 12291 -33058 -42936 -15814 22133
1835 22133 43849 19941 -26726 -32373 2779 19043 926 -21853 -30332 -10095 30215 42826
1847 42826 10415 -21179 -26437 -16878 2195 18581 6740 -15394 -9580 11195 16138 8207 -8627
1860 -8627 -32149 -31308 3720 29813 23895 4557 -13201 -17239 3516 19323 -2288 -28720 -18653
1873 -18653 8125 24938 27593 6734 -26502 -32638 -8954 7984 11178 8307 -5698 -11542 9488
1886I488J8344j8117k9941j1936R712L3294L0922j6441m6181j2534K8184K3133
1898A7927l609k6637k4994J8239N0317J5980l4237l4074o618J2989K2624R475
1910A7382j9265j5094J5311J8120k196r647j5708j6700Q336K5847J1639l488l608
1923A0929j2081j1409J0541J0970j2018j1846N848J0315J1706J0499j2644k5830
1935a5020n497R975N248Q503Q415o552n819J1065L148j2418q500o237p178J3497
1949g370K7442O627j7146j7121j0005L331J9616N005k1486o887K4583K1595k151
1962B6033j7954k6542j2885K1615K4819m813j2174K886M848L155J648j2789j8913
1975b1066L581J5307Q443J0802R769j3466k3664l060P728N472M846k897j0329
$$ plain form
1886 9488 27832 9715 -20226 -32162 -22450 10844 41766 25325 -20856 -33390 -5206 17927
1898 17927 14318 -12319 -37313 -19074 31243 47223 12986 -21088 -27706 -14717 7907 17382
1910 17382 -1883 -16977 -1666 16454 14258 4611 -11097 -27797 -19461 6386 18025 14537 10929
1923 10929 -1152 -12561 -2020 8950 -3068 -14914 -9066 1249 12955 23454 10810 -15020
1935 -15020 -20517 -10542 -5294 3209 11624 5072 -747 10318 13466 1048 -7452 -13689 -20867 -7370
1949 -7370 20072 26699 9553 -7568 -17573 -14242 5374 10379 -11107 -17994 6589 28184 26033
1962 26033 8079 -18463 -31348 -9733 15086 10273 -1901 985 5833 8988 10636 -2153 -21066
1975 -21066 -17485 -2178 6265 17067 26836 13370 -10294 -13354 -5626 -154 4692 1795 -8534
1988h534R793K4049j029k5588j9124m123J1013K6686J4847j5897j5240M043O086
2001F982P30j33j5374j9041J0976L1635J5448o432k2342k8465j693L2800J9931
2014B5022j9175k2345M069K4069K5927l213m5150l7626J8075M4054J8595j2341
2026A9961k5210j4621J8430K7190j0528l4683j1929J7312K4841K1008k554k7610
2038A607j9527O356R167L331M147o794j1751J1896K3741J405k0258k2978j4562
2051c4220J3105L7392J6162k1515j9851L160J0076O830n482k4819j3174K2648
2063i688K9219N606j0104j7807k0699P60K3479J1025r718r140k200Q861K3669
2076B3263O443l4291l4609O210L1628K5311M52k6688k2954J6913L0372n949l1424
$$ plain form
1988 -8534 1259 25308 24279 -1309 -20433 -24556 -13543 13143 27990 12093 -3147 896 6982
2001 6982 7712 7579 -7795 -26836 -15860 15775 31223 24791 2449 -26016 -27709 5091 25022
2014 25022 5847 -16498 -12429 11640 37567 34354 -10796 -48422 -30347 13707 32302 19961
2026 19961 -5249 -19870 -1440 25750 15222 -19461 -31390 -14078 10763 31771 29217 1607
2038 1607 -17920 -11564 -2397 934 5081 -1713 -13464 -1568 22173 23578 3320 -19658 -34220
2051 -34220 -21115 16277 32439 10924 -8927 -5767 4309 11139 5657 -19162 -32336 -9688
2063 -9688 19531 25137 15033 -2774 -23473 -22713 766 11791 2073 -7067 -9267 -406 23263
2076 23263 29706 -4585 -39194 -32984 -1356 23955 24407 -2281 -25235 -8322 22050 16101 -15323
2089a5323j6308J0023K8120K6549o114l2254j3531J0909P281j48o55o338j588
2102i377J4778J1249o656r732q750j2364L772K3346J1186q577o053j873j156N171
2116D964l6j7424r667J4681J5906N632K626q226j8026m194P924K670L050Q447
2130H327l224o903R724J0606j0648j8339j0915J055K1886K6184o286k7884p021
2143a3438J3560Q776k229j2924j5470Q870L2340J3063j7323j8862q971p65J0277
2156c096R337o640m531J0039N409l235J789n293j8688o055J5796J6467R688l62
2170B0625j7936j6669Q069J3746m972j1569l166L162J6914K0616p179k8664j3817
2183b0840O102J1310J3714M984j4033j0004J3075J3605k698j4692k1766j2200
$$ plain form
2089 -15323 -31631 -21608 6512 33061 26947 -5307 -18838 -7929 -648 -796 -1451 -7789 -9377
2102 -9377 5401 16650 9994 262 -8488 -20852 -17080 6266 17452 8875 2822 949 -207 4964
2116 4964 4928 -12496 -22163 -7482 8424 14056 16682 8456 -9570 -13764 -5840 -3170 -120 8327
2130 8327 5103 -1800 7924 18530 7882 -10457 -21372 -20317 1569 27753 21467 -6417 -13438
2143 -13438 122 8898 6669 -6255 -21725 -12855 19485 32548 15225 -3637 -12608 -13373 -3096
2156 -3096 6241 -399 -4930 5109 10518 7283 9072 3779 -14909 -20964 -5168 11299 20987 20625
2170 20625 2689 -13980 -5911 7835 2863 -8706 -11872 -8710 8204 28820 21641 -7023 -20840
2183 -20840 -14738 -3428 10286 15270 1237 -8767 4308 17913 15215 523 -21243 -33443
2195c3443K4234L8082M565k7295k1440j511J6070J9057p855l0725o949L1409L0184
2208C4383N30k5647l4110r816K9366K7001r622k0768k206J1866J6427O874j9909
2221D369k9668j430K2486J8909Q913n341k0378j1091J1607Q888p708p702l001
2234a1147J697J9189K0625q883k8631j5029M006J5605J8668j61j8598n174J5671
2247G838Q711o466j1916j6631o862K1023K7216J013j6500j4548o444R201J7769
2260A3404l468k2342n174J8337K0711Q923j4259l4903j6095K4645K8078k174j7205
2273a522q980N811K0329R576k2572k7157K833K0386J5721O373q680j7935k698
2286h515J2629M62j1194j900K965K357J0980R218o097j0164p444q622K218J8810
$$ plain form
2195 -33443 -9209 28873 33438 6143 -15297 -16808 -738 18319 10464 -20261 -27210 4199 34383
2208 34383 34913 9266 -24844 -34660 -5294 21707 12085 -8683 -10889 977 17404 24278 4369
2221 4369 -25299 -26729 -4243 14666 23579 18238 -2140 -13231 -1624 7264 -444 -8146 -11147
2234 -11147 -9450 9739 30364 21481 -7150 -22179 -18173 -2568 16100 15939 -2659 -7833 7838
2247 7838 16549 10083 -1833 -18464 -25326 -4303 22913 23926 7426 -7122 -13566 -4365 13404
2260 13404 9936 -12406 -17580 757 21468 30391 16132 -18771 -34866 -10221 17857 15683 -1522
2273 -1522 -10502 -4691 15638 25214 2642 -24515 -21682 -1296 14425 20798 12118 -5817 -8515
2286 -8515 4114 4576 -6618 -8518 -5553 -3196 7784 17002 10905 741 -6703 -15325 -13107 5703
2300E703Q658q960m554L503q3r11n06j3147r910J1890J7637O375j356r634j5699
2315a0994j113J3131L535n477m45j6J159J3316P314j8567k2603r13J4088J6272
2329H687Q866j2080j6666O762J7545k018j6071j0044j785J2398K3099M015j8785
2342C923j2651J862J911K242L488l658k648P994O632j349J316n144j8776o454
2356b1312J8759J7271P73p643j2094n358J3513J1176j4097k0327m54J5887K1086
2369A7180J2211j5924k9677l914K0305J0226m248p536p704M132K0532J0080j7339
2382H324k3473j0002P355K5025K0278j2502k6303j406J8929J0395m722j9131k0550
2395b7783R542L5898J7859j7924k6289j1409Q833K0516M848k0782j2053J6738
$$ plain form
2300 5703 14361 5401 847 4350 4267 3356 2850 -10297 -20207 -8317 9320 15695 14339 4705 -10994
2315 -10994 -12107 1024 4559 -918 -1363 -1379 -220 13096 20410 1843 -20760 -21673 -7585 8687
2329 8687 17553 5473 -11193 -4431 13114 11096 -4975 -15019 -16804 -4406 18693 22708 3923
2342 3923 -8728 -6866 -4955 -2713 775 -2883 -5531 2463 9095 7746 9062 3918 -14858 -21312
2356 -21312 -2553 14718 15491 7848 -4246 -9604 3909 15085 988 -19339 -19793 -3906 17180
2369 17180 29391 13467 -16210 -20124 181 10407 6159 -1377 -9081 -4949 15583 25663 8324
2382 8324 -15149 -25151 -17796 7229 27507 15005 -11298 -12704 6225 16620 11898 -7233 -27783
2395 -27783 -18241 17657 35516 17592 -8697 -20106 -11273 9243 14091 -6691 -18744 -2006
2407b006J8964L043p028j6871j7457L796K0700J0850j096n697j0724l423J1893
2420D944N933j4337j2815Q06J0646J9536J3820j5635k8230l573J7007J0570k061
2433F611r592j0233Q966K1392L943j8229j6627o780L203J9556J7259q867j6600
2446e998p73P884N367N23j2628j6973O391K6184J3739p875j7706j7283O60K1257
2460B769R955j7249j2650J0987J5731P509n186j8933j3793Q848J4547K478p20
2473D293M71n117j306M799l860r907Q64M802j3P876J2641k910j4216q386j968
2488a1937M901J2709K367j1878j743J1554L398n570n894r646n589J2681J6612
2501A1965J83o973n552n695J850R838j542j1974j210Q370P721Q740j79k0382j6987
$$ plain form
2407 -2006 16958 20001 12973 -3898 -21355 -17559 3141 13991 12895 7198 -3526 -6949 4944
2420 4944 10877 -3460 -16275 -15469 -4823 14713 28533 12898 -15332 -18905 -1898 8672 6611
2433 6611 -2981 -13214 -4248 17144 21087 2858 -13769 -20549 -17346 2210 19469 10602 -5998
2446 -5998 -6771 1113 6480 7003 -5625 -22598 -16207 9977 23716 15841 -1865 -19148 -18488 2769
2460 2769 12724 -4525 -17175 -6188 9543 17052 11866 -7067 -20860 -12012 2535 5013 4293
2473 4293 4764 -353 -1659 3140 -720 -10627 -9763 -4961 -4974 2902 15543 12633 -1583 -9969 -11937
2488 -11937 -7036 5673 8040 -3838 -5581 5973 9371 3801 -2093 -11739 -17328 -4647 11965
2501 11965 12148 5175 -377 -6072 -4222 5616 4074 -7900 -9110 -740 6981 15721 15542 -4840 -21827
2516b1827R999J7039L451m407o430l307J0540J2082q775j7446l996N544R233J2891
2530A4591J224j5674q131O639L317j326J080m494n910Q171J4118K246n745j1470
2544a364j4625J762K1983R859j2841j1359K103Q470J0821j183k1852j7442J2899
2557a2769K4427J0666o897j7804j4303J0377K0817j602j8739p729N842J2595J5486
2570B0367n32k3158j7922O591J6041J1032j08j5715j1727J4495K1198k726k0272
2583b436j4977k904J6753K5060O51k4299j3822Q399J2402M980p021j6159k933
2596a6306J9840J5303m830j0357j0090q936N895J7334L223j0470o051R26N494
2609I75J1165l81k0107j3760R819J7578J1248o32j7034j5628J0484J9639l695
$$ plain form
2516 -21827 -11828 5211 8662 4255 -2175 -5482 5058 17140 8365 -9081 -13077 -7533 1700 14591
2530 14591 15815 141 -7990 -1351 1966 640 1720 -2774 -8684 -513 13605 15851 10106 -1364
2544 -1364 -15989 -14227 7756 17615 4774 -6585 -4482 3988 14809 13626 -8226 -25668 -12769
2557 -12769 11658 22324 15427 -2377 -16680 -6303 14514 12912 -5827 -13556 -7714 4881 20367
2570 20367 19835 -3323 -21245 -14654 1387 12419 12311 -3404 -15131 -636 20562 17836 -2436
2583 -2436 -17413 -20317 -3564 21496 22147 -2152 -15974 -7575 4827 9807 2786 -13373 -16306
2596 -16306 3534 18837 14007 3650 -6440 -15376 -9481 7853 11076 606 -5445 -4519 975
2609 975 12140 11759 -8348 -22108 -12289 5289 16537 15905 -1129 -16757 -6273 13366 9671
2622I671j6468o844N033J4171J3952n391k0878r104O399P803P374M108r753p967
2636g894R462J1036l522q408r380p631R469K1341M224j5157j0648l32O285J0081
2650H926k228j7211l563J8366J3020m185q397r660n897O788Q987k387k100N032
2664E491j119m287K792Q66p301k509J307O68R366J2708o284j8153l702Q332O024
2679D199J534n293r408M139J6606K514j2521q492k845J15J0823R812m578p234
2693f29J115O81n38M961l189j2723j431J2590R700K964o368j6780p391J5451J4304
2708A2717p702j1748j204O536J1027O359j2602j7168J255J1106N733L669j525
2721F453j0321m149R151M571m248l170o002m664J2224J8682j812j7823j2407Q9
$$ plain form
2622 9671 -6797 -13641 -8608 5563 19515 14124 -6754 -15858 -9459 -1656 5718 9826 73 -7894
2636 -7894 1568 12604 9082 674 -8706 -16337 -6868 14473 18697 3540 -7108 -7440 -1155 8926
2650 8926 6698 -10513 -14076 4290 17310 13125 4728 -4932 -10829 -4041 4946 2559 459 5491
2664 5491 4372 85 2877 3743 -3558 -6067 -4760 -4092 5274 17982 11698 -6455 -10157 -1825 4199
2679 4199 5733 440 -8968 -4829 11777 14291 1770 -6722 -9567 -9452 1371 11183 6605 -629
2693 -629 486 1167 629 5590 2401 -10322 -11753 837 10537 13501 7133 -9647 -17038 -1587 12717
2708 12717 5015 -6733 -7937 -1401 9626 15985 3383 -13785 -12530 -1424 4309 7978 6453
2721 6453 -3868 -8017 1134 5705 1457 -1713 -7715 -12379 -155 18527 16715 -1108 -13515 -13426
2735a3426J3088J5431m701k2156m685J9104J3503k826j4365j6624j413K2424J6199
2748A9553q487j4402m321L276R193Q642q738j7119j099J2240J0686P309n478k0660
2762i405j0013J6445J6535k019j2366j1005J625K0455J4955j5808k4689k782J4034
2775d038J4622N902j1222j7454K066J7227M984q755p753n893J445J4388J0744
2788A6263o777j0109n521k685P593J3183l726j6973l739J2715J1680L132j0620
2801D416j9307l747K0579J4826o885j1635n928K406J2186O988j3161j4179L599
2814i842J0791N752L671m487j2572l538Q790N062j26j236o586m420J1770J1289
2828A4318o552j3531n911J525R668J2211m466j5065q01J0317K771j873m392p720
$$ plain form
2735 -13426 -338 15093 10392 -11764 -16449 2655 16158 13332 -1033 -17657 -19070 3354 19553
2748 19553 11066 -3336 -7657 -4381 4812 13454 4716 -12403 -13502 -1262 9424 16733 11255 -9405
2762 -9405 -19418 -2973 13562 11543 -823 -11828 -10203 10252 25207 9399 -15290 -18072 -4038
2775 -4038 10584 16486 5264 -12190 -10124 7103 12087 3332 -4421 -10314 -8869 5519 16263
2788 16263 9486 -623 -6144 -8829 -1236 11947 8221 -8752 -12491 224 11904 15036 4416
2801 4416 -14891 -18638 1941 16767 9882 -1753 -7681 -5275 6911 13899 738 -13441 -9842
2814 -9842 949 6701 10372 5885 -6687 -10225 -1435 3627 3501 2265 -4321 -8741 3029 14318
2828 14318 7766 -5765 -11676 -10151 -483 11728 7262 -7803 -8604 1713 4484 2611 -1781 -9501
2842i501Q19J3095N301o270l531j343n771J389Q463M7m774j20p55K11Q609K834
2858H703j2631q569O398Q281M923J334q596r841O211J0755k947o729j959j550
2872f217L837J0936J301j0738n868J073J003O430P939o074j0354K465P756L094
2886F583N00p609j3563K889J8189P252r605q981m586K730J3623M870j3054j0853
2900a1615O567R727N701J297j1228j3245L809J3317M065l108l962q183l64J3791
2914F569P535j0252j1852l076N746J4945R959j3409j9244J653J5026Q573k418
2927I755j2289j3303O916K1428N108j4498j2402k653P523J4051M678j3508j1060
2940a0254N062Q228M757K279j0058j5201L478J6966P720n136j0473j1200L155
$$ plain form
2842 -9501 -8682 4413 9714 3444 -87 -1430 -7201 -5812 2651 2698 -2076 -2196 -2951 -2740 5869 8703
2858 8703 -3928 -12497 -6099 2182 7105 8439 -157 -9998 -3787 6968 4021 -2708 -4667 -6217
2872 -6217 -2380 8556 9857 -881 -6749 -5676 -4673 1757 9696 3622 -6732 -4267 3489 6583
2886 6583 7083 -526 -14089 -11200 6989 14241 4636 -4345 -8931 -6201 7422 12292 -762 -11615
2900 -11615 -5048 4679 10380 11677 449 -12796 -8987 4330 8395 5287 1325 -6858 -7222 6569
2914 6569 14104 3852 -8000 -11076 -5330 9615 19574 6165 -13079 -11426 3600 12173 9755
2927 9755 -2534 -15837 -8921 12507 17615 3117 -9285 -11938 -4415 9636 14314 806 -10254
2940 -10254 -5192 3036 7793 10072 14 -15187 -11709 5257 12977 7841 -2632 -13832 -10677
2953a0677J9060Q187j4876j3977Q69J0903J2986K201j7683j6089R059J7350K867
2966A0180o605r105o299O859J4329J66j1322o018j53K898J1499O462j1247j2538
2980a0894K520Q000O137K724r385j3737M572J7270M925q756j0468o111O561J6424
2994I782K379j5045p960O726O105L050N52q797q146N567Q855M80m69k328q038
3009g287n36J0835M055n937m101k864l71R774Q038r117j2788K043Q247M655J733
3024F379o284r372M414J0613r95n254k16j984k377O351N560m442l449l75l282
3039d713K183Q444k37j0145k491L883M367N951n39j2404o092J1926R160m057n803
3054e67l901j913O962P071m649p598P6J451J015P641J934j0070n292N082M341
$$ plain form
2953 -10677 8383 16570 1694 -12283 -11414 -511 12475 14676 -3007 -19096 -10037 7313 10180
2966 10180 3575 -5530 -11829 -4970 9359 9525 -1797 -7815 -7968 -5070 6429 12891 1644 -10894
2980 -10894 -8374 -374 5763 8487 -898 -14635 -10063 7207 12132 3376 -7092 -13203 -6642 9782
2994 9782 12161 -2884 -10844 -4118 1987 5037 5589 -3208 -11354 -5787 3068 3548 3079 751 -7287
3009 -7287 -7823 3012 7067 1130 -2971 -5835 -6206 3568 11606 2489 -10299 -8256 -9 4646 6379
3024 6379 95 -9277 -4863 5750 4755 -499 -715 -2699 -5076 1275 6835 2393 -1056 -1431 -4713
3039 -4713 -2530 5914 5677 -4468 -6959 -3076 1291 7242 6703 -5701 -11793 133 9293 5236 -567
3054 -567 -4468 -6381 581 7652 3003 -4595 -4519 -3068 -2053 5588 7522 -2548 -7840 -2758 1583
3069A583L514K449q806j0882O730J3713J842q282r130m523R407J5400k961j5957
3083e903n971Q167P750M837j833j2569n740R884R677j438m165o935n730O269J2791
3098I091M9j0080n658k165N120J4123L228j6287j1787P983J3111O286m882j5896
3112g764q716J3596J6326k750j2354p495p49J0189J2703l236j6269m841Q587P851
3126E078M862j817j2394p654R082J0688J182m575r204p435R290J7100j809j6154
3140c760p739M462J0797J0778l867j7077n920J2360R811p81n981j0115l469J2625
3154B124J1221o217r977k187L96M658R375J21j1774m269M503N906N959j181j3458
3169d800p433J1075J1491j832o855n775m137P954J1490l420j2031k179N316N706
$$ plain form
3069 1583 5097 7546 -1260 -12142 -5412 8301 10143 1861 -7269 -11792 -2385 13015 10054 -5903
3083 -5903 -11874 -3707 4043 8880 7047 -5522 -11262 -1378 8299 6861 2696 -4239 -9969 -3700 9091
3098 9091 9140 -940 -6598 -8763 -3643 10480 13708 -2579 -14366 -6383 6728 13014 8132 -7764
3112 -7764 -16480 -2884 13442 10692 -1662 -9157 -9906 283 12986 9750 -6519 -11360 -2773 5078
3126 5078 9940 8123 -4271 -11925 -2843 7845 9027 4452 -4752 -12187 -2897 14203 12394 -3760
3140 -3760 -11499 -7037 3760 14538 10671 -6406 -12326 34 9845 9064 3083 -7032 -10501 2124
3154 2124 13345 7128 -2849 -5036 -4640 18 9393 9514 -2260 -6529 -2026 3880 9839 8658 -4800
3169 -4800 -12233 -1158 10333 8501 1646 -4129 -8266 -312 11178 7758 -4273 -6452 -1136 4570
3183D570N056k933j1252k825Q132L795j252Q86l930o253M279Q692p43o600k990
3198c368j948L756J0472K90j0342l541L560J964K972J682p281o175P028P382j751
3213D700l512k059m455K074O814K60l030J90j958l338N856N766o588p212J884
3228d608L544L739M974m162j0692l04Q237L523p06l119o945J61J1452N234r101
3243A227o889M07R49N554O541m241r164N7N450K765K436l132j0178o79J2394O154
3259I651l987m947o368l916R105J0214n151j1176j089N334P939N213q075j4567
3273a1820R90J2575O223j359m127q459k733J1431P690p582r460j956L348R717
3287D478Q472o464j4284j855O539O955N094m567j3811j653J5690J0057p166j2292
$$ plain form
3183 4570 9626 6693 -4559 -7384 748 4543 3291 4177 247 -6006 -1727 6965 6222 -378 -3368
3198 -3368 -5316 -1560 8912 9202 -1140 -4681 -1121 843 3815 5497 -1784 -7959 -931 6451 4700
3213 4700 1188 -871 -5326 -3252 3562 3822 792 982 -976 -4314 1542 7308 720 -6492 -4608
3228 -4608 -1064 2675 7649 3487 -7205 -7509 728 4251 3545 426 -6519 -6358 5094 10328 1227
3243 1227 -5662 -5255 -4306 1248 7789 3548 -5616 -5559 -109 2656 5092 1960 -8218 -8897 3497 9651
3259 9651 5664 717 -5651 -9567 -462 9752 4601 -6575 -7664 -2330 5609 10822 2747 -11820
3273 -11820 -10830 1745 7968 6609 2482 -5977 -8710 2721 10411 2829 -6631 -8587 -5239 4478
3287 4478 12950 6486 -7798 -9653 -3114 3841 8935 4368 -9443 -11096 4594 14651 7485 -4807
3301d807p934K737J5321R101r616j3231M72P655O802K499q960j2541L087J5155
3315E740N409m574o367p934j562J0499P801n947q586j411L233R663P015j0465
3329B514j5526J328J2520P098j47o518r519J116J2364L493r116o784j013M256
3343c934J0076N179r259r217J079M350K302M030j746q904K5R322M765l332o199
3358a463q654p97J2873Q858p296q485L60K713M989L569p542r727M123J0737K624
3373F882j943l949p057o07O698K017l204J08O59l014L496O696l674q694j360K878
3389d068M214O330o33q765k492N756K010j573j080m450j792Q249O446m658m469
3404i75o02k679m32O444K311l479q80J76n91M678K434q825q287N266Q955L243
$$ plain form
3301 -4807 -12741 -10004 5317 14418 4802 -8429 -7957 -302 6500 8999 39 -12502 -9415 5740
3315 5740 11149 6575 208 -7726 -9288 1211 9012 3065 -5521 -6932 -3699 5964 12979 2514
3329 2514 -13012 -11684 836 7934 7787 1269 -8250 -7134 5230 8723 -393 -7177 -8190 -3934
3343 -3934 6142 11321 2062 -7155 -6076 -1726 576 4606 2860 -6044 -6019 3303 8068 4736 -1463
3358 -1463 -10117 -10914 1959 10817 3521 -4964 -4604 -1891 3098 6667 -875 -10602 -6479 4258 6882
3373 6882 4939 990 -6067 -6674 24 2041 -1163 -1055 -396 -3410 86 6782 3108 -5586 -6946 -4068
3389 -4068 146 6476 5843 -2922 -5414 342 2352 779 -301 -4751 -6543 1706 8152 3494 -975
3404 -975 -1577 -4256 -4688 1756 4067 588 -292 -116 -707 3971 6405 -2420 -10707 -5441 3514 6757
3420F757J28o041q910L282J0623L92q423l662J230N974Q681n74j2202o203M723
3435d225M207K332L127l829o689L426P999j52m639n632n320L855J3647M197r077
3450C227p782o17L171P137K812j0392q855P586J2179K286m877q840p804M862J2150
3465F243K097o481l423j290J969Q589J845j1398r970L872R373P850K898r481j2768
3480a0075K978J2033L625o063q104m329P673J6405Q46j6330j1170L228Q912P948
3494G577K44j0170o796Q323R655j087o816p773n397P451J4657J384r246n831j643
3509e468K703P420J376j0612o077P667J0102L688l708j1206q640P307J1490k3
3523F019n954k147J62L067O184k597j0308l425M961M298M991L574o582p408J574
$$ plain form
3420 6757 6885 844 -8066 -4784 5839 6231 -2192 -5854 -4624 1350 10031 9457 -2745 -8948 -4225
3435 -4225 -18 2314 5441 1612 -5077 -1651 6348 6196 1557 -4075 -9395 -5540 8107 12304 3227
3450 3227 -4555 -5172 -2001 5136 7948 -2444 -11299 -3713 8466 10752 5875 -2965 -10769 -5907 6243
3465 6243 8340 1859 -1564 -2854 -885 7704 9549 -1849 -11819 -7947 1426 9276 12174 2693 -10075
3480 -10075 -7097 4936 8561 2498 -5606 -9935 -2262 14143 14989 -1341 -12511 -9283 -371 7577
3494 7577 7821 -2349 -9145 -822 8833 7746 930 -6843 -12240 -4789 9868 11252 2006 -3825 -5468
3509 -5468 -2765 4655 6031 -4581 -10658 -2991 7111 10799 7091 -4115 -12755 -5448 6042 6019
3523 6019 65 -2082 -1920 1147 7331 4734 -5574 -8999 -4038 260 5251 8825 2243 -5165 -3591
3538c591M502q2M00k269n692L494J1706J975r221p893k896L708R952M025q075
3553D3o375N499N351L5l102p412m607P186J0717o04n166k107k586p66M428Q27
3569A361n023k38L717J134K783K633n572q448J169M870K139K841J28n118j096
3584b720N091j47m944j059r10j05O083O695k837o469j885k302M62O871K054o164
3600b286k615M753L962K308k992j0801o381R229J2121J71o387n737j788O492P370
3615G419n533j2513K00R396P537K791n219j1580k449Q019M424k497j700j068q33
3630c606N849O167m688q876k794Q13N094R632R47j0600m808N100N206L57l566
3645B27q419k292J1551J0664l475q157n928k121N215Q053o53q260j316M295N070
$$ plain form
3538 -3591 911 829 1229 -1040 -6732 -3238 8468 10443 1222 -6671 -9567 -5859 4093 8118 43
3553 43 -6332 -833 4518 4553 1451 -5961 -10568 -3382 7335 6731 1565 -542 -3128 -3894 534 1361
3569 1361 -3662 -3900 -183 951 3734 6367 795 -7653 -6484 -1614 525 3366 3494 -1624 -2720
3584 -2720 2371 2224 -2720 -3779 -4689 -4794 1289 7984 5147 -1322 -3207 -5509 -5047 1824 3878 -2286
3600 -2286 -4901 -148 3814 6122 3130 -7671 -14052 -4823 7298 7469 1082 -4655 -6443 49 7419
3615 7419 1886 -10627 -10427 -1031 6506 9297 4078 -7502 -9951 -1932 2492 -5 -1705 -2773 -3606
3630 -3606 2243 8410 3722 -5154 -7948 -7135 -2041 7591 8538 -2062 -6870 -1770 3436 3793 227
3645 227 -8192 -10484 1067 11731 8256 99 -5829 -7950 -2735 5318 4665 -3595 -4911 -616 4454
3660D454M404k992j3083p488Q994J2838L259m576j0257n019R917J2001o183j4800
3674h531m084Q455J2753P343p954j6166k621J0615O440k452n127m326K789J0854
3688G988M580q550r711j672J586O417Q041j021q442j544L465J643R51l277p939
3703g485n27J1707Q403l208o769o186k390N622O397m028n468L282M528J851L08
3718F037l792q355j616N521L798L169L341n146o846K048O078j393n486l246K30
3733e658Q042J0372k739j3004n878M383N358K517j421n763N38R602L249p578n644
3748c624j773n63M613O056l29k630M58j111l787K451J100m851r94N915L588J323
3764E842M6m882p603N24N884R83R34J374k169q98L428r1n931k367k53N10O756
$$ plain form
3660 4454 8858 5866 -7217 -14705 -5711 7127 10386 5810 -4447 -9466 451 12452 6269 -8531
3674 -8531 -12615 -4160 8593 15936 7982 -8184 -10805 -190 6250 3798 -1329 -5655 -2866 7988
3688 7988 12568 4018 -5693 -7365 -5779 638 8679 7658 -784 -2328 1137 2780 3731 454 -7485
3703 -7485 -8012 3695 12098 8890 2121 -4065 -6455 -833 5564 1536 -3932 -650 3878 5729 6037
3718 6037 2245 -6110 -7726 -2205 1593 4762 8103 2957 -3889 -1841 4237 2844 -2642 -5888 -5658
3733 -5658 2384 12756 10017 -2987 -8865 -4482 876 3393 1972 -3791 -3253 6349 9598 2020 -3624
3748 -3624 -5397 -5960 -1347 4709 4380 1750 2208 1097 -2690 -239 861 -3990 -4984 931 4519 5842
3764 5842 5888 1006 -6597 -6073 -189 794 1728 3102 933 35 3463 3372 -2559 -4926 -5179 -4669 2087
3781B087Q602k947r523l297K018L219L405k751q049J855J2396N247o448r607o743
3796a0536J236J2068P077p282p248L007O100K043k564q393o978N949J0645K797
3810G921k725l017n790j550N455L157m937k815J649K763N972M427o976j1404p38
3825h608N868N392L588l187p540J109Q913J506p497n697k174K931R494P049n015
3840F132q142l176R16M489M847l703r614J369J1473O046k234r458j0789m15J3940
3855A681Q926o254r341r07O359Q494M97j3774j1476O539J3538N380k767p121o740
3870f966K176Q842l07p777l249L020N643P256L68r712p733K364L890K426L024
3885C265j712n157K203O227m42n976l812k738K785R072M273m921l886q16j306
$$ plain form
3781 2087 10689 7742 -1781 -5078 -3060 159 3564 813 -7236 -5381 7015 12262 5814 -3793 -10536
3796 -10536 -9300 2768 9845 2563 -4685 -1678 4422 6465 3901 -4492 -11470 -5521 5124 7921
3810 7921 5196 2179 -3611 -5161 294 3451 -1486 -4301 -2652 111 6083 10510 3534 -7870 -8608
3825 -8608 -2740 2652 6240 3053 -4487 -3378 5535 7041 -456 -6153 -8327 -5396 4098 11147 6132
3840 6132 -2010 -5186 -4270 219 5066 1363 -8251 -6882 4591 10637 8403 -1055 -11844 -12259 1681
3855 1681 10607 4353 -4988 -5895 464 8958 9455 -4319 -15795 -9256 4282 9662 6895 -226 -6966
3870 -6966 -4790 4052 3745 -4032 -7281 -4261 1382 8638 9006 -706 -8439 -6075 -2185 241 3265
3885 3265 1553 -3604 -1401 4826 4384 -1592 -5404 -8142 -5357 3715 7988 3067 -819 -1635 -2941
3900b941J110K966k863m499L921O017J627l85l475q423l074P429N829K39j514
3915A964l336j532N885M154q211r341K049O949O439L213m582q469Q5N578q7l641
3931b883j108K84L357P700O69q005m378Q9m83J126N408J554k281P78L42k740j69
3948g40k79m213q46O814M131l65O37l837p136k07N259J975j534J25k3J121N033
3965E915l4r066n918K045M491P458M537n990r017J704O934%m923n436j776P715
3981a361J2431Q5j1685q124J311N239O157J66q805k638J0068O713m408p245n694
$$ plain form
3900 -2941 -1831 1135 -1728 -6227 -2306 3711 5338 4953 1478 -6945 -10019 -2590 3239 3478 1964
3915 1964 -1372 -2904 2981 7135 -1076 -10417 -8368 -1419 5020 8233 3651 -4818 -4733 845 758 -2883
3931 -2883 -3991 -3707 -350 7350 8019 14 -4364 -4275 -4758 -3632 1776 3330 1049 1827 2169 -571 -740
3948 -740 -1019 -5232 -6078 736 4867 4502 5139 1302 -5834 -6041 -782 1193 -341 -216 -239 882 5915
3965 5915 5881 -3185 -9103 -7058 -2567 4891 9428 3438 -5579 -3875 3059 3059 -1864 -7300 -9076 -1361
3981 -1361 11070 11155 -530 -8654 -7343 -2104 4053 4219 -4586 -7224 2844 9557 5149 -2096 -7790
$$ [...]
8191a33
##END NTUPLES=NMR FID
##END=
