##TITLE=1H_TG-2270-3
 CDcl3, 8 sc, 
 19.12.2019
##JCAMPDX= 6.0         $$ Bruker NMR JCAMP-DX V2.0
##DATA TYPE= NMR FID
##DATA CLASS= NTUPLES
##ORIGIN= UXNMR, Bruker Analytische Messtechnik GmbH
##OWNER= root
$$ XWIN-NMR		Version 3.5
$$ Thu Dec 19 14:02:47 2019 Russian Standard Time (UT+4h)  she@DPX200
##.OBSERVE FREQUENCY= 200.1315
##.OBSERVE NUCLEUS= ^1H
##.DELAY= (6, 6)
##.ACQUISITION MODE= SIMULTANEOUS
##.ACQUISITION SCHEME= undefined
##.AVERAGES= 8
##.DIGITISER RES= 18
##SPECTROMETER/DATA SYSTEM= spect
##.PULSE SEQUENCE= zg30
##.SOLVENT NAME= CDCl3
##.SHIFT REFERENCE= (INTERNAL, CDCl3, 0, 15.7039)
##AUDIT TRAIL= $$ (NUMBER, WHEN, WHO, WHERE, WHAT)
$$ ##TITLE= Audit trail, XWIN-NMR		Version 3.5
$$ ##JCAMPDX= 5.01
$$ ##ORIGIN= Bruker BioSpin GmbH
$$ ##OWNER= she
$$ F:/spectra/data/she/nmr/H-F/1/audita.txt
$$ ##AUDIT TRAIL=  $$ (NUMBER, WHEN, WHO, WHERE, WHAT)
(   1,<2019-12-19 14:01:34.25 +0400>,<she>,<DPX200>,
      <created by zg, POWCHK disabled, PULCHK disabled
       configuration hash MD5:
       00 E9 B6 7A A2 85 ED C7 34 08 36 98 17 FE 4E 26
       data hash MD5: 16K
       E2 51 62 4D EB 7F B4 46 DA 2E 35 05 F6 AD 04 6B>)
$$ ##END=
$$ 
$$ hash MD5
$$ 90 EE A8 CF FD 4D 51 EB 43 38 CD 9F 3F 51 C9 96
##$RELAX= 
##$RELAX= 
##$RELAX= 
##$RELAX= 
##$RELAX= 
##$RELAX= 
$$ Bruker specific parameters
$$ --------------------------
##$DU= <F:/spectra>
##$EXPNO= 1
##$NAME= <H-F>
##$PROCNO= 1
##$TYPE= <nmr>
##$USER= <she>
##$AMP= (0..31)
100 100 100 100 100 100 100 100 100 100 100 100 100 100 100 100 100 100 
100 100 100 100 100 100 100 100 100 100 100 100 100 100 
##$AQSEQ= 0
##$AQ_mod= 1
##$AUNM= <au_zg>
##$AUTOPOS= <>
##$BF1= 200.13
##$BF2= 200.13
##$BF3= 200.13
##$BF4= 200.13
##$BF5= 200.13
##$BF6= 200.13
##$BF7= 200.13
##$BF8= 200.13
##$BYTORDA= 1
##$CFDGTYP= 0
##$CFRGTYP= 5
##$CHEMSTR= <none>
##$CNST= (0..31)
1 1 145 1 1 1 1 1 1 1 1 1 1 1 1 1 1 1 1 1 1 1 1 1 1 1 1 1 1 1 1 1 
##$CPDPRG= <>
##$CPDPRG1= <>
##$CPDPRG2= <>
##$CPDPRG3= <>
##$CPDPRG4= <mlev>
##$CPDPRG5= <mlev>
##$CPDPRG6= <mlev>
##$CPDPRG7= <mlev>
##$CPDPRG8= <mlev>
##$CPDPRGB= <>
##$CPDPRGT= <>
##$D= (0..31)
0 1.2 0 0 0 0 0 0 0 0.06 0 0.03 0 0 0 0 0.0002 0 0 0 0 0 0 0 0 0 0 0 0 
0 0 0 
##$DATE= 1576749693
##$DBL= (0..7)
120 120 120 120 120 120 120 120 
##$DBP= (0..7)
150 150 150 150 150 150 150 150 
##$DBP07= 0
##$DBPNAM0= <>
##$DBPNAM1= <>
##$DBPNAM2= <>
##$DBPNAM3= <>
##$DBPNAM4= <>
##$DBPNAM5= <>
##$DBPNAM6= <>
##$DBPNAM7= <>
##$DBPOAL= (0..7)
0.5 0.5 0.5 0.5 0.5 0.5 0.5 0.5 
##$DBPOFFS= (0..7)
0 0 0 0 0 0 0 0 
##$DE= 6
##$DECBNUC= <off>
##$DECIM= 24
##$DECNUC= <off>
##$DECSTAT= 4
##$DIGMOD= 1
##$DIGTYP= 9
##$DL= (0..7)
0 120 120 120 120 120 120 120 
##$DP= (0..7)
150 150 150 150 150 150 150 150 
##$DP07= 0
##$DPNAME0= <>
##$DPNAME1= <>
##$DPNAME2= <>
##$DPNAME3= <>
##$DPNAME4= <>
##$DPNAME5= <>
##$DPNAME6= <>
##$DPNAME7= <>
##$DPOAL= (0..7)
0.5 0.5 0.5 0.5 0.5 0.5 0.5 0.5 
##$DPOFFS= (0..7)
0 0 0 0 0 0 0 0 
##$DQDMODE= 0
##$DR= 18
##$DS= 0
##$DSLIST= <SSSSSSSSSSSSSSS>
$$ [...]
##$SUBNAM2= <"">
##$SUBNAM3= <"">
##$SUBNAM4= <"">
##$SUBNAM5= <"">
##$SUBNAM6= <"">
##$SUBNAM7= <"">
##$SUBNAM8= <"">
##$SUBNAM9= <"">
##$SW= 24.9337058887773
##$SWIBOX= (0..15)
0 0 2 0 0 0 0 0 0 0 0 0 0 0 0 0 
##$SW_h= 4990.01996007984
##$TD= 16384
##$TD0= 1
##$TE= 0
##$TE2= 300
##$TE3= 300
##$TEG= 300
##$TL= (0..7)
0 120 120 120 120 120 120 120 
##$TP= (0..7)
150 150 150 150 150 150 150 150 
##$TP07= 0
##$TPNAME0= <>
##$TPNAME1= <>
##$TPNAME2= <>
##$TPNAME3= <>
##$TPNAME4= <>
##$TPNAME5= <>
##$TPNAME6= <>
##$TPNAME7= <>
##$TPOAL= (0..7)
0.5 0.5 0.5 0.5 0.5 0.5 0.5 0.5 
##$TPOFFS= (0..7)
0 0 0 0 0 0 0 0 
##$TUNHIN= 0
##$TUNHOUT= 0
##$TUNXOUT= 0
##$USERA1= <user>
##$USERA2= <user>
##$USERA3= <user>
##$USERA4= <user>
##$USERA5= <user>
##$V9= 5
##$VALIST= <valist>
##$VCLIST= <CCCCCCCCCCCCCCC>
##$VD= 0
##$VDLIST= <DDDDDDDDDDDDDDD>
##$VPLIST= <PPPPPPPPPPPPPPP>
##$VTLIST= <TTTTTTTTTTTTTTT>
##$WBST= 1024
##$WBSW= 4
##$XGAIN= (0..3)
0 0 0 0 
##$XL= 0
##$YL= 0
##$YMAX_a= 450763
##$YMIN_a= -262598
##$ZGOPTNS= <>
##$ZL1= 120
##$ZL2= 120
##$ZL3= 120
##$ZL4= 120
##$ABSF1= 10
##$ABSF2= 0
##$ABSG= 5
##$ABSL= 3
##$ALPHA= 0
##$AQORDER= 0
##$ASSFAC= 0
##$ASSFACI= 0
##$ASSFACX= 0
##$ASSWID= 0
##$AUNMP= <proc_1d>
##$AZFE= 0.1
##$AZFW= 0.1
##$BCFW= 1
##$BC_mod= 2
##$BYTORDP= 1
##$COROFFS= 0
##$CY= 11.3945322036743
##$DATMOD= 1
##$DC= 2
##$DFILT= <>
##$DTYPP= 0
##$F1P= 16.9975609425685
##$F2P= -3.02152046262296
##$FCOR= 0.5
##$FTSIZE= 0
##$FT_mod= 4
##$GAMMA= 1
##$GB= 0.15
##$INTBC= 1
##$INTSCL= 1
##$ISEN= 128
##$LB= 0.24
##$LEV0= 0
##$LPBIN= 0
##$MAXI= 10000
##$MC2= 0
##$MEAN= 0
##$ME_mod= 0
##$MI= 1.114404
##$NCOEF= 0
##$NC_proc= 0
##$NLEV= 6
##$NOISF1= 3.799351
##$NOISF2= 2.8
##$NSP= 1
##$NTH_PI= 0
##$NZP= 0
##$OFFSET= 15.70392
##$PC= 1
##$PHC0= -10146.9
##$PHC1= 14.00082
##$PH_mod= 1
##$PKNL= yes
##$PPARMOD= 0
##$PSCAL= 0
##$PSIGN= 0
##$REVERSE= no
##$SF= 200.130013532006
##$SI= 16384
##$SIGF1= 3
##$SIGF2= 2
##$SINO= 400
##$SIOLD= 16384
##$SREGLST= <1H.CDCl3>
##$SSB= 0
##$STSI= 0
##$STSR= 0
##$SW_p= 3612.71676300578
##$SYMM= 0
##$S_DEV= 0
##$TDeff= 0
##$TDoff= 0
##$TI= <>
##$TILT= no
##$TM1= 0
##$TM2= 0
##$TOPLEV= 0
##$USERP1= <user>
##$USERP2= <user>
##$USERP3= <user>
##$USERP4= <user>
##$USERP5= <user>
##$WDW= 1
##$XDIM= 8192
##$YMAX_p= 0
##$YMIN_p= 0
$$ End of Bruker specific parameters
$$ ---------------------------------
##NTUPLES= NMR FID
##VAR_NAME=  TIME,          FID/REAL,        FID/IMAG
##SYMBOL=    X,             R,               I
##VAR_TYPE=  INDEPENDENT,   DEPENDENT,       DEPENDENT
##VAR_FORM=  AFFN,          ASDF,            ASDF
##VAR_DIM=   8192,          8192,            8192
##UNITS=     SECONDS,       ARBITRARY UNITS, ARBITRARY UNITS
##FACTOR=    0.0002004,     1,               1
##FIRST=     0,             0,               0
##LAST=      1.6414764,     0,               0
##MIN=       0,             -262598,         0
##MAX=       1.6414764,     450763,          0
$$ Real data points
##PAGE= N=1
##DATA TABLE= (X++(R..R)), XYDATA
0@%%%%%%%Qj6J6k4L2m0M8n6P2q8J04j21J40j64J94k26K60l00L47l98M52n13N83
30C10o59P42q34R32j039J161j294J439j599J774j964K175k409K666k953L273l631
47a910M038m504N037n658O396p286Q385r785J1638j4226J8121k4729L8880j23101
61i8704J52050J59864k94426j81382L5980J76108Q8144n7012j64642k3486J08538
72i8968Q0534j0939j7521m5963k2042L1601J2363j9576P9892O5259j15411j16637
84a77408J17718J60586k6178j27423p4282K2647J32314J16549n8206j46584l5899
95i6166P5883J01843M8496r4987j50655L7180J79809M1146j08529o0970Q60J4379
107a1711N9175L6277o2478n2248K7079J3753r810K8963J0751m4528l5105j1769
$$ y = [0, 0, 0, 0, 0, 0, 0, 0, 8, -8, 8, -16, 16, -24, 24, -32, 40, -48, 56, -65, 75, -89, 105, -121, 139, -161, 186, -212, 240, -273, 310, -349, 393, -441, 491, -548, 613, -681, 758, -841, 933, -1031, 1144, -1265, 1401, -1552, 1721, -1910, 2128, -2376, 2661, -2997, 3399, -3887, 4498, -5287, 6351, -7875, 10246, -14483, 24397, -98704, 53346, 213210, -81216, -262598, -226618, -50510, 37634, -19378, -184020, -207506, -98968, -18434, -29373, -46894, -92857, -114899, -83298, -70935, -90511, -10619, 54640, -60771, -177408, -59690, 100896, 74718, -52705, -126987, -104340, 27974, 144523, 86317, -60267, -96166, -20283, 81560, 130056, 35069, -115586, -78406, 101403, 142549, 34020, -26950, -26090, -11711, 47464, 83741, 21263, -30985, -3906, 9847, 37, 29000, 39751, -4777, -39882, -51651]
119e1651J3871Q2851M6693j20151j16674Q7834J36629j5124r5064o4263r530Q6231
131a8348J09453l6179j30210k5560Q0176O0072M293n1470o2401K6499P4835q069
143B3091l3114L9522N120p2515K3P8409J5180l6002j1056j7728l381O7287L9986
156I4822p0110p1356J2885N4705N6333O150q3194n5789O8475N9601m0975l6816
168e269K290k4584N478P0195J0835p1430k6682K6077Q346P390O247l3871j7979
181d2957L4723J3372j2593J2592j3631n6509P339O4539O242k4846P312j4057k6706
194d5180M3287M3221n0702n3473K9253M7715K1988k298m2824l0218M6573L7536
206D4878l6918j9024K9793k834j2208L1049O435l1000P396J0892l7673L824O5734
$$ y = [-51651, -37780, 45071, 91764, -28387, -145061, -57227, 79402, 64278, -30786, -95049, -104579, -18348, 91105, 54926, -75284, -100844, -20668, 39404, 43697, -7773, -70174, -43675, 31160, 23091, -10023, 29499, 34619, -37896, -37873, 40536, 55716, 19714, 8658, -9070, -12451, 54836, 94822, 24712, -46644, -33759, 20946, 77279, 83429, 235, -55554, 12921, 72522, 31547, -5269, -2979, -27563, -22085, 48110, 58945, -12485, -39167, -13090, -4744, 2646, 8893, -24978, -42957, -8234, 5138, -7455, 5137, -8494, -65003, -57664, 6875, 13117, -11729, -4417, -18474, -45180, -1893, 41328, -9374, -62847, -33594, 14121, 36109, 33811, -9013, -39231, 7342, 44878, 7960, -11064, 18729, 15895, 3687, 34736, 41171, 10171, 17567, 28459, -9214, -5390, 60344]
219F0344L432o4216j5383L8420K9660J185m7241n5091L7032Q3238j2958o9482
231a1060n711K4418N735K0105k775o0004j3205O5694J8845m6122j2024J7782k576
244h98K158L609j7807L985K1724k0039j6685L9684J7116m1380j0761J7855j2952
257a4391Q592M7491j2866o2827N742N7955J7690k3399l9234l0616L6480P4171
269F4788r078p1248j4840L5923K7735J8290k1424o8525m746Q2844K6793o0758
281E754k3948K8497N725r440k457j0128J0514K3496k5656l5706L7698M6577k9848
294B1078m9533j2754J2939M9772M4008n6056q9384L1860R9192Q462o7240m8554
306e6210j221N0835O1280j9538p0684o772M2759J3055l601p009k9125j307M4461
$$ y = [60344, 63776, -440, -15823, 22597, 52257, 53442, 6201, -48890, -11858, 71380, 58422, -11060, -16771, 7647, 13382, 33487, 30712, -29292, -42497, 23197, 42042, -4080, -16104, 1678, -898, 1260, 4869, -12938, -8953, 12771, -7268, -23953, 15731, 32847, -8533, -19294, -1439, -14391, -5799, 41692, 28826, -34001, -28259, 29696, 47386, 23987, -15247, -45863, -9383, 64788, 55710, -15538, -30378, 5545, 33280, 51570, 30146, -38379, -43125, 39719, 66512, 5754, -18194, 10303, 16028, 6588, 4131, -5997, 4517, 28013, 2357, -33349, 4349, 50926, 21078, -28455, -41209, -28270, 21502, 65510, 9454, -79930, -48070, 51122, 59584, -7656, -56210, -57431, -6596, 54684, 35146, -35538, -42310, 449, 13504, 9903, 2894, -26231, -27538, 16923]
319A6923N679l3638J4098K4563l8381l2197L3502L4419K312j0140l3376k2163
331c8399M7722N1976l1985n9859j3009K5032N1721L9864n0041q4453J9835Q5742
343D4146J2135n0830l2542m895K8566N2047k958n9176j5161L3004P194p894N523
356I159m897m096J4853j1056k3346L2451L4895m6451n2099K9722N1915J1407k1070
369B1387m4729k4716N2747O0487l4127o7861l642L7085L3264J3684l4435m9288
381d0144J9145N0668r714k9735Q828L690j3217J3732J5120j3779k346L999k4741
394a8494m583M1776J3146l4032j6052P914R711K6846P735n0508l2159M1739L9888
407C2927j0171j7019j6936j4849K9493L8257k6048m4847R581K7102P207P746q092
$$ y = [16923, 22602, -11036, 3062, 27625, -10756, -42953, -9451, 24968, 27280, 17140, -16236, -38399, 9323, 61299, 29314, -30545, -43554, -18522, 33199, 73063, 23022, -61431, -41596, 44146, 56281, 5451, -27091, -31986, -3420, 48627, 45669, -13507, -28668, 4336, 11530, 3636, 9159, 4262, 166, 15019, 3963, -19383, 13068, 47963, 1512, -50587, -20865, 31050, 42457, 21387, -23342, -48058, 4689, 65176, 31049, -36812, -40454, -3369, 29895, 43579, 9144, -40144, -20999, 29669, 19955, -9780, -952, 2738, -10479, 3253, 18373, 4594, 2248, 6247, -18494, -23077, 18699, 31845, -2187, -18239, -10325, -614, 26232, 33967, -16541, -48700, -6961, 32927, 22756, 5737, -11199, -26048, 3445, 41702, 15654, -29193, -19612, 7490, 14697, 22443, 14351]
420A4351l0481K316K7598o153j3292J7152O3k6085P785K6534k438j0394r513k5163
434b7720L212N1344J2787m8596k2675K5133K1499Q438j2353m1544r832M9766K6069
447C5528l2200j8999R299q57M235J2547j3828j2413J9276M566k0046J3561K4892
460B5561k1603k7633R592J4960J0295J2402j9841l1737K2922M4126j1966l7444
472a0366p574P336J9415K9521j2042m4354L018L8205K104j8163k404p247k325
485d876K5515Q202k6005m807J5226j0989r374J7925M536j3562J094k886j1233
498a1234K1478K3323l0169l7584J3627K8557J0944k94k8016l3996K6752N3576
510C6964r502n0360j5901J8474K8048K2514k0748m6298N209M5351N197k4862n501
$$ y = [14351, -16130, -13814, 13784, 7631, -5661, 11491, 11554, -14531, -6746, 19788, 17350, 6956, -2557, -27720, -24508, 26836, 39623, -8973, -31648, -6515, 14984, 23422, 11069, -30475, -40307, 9459, 35528, 3328, -15671, -6372, -7229, -2994, 9553, -4275, -16688, 2588, 7154, -12892, 669, 25561, 3958, -23675, -14083, 877, 11172, 23574, 3733, -28004, -5082, 39044, 27078, -10366, -17940, -10604, 8811, 38332, 26290, -18064, -15046, 23159, 25263, 7100, 4696, -2551, -4876, 20639, 28841, 2836, -1971, 13255, 2266, -7108, 10817, 15353, 1791, 2885, -1, -11234, 10244, 33567, 3398, -34186, -20559, 7998, 18942, 18648, -9368, -43364, -16612, 36964, 27462, -22898, -38799, -20325, 7723, 30237, 9489, -36809, -31600, 13751, 18948, -5914, -11415]
523a1415J717L54J7205L343j9732O244K1538j9801k6560K2007K9543o331j9262
536a150j5521J687L9037K7010m3291n1401K0359M7723J4255j4932l4723k7113
548c8060L4092N3298j6789n5672q119K8897J9056P205j3937k9511K103K8199l614
561G148j8345P801N370j3663K661J0647l257O979P768l2933k6105L7426M2078
574C3575j5314l6424j5336J1644M0150K5300m2044n2869J9188N3497J6926j8998
586A9295l4676k0902L1929M6520j6649m6716N373K9464J767m598M316o939l764
599D420M108j1317n194K9815J4689l1730k4528J4058K4163J7280j1314m9644k0387
612d5581N5318M6598l3621m9418l840K2234K6566J1169l0958l7564J4537L5813
$$ y = [-11415, -9698, -9344, 7861, 11204, -8528, -2284, 19254, -547, -27107, -5100, 24443, 18112, -1150, -16671, -14984, 24053, 51063, 7772, -43629, -23270, 24453, 38708, 23776, -10947, -38060, -3968, 49330, 32541, -23131, -31250, -2353, 16703, 23908, 9971, -19540, -17437, 10762, 7148, -11197, -3396, 1974, -11689, -9028, 1619, -1638, 5341, 13109, -19824, -45929, -8503, 33575, 18261, -18163, -33499, -21855, 18295, 43595, 1551, -51318, -32130, 21367, 38293, 19295, -15381, -36283, -4354, 42166, 25517, -21199, -15826, 13638, 15405, 10807, 15123, 8184, 4420, 8528, -2789, -7983, 21832, 36521, 4791, -19737, -5679, 18484, 35764, 24450, -25194, -45581, 9737, 56335, 22714, -26704, -30544, -8310, 18256, 29425, -1533, -39097, -24560, 11253]
624A1253M490j3048j3661j5298O873K4733m359j8197J0014N992k1074J910L1430
637A1058J358k4867j0586R38J0125K7268N777l5755k0670K2855K6448Q727j2172
650A0504l5007j2332M3625L3470k8154l1150Q037J1016O109J1732q053k4427L685
663a0945K0491K42k689M191j0858j3607P289Q482K086Q331r977k9343Q196M0522
677B2411N54l5390j2384Q357R940J8390L617l1103j7564K3316J9986n839j1311
690g020j2979l190K1247J4099j6082p408J0756r678j1428K1635J5430j9104j1959
703a5681R161M246O816J3388j2558k6369N478K4657J0145l967j7280j9105J6402
716d667L4480q359l2666K59J6204j030N853P934j7912j4336J5833J0352j0814
$$ y = [11253, 15743, 2695, -10966, -26264, -19391, 5342, 983, -17214, -7200, -1208, -22282, -20372, 11058, 12416, -12451, -23037, -22099, -11974, 15294, 21071, -14684, -35354, -12499, 13949, 22676, 10504, -24503, -36835, 6790, 40260, 12106, -19044, -11007, 9, 6118, 17850, 9797, -14630, -10945, 9546, 9788, 7099, 11290, 432, -13175, -5886, 2596, 4682, 13013, 3036, -26307, -18111, 22411, 22965, -12425, -24809, -16452, -6512, 11878, 15495, -15608, -33172, -9856, 10130, 4291, -7020, -19999, -23189, -1942, 12157, -3925, -11333, -577, -10255, -21683, -48, 15382, -3722, -15681, -6520, -2274, 4542, 17930, 5372, -20997, -15519, 9138, 19283, 15316, -1964, -21069, -4667, 29813, 21454, -11212, -10953, 5251, 4221, 10074, 18008, 96, -14240, 1593, 11945, 1131]
729A131k032K522n869P10O137l820K448O495j9451j7342K4514K3258j9275k0291
743b0865L973M941R192J5138j4907l2125N954L2933P660j6169j7311o071J8358
756i299K3162j4109k7664R425K0429n589m764P737m844o370J0737j514j4140J2088
770d715J8836j3776j9422P758J7850Q350p364k4704j0219L0870K3827k1463k4238
783a8410M148J1058J0337J0701j8227l0787J3442L6483j416k6899p845P616R705
796i4O575j1777j4677J1766J3744j1461p230J0857Jn946M970n994j2331J7514
810d083K2594k1591k7534J4449K7744J939j6591j9763m92L0352J8342k4809k3483
823b2926J0539J6095O469J594j6853j9398K0824L0935j4141k8785P018J8019L51
$$ y = [1131, -901, 1621, -4248, -3538, 2599, -1221, 1227, 7722, -11729, -29071, -4557, 18701, -574, -20865, -16892, -11951, -2759, 12379, -2528, -34653, -28699, 4234, 11894, -4275, -21586, -27657, -9299, 13863, -246, -27910, -18485, 1944, -3645, -8409, -672, -5516, -11886, -1149, -2663, -16803, -4715, 14121, 345, -19077, -11319, 6531, 14881, 7517, -17187, -27406, 3464, 27291, 5828, -18410, -14262, -3204, 7133, 17834, -393, -31180, -17738, 18745, 17329, -9570, -17415, -9799, -94, 6481, -5296, -19973, -8207, 5537, -5924, -13154, -2297, -2296, -8242, -3272, -9266, -21597, -4083, 18511, -3080, -30614, -16165, 11579, 13518, -3073, -22836, -23328, 7024, 25366, 557, -22926, -12387, 3708, 10177, 11771, -5082, -24480, -3656, 27279, 13138, -15647, -8629, 9390, 9741]
836I741o236n914l129J1472P791j4706q212J5435N857q852k895m099n010J7422
850H665J3409k5777k1302K3107K4082j1917j9311n685N578J8065R198k0208j7722
863a9818J2067J5573p42n751j1183q033J8014J8331j8528j8473J6912J3256j4157
876b532o652Q010J473K42L208q142l617J4704N254j3799o967L728N430J3460K148
891A5948k6384j1517L0761J7465k3880j7260Q549R480P064M139j4136j3984J1842
904a913J4042n260p260m099k244J0556R462j5011r134J7348L534k0883K64K1208
918A0610o43j4743k130J774L238J1695k276j9625k522J6230P885j758p779j5803
932a5847K066K6367M295k6501o535J7385L706n092M052l005r138O246P611n938
$$ y = [9741, 3505, -2409, -5538, 5934, 13725, -981, -9193, 6242, 12099, 3247, 352, -3747, -8757, 8665, 22074, -3703, -25005, -1898, 22184, 10267, -9044, -14729, -9151, 8914, 18112, -2096, -19818, -7751, 7822, 7080, 1329, -9854, -17887, 127, 18458, -70, -18543, -1631, 11625, -2532, -9184, -1174, 299, 541, 3749, -4393, -8010, 6694, 11948, -1851, -8818, -5090, 340, 13800, 15948, -10436, -21953, 8808, 26273, 2393, -14867, -6318, 3162, 10226, 14365, 229, -13755, -1913, 12129, 6869, -391, -4490, -6734, 3822, 13284, -1727, -10861, 6487, 10021, -10862, -10598, 10610, 9967, -4776, -6906, -5132, -1894, 9801, 7525, -12100, -14622, 1608, 9493, 7735, -44, -15847, -13781, 12586, 16881, -9620, -16155, 1230, 4936, -156, 3896, 891, -8247, -2001, 5610, -328]
946c28j126O025n132n296N750K426O94M644q605j5697J3223K4100r859k2491J253
961a0419J0985N033O113n377j9750L75K2118N462j2315p376j478N097J1807k159
975H116j5617L251J2488q880q669J5417P187j4578n917N019J547O840P592j4384
989e88j6710J1297J8898J007j0268j5591n403K2116K0995j8421k4732Q337J5723
1002F660k23K20k497j4417N33J8029K682j2512j129L673k328J650K607k547L904
1017D305K104j4531m789K2700R442k0560j2335P528P774R814M931j9814j8415
1030b1846J6351K4063l314j7937j1227K195J8426J4390j6263j9972Q924J3062
1042F852k783j402J607r560j659J1933j293q806P820N468j3572o055J1886Q194
$$ y = [-328, -1454, 4571, -561, -5857, -107, 2319, 3013, 7657, -948, -16645, -3422, 20678, 10819, -11672, -10419, 566, 5599, 11712, 6335, -13415, -13040, 9078, 14540, 2225, -5151, -6629, -1532, 10275, 8116, -7501, -4250, 8238, -642, -9311, 6106, 13293, -1285, -7202, -2183, -636, 6204, 13796, -588, -17298, -6001, 12897, 13904, 3636, -11955, -17358, 4758, 25753, 7332, -17400, -9063, 6660, 6437, 6657, 4160, -10257, -9724, 8305, 10987, -1525, -2654, 1019, -1309, 341, 2948, 401, 4305, 6409, -8122, -12911, 9789, 19231, -1329, -13664, -6136, 1638, 11452, 16383, -3431, -21846, -5495, 18568, 15254, -2683, -13910, -11715, 6711, 21101, 4838, -15134, -6210, 6852, 4069, 2667, 4274, -5286, -6945, 4988, 3695, -5111, 2709, 8177, -5395, -11450, 436, 8630]
1056H630j098p572j5285k99K5243J0406k2282j6879P233J2336J0997K810k2290
1069h050j8879J9957K6273q160k1029m004N730J0217Q317r521j2537O866P970
1082C150o000R04P566n444o775M830j67k437J2821L544k1589r152K1135J4798
1096A7184o794j4560j1632N411K4067Q175k3104j6481R563J3500P204j21j7557
1109e145j3896J7050K0169j0230j5260L032L976r53M317P7n380L046N16r364L246
1124d799J5688k179j4728l991L510P220J3370l337k6353o126K6645J5157j3228
1137F849j5696n431P061J8548O342j9542j3549J1211J0120j73Q24o155q454O932
1151a113R827o558k134Q953o382j2938P238J4727j145p572o966o394R608K0117
$$ y = [8630, 7532, -40, -15325, -15624, 9619, 20025, -2257, -19136, -11903, 433, 11430, 14240, -8050, -26929, -6972, 19301, 11141, -9888, -13892, -8162, 2055, 10372, 851, -11686, -4820, 3150, -2850, -1946, 5620, 176, -6599, -1769, -1936, -4373, 8448, 11992, -9597, -18749, 2386, 17184, 10390, -4170, -15802, -10391, 13676, 21851, -1253, -17734, -8171, 5329, 12533, 12412, -5145, -19041, -1991, 18178, 7948, -7312, -4280, -304, -1257, 3060, 3137, -2243, 803, 1319, -8045, -4799, 10889, 8710, -6018, -10009, -6499, 721, 14091, 10754, -15599, -21725, 4920, 20077, 6849, -8847, -14278, -7217, 11331, 17673, -1869, -15418, -4207, 5913, 5740, 6564, 409, -8045, -1113, 8714, 2156, 22, 8975, 2593, -10345, -3107, 11620, 10475, 2903, -4063, -10457, -849, 19268]
1165A9268m442k2746n473J1612J0807P152p695k2756j309K4554R066j6283q708
1178f953J154J504Q298O426r542q733N850J636l526O824M389j0463n420M879K940
1193g37N807O595j3924j7748J1818K1932j613j4497q243j233J2116J7015p311
1206I977k2081j289J5428O478j091m076j0488q20J4104K152j0540J931N592p708
1220b431k605J0482K962m442k725p263l565J6012J1853j4971j6398M833J1577
1233C319Q078J157j6612j5264J4024K1443n298j5595l504K111O152R503m764j4311
1247i561K836J0663k929l617O111q86p338J618J493j345Q697L152j5320p263J5611
1262A922J0763o102q373p577l37J7824J1566j7087j7219Q480J4102L289k921j1123
$$ y = [19268, 14826, -7920, -13393, -1781, 9026, 16178, 8483, -14273, -15582, 8972, 18038, 1755, -6953, -5799, -4295, 4003, 10429, 887, -7846, -1996, -360, -3886, 2938, 7327, -3136, -8556, -3677, -737, 5070, 11665, -2259, -20007, -8189, 13743, 12130, -2367, -10610, -11843, 273, 17288, 9977, -12104, -13393, 2035, 8513, 7422, 3346, -7142, -7962, 6142, 8294, -2246, -315, 5277, -2431, -5036, 5446, 8408, 3966, 1241, -6022, -9587, 6425, 18278, 3307, -13091, -8258, 3319, 11397, 12554, -4058, -19322, -5298, 16145, 10847, -4748, -8252, -6141, 11, 9514, 4750, -9561, -6725, 3938, 1009, -2608, 3503, 2617, -4721, -3103, -1610, -2955, 5742, 8894, -6426, -13689, 1922, 12685, 6583, -1790, -9367, -9704, 8120, 19686, 2599, -14620, -6140, 7962, 11251, 8330, -2793]
1276b793r015J2246J5958p776j3660L053N639j87K073k241n912N116O109r250
1290f40m831J2556M158j1315n142K705L270Q704J156j7188o983J7642J1301j0485
1304D908j0504k485M059J2770M056j6002j0227J3512R331o618m720m58k235N979
1318A366P041q208o914R356M226q894j219M767n39J467J347p468r75J3118J319
1333I790j3514k966P541L066K565k72j1702l601J6358P278j3861q775M703N860
1347B470N719Q86j2397o288J2918P539r583m990K471R9L403N392p263n960Q647
1362C063L519j1057q21R754K30n074j331j972L170R878l313j5425K16J3805L733
1377H375l862m094p531P79J6218L444j7233o865J1084O386l90j178o374l916Q796
$$ y = [-2793, -11808, 438, 16396, 8620, -5040, -1987, 3652, 3465, 5538, 3297, -2615, 2501, 8610, -640, -5471, 7085, 11243, -72, -5214, -2509, 761, 9465, 10621, -6567, -13550, 4092, 15393, 4908, -5596, -8081, -4022, 8748, 12804, -3198, -13425, 87, 9418, 2800, -1920, -2378, -4613, 1366, 8407, 199, -6715, 2641, 6867, -2027, -3246, 1521, 982, 2449, 3796, -3672, -4647, 8471, 9790, -3724, -6690, 851, 3917, 6482, 6210, -5492, -9093, 7265, 14543, 682, -8093, -3390, 2470, 8189, 9075, -3322, -9610, 3308, 10847, 1264, -3726, -1255, -1156, 2247, 7639, 376, -5584, 3063, 6582, -4475, -5296, 4458, 4688, -386, -1717, -3689, -519, 9359, 6046, -9379, -9163, 4642, 8375, 4513, 419, -7112, -6333, 9885, 13329, -3904, -10769, 315, 6701, 6311, 5133, -1241, -5157, 3639]
1392C639L956o853l81M015m543j359P990o6n214K212o14q028N561J2711n285j2774
1408e033R40O399L912M267o201j4143K880J5806K432p734m767m390J662J3467
1422I497K546j5985o079J0199L808k188K421k143o740K198M842l329K065M168
1436E280p205p503Q144Q200j380l862q520p585J3417J8108r209k1190J391J3815
1450A901N637q79p534j2100L950J5750J732r162l001L74o95N572K129o835j43
1465c304M902o102l166J3842N726j5149r885O765Q578N065o25j2880q457J2735
1479a955J2309m011r052p286k120J2304J3938q942j7128L724J0581r80n43O03
1493A442p016k496R003K868l669J578j309p006N41P747J772o1j828j0202j873
$$ y = [3639, 7595, 742, 361, 4376, -167, -1526, 6464, 6398, 1184, 3396, 2782, -5246, 315, 13026, 7741, -5033, -4093, 2306, 6218, 10485, 4284, -9859, -6979, 8827, 11259, 3525, -1242, -5632, -3970, 9497, 12043, -3942, -10021, 178, 3986, 1798, 4219, 2076, -4664, -2466, 2376, -953, 1112, 5280, -1925, -9428, -1284, 6916, 5536, 1674, -6846, -14431, -1014, 17094, 7885, -13305, -11914, 1901, 7538, 6659, -875, -12975, -9025, 6725, 8457, -705, -3706, -3332, -4027, 1545, 3674, -3161, -3304, 1598, -4504, -7670, 6172, 11898, -3251, -13136, -6371, 2207, 7272, 6647, -6233, -14690, -1955, 10354, 6343, -2709, -9995, -12115, 189, 14127, 5185, -11943, -8219, 2362, 1382, 839, 1442, -5574, -8070, 933, 3801, 132, 1710, 401, -6605, -6064, 1683, 3455, 3394, 1566, -8636, -10509]
1508a0509J8209Q198j7169j3880P512J1673N936p44j4000r613J2650J5008n976
1521G295j1800k963K940Q220O541p654q733O953M454q777L29J0139k174q716M87
1536c459L505K089O348k154j4022l223J3970Q022m894q446p454L703J6611K237
1550A2833j7265p642J0573N799j06J332n113q972N536J0209l909o882J069O77
1564a861O33M504j272l525K326m61p298L234J1102l452j0424J769N140o31M391
1579D175N69j2552m159J3049Q041n225p980l895L520J1669J269j4774m669J0895
1593f7M772l731O63j719n166M094O211o137l869P053M95p482K462O467L88l145
1609A289m978m885P731J2435o158j3884K089R734K004k35m141j0523J501J6052
$$ y = [-10509, 7700, 15898, -1271, -15151, -7639, 4034, 9970, 9226, -4774, -14387, -1737, 13271, 7295, -4505, -7468, -4528, 3692, 10233, 2579, -6154, 799, 5253, -3524, -3195, 6944, 4770, -3946, -3459, 46, 2135, 8483, 6329, -7693, -10916, 3054, 11076, 6182, -2264, -9718, -6015, 10596, 12833, -4432, -12074, -1501, 4298, 4192, 5524, 411, -8561, -3025, 7184, 3275, -3607, -2538, -1861, -1228, 3276, 2004, -1521, 805, 344, -6954, -3720, 7382, 3930, -6494, -4725, 415, -216, 4175, 4744, -7808, -11967, 1082, 9123, 3898, -4082, -7977, -4457, 7212, 8481, -6293, -10962, -67, 4705, 974, 1637, -82, -5248, -1154, 5057, -1080, -4949, 2104, 2599, -4883, -2421, 4046, 4434, 1289, -3689, -8574, -843, 11592, 5434, -8450, -6361, 3373, 5377, 5142, 1001, -9522, -8021, 8031]
1623H031K858j1827m648M314K406K923N40o761k650N374J321q47M477j158r150
1638d797P97Q797j505l680L541j852o702N861J0044m386r168k003J454P820Q213
1653A2434o686j2610J953R672K806o38m972j0516J651J7601M249j4667n659O550
1667A168K009J76J508k941l409K491k09n04P262J020j1644n078Q394N520N28j13
1683F178r849q008J2736J5001q916j6440j110Q445Q179L402q127j0457L836R312
1697D182n77l042l83m875k203R116L532n899n41J797p284q32J1771L048q950n768
1713f908J495N062P890Q84j3135q116Q316R512L069k046j1394q148J2739J5130
1727A4350p761j4818m85N919M865N250k093j0049j420P003J256j479J394l023
$$ y = [8031, 10889, -938, -5586, -1272, 1134, 4057, 4597, -2164, -4814, 560, 1881, 1034, 5511, 4353, -4797, -4000, 4797, 3292, -388, 3153, 1301, -5401, 460, 10504, 6118, -3050, -5053, -3599, 4221, 12434, 5748, -6862, -4909, 4763, 7569, 6931, 1959, -8557, -6906, 10695, 14944, 277, -5382, 1168, 3177, 3353, 4861, 1920, -1489, 1002, 793, 289, 7551, 8571, -3073, -8151, 243, 5763, 6291, 6178, -3671, -11679, 1057, 16058, 7142, -9298, -10408, -1963, 6216, 9618, 1491, -8966, -5130, 4182, 3605, 563, 180, -4695, -6898, 2218, 5750, -149, -690, 1107, -6177, -7009, 4762, 7810, -1140, -6908, -5413, -351, 7539, 8423, -4712, -12828, -4512, 5000, 8069, 6023, -5371, -13519, -780, 14350, 6589, -8229, -8714, -2795, 2070, 7320, 5227, -4822, -6242, 761, 2017, 538, 1932, -1091]
1741a091m199L447K952M26L823j469j4250l143J7365R934j1104j1675n71P217
1755b338J1035K113j5283j1361Q964J3249K210n259q976m428J0080Q832p189q038
1769f389N286K219n059L296P324l305n943j595m01M378R179k853j1769j981P813
1784B00O336K169o312j2843k10J6706P607j1096q005Q06K557O511M757q471j0074
1799i362M429Q790Q62j827k910m773J986N131k514j717M825k336q861L407J0386
1814E516l34o598l875m028M088J2799J353j5130p048R216R937J193p802j1519
1828a2232J090J4856M947j0818m339M845L68m59L451k261m768L734J679l114K149
1843h72O352l746p985O72M453M189K474o808q375O959J1245l652r753p01J983
$$ y = [-1091, -5290, -1843, 1109, 1535, 5358, 3889, -10361, -13504, 3861, 13795, 2691, -8984, -9555, -2338, 8697, 10810, -4473, -15834, -6870, 6379, 8589, 3330, -5646, -10074, 6, 8838, 1649, -6389, -1103, 1116, -3943, -647, 6677, 3372, -2571, -4166, -4567, -189, 8990, 6137, -5632, -7613, 200, 6536, 8705, 2393, -10450, -10660, 6046, 13653, 2557, -5448, -4642, -2085, 4426, 9183, 712, -9362, -4933, 3857, 4719, 2892, -18, -4791, -2805, 2326, -188, -1905, 2920, 584, -8277, -4870, 5516, 5182, -1416, -5291, -9319, -5231, 7568, 8921, -6209, -13257, -4041, 5896, 7089, -713, -12232, -11142, 3714, 8661, -2157, -6496, -1651, -1283, -1742, 1709, -552, -5320, -1586, 93, -3021, -872, 5480, 1734, -6251, -5579, -1126, 3063, 5537, -1271, -9646, -2687, 8558, 4906, -4847, -5548, -3565]
1858c565J778N888P73q387k382P044J431l154j089j508j186N208J606m359N30
1873a372L142l995k961N309R40m023K135J387l661J229O479l490p444J407N184
1888B66K357Q28l777n769M852Q592m220q216J076M255J534K984j725p023J523
1903b463Q854j914p867Q79M797J69L5o97k431J942L490n244l699N955L558m531
1919H33j847J963j153K656L258o669o932O989P923l882n421l61Q81M120K945n901
1935e98o461N042M371j913RJ62l923P95O049k202n902K581L491k863k85L286j315
1952C24j433J316k733k126O113K742n864k201L072J764K435J088p702o636Q400
1967a441R965m478p565q98K990N291K428p335p598N420P830k172l605R26p71N83
$$ y = [-3565, -1787, 4101, 4874, -3513, -5895, 1149, 2580, -574, -1663, -3171, -4357, 851, 2457, -1902, -1372, 1770, -2225, -5186, 123, 1063, -2960, -825, 562, -3099, -1870, 4609, 1119, -6325, -4918, 266, 2623, 3451, -326, -6095, -1243, 7349, 3129, -5087, -4011, 244, 1778, 4762, 3037, -3986, -2463, 6391, 4477, -3390, -2511, 2286, 2455, 2490, 1793, -638, 1304, 4794, -450, -4149, 1806, 5364, 833, -1014, 949, -204, 2452, 5710, -959, -7891, -902, 7021, 3139, -2282, -2643, -1762, 2358, 5303, -598, -7059, -2017, 2354, 441, 450, 612, -3311, -2516, 3533, 1331, -4571, -1990, 1501, -1362, -1647, 1639, 324, -1109, 207, -2526, -4652, 1461, 4203, -1661, -3862, -790, 974, 3409, 4497, -3205, -9841, -1441, 8524, 4046, -3519, -4417, -1427, 3864, 6292, -1043, -8641, -3221, 4609, 2437, -1168, -242, -1013, -430]
1983d30J955l569k927O731K873q075l102P881M669m389n410m399K381J1046K881
1998H116j1502o229P166P078N93m343p378k433R697P683o562o166K097K123J96
2013A36K272j798l875J923M041k370J73L440k439m719J197K496L46L727p63p706
2029c919m81Q916L221n788n006k200K764R091K952j0283p321O759O487J2l710
2044A494n236k092P337O070n518n511K770J277k540J676J598j564J93L00l638
2059c384K040P629k053r939j066O035M401J171l986q259J726J0772K332q455m535
2074e571J738K840M564J204o619k928M861J912k868J489O86m315p5M284P15q34
2090A083J256m175m008M697N644l045l771J2l69L074N667m008q223L41O147J563
$$ y = [-430, 1525, -2044, -4971, 1760, 4633, -3442, -6544, 1337, 6006, 1617, -3793, -8192, -5811, 5235, 8116, -3386, -9615, -2449, 4629, 5222, 879, -6499, -8932, 765, 8448, 1886, -4280, -2183, -60, 136, 2408, 610, -3265, -1342, 2699, 329, 502, 3942, 1503, -3216, -2019, 477, 823, 4550, 3787, -3919, -4400, 4516, 7737, 1949, -3057, -5257, -2493, 6598, 9550, -733, -8054, -1295, 5192, 5204, 1494, -3742, -5834, 1503, 7573, 2055, -3456, -686, 591, -1949, -273, 1325, -239, -46, 254, -3384, -1344, 6285, 4232, -5707, -6773, -738, 3663, 4834, 848, -7411, -5685, 5087, 7419, -1036, -5571, -3833, -993, 3571, 4775, -1844, -4772, 89, 2001, -867, 622, 1308, -3007, -3082, 1202, 1917, 1083, 2339, -1836, -5844, -1147, 4497, 1452, -2319, -2307, -2676, 398, 6065, 2057, -6166, -5825, 322, 1885]
2106A885L90o93n446j457P460K677n655l569J205J047L332L210m108m110K376
2121a456J260j916K216J964l956k195M492J433r4R55m422n745N134Q115j748o107
2137b070j348J366M233M154m990q314L009P538m43k534M41j455j568L264O94l361
2153a384J580K038l434j181N681J555m394k935j065J970N966J428q501l698P184
2168H10M631k625k711l340k183N752O270m100n839J126K350N82J703j039n116
2183c729J356M244j003o43K299k650m006K776L063j488M46P13m752r54P080L699
2199F451n831n622o44M016O478J450r629n344P210O807j735m435m166j294O819
2214E31N663n742o163L631M505k484k043J329k9K88l09k728K000O211j491q598
$$ y = [1885, 2275, 1582, -3864, -5321, 2139, 4816, -839, -4408, -3203, -2156, 1176, 4386, 278, -3832, -1456, -196, -2112, 104, 2068, -1888, -4083, 409, 1842, 1748, 2703, -1719, -7464, -2330, 5785, 4037, -2070, -3418, -2052, 2181, 6335, 1345, -6969, -3960, 3578, 3135, 601, 1042, -413, -1981, 1283, 1977, -1384, 196, 2234, -1200, -2381, 3300, 4855, 461, -2474, -3539, -1569, 4397, 5825, -2676, -6374, 810, 5441, 2816, 105, -3235, -5418, 334, 6604, 2504, -3335, -2209, 141, 723, 2426, 1387, -3729, -2373, 1871, 868, 225, 2524, -126, -4132, -1356, 1707, 219, 665, 1378, -3374, -4328, 2752, 6451, 620, -5002, -5646, -1630, 4848, 6298, -3331, -8675, -1465, 5342, 3607, -828, -4994, -6288, 531, 6194, 452, -5711, -2080, 2425, -59, -2102, -773, -802, -514, -823, -3551, -1551, 4660, 3169, -5429]
2230e429j340O098L261O8k877o302J213J0223K934r657o134L182N089L932j049
2245C212o688k757O422L540l543k258j96j205K432M474k524l412K478J065m620
2260c580M74M783l06k603m82p08J560N203j182q483j803O427L974M38k929o597
2276e814M2R800L201r064n448M147M550J786n23m343k617M596L043m166j771K620
2292C9L98l54O02j122M34L631k183p135J972Q440N83o786j742J453L273L773k390
2309B886p871k23P116K522k691k483k358Q85N875M99p191j147N826l24l056K253
2325E18J189k844R6J268j956R23K789k012l107K190J947N33P53k717n346K896
2341b880Q010j625o630j89L322J325J679j476n418m13O254J724l269j592J46P19
$$ y = [-5429, -6769, -671, 2590, 2658, -219, -6521, -5308, 4915, 7849, -1808, -7942, -4760, 329, 4261, 3212, -3476, -6233, 189, 3729, 186, -2072, -2268, -3473, -1041, 3433, 909, -2503, -25, 1040, -3580, -3106, 1677, 1371, -1232, -1714, -2422, -862, 4341, 3159, -5324, -7127, -700, 3274, 3712, 783, -5814, -5772, 4028, 7229, -1835, -7283, -3136, 1414, 3200, 2677, -1666, -4283, 313, 3356, -810, -2581, 39, 437, 83, 685, -437, -3, 3628, 1445, -5690, -3718, 4722, 5305, -1481, -3223, -1770, 1503, 5276, 2886, -4985, -5208, 1908, 4430, 1739, -744, -3102, -2217, 3658, 4157, -3034, -4181, 1645, 1321, -1735, 518, 1707, -1137, -1041, 227, -1729, -806, 1983, -29, -3136, -946, 1001, 1534, 2287, -430, -5776, -2880, 5130, 3505, -3125, -3314, 8, 1333, 3012, 1536, -3882, -4295, 1959, 3683, 414, -1178, -1032, -313]
2357c13K377o48m101R61M598k408l450L872L428l198l002l77L07K999L289m044
2373B90n621L860N929q80l919l642j81M815M827m898n612M246L815k654j407J222
2389A90j923m38L613M2k471J527J639l238j636K549J044P20l13l367j85O504J037
2406E294p255k234M741K024o37P06k581k880L870M768l209m739L21K073K828J255
2422D345m188k878M325K582m287j079L032k90k018K261j59j855K294J615m664
2437i64k193M237K946j632k605l092J627O509O03p759k705N528L316j679j485
2452F52k938r13N396L360n225m739L428L549p79r46j504j3L036Q02m904J1M263
2469B536M9l832P30J386J19K568k52o245j471P086L008n071l435R09L062L960
$$ y = [-313, 2064, 1416, -2685, -1724, 2874, 466, -2984, 888, 4316, 1118, -1884, -2261, -1954, 1045, 4334, 290, -5331, -1471, 4458, 3578, -341, -3983, -4164, 651, 5478, 580, -5032, -786, 3029, 375, -1032, 190, -1733, -2171, 1442, 1484, -987, 540, 2179, -1059, -2695, -146, 898, 1618, 1305, -2062, -2247, 4257, 5294, -1961, -4195, 546, 2570, 1933, 2639, 58, -2822, 1048, 5816, 2607, -2132, -1811, 262, 3090, 4345, 157, -2721, 1604, 4186, -101, -1180, 1852, 1562, -456, 1805, 1646, -209, 2085, 3700, -964, -3157, 1080, 4026, 2394, -211, -3303, -1676, 4833, 5436, -2323, -5028, 500, 3816, 2137, 652, -2286, -3199, 2197, 5557, 332, -4407, -979, 2570, 1791, 845, -659, -672, 2364, 3166, -1738, -1727, 2536, 2585, -1247, -517, 869, 988, 3556, 3304, -2941, -4412, 2674, 5682, 611, -2824, -1915, 1147, 5107]
2485E107j156o932k030O006K441j836j487j908j004M596K938n750m602N030L400
2500B813k765j206J100l9Q76m18l535L73M617p5l993J73J580R03K500j416o447
2517d959j120R056L487o600m350K356L906K152j994o109m33O536K060l096j878
2532i86M80m8K197P60m420q77N120J031m998k08M191k73j877j022j416J541M588
2549C783j240n408L6M022Q26n72j874m104J072P545N08o946j781L766J637k34
2565A036k0l143j364M300J653k932p99J171l85J84Q61j501j96L536j684m733L268
2582g48N333k379m664M17J462K085J896j875m936J465M965M94k514k234j724K057
2598i00N279j002n765J72M065j194j212J629o91k902J522K054o66N79L16l126
$$ y = [5107, 3951, -2981, -5011, 995, 3436, 1600, 113, -1795, -2799, 1797, 4735, -1015, -5617, -587, 2813, 48, -1158, -58, -97, 779, 361, -3174, -2801, 1816, 1741, -2252, -2079, -499, 404, 2904, 1488, -4959, -6079, 2977, 6464, -136, -4486, -2130, 1776, 3928, 1934, -4175, -4608, 1928, 3988, 892, -986, -506, -554, 1643, 2403, -2017, -2894, 2226, 3257, -1741, -1949, 2242, 1969, 92, -930, -2346, -805, 3783, 2543, -2865, -2829, 1193, 2019, 1447, -427, -4531, -3459, 4086, 4594, -2352, -4133, -367, 1270, 1036, 1016, -2127, -3491, 809, 2462, -470, -1269, -98, -483, -299, 562, -939, -1135, 2401, 717, -4016, -748, 4585, 2206, -2458, -2041, -579, 1506, 3402, 1527, -3409, -1944, 3021, 3515, 1001, -1233, -2957, -900, 4379, 3377, -2388, -2216, 1849, 655, -557, 1072, 381, -2521, -999, 1055, 389, 968, 1284, -1842]
2614a842j264L108J675j458k78j882j698M276M290n111n219K711L356N31K77j769
2630b97l176J379M563q24k570m73n11J66L152J278l186J75O45j885J25M447k02
2647B806n599j51L406J490J63n04m599j901O208L099k919l035r23N45M373J693
2663D152m807m295L585L111j029l5O7k842J42L268q00j657J168R4k536Q38L076
2680A500L60j508k022k674K380O826o15p391j844M966L164P1j685n424r35O591
2696A760L766l905m100K47K471K280O15l827j818L541R64k769J137K746j719k921
2712a532P02P69M35L002j467n816N55O180J864l449l968k031L125P133o86p991
2728c175k561N318L581p51j746m278q91N687L059m733k533K726Q24r33O47m65
$$ y = [-1842, -3106, 2, 1677, 219, -59, -1941, -3639, 637, 4927, -184, -5403, -2692, 664, 1195, 1472, -297, -3473, -2094, 2469, 1645, -925, -1398, -1909, -1743, 1409, 2687, -499, -324, 321, -1564, -1439, 3008, 2806, -2793, -2944, 462, 1952, 2115, 1611, -2988, -4889, 1319, 4418, 1499, -1536, -2459, -1914, 2459, 4152, -655, -4950, -1365, 1746, 717, 682, 749, -2093, -1951, 1317, 517, -1140, 28, 122, -2414, -1576, 1500, 1860, 352, -1670, -4344, -1964, 4862, 4247, -3144, -4988, -22, 3142, 3213, 1528, -3896, -4831, 1760, 5526, 1621, -2479, -2232, 239, 2519, 3134, -693, -2511, 1030, 1994, -775, 362, 3108, 1389, -1532, -830, -61, 374, 3376, 1909, -3907, -3352, 2828, 4692, 1243, -2725, -4756, -1631, 5502, 4816, -3175, -5736, -418, 3163, 2412, 666, -3612, -4503, 1184, 4243, -490, -3023, -297, 527, -406, 241, -224]
2744b24o45J122l62k829K327N206k639m525q20K516K524K867k892o988O40Q452
2760C730K009n542l781p52L696N267m31o779j926N161J743j174p57k029j904L617
2776A48K480l090q10K316j216k677J807K011l05o97j218k206K781M570k257n640
2792d003K9K982K525J495k382n788J107P048J366n355k207O13J754L098R18m295
2808a095j975L665P95j536Q07r8k053J418J271j209M38J990k475k964K351L908
2824C238j274k061j058j471K494M789k183o078M77L516J568K02j637m338L19N924
2840B427N09m058j136R25QJ816J631k417j834J777J69j176K333P99l476j023K303
2857d23J058L12R12l130l145M182M018k475k704j33R3J561L393k296m818J574
$$ y = [-224, -869, 253, -109, -2938, -611, 4595, 1956, -2569, -3389, -873, 1651, 4518, 1626, -5362, -4722, 3730, 5739, 197, -3584, -4336, -640, 4627, 4196, -2583, -4509, 652, 2395, 1221, 464, -1565, -3469, 148, 2628, -462, -1272, 1044, -172, -2849, -1042, 969, 664, -33, -1251, -3457, -676, 3894, 1637, -4003, -3974, -992, 1533, 3028, 646, -5142, -4035, 3013, 4379, -976, -3183, -2570, -816, 2282, 3200, -1095, -3070, 595, 1390, -146, 661, 563, -1490, -72, 1199, -10, 428, 2418, -57, -3021, -670, 3238, 1964, -97, -1155, -2626, -132, 4657, 2474, -3604, -3127, 389, 1957, 2159, 522, -3816, -3497, 2427, 2936, -1122, -2258, -1333, -1325, 491, 2122, -295, -2129, -352, -183, -1359, 974, 1773, -1703, -2726, -423, 635, 947, 1859, -1271, -4416, -234, 3784, 1309, -1395, -1528, -1435, 126, 3519, 1223, -3595, -2021]
2873b021L215K59n52m2k029p81L230L77k345K60P70k109L62L340o29k317o8n79
2891a659k8L286J153m890k306M024K309j129j063k134j767M306K890l180l211
2906c399K095J303n63J256j011k103J663J414k288L03L265p91l711P60J765P27
2922F85P76j022l634O22N444Q10m674j632P06K072L124m76n389j289N501J591
2938C215k810j131n8q27K716J374l177j511K894L47k586O22J799o70o09m63j516
2955b391J572M068j692n651Q52L920J128p42j898l587J640O047N3n782j845K855
2971a453K696J151j729m225m0N667Q27l936j020J978k9K21P78j859n03K929j25
2988A328l543R97K852m10j742o98j152K452L738k559n771J439M907O58k245j687
$$ y = [-2021, 1194, 1453, 901, 859, -1170, -1951, 1279, 1656, -689, -429, 341, -1768, -1406, 1934, 1305, -1012, -1080, -1659, -1687, 1599, 2752, -2138, -4444, -420, 1889, 760, -303, -2437, -4204, 102, 2992, -188, -3399, -1304, -1, -564, 692, -319, -2422, -759, 655, -1633, -1330, 1935, 1144, -2567, -1807, -42, 685, 1461, 439, -3195, -2573, 2871, 3681, -993, -2625, -1919, 153, 3277, 2801, -2588, -3877, 1624, 3215, 405, -726, -784, -1611, 1105, 2479, -698, -2209, 685, 1032, -1554, -932, 867, 197, -412, -875, -2391, -819, 3249, 1557, -4094, -3242, 678, 1806, 1064, -834, -4421, -2781, 3266, 3319, -2463, -4308, -1453, 1243, 2394, 665, -3560, -3600, 2067, 2894, -1042, -2062, -84, -113, 108, 886, -973, -1476, 1453, 1328, -2215, -1218, 1634, 1224, -518, -1216, -2368, 84, 3822, 1263, -4508, -3069, 1838, 2496, 251, -1436]
3004a436k262J895N218q33n931j364M028K108p49j048k742K89L881J56l664M2
3020b412K194m17q05J194p82l80K045q69l166J727L959j435k831n93J116K152
3036F97K312k623m777J560N299K60k781j716j067J904M740p02o223o52M713J283
3052B227j700q27j133k16L041L81k983M54J972j829q43J715K30q29R97j168k787
3069c298L147M091k675m904R76L205J365m9k555l497K291M630k88l608p43o9J168
3086h13L358j13m828l50L709J9j219J096m19j935O65J598j03J05M90k652r99L383
3104I92J882j860j542r42q38L224L702l750n074K033L790P92q48j671l077J251
3120a936M144j04k436p98m19j99K520J055k189j590J100o84N78L738r70m538r83
$$ y = [-1436, -3698, -1803, 3415, 2582, -3349, -4713, -685, 1423, 674, -374, -3116, -2827, 1054, 1210, -2454, -2412, -218, -635, -1440, -246, -1028, -1408, 637, -232, -3398, -1671, 2288, 853, -1978, -2571, -1455, 697, 3009, 386, -4391, -2831, 2468, 2728, -53, -1769, -2836, -932, 3808, 3106, -3117, -3769, 944, 2227, 527, -300, -1433, -1649, 1392, 1773, -1210, -756, 1216, -613, -1456, 259, 489, -340, 657, -511, -3298, -151, 3940, 1265, -3639, -2663, 542, 1907, 1858, -697, -4194, -1903, 2727, 2439, -1169, -1912, -1981, -813, 2545, 2432, -2396, -2746, 963, 982, -237, 859, 440, -1495, -830, 768, 665, 770, 1260, -1392, -2391, 992, 2874, 1014, -528, -1470, -2308, 916, 4618, 868, -4206, -2173, 1617, 2409, 1561, -110, -3187, -1936, 2208, 2104, -332, -1130, -1549, -1748, 772, 1827, -362, -1952, -852, -1536, -958, 2780, 1810, -2728, -3711]
3137c711L933J658m2j328l314p50M440K737k534k780o75J063K670K169l369l593
3153c426K439K428j180N94J358k554k257K559K059n33j39j810k468K323M318p09
3169C002l465j293r90K355N144q34p056r62M949K730j573j600k482o37M001K314
3185C603k935j800N03j5Q66J718o57k436J272j6j334K149K779k369m438J377K896
3202A163J272R12k706m684J646O336J228m555l332pL301M604j258o455j132N303
3218A636J691j795r41j050j076K356J596k291p07J944r18k047J241K511n03j369
3234B78k489r65M194M367m125n632J404M108J870r54k910l812K081O233M98n275
3250a129k803J625K832J886j165m140L86L705R2k562J320O86k312P34J927j268
$$ y = [-3711, 222, 1880, 1838, 510, -2804, -3554, 886, 3623, 1089, -1691, -2366, -1303, 1367, 3536, 167, -3426, -987, 1441, 261, 855, 2213, -341, -2598, -39, 2020, 1487, 1348, -462, -2930, -607, 3711, 3002, -463, -1756, -2746, -391, 4753, 3919, -3137, -4099, 850, 3580, 2007, 407, -2075, -2712, 1289, 3603, 668, -1132, -629, -644, 222, 1940, 1283, -1153, 119, 103, -1231, 918, 3697, 1328, -3110, -1733, 1163, 2435, 3347, 641, -4043, -2397, 3939, 5167, 612, -2720, -2727, 574, 5178, 3920, -2535, -3667, 1636, 3327, 1532, 591, -459, -1535, 821, 2417, 126, -581, 1363, 445, -1602, -361, 2150, 1647, 278, -2211, -3176, 1018, 5385, 1260, -4372, -2968, 1140, 3010, 2056, -854, -4666, -2585, 3648, 4146, -1129, -3932, -2307, 525, 2411, 1246, -2894, -2508, 1197, 1289, -1273, 47, 733, -1579, -845, 1082, -186]
3266a86p2K170j811l369J658L837p8k258k411q29M203M060l729n823J313M464
3282A139J321r35k184l390J915N136Kn051j109K777Q48O85o03j819N97J505j511
3299f77j735K882J521k735j111J178J097Q14N81l086k600L337M703j804l638m96
3315a769O45K599J923k282l950J281L486J17o78l51k433l22M376k8l507N7J792
3332I56q79q9J949o41j939N23K30k06J873l2k883m36K059M42K5P06k404k847L532
3351f1L920k498l401J85J529J454J322j961k942J128K377J04k95K74k119n20K821
3368A317L98k005qJ090k068o0L746O75l707j164J004J346J666k25l879q51L471
3385G46J190q58j214j390j209L011K218k181k316J317L52o69J407O91k537j166
$$ y = [-186, -258, 1912, 101, -3268, -1610, 2227, 2149, -109, -2520, -3349, 854, 4914, 1185, -4638, -3325, 1139, 2460, 1525, -659, -4049, -2134, 3002, 3004, -2047, -3156, -379, 469, 1154, 551, -1268, -671, 834, -677, -2412, 470, 1991, -744, -1855, -677, 420, 1234, 1815, -1271, -3871, -534, 4169, 2365, -1273, -1769, -1124, 1475, 3398, 1116, -2834, -1553, 1933, 2050, 1372, 1021, -1412, -1734, 2642, 2614, -893, -836, 956, 77, -12, 1937, 1296, -643, -120, 110, -96, 1777, 1745, -1138, -1574, 485, 927, 952, 1658, -746, -3593, -61, 3859, 1361, -2040, -1855, -326, 1128, 2450, 489, -2453, -1325, 1052, 1156, 861, 1135, -984, -1504, 1317, 1715, -290, -298, 792, -1276, -1336, 2410, 3085, -622, -1786, -782, 564, 2230, 2005, -1874, -2725, 746, 1936, 1078, -136, -1526, -2735, 276, 2494, 313, -2003, -686, -334, -1003, 404, 1095, -1442, -2608]
3401b608J828O53N87R25k399k620K074K815p55q09j005j847J270M678n07m594
3417b314j000K206J515P04O7k988r27K954J573j297r09n92p94K215J462j326j270
3434g21J894j081k159J738L302j880k427K63N53K043K094k870m185J290M207J093
3450C154k001k707j656K538M978j567n446l66M130N61j165j88r13l50J901l86
3466E17j733J146J417j406j814J711O87Q68N75k859k563L349M163k435l747K38
3482a886K329J798P80k529l730J395M703L59k768j151m62J508K657q88l818O06
3498a097K301p8j513Q22k15m53R82m33k025J159K753j983k710R24K465M32m31
3515I00l001k158L553M029k455m345P22K344J409M13k412l513K099M421p25l614
$$ y = [-2608, -780, -127, 460, 1385, -1014, -3634, -1560, 1255, 500, -309, -1314, -3161, -1891, 2787, 2280, -2314, -3314, -1108, 407, 1111, 1178, -1810, -2737, 217, 1790, 493, -416, -1008, -1802, 413, 1875, 549, -721, 1173, 92, -2067, -329, 2973, 1093, -1334, -1071, -518, 1525, 3619, 749, -3436, -2146, 2061, 3154, 1153, -1554, -3210, -672, 4306, 2739, -2707, -3073, 1057, 1618, 453, 265, -648, -998, 903, 517, -1216, -70, 1347, -59, -1873, -162, 525, 1393, 1968, -891, -3454, -105, 4058, 1623, -2124, -1886, 443, 2241, 3021, 492, -3238, -1843, 2860, 3219, 451, -700, -1162, 346, 3003, 2115, -1703, -1097, 1204, 1126, -387, 435, 220, -233, 749, 316, -1709, -550, 2203, 220, -2490, -1566, 899, 1331, 900, -2101, -4259, -706, 3323, 868, -3477, -2755, -411, 998, 1411, -1001, -4514, -2415, 2006, 1281, -2333]
3531b333K19J565M37P66j757j774J625K768k204j882K186J676j798o72O3o63K425
3548F47J583l118k432K659K734q72j927j319n63L039K101k451l092J690J866K9
3564E74l94p95k025J064K945q76k372N31R81k11K29q8j060K09J733q82j537J897
3582g7Q95j661p18L66j38J748J230k646k553L273K947j584k542k40M58K246J582
3599B586k768k416K213K356q72j075j70m61O56J650q02j797J627N69k328M18J986
3616A372k54j411P3p5K20K375q43l501n9K838P07j100k83j541j82K769R07k647
3634f35j252J323J62N78J053j015j934J228J202j122J86P18j440r29K202Q91r60
3651B56l1l35j926R00K781m43k365j33R05M80K433q44l844q95L785J205j289r90
$$ y = [-2333, -2114, -549, -112, 654, -1103, -2877, -1252, 1516, -688, -2570, -384, 1292, -506, -1178, -1115, -1778, 647, 2230, -888, -3320, -661, 2073, 1201, -726, -2045, -2608, 431, 2532, 81, -3011, -1321, 545, 574, 180, -615, -2640, -1576, 1369, 493, -1879, -1348, -367, -578, -349, -437, -1497, -1288, 445, -437, -1974, -77, 818, -843, -1561, -1195, -1333, 415, 1645, -1001, -3554, -281, 2666, 1082, -1460, -1700, -1242, 1004, 2586, -182, -2598, -385, 1971, 1099, 24, -146, -607, 49, 1699, 897, -900, 727, 1296, -1032, -614, 1372, 1118, -293, -220, -295, -75, 2300, 1457, -2044, -2103, 735, 1442, 342, 59, -1482, -1664, 1105, 2012, -635, -1887, -564, -402, 176, 1229, 214, -1720, -492, 710, -412, -226, 492, -948, -1877, 325, 1216, 256, 225, -110, -2036, -1136, 1645, 1202, -1163, -1296, -391, 89, 2522, 1678, -2166, -3061, 724, 1929, 640, -350]
3669c50n39n15K319J099l014r28K166k95o22J427J75j340k26p2j111J503K307
3686A984k270k999J462L128M36j301k066k082K513L874j443l779J2K021J280L42
3702A112j302k569N69K933k99j482N67P75j497K51J382n89k68J051j713r99K623
3719E45J907k140k011J54L84K186J536k772l081J999L400J67k097j391j032J582
3735f64L509q36l528k42J950N51L32n73k270N05K831q12k393J671J653j874j024
3752a214P88K16J362J86k725j681L417L105j905l707m19J537L071O88l298l148
3768c727K705M078j434k281q92j33J803J842j017k515J105J795j245q13J147k83
3784A35p89K82j53k15K115M98l174j526K744J485o92n95j462j208L092K439k590
$$ y = [-350, -889, -1404, 915, 2014, -1000, -1928, 238, -57, -679, 748, 923, -417, -643, -715, -1826, -323, 1984, -286, -3285, -1823, 1305, 1741, 440, -1626, -3708, -1195, 2679, 1236, -2543, -2531, -510, 770, 1112, -190, -2759, -2190, 743, 444, -1038, -471, 304, -1193, -942, 440, -149, -417, 634, -1079, -2078, 545, 2452, 312, -1699, -1545, -1161, 1025, 2561, -211, -3292, -1293, 2107, 2274, 177, -1214, -2246, -664, 2845, 2009, -1519, -1761, 189, 740, 1072, 499, -1771, -1266, 1565, 753, -1640, 31, 1684, -190, -1214, -426, -210, 1152, 1338, -1387, -3068, 349, 3454, 1549, -2158, -2577, -1040, 2031, 2719, -579, -3727, -1022, 3056, 1622, -659, -1551, -1684, 119, 1961, 944, -1571, -466, 1329, 84, -729, 418, 135, -654, -372, -525, -740, 1375, 1873, -1301, -2827, -83, 1402, 710, 115, -1347, -2555, 537, 2976, 386]
3801C86k977P2J657J952J183k812k696K112K879r69j778k68m68P48K367l56k690
3818a658J140J030j249j258K492J43q52r50k97R95K111K57m098j326L335J905
3834A720k23j780j708j82K999J733k450k965J607K024N2J83q29j391Q56R19j105
3851e40L47J200j131j645J560J873r46o45k00j403M52L223o75k369j50J064O25
3868F40R29l00k198p35J982J615j331N1o23j300J588J885j303j894M12P91m83
3885b74J515O36k015o26O34M47J24P56j080j931J258J860j83o17o01j677N66L363
3903B155J16l679n36J964Q99j11j86j577o33J813N05j451O30Q81j321k69J178
3920C78j90k76P32p33j727K293K677j993k882M08J247J723O8j962j664J857K424
$$ y = [386, -2591, -2519, -862, 1090, 2273, -539, -3235, -1123, 1756, 787, -991, -1259, -1727, -979, 1388, 1032, -1658, -518, 512, -737, -1995, 497, 640, -212, -1162, -1459, -464, 1647, 1904, -2194, -3520, -185, 1720, 1497, -283, -1991, -2173, 826, 2559, 109, -2856, -1249, 775, 827, 1010, 181, -1210, -354, 565, -540, -193, 1007, -124, -1769, -209, 1664, 718, 73, -127, -1530, -1078, 2145, 1470, -899, -1049, 15, 640, 1569, 1269, -929, -1664, 318, 1933, 602, 653, 30, -1270, 318, 2203, 900, -994, -582, 209, -274, 1241, 1877, -138, -764, -130, 317, 441, 1197, 117, -1814, -556, 1304, 1121, 504, -97, -1774, -1208, 2155, 2271, -1408, -1944, 20, 919, 808, 622, -955, -1588, 225, 730, -721, -91, 790, -531, -800, 378, 188, -88, 644, -89, -1816, 477, 3154, 1161, -1721, -1313, -66, 1657, 1725, -237, -1901, -44, 2380]
3937B380j202j554k58l11O44J857m13k091M91J542n66r59J041p9j120N54K47j09
3955I4R47J39j607j121J069J373m57J22j044j388K107K653k433k906J093J639
3971B80O85O24j478k212J721K813j035k498K66Q17R11P02r34j827J820J719k365
3988Ij671K300J387j303j084J46J40J581N00k329j520K229J566p35j320p59J01
4005g62K306J256l406k062K597K278j886j092M94J08N61J108j778j351J265J065
4021G01p88n16K01l81R64R62j948j146K184J203k103k10R45J60L68M76j860j317
4039b105K040J559j087j611L96Q37J383M89k617j874L263J630j618j266O49K35
4055C03R69O67k082j548J831J875j307j197R27k7L78j18j422j79K084K50l132
$$ y = [2380, 1178, -376, -634, -945, -301, 1556, 1143, -948, -457, 1085, 519, -440, 601, 522, -598, -44, 203, 94, 1041, 1180, -427, -1548, -479, 894, 437, 559, -485, -1873, 234, 2887, 454, -2452, -1359, 280, 965, 1589, 111, -2101, -380, 2433, 1398, -1100, -834, -17, 894, 1596, 662, -1165, 655, 2374, 9, -1662, 638, 2025, 722, -362, -216, -76, 1505, 2005, -324, -1844, 385, 1951, 1216, -104, -863, -762, 1544, 2800, -606, -2668, -71, 2207, 321, -771, -277, -169, 392, 1500, -278, -1629, -364, 701, -87, -603, -402, -783, 181, 1143, -805, -1951, 233, 1436, -667, -877, 68, 228, 596, 1072, -788, -2105, -65, 1494, 407, -1204, -808, 29, 1412, 1901, -716, -2590, 673, 2303, 685, -581, 68, 303, 1272, 1939, -143, -1691, 140, 2015, 708, -489, 438, 411, 789, 671, -751, -930, 1154, 1404, -1728]
4072a728K96K158N61p20p24j397k34K901Q42k710j156J876R56N1n89j807m67K240
4090C49J199j968n3J107p51p74J879n06j182M79J057q32J16J328n66j210j45L48
4108a25N16J518j031k248N37K658k22r95m54r82l06K449J119k106j929J589J082
4125A070m04k95q52m85J413M56j378L91J229j516j281J127J228n54j4o40j656
4142b161J849K463o25l213k87J695J106N32j097k108R55K352kj993K96L4m55R70
4160C11J065j139m10R77p11p66J184J217j895p41O07Q41J080J42k319j430K234
4177B47J670q36q18p08q68J645K370j576l135O01J706O43l90o8j390O24J326k52
4195G91j481L94K36q61K68J573o74l03R04j634j448K682J519j901j659O41J508
$$ y = [-1728, -1432, 726, 1287, 567, -157, -1554, -1788, 1113, 1955, -755, -1911, -35, 921, 972, 383, -1424, -1891, 349, 1548, -420, -473, 634, -117, -891, 988, 482, -700, -221, 836, 4, 120, 1448, 882, -328, -473, -125, 391, 1909, 878, -1370, -833, 1825, 1603, 608, 154, -828, -1134, 1315, 2434, 328, -1601, -12, 1070, 666, 371, -481, -966, 447, 903, -475, -84, 1145, -371, -1652, -525, 703, 149, 135, -505, -2161, -312, 2151, 1526, -1687, -1974, -279, 827, 1359, 262, -1846, -891, 1461, 1459, -534, -238, -204, -659, 311, 1376, 237, -173, 804, 93, -673, 511, 1728, -167, -908, -301, 540, 1620, 1762, -557, -1987, 247, 1917, 1081, 263, -445, -1313, 332, 2702, 1126, -2009, -1408, 298, 941, 551, 483, -907, -283, 1043, 791, -690, -296, -60, -921, -653, 920, 246, -57, 847, -787, -2235, 447, 1966, 65, -1594, -953, 555]
4212E55R36K5k474j516K258K319r07j479l64K89J119J354j507k477J450J969o25
4229I25j054R27l67k11L20n23n45J594M72k288o69K404M24n53m37j612n08K820
4247A119J386k666k088J718J737J63p41j559j205K151J838j437j229J70M16L78
4263A51J136j429j401J378J203j615n09J768j2q76l17J21k46J256O30k226p25
4280a713K183J287q88j180j260J23K477J459l501j593K349J790p30q75r95m90
4296a557J647J601j710j328J223P98n67n01k13k20Q47K55j848O30K504k87k597
4313a323j53J170O39M47n51k080L16K711M77j836j597L64P86J928M01k839o71
4330a811J855J153j240l58J50q92O85J289p96l97Q54l26j307O56J376p35n31k0
$$ y = [555, 1491, 1516, -958, -2474, -216, 2103, 1196, -283, -647, -358, 761, 2115, 608, -1869, -419, 1550, 925, -129, 798, 431, 220, 540, 17, -528, 1066, 1538, -750, -1419, 985, 1409, 856, 419, -1193, -1701, 1119, 2505, -161, -2249, -531, 1206, 1369, 628, -931, -2136, 15, 1853, 416, -813, -643, -227, 151, 1287, -142, -1543, -165, 1038, -577, -1086, 682, 670, -206, -523, -402, -648, 608, 1238, -988, -1713, 470, 1757, 869, -311, -1571, -1448, 1029, 2488, -1013, -2606, -257, 1533, 803, -72, -1067, -1557, 90, 1691, -19, -1347, -124, 674, 107, -394, -607, -827, 20, 275, -1573, -943, 1561, 1274, -1323, -1476, -306, 333, 780, 229, -1851, -1535, 1176, 1653, -183, -1780, -1416, -630, 1298, 1699, -1140, -1811, 44, 1197, -43, -401, -251, -1143, -458, 831, 35, -362, 492, 166, -1141, -485, 891, 156, -375, -395]
4348c95p46J200K351j577k511J69K017O97l1q50j516K27K627L57k206r82P88N60
4366A79P44K73j098r94J469J48j292J136N77j226q19J183O26n5J60j049j741J447
4384c32K374q12j864m55N35R63J680j473k681Q18J908O18j206r9o56l86J656N61
4402A149j527l77N98o01k6J596R8j005l97l21L17J134J062k356j404J715J160
4419H15J38m11j308j464K004K280j153j799q0P45N62J027o25k125K36J805n7r93
4437d03Q30j33j069O54P15j023L48M82j182o96K051J076j688o23m75M14J601Q63
4455A742k660j482K080J830o10q01q44j074J509J809j127j760J039P48n59L09
4471A49K71j073N7R54n10m46J885l30j596o4J105K83J34K95j766l87K654N83j849
$$ y = [-395, -1141, 59, 2410, 833, -1678, -1509, 508, 1205, 1174, 324, -1192, -965, 1662, 2019, -187, -1169, -381, 179, 923, 1196, 98, -896, 573, 721, -571, 565, 1142, -84, -903, 280, 906, 851, 1011, -38, -1779, -332, 2042, 1230, -634, -1089, -554, 409, 2089, 616, -2065, -1247, 661, 1279, 73, -26, -682, -1068, 588, 1149, -378, -755, -157, -758, -784, 812, 910, -95, -492, -813, -496, 638, 1700, -656, -2060, -345, 815, 953, 542, -766, -2230, -226, 2054, 901, -898, -978, -233, 329, 1356, 731, -1394, -1158, 647, 590, -403, 427, 294, -775, -121, 594, -429, -81, 401, -781, -1477, 574, 1650, -38, -661, -1136, -722, 879, 1742, -918, -2400, -320, 1510, 900, 99, -745, -1819, -310, 1499, 372, -1388, -349, 399, -160, 149, 420, -653, -596, 358, -152, -598, 1287, 957, -639, -703, 402, 685, 819, 1114, -652, -1039, 1615, 2198, 349]
4490C49j112K03N24J176Q15j814j693J939J399j053o74p0m47N33J231j096o12
4507d02Q21M92j482jJ135J76n14m3o86R8J858j7k420n43J857L34J22r57j316J44
4527a344K624P00k534j289J245N41N59%j003n66J648L92j402PN07j5m68O44q8
4546A58m75R03k50j347M25J568l00j553O55J8M26J455r28k379L11K195k6q95J12
4565G3j029M91J538J65k048q00J235P31o35L03j57p72Q65N63j563K56J280n93
4583i7p57Q68N05o95Rj54j274R62J373l81j637P38L23K99P35o51j980O97K439
4602A322l0j879K50M02P3R54r4j692K51J075J10j028Q79K24j170M29O9o21J067
4621E91R07j717r96J521J345q95p16o31j66J083J598j310k042N08J701J66r25
$$ y = [349, -763, -560, -36, 1140, 1955, 141, -1552, 387, 1786, 733, 59, -11, -458, 75, 1306, 210, -402, 419, 911, -571, -572, 563, 739, 225, 182, -504, -406, 1452, 1435, -985, -1528, 329, 663, 785, -172, -1488, -1344, 1280, 1980, -554, -1843, -598, -57, 502, 502, -501, -1067, 581, 973, -429, -422, 85, 70, -398, 246, 158, -317, 586, 336, -1011, -586, 982, 682, -871, -216, -198, 228, 1683, 755, -1624, -1313, 882, 856, -39, 73, -956, -465, 1073, 1238, -810, -1610, -375, 356, -279, 24, -133, -905, -40, 523, -1040, -784, 496, -97, -854, 14, 519, -176, -167, -321, -1595, -633, 740, 359, -1278, -540, -217, 82, 817, 166, -1814, -1117, 1322, 1292, -587, -337, 65, 138, 1092, 998, -694, -443, 632, 742, -286, 593, 817, -353, 76, 145, -476, 591, 1498, -219, -1215, 306, 1651, 756, 40, -591, -757, 326, 1924, 614, -1428, -920, 781, 947, 22]
4638B2Pj307P92J832o75j659R60K28n91L96Q50r86k50J091o60o32J275P70j002
4657D61j348O04O02J162k49k007r22K397J566j300j569j42M43R73R91j189j851
4674a378P73K127q92o04R8l54J57J026m64j044R80N70j501l32J408J99j007j47
4692c85l79j00J892P03k246j503J413J380q4k67j970l47K478J262j896j293N08
4709h34N15K72P94p51j034N30Q96o21m51R83o4q34M15M01k14Q61l63j634J34K028
4729A029N32j606m63l81M09J999K09k425j390K215J052n58m45p33n20J655Q17
4746A396j425n53M74J04K0O09J29j330L14L53p46K17J255j14j868K03J145R08
4764A091k23p55j949Q20K179J90j621m67j29O29J714K58k600p09J726Q64o87q2
$$ y = [22, 29, -1278, -486, 1346, 671, -988, -28, 200, -391, 5, 855, -131, -381, 710, 50, -582, 693, 1463, 461, -887, -283, 319, 1481, 1232, -775, -1697, 700, 2266, 966, -603, -745, -302, 671, 1662, 473, -1378, -605, 1522, 630, 26, 124, -230, -73, 953, 489, -555, 425, 995, -506, -838, 570, 769, -238, -385, -764, -864, 1028, 1731, -515, -2018, -605, 775, 691, 424, -1546, -1893, 585, 1847, -49, -1342, -834, -319, -47, 747, -4, -1038, -508, 388, -233, -684, 299, 235, -599, -184, 217, 3, 864, 501, -1133, -999, 1029, 1561, -45, -508, -889, -480, 1519, 1728, -697, -2087, 128, 1180, 622, 177, -556, -1076, 579, 1396, -29, -582, -108, -4, 16, 625, 754, -576, -262, 91, -655, -438, 817, 703, -1165, -962, 183, 1091, 868, 113, -1836, -1016, 1163, 1353, -268, -735, -864, -235, 1479, 1737, -863, -1572, 154, 1018, 331, 249]
4782B49l81k70M01J009p16n10M02k23p87J367P05j007n00K46o52O57J656j053
4800E93k183L02K221K13k76j153j056N5K123P79j859q67M73M20R32J98k017k08
4818a310J256L99q40O09M81j390k18Q60P07o46L46n76j133J284J621r32j268n91
4836a341J49J354J862j925k291P14K614j19j236l27n99J35J519L53j320j11N95
4853B6l78J27Q62k58q05M38j17m06J355M44j925r53J460Q53jj87j027o08J078
4872b2J640m91j887j00P51P08P74j076j282N74J527l78j028O25j52r79P40O70
4890F14l45j20p6m80m67J585O31j252o85k88J95J827O55k272j511J909J589n07
4908A002p84o63q51J497J721j027j881K57R48NN42l67r67M28L09k35j42J174k20
$$ y = [249, -132, -402, -1, 1008, 292, -218, 184, -39, -826, 541, 1246, 239, -261, -15, -667, -10, 1646, 593, -1590, -1288, 933, 1146, 870, -283, -1339, -1284, 839, 1618, -241, -1108, -635, -215, 717, 915, -1102, -1310, -54, 345, -495, 114, 595, -795, -1013, -153, 554, -92, 254, -322, -1455, -171, 1450, 518, -750, -1341, -1192, 162, 2024, 99, -2192, -1478, 1136, 1017, -219, -546, -1145, -1010, 509, 862, -458, -569, 26, -352, -225, 637, 379, -426, 12, -105, -511, 844, 1288, -637, -1590, -130, 723, 722, 535, -492, -1100, -22, 1618, 1127, -760, -860, -109, 599, 1373, 297, -985, -411, 1116, 738, -290, 335, 183, -796, -56, 614, 269, 149, 73, -407, -874, 711, 1342, 90, -595, -883, -688, 1139, 1794, -478, -1989, -80, 1509, 1002, 218, -445, -1296, 201, 1922, 895, -986, -729, 219, 224, 766, 399, -568, -140, 169, -66, -208, 966, 746]
4927G46j479J66P37N41p9j1j315p13J937J216j701j335N66Q05J207j41k082q27
4945a762J589J216r06n67K55o72N30J051l02j477P09M73n64L09M67j75k34r2k98
4964d50K5J174Q9j806j61J408L29k4q4j596m44K145J294j993j199N95J291L21
4982I14j3j519r56J685Q23p23j51k94N3K03L98J9q82J173m26j031K74J156m3j215
5002e55Q2j25R27R22p45j906M78J768m2q70m7q50Q2J544L88j672n96J124L78o43
5022c58M56k68p91J018M16m94P7N73q72n44Q38J05k49O84n10r70K06K003n02j586
5042g68j81Q72K61N23n47j202R2J810O5j183O3k46Q2R32J55j454KJ140j98r70
5062g52Q80K45o67J21k95q0O04K66o95j085J117Q83k23o14l80n92J055J319n64
$$ y = [746, -733, -567, 170, 711, 632, 621, -694, -1407, 530, 1746, 45, -1290, -724, 81, 1288, 1147, -935, -1762, -173, 1043, 137, -430, -175, -847, -317, 734, 432, -1045, -336, 137, -427, -118, 349, 174, -60, -152, -450, -425, 749, 838, -968, -1129, 279, 608, 584, 500, -1096, -1540, 605, 1899, -94, -1293, -698, 593, 914, 901, -618, -1574, 111, 934, 211, 60, -234, -181, 22, 420, 439, -443, 730, 304, -727, -453, 703, 660, -555, -473, -598, 329, 1251, 506, -1400, -922, 846, 804, -66, -113, -963, -881, 663, 1051, -621, -1217, -93, 285, -358, 98, -170, -961, 57, 473, -21, 56, 629, -243, -787, 51, 156, -93, 591, 81, -889, -683, 1320, 818, -768, -949, -77, 184, 707, 160, -1042, -950, 860, 925, -258, -195, -441, -359, 573, 728, -726, -724, 416, 218, -752, 128, 373, -294, -173, -468, -548, 56, 322, -373, -1458, -341, 542, 319, -295, -675, -1267, -212, 1107, 543]
5081E43j851K84J498l77l41L47r23O9J184m20m51J35L10o03K63P19m58l50M61
5100C9n71O5J036L39r87n12J11P20K9O42j171r70J087R95m08r59J29j41Q46O30
5120I49r42j223Q77J024o54k24K18j75l48P37j3r24N59M10r77L63M17J95j99j85
5140a15m89j54J414P14j732j384J485P26N8l71p47p47J573R43r02j149N39M60
5158A22J76L47p58p55J205O71j268j53O40J04m05K11J34j83M01j62q27k43J297
5177E54J91m36p60l66O29J166L17j859n68J287P19o85l39m75k31P58J176j209
5195a31j126Q54O05n34M19l96m01O50K78q10K4P59M39j388R8L54L67O46j08j574
5215i75J1J575N12j174p69K16O10J173l18j639m76J450P24q71m30K8j47Q60K81
$$ y = [543, -1308, -1024, 474, 97, -244, 103, -820, -751, 433, 13, -438, -303, 7, -596, -333, 386, -72, -422, 39, -532, -467, 569, 908, -79, -591, -480, 240, 269, 911, -260, -1230, -143, 852, 444, -515, -386, -527, 319, 949, 7, -1216, -339, 685, 31, -193, 25, -150, -498, 239, 226, -698, -139, 271, -706, -343, 74, 269, 70, -115, -604, -758, 656, 1370, -362, -1746, -261, 465, 523, 152, -595, -1342, 231, 1174, 272, -877, -338, 122, 298, 645, -113, -868, 337, 1008, -260, -413, 227, 331, -74, 137, 271, 88, 489, 327, -500, -743, 554, 745, 309, -451, -817, -188, 978, 1295, -564, -1132, 155, 874, 189, -150, -625, -856, -98, 1078, -131, -1257, -403, 202, -332, 87, -309, -710, -60, 218, -592, -568, 191, 630, -758, -660, -306, 61, 707, 599, -975, -964, 611, 1123, -51, -820, -604, 6, 1179, 861, -778, -1254, 196, 920, 49, -381, -353, -500, 360, 641]
5234F41p72j014J312Ko53M05M76kn09j06m54K14J269m84j298M00Q08L75m95l44
5254b29q46K26J687K22j204r04J020o3M68N1q22n59J143M42q50O1L66o96J28P69
5274D10j20m62P60o77j183J259Q34m85q34J12j60M94J036o16j541P83J033p9k81
5293B83k72q20K16J159J94j106l54O71J11j32O08n34o26O35m9l10O47J71j124
5312f32n59J277P7j50N5j059k51R67J407p80j251K8O63M21N28n13j273K30J353
5331E38m11o02Q2K66l26M25L25m70J22L1n5l34O83M48j142k51N30k57R16M08j429
5352e03j017J185Q21N5n28m43n01Q44J359p01j779O96M42K20M98n39q43K26J191
5371F83q39o94J030J69j041J83L87K68O01q13r66j30J793N44j543o31N94P27N97
$$ y = [641, -131, -1145, 167, 169, -484, -79, 397, 395, -114, -220, -674, -460, 809, 325, -973, -573, 235, 610, 115, -229, -1075, -849, 838, 1060, -144, -1048, -28, -91, 377, 428, -394, -953, 190, 632, -218, -157, 209, -487, -359, 410, 290, -172, 588, -89, -1272, -13, 821, 336, -498, -386, -546, -52, 984, 368, -1173, -390, 643, 564, 283, 11, -809, -593, 566, 760, -346, -700, -29, 82, -50, 558, 24, -602, 33, -16, -326, 321, 492, -632, -1191, 86, 163, 13, 68, -991, -1242, -275, 1132, 352, -899, -871, -208, 213, 741, 228, -1045, -815, 538, 127, -475, -393, -127, -453, -28, 297, -173, -51, -20, -75, -409, 274, 722, -420, -671, -141, -398, 518, 926, -503, -1520, -335, 486, 541, 13, -430, -931, -87, 1272, 571, -1208, -512, -70, 150, 648, 109, -734, -508, 683, -156, -850, 180, 349, -692, -509, -122, 146, 747, -66, -1032, -1162, 631, 1175, -368, -999, -405, 322, 919]
5390I19r6j530r92J896J002q49r11J99J26L88P73r28q19R25K65o64K81L50k57
5409G8l2M5l89O3Q38M24j571j77J134K66n73L3p79PJ143N56j067q01L32J113J10
5430G53k40j252q07J529J075j072q90R76j6J80Kn99j23P75K69j389Q8J329J38
5449G26p11k94o91R06Q97l80j748J97J665N30r00q47j51M19J263M2j574p58J687
5468B78N47q46l5k41k77Q49L07r89L22N09l93m95L70M62m58J80m9q05N40J063
5488H39k74j246k71P87L49M63l11j408j16J999q9q47l50j65K80N73O67j348l55
5507h23Q38P66o63k68k77J13L20K01l77J84J99j58o42K88N78l06L34j09q98N53
5527a47R87n9j523o8R97Q43k08r10q33P64R56j05j184L2M24k32L79M36n40l96
$$ y = [919, 823, -707, -1699, 197, 1199, 350, -561, -362, -236, 152, 925, -3, -822, 103, 368, -296, -15, 335, 78, 46, 91, -298, -235, 603, 1027, -544, -721, 413, 679, 106, 139, -640, -633, 510, 1066, -1, -802, -470, 643, 753, 513, -739, -1546, -17, 1058, -14, -904, 72, 56, 236, 238, -361, -484, 291, 560, -829, -741, 588, 726, 15, -279, -970, -64, 833, 453, -1295, -1098, 567, 1097, 197, -650, -801, -382, 881, 923, -651, -1409, 278, 825, -21, -56, -297, -574, 275, 582, -407, -85, 424, 31, -464, -94, 368, -90, 90, 41, -764, -224, 839, 565, -681, -952, -165, 184, 647, 336, -1072, -1188, 811, 722, -125, -475, -640, -360, 213, 880, -468, -823, 15, 781, 118, -150, -427, -314, 6, 207, -170, 14, 213, 55, -587, -299, 279, -27, 307, 198, -700, -147, 840, 781, -742, -810, 187, 1030, 822, -88, -921, -157, 799, 694, -490, -458, -34, -266, 113, 549, 9, -387]
5547c87M46J4l52M41R3n87j17K37P88m59L5n64n01R82O33r79M7K75m08L35R45
5568I17o92j248K87P69J51j21M6o37l7O25L11n67J19L3n81N95N96m38n5L6n61
5589d52k39J014N93j166n69M29R43J36l84r58o62J206J210j265q1K42J70j2N01
5608F56m30r21M57Q12p24m81R38K30j030N7L93J36L44j78j152L24J326j22q58
5627b23l01MJ71O36K05q53q10J477L05o73j76j78j77Q44L22p89j75P11j07o26
5647d13L07R3m50M61K95p72L15R62q2r33J3K85J04L07L58j411j2J210J45q23l18
5668c59j16L26J017m7j362k86J125O60j057k84O04J61j13J35p27k59J276l19o00
5687b25m97N70N51p7l05q48J54J711n16j316J56Q63L73q37J69j83J08R26l09j057
$$ y = [-387, 59, 73, -279, 162, 255, -332, -449, -212, 576, 117, 152, -412, -913, 69, 702, -277, -230, 45, -363, -28, 917, 225, -1023, -736, 33, 184, 63, 109, -528, -565, 60, 371, -196, -77, -44, -625, -30, 566, 128, 73, 109, -452, -691, 323, 916, -250, -819, -390, 553, 689, 305, -653, -1315, -109, 1101, -164, -245, -3, 167, 155, 656, 226, -695, -238, 574, -150, -631, 307, 537, -493, -436, -43, 93, 437, 259, -893, -569, 757, 635, -223, -524, -520, -349, 287, 492, -361, -1171, 306, 611, -62, -238, -416, -593, 251, 573, -216, -391, 320, 213, -413, -106, -13, -463, -2, 293, -479, -164, 798, 716, -217, -204, 81, 185, 492, 850, -561, -573, 637, 782, -41, -359, -475, -149, 868, 821, -541, -827, 298, 958, -99, -383, 221, 382, 269, 404, -323, -582, 694, 375, -225, -722, -152, 399, 322, 17, -831, -677, 1034, 518, -798, -642, 221, 594, -243, -74, -257, -149, 777, 468, -589]
5707e89M0P53J9Q3m44o26L84J035K10j531M01Q02l08k06m8k84k27P39J71q11K4
5728d13N20k55rJ68n72L23J036l25j666N84J161m01l90j95j44M07J065l96j569
5747a071%J172N42j63n10o51J00J021L9j116K98O60p9m04L42l8r4K96l69q38R31
5768F8Q13q43q86M82R15k26J06r33l32O90J134l12j013K9%M06O61l58j049QJ073
5789D33m99L15J87l30m71Q1O95m41K49j06p66P9J242p4p56p5N37o49O43O67j359
5810c98n20M57R49n2N5q33k26L65J082l41p87L14k18L6P36L3q66P9K41l30L7R05
5832G18r1q01l78K78O12M6k09r38k18J614M25j199o34R2L17M86P16r19r23Q76
5852a30N52n23J52M5l55j39K11K91P1M0l35p64M39R23p4n05m65k10N11J026r0
$$ y = [-589, -549, 204, 223, 306, -138, -764, -380, 655, 865, -666, -265, 537, 229, 23, -25, -309, -536, 203, 374, -437, -413, 107, -148, -157, 11, -561, -238, 798, 473, -1193, -609, 552, 151, -239, -434, -578, -171, 894, 498, -1071, -1071, 101, 643, 480, -30, -681, -581, 440, 479, -637, -339, 321, 242, -162, 180, 142, 48, 344, -25, -863, 68, 881, 38, -848, -366, 549, 323, 429, -504, -836, -146, 988, 676, -337, -308, -308, 98, 759, 401, -648, -640, 433, -66, 249, 436, 106, -365, -284, 411, -30, 219, 113, -653, -574, 668, 594, -162, -237, 300, -349, 294, 961, -398, -918, -461, 488, 436, 491, -342, -568, -203, 879, 538, -249, 65, -153, -117, 619, 652, -214, -135, 106, -224, -187, 718, 627, -174, -552, -274, 338, 384, 175, -763, -981, 633, 1058, -141, -775, -683, -366, 120, 836, -83, -1006, -130, 422, -101, 51, 96, -259, -398, -187, 104, 175, 215, -120, -884, -445, 478, 404, -101, -566, -776, -265, 761, 671]
5873F71j270k85Q44K45P7j92p98j18J412K40p07q80N53J9j49O78k18m78L26M40
5893D10o43J1O60j90q13J40M59L60K65m66p78j74J049Q79j288n16M2N64J299k41
5913A029j872k97J570M23p26j55l33L71N84L49j161k11N67J4l76J26M10l2K5n08
5933b03l74K59J525o38j375L14R04N02M8q22j280N64J627k59j047J00k82P03O30
5952H96j33j310l5J098J2l81k29M28k57J32Q2n24k88P59q9n88L41K83m8j48l47
5973c46k50O72P99p90q44J74J106J29l16m30j106P28J237k96j114k9N65K97K87
5992D73l41q91L07P56O9o48K67M84n69j93J65j01M07Rn4p84O52P42n52o46Qj30
6014e70K69Q60k64r42K53J014l43j55m44o82N22J155j32q20J17J92m9j12J35m43
$$ y = [671, -599, -884, -40, 205, 282, 90, -708, -826, 586, 826, 119, -761, -208, -189, -338, 340, 122, -356, -30, 410, -233, -222, 438, 248, -565, -425, 34, 394, 659, 193, -585, -759, 290, 1169, -119, -635, -593, -29, 1270, 1029, -843, -1140, 430, 853, 127, -28, -361, 10, 594, 943, -218, -429, 138, 152, -224, -98, 312, 280, 305, -203, -577, -318, 1207, 569, -806, -492, 412, 914, 962, 140, -1140, -576, 1051, 792, -255, -155, -437, 266, 896, 763, -547, -582, 516, 528, 147, -82, 346, 89, 221, 303, -221, -509, 250, 161, -427, -86, 197, 149, 1, -346, -596, 76, 875, 85, -759, -585, 521, 650, 334, -96, -1202, -474, 763, 467, -647, -676, -111, 186, 473, 132, -759, -452, 304, 373, -275, -8, 476, -93, -286, -121, -222, 185, 194, 140, -644, 8, 750, 198, -448, -440, -570, -301, 559, 295, -647, -394, 620, 277, 122, -322, -1004, -482, 673, 541, -279, -162, 30, -19, -131, 4, -439]
6034d39J00K46M17n65M26Q2l54k28M45k32k4L48l95n60Q63R14q27o19M08k23K87
6055G0Q11q99p21M66J066n57k98m6j19R4N35O8o16J72P18j047K89L40J12j055
6075f17N68J63P1L85j86r25l31J655j29p00n8n6m37R13O88j248o20P54J33l07
6095b84N19kp01L60K54l73j4O08p12p3J70R95n96m3k10k88k3J033l63r08J02N38
6117a1J94L77k43r36K02M16O98n59k14m8J40K0M67p31n64O07K76n69P13K66n37
6138c6j27J90k29J15Q62q40p26N57O23M71o07n47l30N24Q52k94r17K07N21j73
6158I6L14j83q27L16R15L7q27j4P06n37kPn4l0L47k80o11P12Q20m63o60J37n0
6181a31L11N33l71j174O61P37M5n11k39k39L29O64j78j162L83Q16m59K96k66l44
$$ y = [-439, -339, -93, 324, -241, 185, 267, -87, -315, 130, -102, -126, 222, -173, -733, 130, 1044, 217, -402, 6, -217, 70, 881, -18, -739, -273, 793, 236, -62, -108, -227, -133, 402, 470, -146, 26, 744, -303, -14, 326, 438, -617, -49, 114, 185, 570, 384, -541, -872, 783, 654, -46, -104, -160, -597, 316, 1004, -244, -864, -110, 23, -284, 235, 233, -468, -108, 146, -227, -241, 367, -345, -418, -248, 747, 151, 108, -102, -390, -413, 620, 257, -651, -549, -11, 183, 560, 317, -619, -417, -1, 697, 138, -76, -124, 16, 36, 503, -228, -792, -185, 91, -478, 235, 501, -36, -163, 27, -202, -87, 775, -65, -791, -234, 389, 860, 253, -294, -624, -100, 752, 458, -459, -252, 269, 96, 410, 227, -600, -284, 631, 668, -159, -173, 533, -4, -6, 1, -53, -83, 264, -16, -627, 85, 905, 442, -218, -81, -131, 180, 713, 342, -832, -171, 566, 611, 100, -139, -378, -49, 615, 437, -725, -342, 474, 15, 311, 45, -299]
6201b99k80J038j45m09o8P25j08p44L09j63M63K66n44p92Q53N19j61r10L91O9
6221A0N6L79m16o25N77R14j86j322N2K60L42O57m71p65M61O93l83l90QJ05K61
6242B17k27J28k53K1P97q29m04P68J10m25j03j57N9O06M48p98m86K66J44Q41j41
6263E82n32o49N65J006n93r45K98K13lN11l7m01k94K75j2j08M66q6k89J4L4Q5
6285A00M02j24p52m32J051N70q63j00j31J62M97L41p41o58P72M70k02m2j05m99
6305b84L4R48l65m61K56k97J64K93M10m73k84j23K53n2N72m85q67M10M41K02N5
6326C47j04n64l7O88N54q21l14K98j76K25J38j80p90O68M61k53q9K51p01j30J061
6347E32j70k95O5l96k89N32R48o79p50N7Q9K64M59O0j101Q4Q74L18m08k73l79
$$ y = [-299, -579, 459, 314, -95, -163, 562, 454, -290, 19, -144, 319, 585, 41, -751, 102, 621, 460, -450, -59, 10, 66, 445, 29, -596, -19, 895, 709, -613, -561, -301, 41, 698, 227, -538, -77, 616, 233, -157, -149, -44, 217, -10, 118, -135, -114, 683, -146, -550, 218, 328, -97, -200, -357, -298, 308, 756, -42, -528, -262, -118, 723, 582, 50, -599, -34, 972, 379, -566, -268, -55, -58, 453, 416, 15, -279, -4, -16, -124, 342, 256, -33, -19, 15, 100, 502, 378, -374, -806, 245, 815, -48, -148, -279, -117, 380, 721, -20, -678, 94, 564, 362, 320, 215, -284, -250, 698, 333, -128, 128, -169, -5, 288, 698, 225, -59, -182, 71, 19, 591, 106, -761, -351, 90, 292, 347, 243, -321, -358, 330, 884, 63, -251, 47, -129, 96, 234, 54, -736, -68, 393, 140, 51, 302, -399, -529, 532, 362, 67, 132, -264, -553, -21, 927, 248, -502, -445, -356, -92, 367, 427, -674, -590, 284, 602, 194, -79, -458]
6368d58J13N22K83q16J36RL56P2q0J5o72M06L13n77N29N41o60o83M04N29Ok09
6390G9m66l77R73Q46m22j099P5K7N88L64m12o71J0J025J1o20m4J7m86N76O02r52
6412c56L96M7k84k45N86J71m57K40l82J47K93Q41r67q91N04J012j01n46l56l86
6432g34O00J257n82p92k01M89L47k40O8l59J1R01l78p27L26K76l11q6J79J36K69
6453D49j70n30k83L68J212p60p99L41jR87J97r36n24p1J274o7q04j16m32O17O13
6474E65l01o12J62K59j43j5Q8n12M1N76m33j20O12q2l37n4K40K89K32k35o54j11
6496e45L75J062o29q48L45K86M30M68j067o73M17Q80m08j76K9k26J48L17Rn69
6516c75L17J8j84K20L66j94k48Pj75k9O57Mr59l28P14Q04o14J99n99l33N58N85
$$ y = [-458, -345, 177, 460, -356, -220, -211, 145, 217, 137, 152, -520, -114, 199, -378, 151, 692, 32, -651, -247, 282, 288, 79, -387, -764, 209, 1055, 633, -466, -391, -364, 224, 588, 176, -495, -485, 540, 551, -69, -113, -96, -582, -6, 596, -356, 40, 87, -197, -442, 144, 315, -142, 98, -284, -137, 156, 997, 30, -861, -357, 655, 554, 8, -348, -734, -134, 1123, 541, -251, -452, 37, 384, 144, 212, -147, -136, 765, 387, -340, -14, 262, -49, -135, 44, 180, 449, 279, -251, -534, -166, 1046, 286, -513, -172, -173, 814, 1011, 75, -449, -520, 754, 687, -117, -233, -665, -48, 565, 264, -348, -186, 73, -70, -85, 3, -509, -468, 108, -325, -445, 167, 85, -252, -306, -66, 223, 455, 220, -434, -545, -170, 892, 263, -585, -240, 46, 476, 944, -123, -796, -379, 501, 93, -83, -54, -280, -132, 185, 194, -375, -58, -40, -224, -4, 362, 168, -80, -73, -248, -277, 380, 384, -575, -903, -189, 615, 1, 200, -399, -732, -174, 411]
6538D11o54p04L93O17L37%n91p08P19M82k55k17N72m41l18J36O82o13l6K12j23
6559i9P0N68n58l29J43R2J94K95P5r42q2J112k17k09j19k57N5N23J78n26k92N81
6581B56l21l89N71r9j56J60K9p1l7K25k62n96J79O88j90j90m6k42M53M23K6q31
6603d20k16Q73Lj49J24q06L0P03n6l75N8K33k39M2L94m68L90L52m88k17K52M17
6625D37l04l64J59J32J52K55l70r08Q72L78m88l32K10l0K6P66o49m55J3O54L9
6646A93l89L33j77j91N47n26k90M63L15m34j06M21O0r2m0m16j82O11N15n28p95
6667g08J67R03J0m1n82p64R86O18n32n28J10L55L63r0j02r37N14Q75m57l46L80
6688A94N9Jk48m4k00L75R6l68k86O61L1j99K3k46m37R03M54q74n64N15P14k47
$$ y = [411, -243, -947, -554, 63, 400, 400, -191, -899, -180, 302, 47, -170, 402, -39, -357, -221, 461, -152, -188, 24, -99, -29, 539, -19, -348, -205, -113, 81, 376, 451, -491, -573, 539, 322, 113, -6, -263, -208, 315, 493, -33, -325, 256, -65, -454, 117, 18, -138, 22, 51, -20, -57, 168, -94, -690, -511, 177, -13, -203, -249, -491, -38, 385, 411, -420, -636, 237, 240, 91, 215, -591, -561, 142, 86, -289, -231, 2, -237, -195, 199, -269, 121, 473, -15, -232, 20, 437, 133, -231, -72, 60, 212, 467, 97, -811, 61, 439, -49, -381, -171, -201, -175, 591, -58, -513, -500, 154, 193, -196, 137, -40, -231, 316, -210, -500, -37, 278, -156, -262, 159, 219, 127, 87, -329, -511, 100, 615, 87, -708, -541, 362, 372, 331, -251, -1015, -29, 589, 57, -471, -361, -6, 357, 267, 165, -772, -258, 617, 160, -186, 194, 253, 254, 6, -38, -238, 137, 233, -135, -421, 240, 271, 72, 95, -151, -588, 315, 769, -105, -669, -154, 560, 313]
6710C13m2n59l79M78O74l58o03J1L98j91O03m03j47J43K75n10j12N78J48l97l65
6731d45L50J69J05J99p14k10O16L57n00m72L19rN19K44r19k47O80M32l1q13K54
6752a16k93Q44j19j15o68L81M70n97K81j7j90r4M00m52l1O10L49q01m71N70L57
6773B98l07k35m0l2O43P0p16j80K95J90J17M16r51m32J011M05n72k31Q8l24P6
6794d11K61J70l47J46M36o97M24J60m80K54k4L7j73N84nq39Q7N18J72l34J56j94
6816i9k57O27Qn1l83J39L70m68N26n05Q9n9K53l33k3M21l32l84J82O08o56L46
6838A9m3l56K97L40Q3n15j35O5L04J88j6n70P1M31O5o20L51p4J40k56M95l01k37
6861b74L40k13j38J64K86l37j11N99o69L32M01n92n04N71P21l23k71P2k18L15
$$ y = [313, 271, -288, -667, -189, 485, 127, -476, -465, -67, -258, 345, -58, -205, -62, 213, -297, -409, 169, 317, -80, -445, -95, 74, 179, 378, -336, -546, 70, 427, -73, -545, -226, -235, 284, 528, -391, -638, 42, 474, 443, -370, -116, -409, 435, 316, 201, -467, -86, 384, -213, 68, 51, -139, -233, 167, -285, -316, 294, 643, -158, -629, -59, 298, -9, -244, -284, -316, 327, 397, -319, -499, -204, -14, 103, 519, -432, -864, 147, 552, -20, -251, -163, -487, -411, -150, 20, -327, -181, 255, -442, -18, 142, -338, -84, -108, -71, -244, 340, 335, -504, -417, 101, 273, -61, 95, -99, -356, 271, 279, 228, -155, -16, 354, -114, 412, -93, -4, -63, 190, -143, -166, 255, -77, -461, -279, 329, -327, 19, -24, -380, -83, 257, 340, -175, -310, -245, 59, 247, 231, -339, -268, 163, 228, -392, -41, -115, 25, -231, 264, -37, -274, 66, -147, -285, -121, 165, -172, -283, 316, -353, -21, 380, -212, -716, -145, 576, 253, -18, 54, -164, 151]
6881A51M18m80k42p4L94J8K37n85j11q1O43l4p72Q44l43j16J43j61j6J26M46p48
6903c43n4M73J64l05m10M69j91L19L95r03k03N78Q08n29m81o5L13j98N45n27k89
6924d34L2R31n49m1M32j62p52P16m07J92J16J08j48l8J18L77k38j67l39p2P41
6945D16K85p47n38N73J58L58j87l63k92M25N62n39k91k76M86J40P4l53k29N64
6965B26L63k95l84P0L9k8Lj99L9L57J89p88m3O93K12k38l59j76j2J189P7j070
6987a35m18M62P11l66j06m50Q8M98M21r44j03L34j56K9J53R8j82M88n58r1J26
7008a01O17j83n77l39Q06j91J67Q8r31J07O91L40n17l15j2j3N62M05r08l71N36
7029a39L21j46K81o02l56N98o2j96K9L30o35L18j33O84j48n6m23k8L00M30k75
$$ y = [151, 569, 89, -153, -227, 167, 185, 422, -163, -274, -355, 288, 254, -518, 326, -17, -133, 10, -151, -167, -41, 405, -343, -397, 76, 240, -65, -475, -6, -197, 122, 517, -386, -589, -11, 797, 268, -213, -278, 35, -163, 382, -145, -434, -402, 529, -20, -61, 371, 209, -543, 173, -234, -42, 74, 182, 34, -4, 114, 491, 253, 86, -253, -325, 416, 701, -46, -584, -11, 147, 505, 318, -45, -337, 88, 650, 111, -180, -456, 30, 170, 244, -109, -338, 226, 589, 294, -90, -20, 19, -9, -6, -205, -166, 191, 380, -408, -451, 242, 454, 216, -143, -319, -331, 858, 935, -135, -553, -91, 620, 254, 148, -302, -214, 284, 705, -239, -342, -8, -164, -135, 18, 116, -66, 422, -136, -227, -101, 516, 333, -244, -583, 223, 32, 199, 287, -644, -537, 154, 494, -23, -338, -350, -363, 199, 604, -304, -675, -139, 182, 36, 317, -285, -641, -43, -105, -301, -272, 58, -577, -259, -392, 292, 144, 88, -335, -363, -63, 367, 92]
7050I2k11PK96j88K58m9n75l2N23R7k60k23N6j13L52o1j64L2j27L55l62L73N4
7073A30j49n2K71k94L34j25r3o35P31L68o3l53k23k66L49O08m40k91N0L93j70
7094H0l10K42o7j99N35k74j15J44q3o9J08K51l42K05j15P6k0q7L79n60j5J69j9
7117h6J90K28l45l42M49K41j91n96J93K10K23L06l19r1R8L75m28o2J09q4j84j65
7139b71J44J48J61K38n12j41N35R1k96m23K69j02N48q1o28k95N99M68l20m89N0
7160c07J68K93J69n31j73N00P5K9m88J94j42M27j78l48j41N29K1j50K41k61J32
7181E9L42m28k55k47Q81K0n50q4o3J35N74j96m66k78O94L27m53l23J17Q7J49L29
7203C71n84k64Q20n2l72J41R9n7k00P22r73K7O59l26j23j00J37M93n6n50l52M71
$$ y = [92, -119, -112, 184, -4, 254, 205, -370, -402, 121, 218, -42, -265, -209, -322, 30, -31, -195, -163, -290, 65, -297, 76, 130, -19, -71, 200, -94, 240, 115, 22, -613, 118, 486, 423, 70, -153, -419, -70, 538, 98, -193, -143, 250, 80, -230, 12, -55, -254, 281, 7, -108, 36, -47, -116, -8, 243, -99, 106, -9, 67, 47, -40, 339, -221, -236, -67, -86, 104, 332, -13, -355, 94, 335, 144, -452, -259, -49, 174, 480, 161, 70, 168, 543, 115, 53, 162, 78, -106, -271, -127, 21, 182, 420, -92, -233, 302, 393, 97, -326, -57, -159, 389, 308, -320, -615, -16, 452, 132, -357, -307, -139, 154, 323, -208, -381, 119, 194, 223, -265, -71, -213, 214, 36, -312, -453, 76, 97, -53, 188, -73, 59, 401, -27, -282, -529, 352, 372, -178, -262, -325, -190, 384, 188, -278, -556, 138, 465, 12, -311, -194, -107, 42, 371, -213, -477, 343, 291, -81, 60, 159, 102, -98, 624, -349, -322, 337, 11, -112, -212, -75, 418, 362, -188, -540, -69]
7225f9N83j64l55n04P05Q7q3j34j01n4P5M80n10m35M67j44J32N36l65j91J19L51
7247D26o65J20L82j29m35L34p9m6N89m01l49j97P10l43oL2j72L29K46k63k57n6
7269b30M03J11k46j56r8l3M08K53l50l97M25j26N1N4j07rJ45k44l41M38N94m73
7291G2m19L04p0M96P1j88q58L22K25J90m52P3j33J95K33J10n20J54K88k75j46
7312c28K29J04k37J14J60o9Q0R8m52n7N5O48m39K0j59j60N13J61l38k30L15K38
7334B66L15o00Q6j91N4M15m38o6K36J84n86J69K17L28m48J21k39K7N5K74l38J01
7356e8J69j77J73N2j76n07O59K52n56o3o1M10l9J44m60k20P11j51J36j50l00K50
7378C8K30k31L1n31P97o6n18PN10k34l64M57k33K92m1M56q33k19N88n7r0j15l0
$$ y = [-69, 514, 350, -5, -509, 196, 283, 200, 66, -35, -89, -14, 466, -44, -479, -12, -156, -24, 512, 147, -44, 75, 426, -239, -119, 263, 134, -301, 33, -46, -92, 497, 96, -253, -450, 260, -83, -89, -57, -229, 100, 346, 83, -174, -230, 173, 284, 38, -118, -216, -249, 159, 412, 62, -335, 90, -36, 15, 69, -38, -47, 98, -146, -487, -49, 545, 72, -347, -43, -113, 383, 454, 266, -592, -270, -45, 145, -307, -234, -367, -172, 61, 171, -349, -195, 93, -182, -328, -99, 5, -232, -118, 42, -27, 53, 151, -301, -358, -303, 345, -94, -74, -233, -393, 120, 281, -57, -287, 28, 266, 581, -19, 67, -124, -70, 345, -93, -159, 77, 261, -325, -156, 61, 389, -59, 62, -177, -150, -95, 179, -159, -58, 111, -66, 107, 159, -17, -524, 135, 387, -169, -232, -293, 117, 78, 222, -238, -458, 253, 102, 238, 88, -212, 38, 268, 37, 68, -463, 334, 268, -250, -243, 267, 33, -331, 126, -107, 185, 144, 600, -233, -452, 136, 79, -11, -126, -156]
7401a56j63O23j49m73r4J42K62M8K29m47L9P4J29m66P3L09M0k90K35o6j38K42
7423CK7l09M30M36l99l19oJ65r8K86Q8n94j42M20L11j32j10j37k35M41M15p41
7445b00j4K30j26R4J50j69j64M96L7k83r1K9Q3k45K6K10m3J95j40m47j07J092
7467F13m87l77n0K24K63J06k54o94L26O67J42l88k93J40pR0M66p23p8M67j65L
7489iP8%j33j31L27j57j73N61m90k90L07J70M34k43l53l25L92M82q6p30P3J18
7511a78K60L97k24o60N6N85r5P4n05N53m82J13J65j52J34m2k57m5N33n0q4n19
7533d23J18M87K08J54m78p91P36K89K4n63j44J3M05Q0J14m24j24M43j13j64K59
7554A06M5j0j83k03M08L2Q4m39k90P96O5j41k11l55k2M25O63q20j75P0N6M7J58
$$ y = [-156, -319, 304, 155, -318, -412, -270, -8, 40, 269, -178, -139, -65, 64, -402, -329, -20, 20, -270, -35, -101, -239, 3, 30, -279, 151, 587, 188, -131, -137, 28, -70, 216, 304, -290, -432, -12, 299, 167, 57, -80, -315, 126, 541, -200, -214, 16, -110, -16, 134, -35, -199, 297, 334, 51, -40, -11, 72, -173, -147, 63, 20, 215, 75, -372, -479, 613, 126, -251, -301, -77, 186, 292, 38, -656, -330, 337, 479, 91, -202, -62, -69, 21, 487, -236, -314, 153, -12, -9, 69, 69, -64, -195, 132, -25, -198, 363, -127, -417, -110, 60, 494, 251, -102, -427, -35, 447, 361, -369, -296, -178, 82, 479, 255, -405, -349, 236, 141, 215, -290, 263, -219, -106, 59, -93, 41, -1, -258, -303, 230, 180, 96, -423, -305, 182, 390, 544, 66, -725, 11, 300, 324, -239, -383, -370, 35, 115, 229, -195, -319, 124, 11, -153, 106, 151, 141, -42, -245, 163, 195, 279, -160, -450, 346, 411, 270, 59, -296, -318, 107, 770, -50, -225, -155, -99, -52, 106]
7577A06K2n20J68L80J19k15j01j78LM21N3n8j55k9k53J01L03j3l14J90o0j1K11
7600A70J93o33O2mO64m36J32l41k18O45L5l36l64M93j65J82M5J03m04L31J05l78
7622a19r7M53l35n6J42J35j91J86K2m99OQ04j21k71l56M21l61L72K97o53j75M62
7644F6K84k17k51R8M6j51N79l46l06J81K22j93k32J39R2R2J10m00j13K92P3m14
7666c49L05J25J64k04n1J61l62O55j64m77j13L48L43m22k46J11j80N37M3m74N2
7687a98K15M6L13k23k07p0M25J79l77j64M99m76L6K7m6J60J78k55k72L37m37L37
7709B7l06R7K9J52K47l2l68L1J79L52l94K3R3L7M8k42q3J25R7Jq2J72j00m29M72
7734A46J4m91N94o7K7n63J61M02l14M50l24j29K62J46q9k56l4P9J33L5q2O8l66
$$ y = [106, 128, -392, -224, 156, 275, 60, -41, -219, -216, 205, 258, 200, 45, 16, -237, -136, 167, 154, -160, 30, -30, -41, 170, 363, -270, -208, -212, 452, 16, 148, -193, -411, 234, 269, -67, -431, 62, -103, 79, 124, 227, -177, 154, 259, -119, -216, 237, -98, -154, -12, 123, -68, 118, 140, -359, -353, 451, 330, 59, -297, 124, -237, 135, 432, -221, -396, 66, 350, 133, -118, -20, 26, -125, 454, 108, -198, -17, 205, 12, -220, -81, 11, 103, 213, -187, -300, -8, 65, -349, -44, 81, 245, 41, -10, 151, -211, 444, 280, -197, -310, 38, 381, -41, -287, -176, -356, 181, 224, -250, -198, 17, 63, 376, 153, -54, -124, 301, 480, 103, -61, 438, -38, -2, 25, -21, 139, 317, 62, -210, 127, -310, 27, -279, -182, -153, -1, 246, 214, -154, -123, 56, 408, 14, 37, 130, 167, 215, -27, -110, 15, 112, 113, 31, 203, 103, -326, 146, 160, -331, 263, 196, 223, -340, -179, 223, -91, 359, 35, -94, 168, 314, 225, -31, -65, 14, 147, 182, 100, 168, -198]
7757a98M28N8l97j17J5J90J33q6n4m1J35j19K9J14K2n9l8k63N0K70K48n66K27
7780a9O3K72o03M27l81k12L02K26j94j47j03K45K36m13L38k37J49R6J50l51L47
7801A91m23M5p6L48L5j65J32j78k24L96K40m39K5j41O2L83K9k40j75M1J19J37
7823A22k5j42m70L48L24j23j75R8J79j03MJ69Ll86J31k00K61K47k54k29p6L07
7845A0K51j10j49l24o0O53k67R0m54J62K92J01J58l82j97M19m9j07j08J42k23
7866a52K56L92j70k34n6Ml48j5M37k00k05J27J6r0O54m63l40R8N84K01l16N1m83
7889b52j33L36K09l27N6O5l1K33j81P7R3N5r1k14J32M34l23m83J5M94m00K57j4
7912Gm78N12J02K0n65M31l03K93J90j6n81Q6K69J61p1j06j95O5K42O7k86K04l51
$$ y = [-198, 230, 288, -109, -226, -211, -21, 112, 26, -28, -69, 66, -53, -24, 90, 112, 53, 15, -248, -198, 72, 320, -246, -19, 44, 316, -287, 140, -241, -453, -151, 75, -119, -266, -369, -124, 112, -301, 37, -200, -51, 45, 195, -156, 191, -232, -187, -263, 85, 120, -45, 87, -91, -315, 81, 321, -118, -93, -234, -172, 211, 240, 0, -175, -134, -15, 122, 97, -45, -515, -167, 157, 34, -141, -43, 136, 33, 37, 206, 209, -177, -46, -246, 15, 262, 8, -221, -297, 10, 261, 151, 2, -322, -382, 271, 4, 94, -360, -198, 94, 195, 353, -29, -226, 193, 144, 37, -71, 71, -152, 104, 496, 326, 92, 36, 40, -308, -323, 114, -86, -291, -164, -148, -238, 416, -47, -387, -289, 295, 496, 180, 231, -252, -385, -49, 160, -167, -111, -46, -77, 156, -25, 52, 145, 200, 109, -105, 27, 461, 138, -345, -330, 164, -236, 21, 7, -471, 41, 143, 163, -402, 29, -274, 19, 209, 193, -388, -302, -33, 128, 57, -49, -244, -179, 63, 130, -156, 48, -303]
7935c03K02j23L55K41n14K00K8j76j16L06r6m60L64J8K07R0j17m12L86N50m05
7956B25m70j36J83N7n2R7Jj20L22Q5j96k02J11l6J12K16j44n33P83l45k13L03
7978D8J46k34ql48M53o7P7Q9l61K89J39j22j42J04l71M77M19k44o42K69Lj37J22
8001d1L75o01L00J36O6p1K1j33k42p7M64n7O0j39m59O5K29L41n33J90Q5J63j59
8024a7L82m95j14K50L35k20j37J58l01o0N46l18k39l7K69l93N73j29K48l12j5
8045b6j01j92L41j98L15k89L58n7k39L38m66K20O3J94l75j65K36K12J28l60L4
8066b9Q5pO6j35o0K23j05j20J05k3q6K18j06q7j2L77k34j32m02M54K03n16J96
8089a27k02K48M40n01q1M8j49K40K35q8k42K85k46K93n3QM3m22J24M06k87M5J
$$ y = [-303, -101, -224, 131, 372, -142, 58, 86, -90, -206, 100, 4, -456, -92, -74, 133, 223, 106, -306, 80, 630, 225, -245, -381, -198, -141, -193, -96, -95, -215, 107, 192, -4, -206, -95, -131, -19, 197, 53, -480, 303, -42, -255, 48, 194, -40, -48, -396, 57, -10, 67, 156, -205, 84, 223, 101, -41, 63, -308, 169, 588, 344, -298, -29, -26, -163, -41, 334, -267, 33, 169, 235, 164, 185, 52, -190, -267, 197, 140, 200, 61, -398, -333, -104, 237, -296, -106, -21, 142, -17, 365, -130, -244, 6, 341, 121, -16, 142, -159, -219, 327, 9, -230, -267, 2, -391, 182, 53, 301, -11, -26, -127, -319, 22, -176, 139, -150, 208, 151, -88, 250, -216, 4, 67, 261, -114, -279, -43, 169, 297, -63, -29, 56, 49, 115, -20, -80, 143, 38, -82, 23, 0, -86, 132, 26, -61, -73, 304, 70, -62, -464, -10, 193, -323, -127, -329, -81, 359, -142, -223, -175, -324, -84, 151, 63, -179, 106, -140, 153, 100, 108, 151, -271, -147, 259, -28, 17, 18]
8112A8J78l17L3M62k46n36N66m62L79K44j95p7k46K03L34m1k66k71k53O18P1j22
8134G4o4P6r5L24l99L72j56J01j87J78j82N45n47j14R1k11Q5L80O2p37J75M07
8156A78J74j30l54J48o4M52l59l51J46l1N50l97k4j40j35N77R3o08K63k05J13
8177a04J12K50q8m06L26J26m28K8K03k7k33L87k06K78
$$ y = [18, 196, -121, -88, 374, 128, -408, 158, -304, 75, 319, 124, 47, -199, 4, 338, 297, 31, -240, -493, 125, 196, 74, 10, 86, -9, 315, -84, 288, 132, 233, 46, 224, 42, 587, 40, -74, 17, -194, -109, 271, 333, -404, -229, 178, 352, 222, -132, 16, -48, 404, 45, -306, -160, -191, 359, -38, -62, -202, -337, 240, 333, -275, -12, -217, -104, 8, 258, 170, -236, 90, 216, -212, -184, 19, -8, -241, 146, -60, 218]
8191B18
$$ Imaginary data points
##PAGE= N=2
##DATA TABLE= (X++(I..I)), XYDATA
0@%%%jRqQj6J8k6M0m8N6p2Q8j04J22j46J76k09K42k81L25l74M33m97N65o42P31
29C89q26R31j047J172j313J469j636J819k023K246k490K759l055L380l744M150
45B181m599N107n687O348p113Q013r088J0398j2038J4161j7029K1147k7599L9232
59B3434o6770K47037K47062m11651j44465J27292K10283J3402j08251j57045K1113
70A441J34613O7046p2410n5587l8798q061L4758K8743k7499L2640L0646j04264
82B3268r6915J25563J38808p9737j57164k5019Q2906J18147N2231j05487j48321
93g1720J1045J21993P8098j4925j04095j03531P3987J79724O519j52747n9280
104c4932N4177M4327L7709J4847o6799n1001M5941L6943j6069P915N460m5299
$$ y = [0, 0, 0, 0, -1, 8, 0, 8, -8, 10, -16, 24, -24, 32, -40, 48, -56, 66, -80, 96, -113, 129, -152, 173, -201, 232, -265, 300, -342, 389, -437, 494, -553, 619, -694, 775, -861, 958, -1065, 1181, -1309, 1450, -1605, 1775, -1969, 2181, -2418, 2689, -2998, 3350, -3763, 4250, -4838, 5560, -6478, 7683, -9346, 11801, -15798, 23434, -43336, 203701, 450763, 39112, -105353, 21939, 232222, 245624, 137373, -19672, 1441, 136054, 203100, 130690, 75103, 36305, 28244, 63002, 91745, 64246, 96886, 127532, 23268, -73647, 51916, 190724, 110987, -46177, -71196, 11710, 129857, 182088, 76601, -71720, -60675, 61318, 139416, 124491, 20396, -83135, -9148, 170576, 177095, 24348, -34932, 19245, 63572, 101281, 116128, 49329, -1672, 44269, 81212, 65143, 73058, 78518, 33219]
116C3219k6006K1484K8751M6602R659j12816q8015J08040J30963n8947j28001
127c5067l1316M4361Q2064O2322p0074j34484P46J09115M5758m0043o1917l9494
139f8029L9028P5940j3070n6669J9558J6007n6520K021Q3142J0099n9409j2078
151a9980J2204Q841M8552K2418p3424n5641N1394P3976K8213k3130p3939l2366
163c2882Q1530O5172n3925n0159K2473J0663Q266N3232K119p7789k1908N0633
175E7425J9499q088m87k3218j4338L5659J6592k8387o532n423l8121J2457O4901
188H1939r26n0106m994R17k0347K8315L2836n2166n1081M3321N3994m644k8878
201B8180l7705j8028M5247L7261m2296k9804L4020R527k0467J8672Q716l4106
$$ y = [33219, 7213, 28697, 57448, 104050, 113709, 893, -87122, 20918, 151881, 92934, -35067, -66383, -22022, 60042, 122364, 52290, -82194, -81448, 27667, 73425, 33382, -28535, -68029, -29001, 46939, 33869, -22800, -3242, 12765, -43755, -41734, 41408, 51507, -7902, -19980, -7776, 1065, 49617, 72035, -1389, -57030, -5636, 68340, 96553, 73423, -516, -32882, 48648, 113820, 59895, 9736, 32209, 42872, 51138, 104370, 106489, 28700, 6792, 57425, 76924, 68836, 68349, 45131, 30793, 66452, 83044, 54657, 48125, 42702, 4581, 17038, 81939, 81013, 30907, 25913, 26830, 6483, 34798, 67634, 15468, -35613, 7708, 61702, 57058, 28180, -9525, -27553, 17694, 54955, 12659, -17145, 16875, 26402, 5935, 24607, 33323, -783]
213g83j271K2562j9705L4N5246j263o8384r253N4054K2291k0212m0070k7428M6127
227A1945P4296k5768q2003P98M7647O408l200o537m3658n549O5545J6818n9997
240c255j8645K9605K241q893K831j2348k614J9612j2720k1160K9227J4884m5477
253b6712j6951L0678Q58m041L0514j3283n8737J0611O3400M610m4342l0059k040
266e5494M2941N7671k3504p6844m007N8410K3974q788k6557m4944J0742Q2552
278C6152J9774p4066k7723M5008J5214j6755j241J073O731J7500j6623k9366L3398
291I076M0973l7950n1113J1070L6435L3897J5438n7646p0793M6659R8954j3668
303F1332q9237l1232L4918N5289L5646l7673p2812L493N9047J2043k3810j0918
$$ y = [-783, -2054, 20508, 803, 837, 56083, 54820, -13564, -22817, 31237, 53528, 33316, -6754, -34182, 11945, 86241, 60473, -21530, -20732, 26915, 33323, 30123, 23586, -20072, -25621, 39924, 56742, -3255, -21900, 7705, 9946, 1053, 3884, -8464, -11078, 8534, -4186, -25346, 3881, 18765, -26712, -43663, -12985, -12127, -16168, 14346, 1063, -57674, -47063, 16337, 20947, -23395, -53454, -55494, -12553, 45118, 21614, -55230, -59237, -827, 23147, 14359, -12198, -57142, -46400, 36152, 55926, -18140, -45863, -855, 14359, -2396, -3637, -2564, 4167, 21667, 5044, -24322, 9076, 50049, 12099, -39014, -27944, 8491, 42388, 57826, 180, -70613, -23954, 75000, 61332, -27905, -59137, -24219, 31070, 66716, 29043, -43769, -40276, 18771, 30814, 7004, -3914]
315c914j4161K434M0388N115m1023J202K7017k7794k6748M1197L6253j6712k4764
328a510j9434n299M3493L8258m4135n9955J2166M8958L6108O800n5861o7346L6880
341c0877R0616k783p1895k4779K4494L4224L1875j7025o0978r601M7745J3563
353B4579j8899Q73K3p461J0072l017j9171K0846K8267m2408m4045M2555N5692
366D7906j0954m0235l0615k049N1904M4712m7088o8722J6246N6777K0692j2406
378B6168l7345l5765K7395N3711j3288m1894P921J6331j0955O531J4817j6002
390b375j1858Q503j0323l015L6095Q586m1411j5337K2455J3615Q988l067m1608
403c0752k0642N0739L9728k7152l1339n256J080K5008K8277k9334m4188J9395
$$ y = [-3914, -18075, -15641, 24747, 29862, -11161, -9959, 17058, -10736, -37484, 3713, 39966, 23254, -1510, -20944, -26243, 17250, 55508, 11373, -48582, -36416, 12542, 48650, 55450, -411, -67757, -30877, 59739, 56956, -14939, -39718, -15224, 19000, 50875, 33850, -27128, -36729, 11016, 24579, 5680, 6553, 6576, -885, 9187, 6170, -13001, 7845, 36112, -6296, -50341, -7786, 47906, 36952, -3283, -33898, -35947, 15957, 60669, 13581, -55141, -38895, 17882, 38574, 26168, -11177, -46942, -19547, 34164, 20876, -21018, -13097, 3234, -7721, -1190, 13627, -2375, -14233, -5730, -16053, -19068, 17027, 25613, -15798, -31135, -8680, 4935, 13923, 10856, -30752, -51394, -655, 39073, 11921, -19418, -24674, -23594, 1414, 29691, 357, -43831, -24436]
415b4436L9147L03r808r215k1622M794L1792k119k1025J2199P057k1943N376K8255
429A8755o469k1451l751o115R219M1283M958n2987j9097L8757K2637r440j8520
442b221k6668J743M9577J9946m3503k5497J9627Q357k100Q027r696j3998J6938
455E32R218k0296M038K0653j9860k8386J7552K3729J208k083j6649k3388K2313
468a1419L9441j9374m3844K157K5563J6478J2406j7060l9404O943M4133N60k8763
481a2183k062N435J170J8984O391k7708p682K1021k262j1268J6132P747j7170
494c455j262O184o131J2368J7301k9089l2472K4637L6082j176j6754k2070j7776
507c3613K8496M5599k0390n6952l565L6885K3524K004k7168l8153J2468M8533
$$ y = [-24436, 14711, 15014, 5206, -4009, -25631, -20837, 10955, 8836, -12189, 10, 7067, -14876, -9500, 18755, 12286, -9165, -12916, -19031, -9812, 31471, 36429, -16558, -35655, 3102, 25739, 16299, -2221, -28889, -27146, 22431, 42377, -1126, -26623, -6996, 1361, -739, 7288, -2408, -16406, 532, 9750, -10546, -6508, 14145, -5715, -34101, -16549, 7180, 8388, 6305, -10344, -33732, -11419, 28022, 8648, -35196, -33039, -7476, 9002, 21408, 4348, -35056, -28113, 16020, 16580, -12183, -14245, -8810, -7640, 11344, 17735, -9973, -17655, 3366, 1104, -10164, 5968, 13715, -3455, -4717, 1467, -4664, 7704, 25005, -4084, -36556, -11919, 24163, 22987, 6233, -15837, -33613, -5117, 40482, 20092, -36860, -40425, -3540, 19984, 21988, -5180, -43333, -30865, 17668]
519A7668L42l7086o761J2799L040R005K302j9659n15K0065j3484k3227K3562K9619
533A7670j5269k5378l382J2528K8609J2503m4000m0432L5019N4542j063l3379
545b032k7029n376L7543M3104k6168n7859M456M6123J6027j0138j8180k1180P059
558a3650L0845j455k3719N050J1511j1591j141J2748m187m445L026k1668j6430
571c5106L8097L5632k9729m2993j084K5257K8969N507m4906m2136L3008N6915
583B7431j045l9888k8729j953L4692L7397k4865m9281J1042M0552k41j6668J029
596a0527l110m884O466j840k335K2326J0157l2480j9531K5747K6151J056j9608
609b412l4615k599N7061L5317m6996n1440J4067L8778J7234m905l1979k6908K4263
$$ y = [17668, 18010, -19076, -25837, -13038, -9998, -993, 1309, -18350, -18865, 1200, -12284, -35511, -11949, 17670, 2401, -22977, -26359, -13831, 14778, 27281, -16719, -57151, -22132, 32410, 31347, -2032, -29061, -34437, 3106, 46210, 20042, -37817, -33361, 12762, 28789, 18651, 471, -20709, -13650, 17195, 15740, -7979, -2929, 8582, -3009, -4150, 8598, 4411, -34, 2992, -18676, -35106, 2991, 38623, 8894, -34099, -35183, -9926, 19043, 24550, -20356, -62492, -29484, 27431, 26386, -13502, -42231, -44184, -9492, 27905, 3040, -46241, -35199, 5353, 5112, -11556, -10527, -13637, -18521, -12055, -13895, -16230, 6096, 16253, -16227, -35758, -10011, 16140, 17196, -2412, -37027, -39626, 17435, 52752, 5756, -45684, -31617, 7161, 24395, 19490, -12489, -39397, -15134]
622a5134L9574m850k7158j1835l021J0636K1873n369k3260N127J1576j5555k008
635a9404K6517k133l1304o712J4347J1843J3693l177l4921j3970L1914K6001p912
648D782k1467k2716O19M2739K4980l7367l4513J8539K3050J105K084p630j9230
661b5025P601K5717m71j1839J713n024r396J1740J3657j783r96o659j8779R872
675i672L6986m437m0785p487K3150J2879O010m393k8065j1941K8518J9576j5886
688D453j7530m495L433J7756R727k0483j3536J2034j552j1135J6704J3760k1903
701a2767j5133J4873Q817j719M124j1300k1397J0862K8001L029j5261j4842p409
714c0122J8477K8937j2341l5216M657K6670Q22m232M477j2648j1764J8463J4140
$$ y = [-15134, 24440, 19590, -7568, -19403, -22424, -11788, 10085, 4716, -18544, -13417, -1841, -17396, -19404, 7113, 4980, -26324, -33036, -18689, -6846, 6847, 3670, -31251, -45221, -13307, 12694, 4782, -16685, -39401, -38782, 3957, 28937, -8430, -42943, -24404, -1354, -249, 1835, -5795, -25025, -17424, 8293, 7822, -4017, -2304, -7328, -16724, -4984, 8673, 6890, 5894, -765, -19544, -9672, 27314, 22877, -17908, -25395, -2245, 10634, 16644, 12251, -15814, -27755, 763, 20339, 4453, -13077, -17572, -14139, 3617, 13344, -7139, -20675, -8641, -10193, -21328, -4624, 9136, -12767, -27900, -13027, -4210, -5929, -1805, -13105, -34502, -23640, 4361, 7390, -7871, -22713, -30122, -11645, 17292, 4951, -30265, -25608, 1062, 1884, -2348, 2129, -10519, -22283, -3820, 10320]
727A0320j3133n889P226j964j53P263k638k580L745j0829j1279K3240K1184k3704
741H09k3689J2343J3207L184M363j3934k5559J1462L4315N50k6800j4524N104
754a9169J8039J5462j6609k7323J1674K5144o960j2705O326r04p975Q535L157
767c308j2001P802J6991j3431j9058J2331K0179p04j2599j6808n42L0377J9378
780B8607k7609k5409J4148J9428M417k66j5146k1177J7620L6705p929l3528l782
793a3921J7393R397N1j0595j1084J1135J5553j1570j1719J0772L277r842K329
806A176J81q931J2116J7381k1551k6128J8609K8558p238k3896j1480Q511K6145
819A3453R711k8835k3111J8578K1065j917p784j2093j0899J9881K7158j7909l1401
$$ y = [10320, -2813, -8702, -1476, -3440, -3593, 3670, 1032, -1548, 2197, -8632, -19911, 3329, 24513, 809, -22880, -10537, 2670, 5854, 10217, -3717, -29276, -17814, 16501, 17051, -9749, -24273, -19169, -1130, 14332, -2277, -29600, -17926, 7218, 258, -12447, -6121, -7025, -15000, -6465, -3308, -15309, -7507, 9484, -3947, -23005, -10674, 9505, 8801, -3798, -20606, -21148, 9229, 28607, 998, -24411, -10263, 9165, 13582, 13316, -1830, -23007, -5387, 31318, 23389, -10139, -13921, 3472, 12869, 12920, 2325, -8759, 2376, 17929, 6359, -5360, 5412, 8689, -1153, 1176, 1357, -7574, 4542, 21923, 372, -25756, -7147, 21411, 14173, -9723, -21203, -12692, 13453, 23164, -5671, -28782, -10204, 10861, 8944, 1160, -10933, -21832, -1951, 25207, 7298, -24103]
832b4103J0411K4590l266j1504k704J308Q857O600j2579q087J5503P420j2736
845b90m471K927j90J1109R246k2280j7561K5996K3478j9068k2373L200J2915J2652
859A5290K300k0661j5111J6857J7495o770j2071n438j523J5346J3899j9066j9858
872a9311J7652J6452j6220j0389J1711L686m290J235m157l718J1803M496j5143
885f193o462J0228O709M913k133k0805o675L0238J4819k7923j8157J6834J4574
898I967M64k613j2110j0118J4276J4930q662j0975J062K255P763O857j3199r543
912i646J5421O671j9171j133K1613j173j8696r82Q277L274M827l581j6461Q6J9261
927H587N790j0201r402p293M959K2207J812k8254o075K2754N904j1479O6M15p324
$$ y = [-24103, -13692, 10898, 7632, -3872, -6576, -5268, 3589, 10189, -2390, -10477, 5026, 12446, -290, -4761, -1834, -2024, 9085, 18331, -3949, -21510, 4486, 27964, 8896, -13477, -10277, 2638, 15290, 17590, -3071, -18182, -1325, 16170, 9400, -2671, -8109, -9632, 5714, 19613, 547, -19311, -1659, 14793, -1427, -11816, -105, 3581, -709, 526, -3631, -7349, 4454, 8950, -6193, -12655, -2427, 4282, 9195, 7062, -13743, -20418, 9820, 24639, -3284, -21441, -4607, 9967, 10431, 7818, -4292, -14410, -134, 14796, 6134, -4841, -3779, -1524, 6239, 13096, -103, -9646, 5775, 12446, -6725, -7858, 13755, 12582, -6114, -7096, 1181, 4455, 9282, 5701, -10760, -10674, 8587, 14377, 4176, -5226, -12519, -7560, 14647, 16459, -11795, -17870, 4884, 10788, -691, -625, -210, -7534]
942g534M988R430o666m916O131k277n822O693M090l061P22m571j0153J1579K0839
957A9472j2450k4743N762J8279J881k492n554j4205L351K2659L512j8675p001
970a0204N525O218P243l001j4807K491J4182n465j0255J2493P570j6051p044J0822
984b83M131O78L016j1557j2653J3835J9015n568j6037r243L479K0032J4068k1547
998A366k4689J3229K1531l654q364j972p778J861J7580J620j6608j908P676j004
1012a114p11L189k724k75K592r155l506J9418P105k2724j2037J4887J1680J734
1026H359k838j5829j2356J9156K3185j0424k2749l974J0617J5940O916j8111j8170
1039b0278J2111J8166n047p691J664m780j125J1820Q16j0636L934P213j0813n460
$$ y = [-7534, -2546, 6884, 218, -4698, 1433, -844, -6666, 27, 4117, 1056, 1778, -2793, -12946, -1367, 19472, 7022, -17721, -11959, 6320, 8201, 5709, 155, -14050, -10699, 11960, 15472, -3203, -10204, -4679, 1539, 8782, 5781, -9026, -6535, 7647, 2182, -8073, 4420, 11990, -4061, -11105, -283, 3848, 4526, 7542, -4015, -16668, -2833, 16182, 10614, -5423, -14666, -11187, 8845, 22913, 1366, -23323, -10094, 11437, 7783, -581, -2553, -10331, -8470, 9110, 10730, -5878, -7786, -110, -1114, -1825, 1364, -1360, -1635, 957, -8198, -11704, 7714, 14819, -7905, -19942, -5055, 6625, 8359, 5521, -10308, -22664, -3508, 19677, 9253, -13496, -17470, -6853, 9087, 16003, -2108, -20278, -8167, 9999, 4952, -2739, -1075, -5855, -6980, 4840, 5656, -4980, -1046, 6167, -4646, -10106]
1053a0106J4006P634p736r151o962M840K1639N074k5412j4484J5851J6283K113
1066A3589n815j8075j1554K2961K3758j4654k5216J474J3775Q320K130j1032j1317
1079a1656P801J1527o519l548P115m124p965O035M098k841O388K016j7690n922
1093a5285K2839J2604j5136j5920j795J0743J9170K000k5495j3524J8036J6134
1105A4371o68p509j3327p298J8514J8452j3838j9066O416J0023k001J085N94n788
1119d0P91L566o243J708J2481l042j6989j395J0661O240M532o380k1249j331K8463
1134A1773J1266k1978j6771L885J1641J3285j1k1413j1019J6478J2668n477n282
1147i55l579n218O710J0244o433o462O826k161j0970P657J5095m771j1871l171
$$ y = [-10106, 3900, 11534, 3798, -5353, -12315, -7475, 14164, 19238, -6174, -20658, -4807, 11476, 13589, 7774, -10301, -21855, 1106, 24864, 10210, -15006, -13532, 243, 8563, 10693, -339, -11656, -3855, 7672, 1153, -2395, 4720, 596, -7369, -1334, 2764, -77, 6311, 8327, -9363, -15285, 7554, 20158, 5022, -10898, -12693, -1950, 17220, 19220, -6275, -19799, -1763, 14371, 13703, 6194, -7133, -14431, 4083, 22535, 8697, -10369, -3953, 6070, 4069, 5154, 5748, -40, 751, 4317, -1926, -218, 12263, 9221, -7768, -9163, 1498, 7738, 12270, 5890, -15359, -16690, 11773, 23039, 1061, -15710, -11825, -184, 13101, 13090, -8323, -19342, -2864, 9804, 4327, -955, -4534, -9752, -3042, 7202, 769, -5693, 1133, -1028, -11998, -4341, 10754, 5983, -5888, -9059]
1161i059J107R408J4191q017k2950m44J8903R252k577j0385j5596L640K5164O146
1175A8783k1668r711Q372O046M001L191j0220q782P999N951m134K651L130r243
1189c634n364Q400N341j11P18j0897j2395J3812K1607p697j9655l674P185J1318
1203D954R553j0388k1171K913K0669M359q295n965n498J583J3418K809j2730k43
1217d032P731m627l183J0112L028q963l022p39r9J2624Q541j6625j4922J0718
1231c458J5230K099n952j3131q748J6531J9764r944k0029O37Q949N399M379n795
1245E931j3334L671J3103k878o944M111N18p684J826M673q22L160J408j2765n093
1260a1119J6780R115j2472j0201j268M906J4085N752j8870j5026J3466J6498k394
$$ y = [-9059, -7952, 1456, 15647, 7630, -15320, -15764, 3139, 12391, 9814, -571, -16167, -12527, 12637, 18783, -2885, -12596, -4224, 1822, 5823, 9014, -1206, -9988, -1989, 3962, -172, 2479, 5609, -3634, -8998, -598, 4743, 4632, 5350, -5547, -17942, -4130, 17477, 9780, -9875, -13549, -6364, 4954, 14507, 4119, -17052, -14139, 6530, 10889, 2594, -3371, -8869, -7286, 6132, 8941, -3789, -4032, 3699, -928, -4111, 6001, 9029, 66, -2956, -3695, -3794, 8830, 17371, 746, -14176, -3458, 11772, 13871, 7919, -5212, -13960, 2571, 22335, 12391, -7638, -7001, 1948, 7347, 11726, 5931, -7403, -3732, 9371, 6493, -451, 3660, 4178, -3506, -1680, 2993, 2171, 5331, 6739, -6026, -11119, 5661, 14776, 2304, -7897, -9165, -4259, 9826, 15578, -3292, -18318, -4852, 11646, 9252]
1273I252q764p923l698J2832J3670j0545j5817N135R942j500j203r46m376L671
1287b70O381o839n747J1437M034j2710m888P707M943K857j538j3701m091J8384
1301E959R583j5267j1945M467P652P774L81j5454q552J5632J0728j0672p851L160
1315d405J087L804M788p439p503Q880M949r456j894O835j42j687J425m286j454
1330f498J0665J125j4424j989J1615L390k168j805p721j154J4748N834j5818q588
1344a2788J0109Q415P59k467r818m097J3526P270j1104o603O491K535R56L240
1358F424n936o149Q064M897j0286j836J1006K03p585n40J232K365N779l545j3465
1373i372K030J5949J708r955m430j901K290J2677J250j7397n524J4795P131n552
$$ y = [9252, 488, -7435, -11133, 1699, 15369, 4824, -10993, -5858, 4084, 2584, 1381, 435, -3941, -270, 6111, -728, -6475, 4962, 8996, -3714, -8602, -895, 4048, 6905, 5367, -8334, -12425, 5959, 15542, 275, -11670, -7203, 449, 8223, 8604, -6850, -15402, 230, 10958, 286, -7565, -4405, -3318, 486, 5274, -2165, -9668, -788, 4161, -5295, -7189, -354, -496, -2183, -758, -5044, -6498, 4167, 5292, -9132, -11121, 494, 3884, 1716, -89, -7810, -8964, 5784, 11618, -4200, -12788, -2679, 5736, 6495, 4028, -5790, -9887, 3639, 10909, -195, -6798, -307, 2228, 3184, 6424, 488, -5661, 2403, 7300, -2986, -4822, 6184, 6387, -1198, -1738, -506, 1859, 7638, 4093, -9372, -7342, 8607, 10315, 360, -4070, -5971, -3681, 8996, 10246, -7151, -12675, 2120, 9251, 3699]
1387C699m208m095j823Q007N053q370k795N890j941k681O580O55p161Q59K287
1402d4m857L680J0756o063j3822L926J0222J582j263o247r346N164J6151k53j3048
$$ y = [3699, -509, -4604, -6427, 1580, 6633, -1737, -4532, 1358, -583, -3264, 3316, 3971, -3190, -2331, -44, -4901, -1221, 9535, 3472, -10350, -6424, 3798, 5380, 4117, -2130, -11476, -6312, 9839, 9586, -3462]
$$ [...]
8191b66
##END NTUPLES=NMR FID
##END=
