##TITLE=1H_TG-2270-2
 CDCl3, 8 sc, 
 18.12.2019
##JCAMPDX= 6.0         $$ Bruker NMR JCAMP-DX V2.0
##DATA TYPE= NMR FID
##DATA CLASS= NTUPLES
##ORIGIN= UXNMR, Bruker Analytische Messtechnik GmbH
##OWNER= root
$$ XWIN-NMR		Version 3.5
$$ Wed Dec 18 14:32:45 2019 Russian Standard Time (UT+4h)  she@DPX200
##.OBSERVE FREQUENCY= 200.1315
##.OBSERVE NUCLEUS= ^1H
##.DELAY= (6, 6)
##.ACQUISITION MODE= SIMULTANEOUS
##.ACQUISITION SCHEME= undefined
##.AVERAGES= 8
##.DIGITISER RES= 18
##SPECTROMETER/DATA SYSTEM= spect
##.PULSE SEQUENCE= zg30
##.SOLVENT NAME= CDCl3
##.SHIFT REFERENCE= (INTERNAL, CDCl3, 0, 15.7039)
##AUDIT TRAIL= $$ (NUMBER, WHEN, WHO, WHERE, WHAT)
$$ ##TITLE= Audit trail, XWIN-NMR		Version 3.5
$$ ##JCAMPDX= 5.01
$$ ##ORIGIN= Bruker BioSpin GmbH
$$ ##OWNER= she
$$ F:/spectra/data/she/nmr/H-F/1/audita.txt
$$ ##AUDIT TRAIL=  $$ (NUMBER, WHEN, WHO, WHERE, WHAT)
(   1,<2019-12-18 14:31:42.42 +0400>,<she>,<DPX200>,
      <created by zg, POWCHK disabled, PULCHK disabled
       configuration hash MD5:
       00 E9 B6 7A A2 85 ED C7 34 08 36 98 17 FE 4E 26
       data hash MD5: 16K
       B3 6A 83 68 7C 77 4A B4 F0 D5 31 16 1D 24 AF 41>)
$$ ##END=
$$ 
$$ hash MD5
$$ 70 A9 C2 4C 2A 24 A1 B3 DD D8 AB F5 0D A3 7D A7
##$RELAX= 
##$RELAX= 
##$RELAX= 
##$RELAX= 
##$RELAX= 
##$RELAX= 
$$ Bruker specific parameters
$$ --------------------------
##$DU= <F:/spectra>
##$EXPNO= 1
##$NAME= <H-F>
##$PROCNO= 1
##$TYPE= <nmr>
##$USER= <she>
##$AMP= (0..31)
100 100 100 100 100 100 100 100 100 100 100 100 100 100 100 100 100 100 
100 100 100 100 100 100 100 100 100 100 100 100 100 100 
##$AQSEQ= 0
##$AQ_mod= 1
##$AUNM= <au_zg>
##$AUTOPOS= <>
##$BF1= 200.13
##$BF2= 200.13
##$BF3= 200.13
##$BF4= 200.13
##$BF5= 200.13
##$BF6= 200.13
##$BF7= 200.13
##$BF8= 200.13
##$BYTORDA= 1
##$CFDGTYP= 0
##$CFRGTYP= 5
##$CHEMSTR= <none>
##$CNST= (0..31)
1 1 145 1 1 1 1 1 1 1 1 1 1 1 1 1 1 1 1 1 1 1 1 1 1 1 1 1 1 1 1 1 
##$CPDPRG= <>
##$CPDPRG1= <>
##$CPDPRG2= <>
##$CPDPRG3= <>
##$CPDPRG4= <mlev>
##$CPDPRG5= <mlev>
##$CPDPRG6= <mlev>
##$CPDPRG7= <mlev>
##$CPDPRG8= <mlev>
##$CPDPRGB= <>
##$CPDPRGT= <>
##$D= (0..31)
0 1.2 0 0 0 0 0 0 0 0.06 0 0.03 0 0 0 0 0.0002 0 0 0 0 0 0 0 0 0 0 0 0 
0 0 0 
##$DATE= 1576665101
##$DBL= (0..7)
120 120 120 120 120 120 120 120 
##$DBP= (0..7)
150 150 150 150 150 150 150 150 
##$DBP07= 0
##$DBPNAM0= <>
##$DBPNAM1= <>
##$DBPNAM2= <>
##$DBPNAM3= <>
##$DBPNAM4= <>
##$DBPNAM5= <>
##$DBPNAM6= <>
##$DBPNAM7= <>
##$DBPOAL= (0..7)
0.5 0.5 0.5 0.5 0.5 0.5 0.5 0.5 
##$DBPOFFS= (0..7)
0 0 0 0 0 0 0 0 
##$DE= 6
##$DECBNUC= <off>
##$DECIM= 24
##$DECNUC= <off>
##$DECSTAT= 4
##$DIGMOD= 1
##$DIGTYP= 9
##$DL= (0..7)
0 120 120 120 120 120 120 120 
##$DP= (0..7)
150 150 150 150 150 150 150 150 
##$DP07= 0
##$DPNAME0= <>
##$DPNAME1= <>
##$DPNAME2= <>
##$DPNAME3= <>
##$DPNAME4= <>
##$DPNAME5= <>
##$DPNAME6= <>
##$DPNAME7= <>
##$DPOAL= (0..7)
0.5 0.5 0.5 0.5 0.5 0.5 0.5 0.5 
##$DPOFFS= (0..7)
0 0 0 0 0 0 0 0 
##$DQDMODE= 0
##$DR= 18
##$DS= 0
##$DSLIST= <SSSSSSSSSSSSSSS>
$$ [...]
##$SUBNAM2= <"">
##$SUBNAM3= <"">
##$SUBNAM4= <"">
##$SUBNAM5= <"">
##$SUBNAM6= <"">
##$SUBNAM7= <"">
##$SUBNAM8= <"">
##$SUBNAM9= <"">
##$SW= 24.9337058887773
##$SWIBOX= (0..15)
0 0 2 0 0 0 0 0 0 0 0 0 0 0 0 0 
##$SW_h= 4990.01996007984
##$TD= 16384
##$TD0= 1
##$TE= 0
##$TE2= 300
##$TE3= 300
##$TEG= 300
##$TL= (0..7)
0 120 120 120 120 120 120 120 
##$TP= (0..7)
150 150 150 150 150 150 150 150 
##$TP07= 0
##$TPNAME0= <>
##$TPNAME1= <>
##$TPNAME2= <>
##$TPNAME3= <>
##$TPNAME4= <>
##$TPNAME5= <>
##$TPNAME6= <>
##$TPNAME7= <>
##$TPOAL= (0..7)
0.5 0.5 0.5 0.5 0.5 0.5 0.5 0.5 
##$TPOFFS= (0..7)
0 0 0 0 0 0 0 0 
##$TUNHIN= 0
##$TUNHOUT= 0
##$TUNXOUT= 0
##$USERA1= <user>
##$USERA2= <user>
##$USERA3= <user>
##$USERA4= <user>
##$USERA5= <user>
##$V9= 5
##$VALIST= <valist>
##$VCLIST= <CCCCCCCCCCCCCCC>
##$VD= 0
##$VDLIST= <DDDDDDDDDDDDDDD>
##$VPLIST= <PPPPPPPPPPPPPPP>
##$VTLIST= <TTTTTTTTTTTTTTT>
##$WBST= 1024
##$WBSW= 4
##$XGAIN= (0..3)
0 0 0 0 
##$XL= 0
##$YL= 0
##$YMAX_a= 415414
##$YMIN_a= -285396
##$ZGOPTNS= <>
##$ZL1= 120
##$ZL2= 120
##$ZL3= 120
##$ZL4= 120
##$ABSF1= 10
##$ABSF2= 0
##$ABSG= 5
##$ABSL= 3
##$ALPHA= 0
##$AQORDER= 0
##$ASSFAC= 0
##$ASSFACI= 0
##$ASSFACX= 0
##$ASSWID= 0
##$AUNMP= <proc_1d>
##$AZFE= 0.1
##$AZFW= 0.1
##$BCFW= 1
##$BC_mod= 2
##$BYTORDP= 1
##$COROFFS= 0
##$CY= 11.3945322036743
##$DATMOD= 1
##$DC= 2
##$DFILT= <>
##$DTYPP= 0
##$F1P= 16.9975609425685
##$F2P= -3.02152046262296
##$FCOR= 0.5
##$FTSIZE= 0
##$FT_mod= 4
##$GAMMA= 1
##$GB= 0.15
##$INTBC= 1
##$INTSCL= 1
##$ISEN= 128
##$LB= 0.24
##$LEV0= 0
##$LPBIN= 0
##$MAXI= 10000
##$MC2= 0
##$MEAN= 0
##$ME_mod= 0
##$MI= 1.114404
##$NCOEF= 0
##$NC_proc= 0
##$NLEV= 6
##$NOISF1= 3.799351
##$NOISF2= 2.8
##$NSP= 1
##$NTH_PI= 0
##$NZP= 0
##$OFFSET= 15.70392
##$PC= 1
##$PHC0= -9787.528
##$PHC1= 14.60081
##$PH_mod= 1
##$PKNL= yes
##$PPARMOD= 0
##$PSCAL= 0
##$PSIGN= 0
##$REVERSE= no
##$SF= 200.130013532006
##$SI= 16384
##$SIGF1= 3
##$SIGF2= 2
##$SINO= 400
##$SIOLD= 16384
##$SREGLST= <1H.CDCl3>
##$SSB= 0
##$STSI= 0
##$STSR= 0
##$SW_p= 3612.71676300578
##$SYMM= 0
##$S_DEV= 0
##$TDeff= 0
##$TDoff= 0
##$TI= <>
##$TILT= no
##$TM1= 0
##$TM2= 0
##$TOPLEV= 0
##$USERP1= <user>
##$USERP2= <user>
##$USERP3= <user>
##$USERP4= <user>
##$USERP5= <user>
##$WDW= 1
##$XDIM= 8192
##$YMAX_p= 0
##$YMIN_p= 0
$$ End of Bruker specific parameters
$$ ---------------------------------
##NTUPLES= NMR FID
##VAR_NAME=  TIME,          FID/REAL,        FID/IMAG
##SYMBOL=    X,             R,               I
##VAR_TYPE=  INDEPENDENT,   DEPENDENT,       DEPENDENT
##VAR_FORM=  AFFN,          ASDF,            ASDF
##VAR_DIM=   8192,          8192,            8192
##UNITS=     SECONDS,       ARBITRARY UNITS, ARBITRARY UNITS
##FACTOR=    0.0002004,     1,               1
##FIRST=     0,             0,               0
##LAST=      1.6414764,     0,               0
##MIN=       0,             -285396,         0
##MAX=       1.6414764,     415414,          0
$$ Real data points
##PAGE= N=1
##DATA TABLE= (X++(R..R)), XYDATA
0 0 0 0 0 0 0 8 0 8 -8 8 -16 16 -24 24 -32 40 -47 56 -65 76 -90 105 -121 141 -163 186 -212 242 -276 310
30 310 -349 394 -442 494 -551 615 -685 762 -843 936 -1040 1150 -1273 1408 -1560 1732 -1920
47 -1920 2137 -2385 2672 -3009 3410 -3898 4509 -5292 6345 -7847 10161 -14244 23569 -91295
61 -91295 106859 231853 -145802 -285396 -118457 70636 29898 -103646 -194986 -116452 -5583
72 -5583 13460 -32250 -49330 -85925 -69172 25275 35074 -86586 -82360 47573 59049 -29769
84 -29769 -7623 57150 39898 471 3945 31945 81261 74693 -6366 8799 138063 124009
96 124009 -25163 -17904 121583 122609 16932 -2339 53287 93066 91843 34059 -14004 27848
108 27848 75685 48259 23376 13765 -30300 -6089 102885 74468 -91553 -105111 46942 94082
120 94082 -1864 -80325 -78901 -1345 82975 35287 -98358 -105652 1383 44373 16528 -21769
132 -21769 -76192 -64256 57047 98637 -26002 -109545 -34628 64425 78095 7085 -76394 -34920
144 -34920 100703 97036 -39858 -47083 63930 61706 -10332 13007 57328 29710 2633 14079
156 14079 35524 58778 35570 -36847 -26936 68295 73725 -11796 -31352 3821 17869 40125
168 40125 35615 -49633 -80091 25958 86563 765 -78647 -49924 29663 69522 -1585 -111696
180 -111696 -64480 95287 82895 -84446 -102119 39209 87588 6564 -56736 -41988 29682
191 29682 83529 37468 -37335 -17621 39977 45733 43298 33325 -17654 -6983 93157 102813 -2806
204 -2806 -23003 54962 70303 32368 32890 43467 35129 31185 26568 38638 73331 40862 -41469
217 -41469 -5989 110998 88254 -35941 -46271 34810 62317 36733 400 -32597 -11795 45659
229 45659 45249 3005 -14124 -28208 -20442 51588 69550 -38871 -87137 18168 84021 17124
241 17124 -43474 -28657 10643 45513 37420 -19642 -29740 26844 42680 12735 7402 3483 -3510
254 -3510 42825 66360 -9952 -49582 38999 93568 23680 -37175 -8717 49152 73867 26170
266 26170 -49203 -25831 69083 64985 -19588 -23538 25649 21155 5878 18308 3819 -18021 -2991
279 -2991 4137 -3498 15365 12835 -35221 -36285 16195 24912 -5256 -22987 -47344 -40358 38353
292 38353 62027 -43573 -106079 -18794 68760 40685 -45116 -90874 -36040 69890 65488 -56737
304 -56737 -91438 6977 56777 7077 -30579 -30643 -15010 22955 31376 -17660 -33766 7620 16586
317 16586 -5024 205 -758 -14850 9844 25913 -16233 -27662 18404 19460 -18644 -5836 18702
330 18702 1018 -8764 4144 1293 697 4754 -17353 -16389 33080 30298 -33725 -31292 28801 28214
344 28214 -9324 -10956 -5177 -3091 21804 24085 -15907 -23627 7540 19790 21528 16553 -23963
357 -23963 -32425 38275 64344 -15108 -58957 -790 50599 40638 3258 -35490 -28010 40142 62307
370 62307 -3897 -44878 -10646 28227 42931 29212 -28265 -51471 22416 71536 6885 -47048
382 -47048 -8273 33060 24896 4238 -13214 -9833 21306 18035 -20932 -5521 37438 9243 -36642
395 -36642 -7918 31147 17763 -3742 -15419 -21485 12320 45019 -1200 -53870 -18855 33450
407 33450 23330 -9908 -29281 -24897 18698 38717 -21517 -61511 -1019 43502 -5140 -46898
419 -46898 -23911 9347 20904 -1172 -49839 -45148 28322 44112 -29850 -63872 -18290 22548
431 22548 24441 -5278 -53176 -47449 26389 47959 -17330 -50885 -15194 12366 16001 9691 -19803
444 -19803 -33004 5475 26731 -1715 -9672 5559 -5328 -10125 15274 14846 -7102 -367 4486
457 4486 -9026 8946 32119 -1158 -32944 -4921 23081 15113 5239 -9796 -23459 6690 38567
470 38567 3781 -35642 -14936 11248 9505 9386 -5406 -30531 -7784 32067 7078 -33203 -13547
483 -13547 15394 8025 -3703 -13134 -17516 10282 27638 -14575 -38198 12176 43005 5431 -24271
496 -24271 -14729 5271 28435 26008 -20751 -34919 21378 48943 7640 -21126 -9509 6017
508 6017 23102 24846 -10664 -23510 17240 28336 -9372 -15094 10677 5462 -9913 -5044 -919
521 -919 3440 10789 -13957 -40451 -3520 34974 -4290 -50405 -28639 9419 13891 -5821 -39930
534 -39930 -47715 3192 34694 -12492 -54554 -26701 6828 5709 -5704 -28214 -40311 -1854
546 -1854 30698 -5664 -41161 -13341 15657 5940 -7650 -15219 -12001 14850 19876 -18118 -23716
559 -23716 20687 26095 -11713 -13382 9368 9817 7996 9354 -9274 -12434 13851 17164 -5668 -7366
573 -7366 -1282 -4540 8980 15559 -17182 -27507 11495 18122 -20087 -22651 4495 2496 -12165
586 -12165 -12705 -10910 -1625 6076 -17021 -32829 2332 24222 -10263 -30064 -7124 3656 2531
599 2531 10703 -6630 -34398 -8648 38194 26563 -16072 -27151 -1448 36563 43465 -8793 -43922
612 -43922 8712 60082 23904 -20095 -1997 24069 22514 18767 11189 1741 14981 23941 5394
625 5394 1993 21121 17214 2342 10229 10067 1816 20630 27298 -13932 -26886 20770 41211 2922
639 2922 -23847 -9786 17115 30080 5476 -30165 -11741 33262 19310 -19095 -3968 22260
651 22260 5963 -6444 6098 8306 7696 14936 5417 -5732 14617 29124 12049 1292 4757
664 4757 5005 23456 42696 9431 -28111 6715 53914 32760 -9908 -10283 14670 35211 31784
677 31784 -1572 -16706 14813 29939 2683 -3385 14624 3739 -8856 10405 16158 -6983
689 -6983 -8554 5864 -1084 -8551 -923 -440 -4211 -5550 -17229 -13380 18556 15651 -32768 -34263
703 -34263 18770 25927 -16317 -29372 -7077 11214 15645 894 -18441 -4814 20322 9298
715 9298 -6663 6040 9605 -317 15330 26822 1055 -5520 26308 29464 -2021 -4022 22458
728 22458 33954 21193 -1735 -3550 34518 52261 2073 -31752 15892 54947 20860 -11847
740 -11847 2336 20507 25201 23395 3877 -10549 7934 24310 15179 6539 1506 -4121 15093
753 15093 31995 206 -27102 9190 39034 5206 -20889 6635 31325 16948 -8990 -16053
765 -16053 10221 38393 14299 -26856 -5420 40942 28670 -7758 -5674 6991 8565 19831
777 19831 20651 -6082 -12272 15589 30199 15291 -6153 -16084 2915 33444 16075 -28355 -14514
790 -14514 31828 17534 -24313 -14344 14788 7171 -13502 -18814 -8366 10468 9048 -20918 -29337
803 -29337 -508 7851 -12890 -16653 -14583 -24582 -9109 18376 -1981 -41130 -27997 9382 11775
816 11775 -14003 -33492 -23986 11064 19877 -20020 -34619 5204 17251 -17997 -22274 9146 11308
829 11308 -7325 -8539 -2458 2694 9999 1052 -15213 -6380 10952 10518 9308 5490 -15886 -13771
843 -13771 26334 28936 -21323 -33726 11314 34348 9843 -15844 -16198 6402 22628 765 -24491
856 -24491 -2882 21612 -579 -17106 6466 14973 -6735 -11442 -1645 -2588 875 8867 -714 -10712
870 -10712 -2653 6438 9169 7358 -14417 -27290 9017 39069 602 -36242 -4250 31543 14292
883 14292 -13192 -13332 1953 14825 9738 -9305 -4664 17089 7018 -13847 97 15416 -1031
896 -1031 -6456 8303 3230 -7980 7124 13734 -7519 -18417 -3477 12775 14335 -6234 -28374
909 -28374 -6580 33162 13218 -36948 -26076 18542 14549 -14718 -15295 -2907 1069 1864 -5365
922 -5365 -12866 -4782 -1246 -10735 -5571 4804 -7536 -13023 6478 3149 -22828 -12947 15768 3046
936 3046 -24967 -15233 11459 15764 -2466 -25729 -19551 15934 20687 -19745 -30912 5624 18364
949 18364 -2237 -7888 -3359 -8358 -3488 7294 -1262 -13200 -5603 2269 3446 3930 -7542 -14851
963 -14851 5189 14010 -13865 -19776 14497 19345 -14885 -20798 6189 15905 2789 -13831 -17090
976 -17090 4792 24744 4017 -21652 -6237 13491 4446 -1232 3274 -7455 -9763 13162 18105
989 18105 -5288 -11622 2329 9119 7734 464 -9430 684 18347 3541 -15477 6148 24704
1002 24704 -2072 -19866 3862 21380 9640 -3812 -8075 544 18432 15906 -7668 -9635 7400
1015 7400 8219 4764 12677 2857 -14064 3982 26810 8227 -14129 -3586 11464 9746 3037
1028 3037 -3294 -1396 12595 8073 -12245 -3164 21845 7930 -19819 -6618 16341 9051 -4305
1041 -4305 -6394 -7723 142 11861 3352 -11190 -7251 -1339 -60 8695 2450 -22424 -16817 15416
1055 15416 12112 -18844 -16474 5036 3307 -7223 -7651 -5180 -173 164 -13393 -13441 10055 9703 -17960
1070 -17960 -18582 5500 6720 -4422 -4267 -8574 -12968 4123 14944 -3531 -17335 -8742 3166
1083 3166 10205 5602 -16527 -20800 11108 22184 -9698 -20525 3643 10783 -3473 -7682 -3613
1096 -3613 -881 4279 -960 -12738 -2296 13031 859 -13578 -3758 2900 -660 4280 1881 -16114
1110 -16114 -9939 16387 12773 -12078 -14416 915 11146 11745 -4009 -18528 -791 23212 6796
1123 6796 -15615 -2197 13810 5538 -133 3470 2064 5000 10711 1717 -4332 10809 15073 471
1137 471 -1579 5979 5874 10874 15272 -3603 -12708 13692 28323 3780 -14406 -2339 13338 18557
1151 18557 8216 -13262 -12053 16812 21815 -5419 -12745 3751 7422 4322 5286 -3787 -10000 4793
1165 4793 10606 -5918 -8581 3412 3484 -2290 -612 -4218 -3047 9542 3433 -17159 -8497 16539
1179 16539 8921 -13479 -11676 2944 8878 9221 -3865 -16870 -1294 17793 4513 -12493 -4123
1192 -4123 4040 1901 5075 1999 -9444 -2794 11756 1378 -10764 1020 9303 -1218 -6578
1205 -6578 -3833 -644 8894 7387 -15758 -18493 11165 20555 -6242 -19967 -7501 5525 12104
1218 12104 4911 -17278 -19155 8481 17193 -4006 -13494 -5527 -82 6453 8578 -6682 -11866 5882
1232 5882 9841 -5406 -3670 8207 2782 -3634 2290 4723 5631 10476 752 -10989 5439 22534
1246 22534 7370 -9274 -1600 8525 11444 13065 1781 -10568 5024 23016 8827 -7396
1258 -7396 306 8537 7319 7441 1796 -4778 7151 15842 -839 -8921 7338 12699 1006 -2990
1272 -2990 -1718 -234 11702 13771 -9078 -16701 7337 19390 2815 -9823 -8588 733 16394
1285 16394 14763 -11618 -17961 7967 18304 1149 -7138 -3375 -366 7962 11685 -3053 -8858
1298 -8858 6213 9525 -2456 -1021 5005 234 -282 3053 -1674 618 11582 1510 -15567 -1928
1312 -1928 18229 6317 -12566 -10890 -246 9746 10582 -9571 -22146 165 18568 1691 -16112
1325 -16112 -9828 -1402 2617 4684 -7447 -19314 -3472 11890 -2950 -16687 -7436 1436 541
1338 541 -2358 -11967 -13278 5273 10657 -13364 -21087 1506 10487 -3651 -11133 -9030 -4102 6540
1352 6540 5233 -11685 -12825 4224 5498 -3555 -2066 -2593 -8981 616 8940 -3606 -10815 1767
1366 1767 4613 -3689 -786 2912 -2916 -3870 -769 -3168 2095 8579 -5302 -15924 4052 16888
1380 16888 -370 -13649 -5582 2572 6458 7456 -5477 -14950 -270 12923 5194 -3523 -5720 -7064
1394 -7064 4018 17782 2030 -19542 -5776 16939 9438 -6321 -5085 1089 7183 7883 -2786
1407 -2786 -7171 7658 11605 -4749 -5420 9217 6585 -2705 1310 1662 -2967 5838 11132 -3237
1421 -3237 -9430 3043 8878 3792 -1432 -7508 -4935 11195 9309 -12598 -11626 10109 6731 -11743
1435 -11743 -7037 6784 3519 -6252 -10671 -6731 6539 8809 -13652 -22921 1172 15126 -414
1448 -414 -13208 -12041 -9436 3248 13389 -5618 -27647 -12970 12941 11967 -7652 -21014 -15256
1461 -15256 7837 16041 -9486 -25064 -3081 11869 -3189 -10890 -1686 -2327 -6824 -1625 -773 -4102
1475 -4102 -1644 -2530 -6829 -1065 3393 -5122 -5716 4018 -1772 -10049 2946 9876 -6595 -12146 2748
1490 2748 7088 -1029 -4755 -4182 1424 8533 1002 -11449 -1193 12411 -696 -10787 2790 9597
1504 9597 723 347 2667 -3272 -786 9556 4541 -6322 -3975 3794 10479 13128 -3640 -18713
1518 -18713 2494 29241 10318 -21271 -11634 15386 19964 4644 -10875 -10597 9265 21000 3597
1531 3597 -11739 -2178 7665 5824 7803 2929 -9400 -2937 15772 9730 -8735 -4824 7179 5654
1545 5654 441 -363 912 5214 2705 -9566 -4216 15663 6941 -18636 -10663 17139 13529 -9692
1559 -9692 -14296 -3037 7466 8944 -4755 -14683 -1829 10383 821 -7386 -3501 -5372 -4756 6437
1573 6437 2851 -14673 -8264 11885 5801 -14307 -14594 -306 8515 2406 -14381 -16409 7326 17008
1587 17008 -7200 -20351 -2613 5923 -2605 -3240 -737 -7874 -7319 4762 5317 -3173 -8927 -9154 -614
1602 -614 11347 2291 -15177 -6622 10592 2764 -9144 -432 1905 -7878 -5132 6944 6022 -2984
1616 -2984 -7993 -6450 5347 12247 -3796 -17510 -2669 12933 4201 -3795 -1102 -6035 -6101 8883
1630 8883 10956 -7907 -14778 63 12671 10932 -4943 -17886 -2158 20368 7720 -18908 -8498
1643 -8498 16595 10880 -7361 -6825 2589 7307 5492 -3938 -9057 3714 12691 3186 -3366 -27
1657 -27 -52 4325 12550 2055 -14718 -3003 18463 10245 -8124 -5084 6854 8883 3280 -5168
1671 -5168 -3442 8546 5728 -8797 -2360 17315 7393 -15903 -8918 11742 10200 -3399 -9455
1684 -9455 -6157 6212 13827 676 -13819 -8118 2607 4859 5582 -2084 -15955 -7237 16865 11519
1698 11519 -16194 -17748 2770 10397 1574 -7422 -8545 619 7305 -2754 -10255 124 3109 -7129
1712 -7129 -3777 8368 497 -10118 -988 6158 -2256 -7585 -2929 1269 3885 -393 -7575 -2073
1726 -2073 8959 719 -12403 -2611 6931 -3239 -7743 3439 3265 -5084 -3440 1334 163 -1105
1740 -1105 -4305 -7168 1349 7496 -3235 -9099 1356 3346 -5027 -607 3684 -7142 -9144 7179
1754 7179 11636 -2829 -11943 -5765 8841 15024 -1866 -20796 -5592 22610 14694 -11847 -11407
1767 -11407 5034 10535 7870 1622 -6350 -2878 9779 10912 1652 -835 -684 1686 10225 9552 -3824
1782 -3824 -2709 10946 7366 -3820 3742 11983 867 -7136 2198 11071 8818 -957 -9271 354
1796 354 17867 9866 -13639 -9866 11470 10333 -3964 -4884 587 2998 5457 1431 -7020 -3635
1810 -3635 6273 3152 -4017 -3568 -2003 1870 9251 235 -16432 -7015 15370 9959 -11349 -12671
1824 -12671 881 9008 6613 -4677 -13485 -3157 9564 4014 -3860 -2453 -5208 -6696 5665
1837 5665 10398 -6457 -14724 -857 8748 2764 -4913 -8970 -6685 3522 3931 -6338 -5882 1568
1851 1568 -3758 -7732 2408 3042 -9865 -10518 -77 2255 -1221 -3498 -8141 -7536 2350 3550 -5803
1866 -5803 -7191 -3798 -3082 2638 5024 -8806 -15064 2688 13333 -2487 -13734 -3696 7562
1879 7562 6860 -3642 -12041 -2393 14138 7032 -13099 -8936 10714 10741 -1962 -5751 -3549 2596
1893 2596 10859 5926 -8847 -7106 7715 10182 2003 -3792 -5522 687 11117 5373 -9252 -4002
1907 -4002 9532 3821 -5781 248 5825 -443 -4388 -1315 2798 6057 814 -10201 -5249 11336
1921 11336 8085 -9284 -9089 1974 5098 3164 -658 -8715 -6874 7236 9334 -3360 -8094 -2500
1935 -2500 3073 6778 2546 -10209 -8897 7691 9104 -4466 -6592 1135 1536 348 1264 -2805 -4854
1950 -4854 2247 2895 -2997 -1723 650 -3301 -1619 2220 -3999 -6880 3399 4627 -6987 -8302 471
1965 471 1723 -2074 -4338 -7203 -3821 4933 135 -10671 -6647 2945 -785 -5885 -2449 -2254 -4032
1980 -4032 -660 -1852 -6555 -1828 2981 -4660 -8372 488 4034 -1303 -5259 -7258 -4205 8142 8213
1995 8213 -10368 -16014 3854 14891 2446 -11388 -11221 850 14211 8619 -12326 -14399 5681
2008 5681 13011 -102 -7756 -4626 924 6866 5495 -5365 -6494 4985 5169 -4612 -3396 3868
2022 3868 2849 -563 -1334 -2985 1758 7658 -311 -9905 -1277 9844 3753 -4595 -2735 400 2940
2037 2940 5389 -955 -6012 2040 7213 -634 -3374 3427 4213 724 1106 310 -143 5995 5958 -4083
2053 -4083 -4340 6333 7904 935 -1487 -2120 762 8502 8332 -4820 -7812 3265 8263 3809 -386
2068 -386 -5179 -4608 6995 11253 -1786 -9836 -1802 5316 3842 1229 -4382 -6607 2318 7927 -1061
2083 -1061 -6963 -1583 933 -1060 678 -725 -4437 -1186 2172 -3892 -4959 2469 951 -6505 -3519
2098 -3519 2432 749 -2380 -4431 -6184 -357 6283 -2096 -11373 -2232 6833 194 -7262 -5453 -2005
2113 -2005 2025 2868 -5023 -8664 1413 6012 -3836 -9152 -2970 1327 2167 -290 -7503 -7335 5513
2128 5513 8279 -6746 -12922 77 8144 2464 -5628 -8942 -2741 7987 4932 -8426 -7503 4604
2142 4604 4758 -2231 -1856 -1044 -2179 1089 3343 -959 -1216 3338 244 -2568 2539 3652 -660 -441
2158 -441 742 -756 4159 7608 -1856 -7883 2486 10644 3314 -3765 -2573 1472 7174 7278 -2594
2173 -2594 -5979 3583 7336 1267 401 1847 -1914 223 7277 4228 -3925 -921 4015 2990 1155
2188 1155 299 -1351 1597 4613 -2043 -4166 5466 6836 -4157 -6019 2482 5053 1361 -831 -4855
2203 -4855 -3810 4483 5827 -2780 -6464 -1753 1603 3549 2950 -6077 -9073 3046 8316 -3491 -8718
2218 -8718 -399 3440 -1033 -4035 -2951 256 2977 -3360 -9280 -74 8214 -2110 -11949 -4142 5188
2233 5188 3016 -1747 -5317 -7194 93 6308 -138 -8864 -5860 1289 4297 2883 -4497 -9573 -252
2248 -252 8725 -643 -10017 -1148 6997 576 -5116 -1239 2235 2418 -1440 -6052 -634 8564 3778
2263 3778 -7293 -3262 5368 2307 -1078 1198 -923 -2128 3864 6072 -821 -3757 -58 2363 4469
2278 4469 3009 -3274 -2146 6833 4399 -5083 -1504 6914 1899 -3506 1830 5785 3226 14 -1142
2293 -1142 117 5234 5204 -1654 -1474 4901 3503 222 4844 3464 -3861 -872 9575 6695 -3579
2308 -3579 -3795 3411 7725 6038 -2864 -5678 4916 10261 95 -5479 2928 5179 419 747 3513
2323 3513 -48 -579 2745 741 -1538 1331 2073 -20 518 -1113 -1574 4665 5177 -6570 -8099 6410
2339 6410 9576 -4338 -10127 -394 7334 4118 -4425 -8303 -80 8464 1375 -8337 -2793 4691 331
2354 331 -3180 361 -681 -2437 1574 1586 -3739 -1848 3139 1767 -2875 -4244 -2223 3771 5492 -4996
2370 -4996 -10740 2637 12271 -334 -12523 -4791 5071 3941 -2002 -5582 -3373 3322 3081 -3810
2384 -3810 -3693 676 -2558 -4154 2561 2826 -4697 -3061 2975 -414 -4602 -1091 1729 -1466 -3392
2399 -3392 -1853 1942 5315 -425 -9363 -3553 9402 5000 -7128 -4581 4443 3908 915 709 -1126
2414 -1126 -1301 2169 3857 1908 1144 -1118 -1321 5631 7331 -2862 -4936 5420 6517 -2724 -1945
2429 -1945 5449 4491 -1101 -2134 1348 6383 4370 -4861 -6381 5339 9238 -1241 -4559 1753 2397
2444 2397 459 2965 760 -4819 -2252 4843 4575 -129 -2950 -2350 2779 4399 -3099 -6498 3753
2459 3753 6965 -3665 -6101 4836 6837 -3268 -6937 -1271 4655 4682 -2096 -6544 403 7535 773
2474 773 -5921 -1647 557 -1708 1311 3321 -3694 -5099 2103 3607 -2978 -5481 -2566 493 1562
2489 1562 -2529 -6494 1 4677 -4123 -10296 66 5750 -3623 -9335 -2488 2725 1047 -2970 -6985
2504 -6985 -4636 2097 1369 -4926 -4152 -812 -2131 -331 3642 -2839 -8730 -1178 6559 569 -5965
2519 -5965 -2784 2454 3896 724 -4653 -2658 5212 3141 -4795 -1069 7279 2745 -3777 149 3843
2534 3843 1682 921 1203 -215 773 3587 3236 1010 341 -1805 766 7993 4599 -6758 -4314 8378
2550 8378 7871 -2977 -3919 2024 5048 3305 -377 -2432 2755 5014 -928 -1977 4528 4304 -1984
2565 -1984 18 3634 1413 673 4321 1508 -2859 1249 6465 4229 -1022 -3918 -748 8359 8718
2580 8718 -4017 -8062 4617 10387 175 -5269 17 3219 2564 1736 -785 -775 1677 934 -2329
2595 -2329 408 2517 -1767 -1679 2149 -334 -3372 1680 1857 -5733 -5186 3057 3974 -2132 -5743 -4535
2611 -4535 1655 5525 -1931 -9685 -2699 6099 843 -5619 -2075 122 -1851 -563 607 -1757 -2021
2626 -2021 132 -1039 -761 1387 -579 -2434 676 223 -3420 1245 5649 -1305 -7056 805 6620
2641 6620 1917 -3818 -4673 -142 5515 4309 -4420 -5331 3023 4469 -1129 -1246 377 -2366 8 4043
2657 4043 686 -3885 -705 2503 216 -675 -477 -402 1647 1697 -3263 -1449 5877 3339 -5800 -2994
2673 -2994 6051 4750 -1570 -3169 -589 3468 5528 819 -4194 683 5968 2715 -56 777 -708
2688 -708 117 5347 3632 -3293 -1195 5767 3293 -1760 -1079 1692 3460 2698 -1780 -3029 4483 6532
2704 6532 -2613 -6256 2360 5749 890 -2070 -2007 -816 3544 4061 -2616 -5029 987 3807 1077 -854
2720 -854 -2955 -3269 2847 5190 -2986 -5940 1516 5068 -414 -2837 -673 510 1350 44 -3244 -345
2736 -345 4769 1086 -5151 -1077 4071 1203 -1880 -1416 -1997 -85 4032 1126 -5579 -3574 2350 2971
2752 2971 80 -2538 -5068 -1272 5297 586 -7551 -3416 3153 1243 -2612 -2240 -1446 -1165 445 -2024
2768 -2024 -3938 272 2058 -3160 -4006 1054 1462 -866 -817 -2713 -3622 2209 4967 -2224 -5941 -307
2784 -307 4205 2742 -289 -3516 -2858 4155 5792 -1934 -4095 2363 3766 653 741 1064 -367 1633
2800 1633 2449 -668 232 4365 1732 -2485 498 3547 2437 1396 -26 -2729 1016 6937 2658
2815 2658 -4513 -1703 4134 4097 1707 -538 -2546 1161 6131 2075 -3382 -137 4190 1582 503
2830 503 2025 811 847 2881 823 -747 3710 4328 -1234 -1556 2933 3948 2138 1411 -1592 -1344 5345
2847 5345 5754 -1941 -3592 1725 3546 2121 378 -2110 -2005 3419 4240 -2353 -3630 1436 1436 -1160
2863 -1160 -284 -707 -1788 529 463 -3522 -1789 2335 -849 -4743 -1614 1025 -167 -854 -2145 -4477
2879 -4477 -1078 3598 -560 -5954 -2466 1014 959 33 -2195 -4561 -985 4546 292 -5396 -1584 2437
2895 2437 474 -1088 -693 -1359 757 2666 -1203 -3232 1931 3109 -2104 -2576 879 864 790 913 -2358
2912 -2358 -3128 2987 4651 -2176 -4380 -223 2254 2479 569 -3930 -3517 4152 4739 -2890 -4133 1351
2928 1351 2388 423 274 -806 -1056 1885 1997 -1511 -170 2777 351 -1420 1839 1808 343 1900
2944 1900 1325 -2071 960 5676 2383 -3030 -739 2931 3386 2614 -1324 -3162 2410 6751 1030 -3951
2960 -3951 490 3233 787 69 964 -1091 -210 2118 410 -1554 1006 474 -1521 -76 595 -1452
2976 -1452 64 1797 -2915 -4359 2176 3802 -2947 -4904 -1499 1498 1657 -628 -4805 -3379 2724
2991 2724 2228 -3192 -2437 304 -1770 -918 1683 -863 -3820 -916 1372 -1048 -1401 163 -1135 -1218
3007 -1218 228 -877 -662 1665 -1362 -5184 -249 5367 -333 -6482 -2867 1799 1388 -410 -3770
3022 -3770 -4824 277 3151 -1819 -4135 -1327 -459 -1294 561 -675 -4706 -1999 2759 -290 -4185
3037 -4185 -1486 1122 -13 -1370 -2492 -1423 2720 1824 -4859 -3623 4513 4276 -3262 -3495 1061 2172
3053 2172 1356 475 -1796 -1333 2738 2846 -534 -29 656 -432 1920 4043 -1001 -2413 2927 3714 -1561
3070 -1561 -874 2985 2253 -916 -1037 549 2958 3361 -2203 -4313 2936 5941 -861 -4378 615 2495
3086 2495 1627 1557 -219 -3121 -282 4074 2176 -1025 -1901 -878 2664 4973 -557 -5535 335 6229
3102 6229 688 -3726 150 2975 1138 -10 -267 58 1919 982 -2510 -713 2739 836 -1871 683
3118 683 1097 -1896 357 3046 -1729 -4334 392 3427 101 -2575 -2674 -75 2835 213 -5176 -3034
3134 -3034 3770 978 -4976 -1958 2432 -338 -2937 -1510 -398 145 358 -2193 -2922 730 1735 -1578
3150 -1578 -2245 -1075 -2051 223 3863 -415 -6264 -1569 5284 3005 -3900 -4397 -585 3763 3364 -2607
3166 -2607 -4146 1805 3894 -1691 -2001 2068 252 -2428 842 2359 12 -573 441 -525 424 1559
3182 1559 -300 -1173 642 -171 -139 3432 2727 -4021 -3319 4390 4181 -2327 -2931 1056 3260 2535 -613
3199 -613 -2119 1532 3724 -654 -2023 2751 3659 -911 -654 3206 1050 -176 2144 1202 -789 573
3215 573 3344 2898 668 -1454 -1839 3477 6399 -1003 -6109 681 7091 2012 -2676 -1033 238 1401
3231 1401 2012 -467 -1721 199 907 224 1300 781 -2925 -2352 2612 816 -3336 -529 2431 -530
3247 -530 -2645 422 1920 -293 -2991 -3288 633 4890 168 -6311 -2390 5240 2020 -4319 -3235
3262 -3235 296 354 813 -335 -2565 -1433 1621 577 -1866 -1628 -1845 -746 2284 -58 -5061 -1894
3278 -1894 4347 643 -5817 -3167 2913 2254 -2138 -4315 -2127 2947 2858 -3825 -5221 1201 2449 -1598
3294 -1598 -1589 213 -1313 -1357 2041 1079 -2392 -2030 527 894 840 -97 -1545 700 2388 -745 -1870 2370
3312 2370 2208 -3066 -976 4302 3465 -2024 -2018 751 2843 3052 -1137 -2975 1224 4506 641 -1203
3328 -1203 443 -254 -1307 3028 3005 -2351 -3449 1846 3871 761 -1586 -2303 432 3573 99 -3945
3344 -3945 -48 3991 -68 -2750 852 2096 -650 -419 766 -96 310 1768 294 -1102 617 466
3360 466 738 1851 -76 -3179 468 5031 704 -3972 -269 3241 1125 -1245 -859 398 1823 543
3376 543 -2208 -530 3394 424 -4380 -1199 3438 1009 -2195 -1644 -899 -55 2086 285 -4421 -3280
3392 -3280 857 2102 177 -2738 -4696 -1007 5074 1214 -6771 -4144 3147 2574 -2243 -2797 -1293
3407 -1293 331 1064 -903 -1915 285 1499 -1749 -1474 2117 1044 -1984 -216 1026 -1431 -69
3422 -69 2348 -384 -2071 -305 1438 1464 112 -1957 -2035 2156 3502 -2392 -3300 1347 1955 -1819 -1333
3439 -1333 599 -300 -786 -6 -942 -270 981 -709 -1923 -149 559 -1203 506 1029 -2224 -1857 3334
3456 3334 3126 -2591 -3814 827 3364 2741 -1051 -3838 99 5371 3145 -2602 -1342 2109 2350 2026
3472 2026 1761 -1145 -1038 2766 3427 182 -752 1220 1710 1830 1569 -519 571 3282 547 -2765 1019
3489 1019 4213 161 -2841 -50 2352 1642 -444 -2106 -1295 2475 2143 -2456 -2881 866 1533 -942
3505 -942 -885 -1242 -1674 923 1838 -1717 -2523 890 1458 -1233 -1716 -1187 -270 1571 -270 -3803 -1170 3827
3523 3827 1522 -3918 -2438 1570 1890 171 -1193 -2387 -161 2679 597 -1835 -1009 -1 -468 648
3539 648 873 -2228 -2592 983 1197 -1653 -1354 -17 -1175 -538 243 -1020 -1770 -832 -1397 -1575 1130 539
3557 539 -3427 -2981 989 1228 -1163 -1300 -1423 -1419 1661 2151 -1675 -2211 4 1372 1265 1297 -1445 -2353
3575 -2353 2136 3995 -183 -2152 1097 2802 1334 722 145 422 2502 2187 -1210 -349 3716 2803
3591 2803 -398 -201 1071 1594 2905 971 -2522 -622 4340 3149 -1162 -1914 311 1368 2091 689
3607 689 -2550 -324 3430 1021 -1768 219 1722 -451 -609 666 566 917 617 -1638 -1839 2847
3623 2847 3216 -1722 -2696 688 2749 2292 141 -2766 -1794 3123 3672 -1389 -2982 541 2350 1474
3639 1474 588 -1699 -1899 1813 2414 -1525 -1716 1051 302 -649 207 -269 -1032 131 45 -2110 -947 1171
3657 1171 -571 -2312 -513 150 -530 36 -649 -2359 -1182 893 -573 -2102 -827 -728 -1642 597 668
3674 668 -2303 -1823 808 126 -1022 -384 -345 -906 78 673 -939 -156 1163 -743 -1393 1175 1909 -953
3692 -953 -833 307 161 1303 1750 -1361 -1993 1689 3163 12 -1286 -762 -11 2672 2331 -1706 -3019
3709 -3019 1994 3729 364 -1764 0 1542 1475 1395 -593 -195 2564 1648 -1445 414 2870 1018
3725 1018 -1180 325 1258 1616 2035 360 -1604 624 3594 1407 -1145 -573 1340 2247 2315 -448 -1874
3742 -1874 1215 4138 403 -2329 503 2701 474 -524 -425 388 1959 778 -1871 -1045 2559 1733
3758 1733 -1940 -1430 411 484 697 95 -2080 -1896 1423 1807 -1514 -2349 -1499 -373 1317 664 -2909
3775 -2909 -2833 987 1243 -1837 -1218 -89 -1121 -1240 348 -219 -1625 -939 -764 -887 416 -180 -2079
3792 -2079 -1431 299 -857 -1415 547 -249 -2902 -1494 2032 832 -1500 -2353 -1581 669 2178 -853
3808 -853 -3625 -614 2586 175 -1736 -756 -257 -297 1407 515 -1678 -502 1808 581 -1100 -371 1037
3825 1037 967 721 -1013 -1435 2468 3750 -1656 -3583 1870 4351 1289 -1960 -1698 981 3540 2053
3841 2053 -2056 -1189 1957 1913 -149 214 670 -325 392 1639 -215 -824 935 985 -971 47 1525
3858 1525 973 31 -910 -1271 1199 3193 -789 -3673 397 3842 385 -2915 -832 1075 1193 563
3874 563 -962 -1171 1163 1145 -1087 -274 1251 -267 -754 1956 1197 -1681 -501 1280 70 -1422 251
3891 251 980 305 91 -1164 -715 1562 656 -2811 -1646 2148 957 -2027 -935 142 -1026 -560 -3
3908 -3 -1039 -1870 -449 166 283 -58 -2077 -2590 858 2051 -2401 -3301 536 1447 -1327 -1998 -269 404
3926 404 98 -1089 -1408 610 1940 -1231 -2700 942 2010 -345 -1021 -399 -1041 101 2216 520
3942 520 -2629 -1288 1906 2106 -51 -2000 -1898 1891 3101 -782 -3551 885 3761 -658 -2560 467
3958 467 1766 181 -1171 -1176 566 2340 405 -3287 -1132 2158 1409 -659 -408 -857 -662 2755 2623
3975 2623 -1755 -2962 1271 2955 983 -1143 -1597 812 3450 1068 -2220 387 3409 576 -1862
3990 -1862 994 2889 663 -568 594 1578 1727 1091 -577 -503 1651 1471 529 945 341 -1505 210
4007 210 3133 559 -2779 -731 2137 1540 -391 -1221 -1182 439 817 -1336 -1506 1015 475 -1727 -407
4024 -407 1547 -1009 -2262 -131 468 -678 -118 328 -354 -801 -877 -471 959 642 -2523 -2128 2826 3000
4042 3000 -2286 -3242 1040 2144 92 -828 -1191 303 1256 739 -1235 -304 739 -769 -441 1179 97
4059 97 -1489 126 1102 -1404 -1022 1642 709 -1733 -1582 207 1515 136 -2230 -3096 1690 3429 -1826
4076 -1826 -4372 48 2842 -211 -1955 -800 89 669 269 -846 -964 484 172 -733 447 671 -353
4093 -353 406 1617 -839 -1527 1597 2631 -762 -1439 1497 2508 1593 -1007 -1849 741 3765 524
4109 524 -2252 260 2857 1186 -778 497 326 -250 697 1175 13 -91 316 85 1294 1009 -951
4126 -951 -1269 1654 475 -1798 -27 2113 493 -1831 -281 1385 385 -530 -1520 -786 1750 1712 -1077
4143 -1077 -1640 678 974 -547 834 150 -1832 152 2399 1584 -1721 -1381 466 1362 1022 -950 -1460
4160 -1460 1572 2214 -1524 -2027 1198 1595 -1811 -1395 876 1014 -263 -726 -1844 -383 1697 88
4176 88 -1917 -1526 -612 -730 889 233 -2862 -2564 1815 2062 -2073 -2915 -319 545 33 -1629 -1648 -230
4194 -230 961 -1243 -2520 833 1496 -1526 -2731 384 1248 140 -634 -1436 -1141 776 1595 -459 -1409
4211 -1409 -458 6 1036 1719 -658 -2666 697 3155 252 -1992 24 1440 682 -192 -185 -296 918
4228 918 583 -1144 212 2069 83 -1536 518 1622 -185 -60 1035 -86 -536 872 1180 -256
4244 -256 -107 147 120 1502 1108 -1600 -540 2385 1376 -1416 -368 1098 454 -13 782 177 192 670
4262 670 49 -593 931 824 -734 27 929 -150 228 1680 68 -2159 32 2453 691 -1718 -1390
4279 -1390 443 1969 1285 -2085 -2611 1142 2745 -754 -1975 349 388 -365 374 -714 -1441 145 1074
4296 1074 -649 -836 84 -506 -646 -88 -787 -1168 634 546 -2153 -1312 1833 933 -2319 -1882 -203 818
4314 818 819 -1380 -2823 -350 1794 42 -2212 -816 314 -422 20 -314 -1359 -1123 780 -122 -1071
4331 -1071 2 369 -498 -654 -204 -890 195 1399 -890 -1767 1275 2283 -753 -1749 -486 375 1402
4348 1402 1025 -977 -1193 1123 1738 -252 -845 -25 -440 574 1945 229 -1762 122 1537 280
4364 280 12 164 -77 54 624 604 78 1130 647 -1255 154 2391 1303 -979 -216 541 857 1283
4382 1283 607 -1623 -62 2080 1299 -318 -194 -39 244 1789 1080 -1313 -338 1848 979 -425 618
4399 618 1126 25 472 539 -175 1053 1542 -874 -1497 1439 2140 -150 -679 -308 190 1141 1141 -1127 -2097
4418 -2097 536 1497 -66 -759 -612 -808 207 747 -993 -1598 92 350 -1692 -863 552 -562 -1322
4435 -1322 -832 -1040 -117 363 -753 -2554 -359 1509 151 -1700 -902 -359 52 857 -485 -2418 -351
4452 -351 1920 -74 -1085 -614 -24 -160 650 -22 -1136 -229 1417 209 -1164 662 651 -203 520 72
4470 72 -599 248 1266 -800 -1287 1270 1694 -242 -618 -94 117 1342 1534 -1405 -1382 1462 1715 -196
4488 -196 -589 -155 -264 985 1478 -285 -1265 785 1445 -17 -67 511 359 725 1150 -165 299 1979
4506 1979 971 -1224 294 2022 923 -503 -66 228 1561 2291 215 -1567 382 2472 1104 74
4522 74 -249 -518 298 2170 434 -1544 -680 1535 711 -600 -476 -429 -108 517 -671 -1228 -5 584
4540 584 -1708 -1991 655 623 -1173 -1110 -825 -545 447 335 -1890 -1813 147 577 -477 -679 -1203 -1191 493
4559 493 1625 -1413 -1830 736 1195 -646 -713 191 -29 9 -39 -766 -39 1242 -697 -1672 425 1365 -245
4578 -245 -1019 71 -546 -198 1410 -99 -1881 -793 580 585 312 -593 -1802 -183 2061 25 -2521
4595 -2521 -887 1395 106 -839 -248 -303 -316 -37 -58 -420 451 360 -1005 -452 821 38 -407 159 214 -780
4615 -780 1054 2267 -291 -1453 493 1632 1145 186 -862 -230 2445 1615 -1070 -605 1803 1129 -424
4632 -424 280 1005 214 241 584 -90 168 1289 117 -436 454 481 152 251 -220 -1690 165 2420 679
4651 679 -2051 -1313 1401 883 -407 -1205 -1316 747 1574 -996 -2207 313 970 -825 -407 515 -613
4668 -613 -889 579 138 -1061 -324 424 -262 -366 -103 -94 4 814 -1275 -1417 1502 1697 -1479 -2226 734
4687 734 1300 15 -1082 -1110 -333 1226 243 -1865 -990 429 -377 -788 93 -920 -1843 73 1019 -1094
4705 -1094 -1676 161 59 -860 -641 -415 251 548 -1064 -2089 207 2185 -185 -2604 -188 1615 534
4722 534 -673 -662 -683 152 1624 339 -565 -340 99 662 1391 354 -1275 -489 2353 748 -1129 56
4740 56 1280 323 -582 245 744 1191 213 -816 -21 2500 1025 -1557 -825 1485 1027 -171 317 -65
4758 -65 -382 579 1502 -194 -792 -328 478 1092 811 -876 -1157 1415 1177 -1400 -848 1665 372 -1289
4776 -1289 -88 924 1168 673 -957 -1008 1393 1605 -871 -1873 1155 1214 225 659 27 -1133 -352 1740
4794 1740 764 -1258 -719 406 1182 1008 -901 -1667 427 1188 -833 -1508 980 1138 -1344 -940 496
4811 496 382 -289 -1081 -905 -214 1122 -266 -1105 -346 118 -523 -96 583 -977 -1743 885 1739 -937
4829 -937 -2152 -593 616 305 -762 -1345 27 1463 -251 -1710 109 1397 -534 -1800 160 653
4845 653 -209 11 -471 -757 65 1016 -80 -515 -435 -480 381 1552 -618 -2265 320 3100 469 -1904
4863 -1904 -945 1246 805 50 -1018 -879 1201 1099 -1141 -439 1056 56 -953 568 1012 -504 -175
4880 -175 647 185 -453 487 658 78 -305 -169 338 1338 385 -1979 -589 2537 1512 -1254 -1089 1555
4898 1555 1324 121 1 -500 359 1105 355 -342 1032 770 -611 220 1099 -397 -869 1025 1140 -703
4916 -703 -181 1256 908 -799 -693 97 1197 1433 -1222 -1417 1101 2134 -332 -1666 -56 287 66
4933 66 217 239 -1065 -303 194 17 42 -418 -1260 -606 971 40 -1734 -351 1079 -941 -1353 682 572
4952 572 -1219 -1311 -326 670 987 -922 -1944 -88 1723 72 -1292 -500 392 -341 82 421 -1100 -1263
4970 -1263 487 690 -276 -249 -559 -92 999 299 -1211 -597 1317 -248 -1805 18 1857 510 -1369
4987 -1369 -626 566 930 436 -1130 -1109 1076 1315 -299 -179 340 -309 41 990 186 -1749 -204 1332
5005 1332 381 -516 221 197 175 457 -670 457 1092 357 -1337 -156 2064 1134 -1033 -541 856 915
5023 915 995 -9 -824 172 1372 1027 -336 88 -133 259 1490 1152 -1152 -679 1621 1261 -530 -607
5041 -607 352 840 728 -207 -773 554 1047 -831 -1076 556 808 -435 -631 72 -183 -252 468 -600 -1151
5060 -1151 -407 508 102 -315 -845 -1380 404 1144 -897 -2080 -35 1077 -300 -1105 -177 -54 111 110
5078 110 -1001 -595 517 -11 -1588 -373 869 -435 -788 -63 -374 -553 734 357 -1321 -1252 862
5095 862 826 -553 -1100 -1147 289 1648 15 -2443 -1157 1201 442 -1213 -950 -260 -240 108 -184 -1025
5113 -1025 -338 271 -482 -770 587 -131 -993 -115 191 -588 398 860 -584 -1041 331 1427 185 -524
5131 -524 -403 124 1386 822 -706 -880 1267 1179 -279 -275 706 -12 -35 741 602 189 573 673 -502 458
5151 458 1111 357 42 237 -313 245 1222 215 -1373 -346 1658 724 -673 -717 -385 511 1485 -90
5169 -90 -1616 -97 1087 194 54 -26 -588 -520 334 644 -886 -399 383 -206 -691 415 220 -539 -232
5188 -232 -364 -528 940 848 -1022 -1576 302 1406 24 -619 -997 -112 1377 826 -901 -1218 577 1008
5206 1008 -351 -793 -569 -676 190 92 -806 -984 577 201 -1347 -887 327 304 107 -491 -1162 -122 1090
5225 1090 -343 -2191 -797 1012 795 -470 -768 -1095 -115 1003 -169 -1582 -829 895 381 -142 89
5242 89 -646 -206 591 273 -524 447 799 -457 -183 775 669 23 236 88 69 823 929 -508 -507 1176
5262 1176 994 26 251 -387 -156 1153 1231 -440 -666 709 1130 115 61 161 -16 527 645 -268 -436
5281 -436 527 534 169 406 282 -109 434 970 -425 -427 995 639 -600 -619 1038 576 356 26 -616 427
5301 427 1431 252 -1171 -1 834 430 203 144 -562 -4 1057 444 -744 -641 369 -13 -246 49
5319 49 -335 155 517 -569 -833 904 744 -1403 -1707 335 1032 -183 -995 -1216 -194 1147 667 -1639
5337 -1639 -1543 204 556 -97 -429 -1007 -1026 145 932 -847 -881 245 399 -253 -395 -88 -408 100 -388
5356 -388 -888 518 908 -429 -1547 -53 794 185 -302 -639 -547 556 1047 -123 -925 30 424 137
5374 137 491 213 -710 -44 1337 598 -541 81 695 387 -120 306 175 479 336 -503 -141 1276 470
5393 470 -760 -674 979 629 -272 -100 -392 -584 715 1288 76 -598 -271 592 1027 642 -859 -1045 1043
5412 1043 1937 -180 -753 424 610 301 -9 162 226 973 122 -818 77 843 113 -480 424 240 47
5431 47 300 225 -829 -357 908 834 -825 -886 164 742 875 -916 -1527 301 1730 -519 -1575 60
5449 60 729 -133 -607 -257 -137 179 128 -732 -528 627 63 -913 -473 229 -186 -137 165 -1282 -1352 784
5469 784 863 -1058 -1334 -121 654 578 -626 -1366 -445 1129 191 -1172 -124 896 -175 -906 334 361
5487 361 -817 -315 130 -343 247 7 -166 -337 346 -48 -238 622 190 -1426 -336 1503 96 -1241
5505 -1241 -304 488 632 174 -640 -829 727 800 -181 -8 631 -37 -461 694 846 -532 -161 680 394
5524 394 -228 24 267 161 -52 -588 -53 1465 928 -1239 -1042 1470 1461 -742 -825 436 1386 866 -64
5543 -64 -760 17 979 968 -478 121 102 -50 528 1083 -668 -711 706 1015 -627 -662 790 411 -324 -566
5563 -566 -211 1299 750 -1032 -1685 923 1902 -508 -1894 -370 973 627 -6 -684 -474 128 570 -30
5581 -30 -297 -231 -796 -215 796 -145 -1166 -16 588 -487 -996 505 877 -676 -803 -360 722 466
5599 466 -658 -1612 -97 1044 185 -1473 -471 575 -503 69 19 -384 -974 105 471 75 -500 -459
5617 -459 -476 758 246 -1023 -682 1112 261 -1149 90 751 -299 -533 -88 242 387 236 -651 -403
5635 -403 258 596 -470 -107 -19 -316 -165 1254 383 -1160 -253 1261 942 -280 -857 15 1201 1125 -149
5654 -149 -593 1097 1225 -873 -592 1021 892 11 -22 326 599 623 -106 -693 -4 762 567 -101 -30 -115
5674 -115 -502 1142 1171 -1285 -1465 1518 1457 -546 -675 -197 500 862 -226 -1117 622 1288 -273 -910
5692 -910 646 609 -748 -721 400 333 -119 -24 25 -270 417 387 -48 -484 -365 -609 472 1072 -558 -1440
5712 -1440 509 1756 -371 -1193 -485 229 272 -70 -649 -86 567 -374 -692 -76 667 -920 -1039 326
5730 326 197 -638 -210 135 -1033 -1032 286 558 -76 -460 -1244 -149 1186 432 -1566 -948 956 690 -916
5749 -916 -727 -62 -317 299 451 -589 -620 103 -150 69 236 -303 -632 286 906 -624 -53 1215 275
5768 275 -1072 -57 1306 816 -180 -852 -124 1209 1458 -1026 -1449 648 1375 -104 -259 117 201 426
5786 426 996 324 -536 180 684 227 11 102 -337 527 621 -456 -283 1309 648 -1270 -961 1282 1478
5805 1478 -32 -711 -186 777 1303 44 -991 89 1159 93 48 788 71 -427 652 809 -272
5822 -272 -142 396 518 177 -127 70 -6 213 -100 -636 590 1024 -821 -1200 576 835 -526 -1149 -200
5841 -200 -113 459 428 -900 -606 102 -162 -468 74 -256 -702 -142 746 -183 -1176 -210 540 -93 -367 41
5861 41 -262 422 180 -844 -705 817 154 -984 -278 699 201 -120 166 -312 -301 504 476 -585 -158 86
5881 86 377 490 108 -399 -149 1522 583 -1150 -438 792 476 -472 -252 -95 188 218 -235 -621 1001
5900 1001 797 -639 -531 738 594 -236 -203 -287 -65 924 1055 -513 -987 32 997 566 10 -564 -199
5919 -199 1674 1421 -520 -1137 630 1187 -263 -28 82 311 341 281 -232 207 692 -114 -681 269 1075
5938 1075 96 47 311 -382 -36 852 529 -640 -514 837 779 211 -603 -831 -70 1157 91 -968 -136
5957 -136 333 -217 -211 131 -184 -346 27 -121 -431 169 148 -645 -593 142 -7 -356 118 -474 -1113 568 817
5978 817 -555 -1082 -250 226 241 -47 -1013 -1209 698 777 -507 -1098 -5 106 -198 2 -411 -787 -42
5997 -42 780 -220 -329 249 -371 -859 -153 -88 -279 35 -134 -1015 3 1217 -165 -1291 -235 207 181
6016 181 -49 -395 -971 281 992 -243 -1143 240 650 -32 -83 148 14 174 859 -232 -653 882 853
6035 853 -424 -443 202 547 210 192 -545 -460 1044 1097 -526 -249 195 797 660 204 -363 -376 670 957
6055 957 -288 -465 576 67 225 27 170 -255 424 93 -247 153 417 -56 -345 222 262 -123 -129 175
6075 175 -57 45 822 57 -712 -65 525 376 712 -497 -927 151 953 -100 -915 119 264 87 109
6094 109 38 -710 -315 632 -264 -731 73 338 -313 -271 51 -180 -161 217 -473 -633 336 732 -525 -1012 -202
6115 -202 49 434 -29 -1562 -990 697 640 -804 -1056 -180 120 133 243 78 -599 442 211 -441 -305
6134 -305 -256 -252 -443 302 -180 -330 357 -172 -975 -1 1525 276 -1327 -418 709 837 624 -391 -967
6153 -967 578 1359 -105 -598 39 88 221 577 339 -339 -138 633 226 53 241 81 -293 175 259 -42
6173 -42 630 749 -679 -393 1066 990 -615 -478 451 279 725 226 -232 132 683 469 59 568 -42 -220
6193 -220 362 969 34 -665 606 944 -138 158 260 3 108 230 -1 348 590 81 -826 507 1175
6212 1175 -143 -870 -223 65 273 356 -197 -685 -143 519 -22 -561 -491 -576 239 1062 -152 -1416 -147
6231 -147 1054 359 -975 -272 355 -262 -103 -634 -117 145 83 -1046 -602 1031 412 -766 -419 33 99
6250 99 -21 20 -674 -470 268 465 -276 -426 -719 28 734 178 -1203 -695 966 99 -1036 -829 658
6269 658 17 -301 -312 -38 190 411 -449 -751 593 696 -465 -462 257 89 -350 522 -35 -1053 -443 1090
6289 1090 341 -502 -459 -171 825 1054 -481 -936 453 1254 -113 -623 590 415 -407 225 675 271 -292
6308 -292 62 -234 443 727 -70 -119 345 200 -230 669 788 -808 -565 720 1090 -212 -822 -299 88
6327 88 859 189 -721 -259 761 331 -491 198 647 -153 -275 704 114 -338 -108 29 -34 -109 131 94 25
6348 25 -155 -1021 75 996 -751 -1878 -210 1158 446 -899 -823 -107 406 346 -540 -663 192 65 -608
6367 -608 102 387 -441 -504 261 200 -759 -349 445 -97 -414 -155 349 18 -493 -824 -268 1023 284 -1669
6387 -1669 -622 817 945 -928 -734 -58 23 376 -86 -522 -33 224 -425 -211 175 -58 -690 176 545
6406 545 -693 -442 481 445 -709 -85 590 504 -331 -531 -139 1136 657 -536 -830 463 866 -374 -487
6425 -487 397 378 150 462 346 -332 -108 301 349 378 -347 -358 523 1066 174 -693 681 696 -379 -570 282
6446 282 735 116 -201 27 390 1374 -180 -1006 -109 1235 520 -104 289 197 -229 345 507 -392 -491 113
6466 113 766 201 -115 -792 107 1068 -200 -1361 -245 922 -61 -887 -100 719 -65 -371 -758 181 661
6485 661 134 -397 -375 326 481 -393 -57 -45 -951 142 969 55 -1214 -299 603 478 -287 -906 -289 583
6505 583 71 -601 -602 532 -32 -858 -626 414 -338 -783 -447 -257 -47 382 -127 -849 -558 -16 -296 241
6525 241 98 -939 -649 766 580 -1097 -939 463 735 -140 -305 -429 -16 416 -53 -496 273 276 -496
6544 -496 -401 900 342 -571 78 173 -138 -87 565 25 -169 138 511 580 561 -416 -888 594 1512 -189 -876
6565 -876 461 727 442 -37 -148 285 -27 353 -350 251 423 75 -384 353 379 -448 34 424 89 -411
6585 -411 570 524 -507 -428 40 521 554 -417 -808 196 1453 210 -1033 -169 375 391 -129 -65 -260 -207
6605 -207 250 51 9 93 175 -314 -155 284 -260 -233 560 69 -845 261 694 -302 -750 -169 431 389 -225
6626 -225 -942 -444 802 621 -1050 -577 138 203 -468 87 -249 -621 -433 80 -206 -452 -206 -504 -148 -204
6646 -204 -332 -703 100 185 -1156 -498 876 233 -839 -401 606 448 -122 -667 -812 93 680 42 -613
6665 -613 -418 240 102 220 272 -839 -379 797 572 -524 -363 608 476 479 126 -273 149 820 -135 -374
6685 -374 739 557 -274 -331 -35 635 395 -222 -367 -315 743 955 -139 -350 285 394 519 766 -163 -588
6705 -588 240 838 51 -247 368 289 165 116 61 272 801 -68 -77 271 1137 -34 -694 27 624 376 57
6726 57 -126 -184 103 1038 152 -389 -409 124 104 539 184 -579 -574 770 185 -732 -318 329 71 -434 209 -52
6748 -52 227 286 -454 -486 736 223 -963 -688 239 -42 183 22 -578 -647 386 310 -629 -690 -523 201 124
6769 124 115 -787 -777 317 267 -711 -501 198 -139 -360 -40 -83 -71 13 -180 -281 -34 517 33 -462 -343 393
6791 393 174 334 -260 -626 -217 613 429 -437 -398 337 347 617 -173 -747 129 932 116 -487 24 140 -133
6812 -133 395 -51 -162 140 579 216 -168 666 343 -11 -361 27 64 366 676 -344 -409 663 619 -53
6832 -53 -614 345 265 756 471 -592 -240 525 820 -32 -319 337 217 220 336 -348 -263 570 351 -265 115
6853 115 521 52 -602 131 -39 33 295 -365 -653 -55 652 -83 -759 -356 -23 -237 138 -199 -1020 -277
6873 -277 317 85 -478 -514 -372 -87 333 -71 -417 -308 132 -305 -571 266 5 -531 -110 43 -248 24
6893 24 506 -442 -660 264 601 -147 -253 -354 118 392 449 -820 -851 457 770 -314 -360 -101 71 159 49
6914 49 -151 -248 132 -44 -310 111 430 -302 -356 -81 8 22 362 72 -754 -67 658 39 -466 -539 -78 259
6936 259 542 -4 -866 220 1089 168 -167 175 295 -68 437 321 -196 338 224 -146 -19 659 341 -122
6956 -122 143 230 101 937 403 -373 -540 707 1021 -96 -225 -131 190 722 480 -427 -271 631 430 -346
6976 -346 -196 169 -283 -234 368 -56 -412 40 -67 -143 -158 324 -219 -74 160 -183 126 613 147 -1057 -190
6997 -190 608 233 -575 -394 -96 228 650 -48 -728 -187 191 -317 -270 -14 -531 -312 615 242 -576 -443
7017 -443 372 -44 -250 -375 -259 -10 -338 -302 -478 601 567 -573 -917 375 468 -257 -715 -336 -85 505
7037 505 113 -894 -776 161 149 -304 -207 -506 -497 193 141 -595 -386 297 561 -333 -247 -169 40 92 -492 -555 480
7060 480 776 -365 -1025 418 945 -67 -387 90 -173 307 581 92 -253 -142 526 494 416 -348 -240 159
7080 159 1134 31 -561 175 613 0 10 95 603 176 -285 23 301 714 54 -642 -9 1067 406 -410
7100 -410 -2 395 77 356 359 -286 -370 332 388 299 67 -453 71 851 517 -730 31 670 -229 -372 100
7121 100 514 -174 -251 -53 23 160 244 -517 -197 441 302 -145 266 102 -689 21 869 -82 -1279 -656 636
7142 636 768 -128 -462 -643 467 541 -840 -726 305 440 -816 -180 448 0 -497 -191 -112 -181 134 52
7162 52 -345 -10 382 108 105 21 -863 -670 657 502 -1049 -1145 309 645 -174 -819 -531 268 675 -241 -1039
7183 -1039 101 526 -221 -671 151 308 -483 -153 207 -145 330 -27 -100 -173 -31 177 274 396 -194 -446
7203 -446 680 1374 87 -999 -4 865 237 60 -263 149 437 149 207 54 606 16 -283 900 549
7222 549 -492 -185 635 265 -488 188 606 176 -196 179 362 503 143 -524 -157 660 330 -1005 -186
7241 -186 620 38 -96 -38 -476 -254 284 199 -107 -242 -102 27 635 520 -347 -647 812 140 -563 -331
7261 -331 660 -138 -620 -364 277 445 -123 -440 -375 359 573 -801 -981 428 123 -17 -247 -263 -478 -223
7281 -223 435 -100 -522 -538 -219 -438 151 -719 -565 151 460 -719 -818 314 -71 -1080 -971 299 433
7300 433 194 -297 -453 368 814 -302 -886 -80 464 -252 139 261 -358 -404 783 492 -263 -244 -25 141
7320 141 398 177 -381 -105 494 58 -481 418 492 -395 -746 533 650 102 125 29 40 328 489 -334 -60
7341 -60 275 -31 289 773 -68 -858 -108 1092 328 -859 -60 48 226 292 -105 -389 432 197 -269 51
7361 51 588 74 -453 25 348 -21 -3 329 -307 207 401 582 118 -109 -385 146 620 194 -1057 -558
7381 -558 995 727 -733 -658 -1 97 -2 -429 -380 -137 336 -8 -341 152 166 -785 -526 73 -196 -188 30 3
7403 3 -579 -131 524 -139 -975 -458 -299 399 253 -936 -818 332 749 -586 -826 351 218 -52 -215
7422 -215 -61 -190 24 219 -654 -3 258 -298 -199 200 229 -360 -1 157 -455 -175 504 133 -389 -34 -14
7443 -14 254 256 -191 -753 203 853 -148 -553 188 224 -466 348 299 -352 78 15 338 210 219 -22 -256 575
7465 575 373 -143 0 616 15 -377 508 876 -113 -346 125 571 833 341 -554 -605 674 515 160 -182
7485 -182 530 146 554 651 -35 -281 161 686 419 -182 263 305 -4 -49 -296 -3 413 92 -907 -622 898
7506 898 296 -660 -576 20 285 446 -310 -1245 -238 517 255 -385 -138 27 -38 367 32 -784 -127 138
7526 138 -111 -493 -354 -97 -157 -171 -273 -67 667 83 -843 -773 477 488 -871 -789 -198 189 432 7 -993
7547 -993 -576 609 284 -82 -410 -236 -187 237 572 9 -688 331 295 -355 -283 208 -58 -185 100 -185
7567 -185 -218 196 -105 -657 177 821 -69 -292 134 -162 -235 586 222 -660 135 819 214 -231 249 219 -1
7588 -1 856 322 -558 -176 593 200 -208 222 124 181 318 409 -296 31 372 -230 -756 441 613 -141 -227 -43
7610 -43 -113 707 575 -94 -513 564 696 179 -210 -201 130 602 423 -445 -568 457 400 -145 -114 -94 -19 184
7632 184 479 -189 17 453 98 -616 -75 491 -15 -350 -328 -56 72 365 -203 -652 269 630 -236 -485
7652 -485 -26 -124 87 64 -244 -351 -194 307 -93 -336 -217 -23 -182 -22 -442 -160 239 197 -808 -458 552
7673 552 98 -222 -310 -135 -138 180 245 -411 -535 439 -15 -72 -64 -398 -221 -1 432 -533 -500 117 656 37 -247
7696 -247 -226 -250 -73 455 -158 -137 436 -149 -140 244 280 -65 -196 143 -470 141 497 -155 -514 25 548 -68
7718 -68 254 187 -395 123 1258 -76 -833 -68 725 -45 -143 -38 240 242 566 -176 -13 295 556 -53 2
7739 2 704 109 4 98 28 -116 397 531 -364 -67 -145 829 568 -146 -560 -194 778 449 -843 -737 680
7760 680 -13 -136 247 -13 -230 -50 35 -172 106 38 -499 -521 553 384 -98 -7 117 -292 -165 398 323
7781 323 -851 -475 265 379 -71 -62 -327 329 777 -511 -571 231 303 -205 51 144 -253 -711 94 -42 -376
7802 -376 -48 -109 -425 218 -74 -120 -189 416 -309 -416 366 546 -206 -677 27 364 -75 -368 -642 -340 433
7823 433 190 -369 -479 373 -180 -195 260 -221 -450 344 449 -426 -241 181 132 -235 113 291 106 533 23
7844 23 -548 681 1055 21 -988 122 1072 527 43 -118 -20 580 555 -256 -631 269 231 -13 447 49
7864 49 -573 -46 575 158 -163 212 282 198 -111 176 149 476 168 -704 143 887 414 -914 -239 342 624
7885 624 -123 151 -87 386 185 301 -477 6 -216 189 181 429 -174 -538 516 640 -452 -178 381 245
7905 245 -364 -252 91 30 -51 -495 -587 374 198 -649 -662 28 353 -221 -78 -524 -560 -288 487 59 -555 -632
7927 -632 -27 293 395 -590 -845 13 681 -175 -696 -43 238 -356 -211 -63 -35 -329 -467 -445 285 709 102
7948 102 -962 39 212 249 351 307 -518 -467 426 566 -602 -384 192 733 503 -254 -524 -294 658 150
7968 150 -806 240 522 -151 -600 180 755 -34 108 -264 -115 440 320 -151 -76 348 54 77 699 -126
7988 -126 -478 477 943 75 -531 58 767 414 52 -270 -15 871 589 -349 49 745 30 -76 306 897
8008 897 448 5 259 356 166 318 160 119 39 -288 -195 331 229 -302 -215 769 697 -749 -641 257 308 189
8030 189 -281 -296 -103 314 -91 -399 -143 219 -438 -75 162 -135 -722 167 145 -312 -116 172 -36 77 -516
8051 -516 -317 571 386 -153 -649 133 1037 38 -747 -40 276 176 -40 -239 -409 -88 250 233 -128 -113 -527
8072 -527 -27 219 206 -460 77 435 -364 -237 327 272 -145 -294 -317 156 398 -171 -734 32 1228 174
8092 174 -719 -190 152 235 123 97 -241 -147 454 321 42 202 -112 -138 437 486 -454 38 793 -215 -758
8113 -758 431 639 210 -287 201 425 732 58 -243 -154 599 591 -389 18 625 -145 9 548 108 -241 -195
8134 -195 498 202 100 -120 316 182 275 -121 -190 411 -97 -641 9 646 216 -565 -145 150 532 62 -255
8155 -255 -419 339 306 36 -329 -41 -485 -519 455 414 -585 -529 197 308 262 -709 -232 -327 212 -17 -497 138
8177 138 446 -364 -651 353 418 -572 -562 15 62 -179 -194 -392 -523 -125
8191a25
$$ Imaginary data points
##PAGE= N=2
##DATA TABLE= (X++(I..I)), XYDATA
0 0 0 0 0 0 8 0 8 -8 12 -16 22 -24 32 -40 48 -56 65 -79 92 -108 128 -147 171 -197 228 -259 295 -335 380
29 380 -429 484 -544 609 -680 760 -846 941 -1043 1160 -1283 1421 -1574 1742 -1930 2138
45 2138 -2373 2639 -2940 3287 -3692 4171 -4747 5460 -6363 7551 -9191 11614 -15561 23102
59 23102 -42701 197711 415414 -52525 -150743 87979 277929 153905 -1985 -51534 65061
70 65061 166611 145732 47352 23300 14463 32481 92833 91422 -26502 -28634 96474 102289
82 102289 -13903 -9469 62242 39922 -13127 3183 36937 61713 47026 -15565 -5634 102372
94 102372 88202 -52698 -39617 111671 110643 -11057 -17290 67310 98382 71135 20951 -5005
106 -5005 47186 100834 64666 23569 31963 24159 41158 116426 83352 -62469 -55679 108077
118 108077 136306 2908 -66182 -18925 57960 97918 26786 -94615 -77919 48069 74563
129 74563 360 -47130 -64059 -37893 52701 64718 -67627 -133369 -27650 69861 39477 -47246
141 -47246 -96666 -37303 79019 60483 -78636 -80046 50023 58723 -28429 -10908 49800 26408
153 26408 -3945 21865 48511 55773 36560 -8685 12745 103359 103138 9617 -2795 61412 80334
166 80334 73507 62071 5739 -6275 94225 139366 36665 -38059 19234 97488 98930 19475
178 19475 -60367 -2599 133333 99362 -72212 -78158 77029 107906 -8616 -67813 -21715
189 -21715 46647 66852 3478 -68308 -36677 33476 28131 -3462 -12313 -36497 -23774 55869
201 55869 55477 -51884 -67437 28768 50355 -5462 -10855 12226 7627 4412 10428 17866 36238
214 36238 14911 -41718 -4659 98132 66191 -59266 -53325 53517 73650 18277 -16533 -23092
226 -23092 6161 54826 41894 -15512 -27873 -13627 14 42604 44198 -52841 -88328 20904
238 20904 77998 -12629 -80375 -40194 9531 20337 -4562 -54972 -58162 601 15107 -30100
250 -30100 -41561 -27684 -27458 -1568 14576 -47773 -78497 8695 57010 -24121 -81498 -29115
262 -29115 32833 31501 -21013 -71876 -34344 56785 45731 -46312 -47316 21588 22753 -8610 95
275 95 -1732 -19776 -2413 15249 3262 7615 9073 -26386 -24604 28203 31536 -14606 -29630 -25133
289 -25133 -10519 42332 48132 -49928 -94067 7233 84653 22766 -68354 -76917 -3605 76376
301 76376 46102 -74123 -91914 23397 69542 -5673 -50621 -26279 1931 24350 22905 -22856
313 -22856 -36670 11184 26207 -5012 -6045 5569 -4409 9712 26298 -7573 -21213 25661
325 25661 33164 -9350 -3096 28823 12317 -4723 11821 14387 6646 11211 1805 186 36512
338 36512 33935 -25646 -23170 40831 38766 -12508 -13713 7988 9596 20328 19210 -16309 -21493
351 -21493 17365 27409 10096 -148 -22267 -23877 32626 49677 -28958 -64829 8123 56931
363 56931 20594 -26362 -42720 -19647 36904 45039 -26590 -60482 -7384 35322 24401 -4779
375 -4779 -43585 -48667 20425 59037 -13475 -67718 -15034 34464 10307 -21200 -27305 -16638 8491
388 8491 7566 -27640 -19343 21884 -827 -45922 -14918 29014 6247 -24882 -23154 -15293 8656
401 8656 28906 -13350 -56951 -13469 42431 19175 -25230 -29994 -10769 22111 30708 -22886 -53655
414 -53655 8771 52579 -3730 -47611 -9755 28036 21356 -6806 -37754 -23864 39564 44661
426 44661 -32740 -58784 4219 43610 20567 -17237 -43553 -24649 39633 48938 -24392 -54276
438 -54276 -1984 31216 15830 -1815 -20134 -23865 13125 33069 -1091 -16818 5374 4518 -4110
451 -4110 16173 18441 -6405 -2033 13193 3928 11240 29676 2870 -25190 8754 41007 22204
464 22204 1803 -1962 -3539 20525 43690 8395 -29583 -440 34265 22682 8251 -52 -14110
477 -14110 4624 37704 12185 -30682 -8419 26231 11054 -10647 -12704 -10250 7915 19062
489 19062 -17588 -38720 8595 35522 -11632 -43687 -18821 7250 13858 2730 -33746 -39153
501 -39153 14930 37677 -13418 -42919 -15032 9493 13774 7716 -19423 -26968 12779 27002 -12578
514 -12578 -21160 11807 12111 -7459 -598 9911 8583 9947 -4888 -21448 10528 43583 2950
527 2950 -40641 -8338 35080 25181 -5836 -26188 -20499 23638 43639 -8496 -48731 -9938 29385
540 29385 13625 -9979 -22200 -22737 9487 33159 -6284 -42445 -9455 24113 5395 -16056
552 -16056 -14357 -5309 12527 15088 -17262 -22129 21440 28322 -13072 -15136 17237 19068 7213
565 7213 9117 563 -593 24841 29590 4281 2261 18391 18209 22321 27416 3519 -5526 32159
579 32159 41133 1391 -3593 29083 28370 6708 7659 15191 18034 20585 3934 -8944 20187 38800
593 38800 1593 -21530 7516 23178 10105 7270 -2329 -20527 3282 41872 20582 -26752
605 -26752 -25804 10689 35620 25801 -20513 -41522 13479 59723 15710 -33823 -6153 31058 22671
618 22671 8570 5565 2020 13348 24413 9422 3387 23519 23526 6146 12511 20705 11742 20280
632 20280 26805 -4208 -13806 32327 48248 2575 -22792 3432 29952 27845 521 -25991 -5748
645 -5748 35325 18772 -26244 -13641 17712 617 -19715 -5104 985 -6896 -4635 -9456 -20135
658 -20135 -4724 8088 -12234 -25802 -14248 -7317 683 9500 -16526 -45090 -8939 35883 7486
671 7486 -38613 -26443 9721 21544 7975 -19764 -26161 8649 26328 -2643 -13569 9845
683 9845 8048 -7121 9166 18946 -3654 -7096 12306 8959 -1912 5886 9133 1832 1431 -1837
697 -1837 75 21139 16659 -25606 -24682 27115 31036 -19087 -29851 3674 19329 10309 -7032
710 -7032 -20203 -6399 17153 5314 -16518 -4141 7122 -4155 2448 14053 -7251 -16854 13995
723 13995 19298 -12447 -13002 17669 24179 4482 -11351 -5718 24732 35135 -9396 -35937 15149
736 15149 53453 11491 -25499 -1088 24368 19388 8451 -6022 -13509 6184 22566 7310
748 7310 -7129 -6597 -5935 4990 15427 -12101 -36106 -1844 26397 -10605 -40259 -10085 13727
761 13727 -9467 -35944 -32500 -6144 11398 -14285 -50571 -27669 17295 -877 -44187 -37510
773 -37510 -11870 -10799 -10327 -10842 -30984 -33901 -3608 7485 -15185 -33194 -29888 -7825 13935
786 13935 -3474 -41396 -25067 21768 8347 -35709 -23318 12802 4159 -20144 -17145 -1169
798 -1169 10681 5113 -20525 -24668 6134 14970 -10661 -17519 -5414 -7588 82 18542 -1341
811 -1341 -36636 -19014 20858 14900 -17916 -28662 -10875 17751 17781 -20818 -33690 6578 21121
824 21121 -16387 -23797 10445 13389 -11681 -12883 -44 2971 4366 -2093 -13761 -3231 16021
837 16021 11523 632 -1228 -10685 -6839 24995 25332 -21325 -27424 22633 40752 4893 -20282
850 -20282 -9275 14814 23927 2088 -19742 1923 27585 5326 -16251 6304 17798 -6577
862 -6577 -13429 2888 4805 1546 5742 -1814 -12628 -3451 5994 1233 -4939 -18003 -22293 7910
876 7910 29281 -9548 -44437 -8565 28566 3323 -29515 -20989 818 8347 -780 -17264 -12853
889 -12853 7791 982 -20798 -8491 10793 -4375 -15036 1584 1763 -11436 -841 7731 -11195
902 -11195 -19220 1502 14902 7199 -11483 -22830 -1908 29229 8139 -38636 -22430 26807
914 26807 19582 -17857 -16692 3682 6132 681 -5230 -10583 -3320 3831 -5150 -4126 6179 -3111
928 -3111 -11727 3896 5459 -17639 -10435 17672 5581 -22636 -9748 17749 14167 -9128 -22686
941 -22686 -10484 19673 19960 -18473 -26350 13634 26890 -2549 -12628 -259 202 1078 10174 3100
955 3100 -8838 883 11238 7960 3670 -2532 -6551 9181 18286 -5662 -13103 18611 23482 -11587
969 -11587 -16438 14608 22277 1994 -11191 -6052 13886 26009 4126 -19962 -2123 21851 9023
982 9023 -3938 2479 -20 -2800 14935 18068 -7079 -13136 6153 12926 5347 -1702 -6520 1717
996 1717 15638 3574 -15648 2239 20921 -4096 -22168 4015 21586 3221 -12662 -9253
1008 -9253 1251 12790 7239 -15373 -15953 6078 8060 -2414 634 -3593 -16377 -1479 19099
1021 19099 -409 -24481 -9387 10227 4269 -6669 -9033 -5778 4790 2345 -15034 -8244 14569
1034 14569 2458 -24342 -9688 16170 5463 -13499 -10942 -4782 802 8265 -463 -14886 -8331
1047 -8331 2838 1706 2337 -2041 -19129 -12783 17098 12284 -20516 -17581 9112 7272 -8795 -8213
1061 -8213 -2457 31 -683 -9169 -9299 9621 9055 -17644 -17252 9933 11645 -7058 -7302 -3838 -5408
1076 -5408 6604 14188 -4825 -17216 -2171 11716 10572 2776 -11983 -11682 17168 25099 -6784
1089 -6784 -18729 9874 20162 311 -4920 4404 7817 8837 5139 -3598 4778 18857 6978
1102 6978 -8644 2693 13865 6442 5351 5638 -5736 -1404 21397 15888 -11135 -10676 10285 16403
1116 16403 8253 -5535 -13854 3315 23089 5558 -18501 -3694 15728 4446 -6360 252
1128 252 1477 779 4741 -1179 -6904 4950 10096 -5505 -8525 3369 4412 2943 4988 -7028
1142 -7028 -13353 10161 22174 -4539 -21680 -2090 15371 11539 -1967 -15705 -10352 16014 18780
1155 18780 -10573 -17828 4128 9967 66 -1908 -5442 -9510 2623 9111 -7103 -11841 2435
1168 2435 3346 -5899 -5003 -4404 -4699 2595 -835 -18283 -10448 13163 4529 -20064 -14814 4476 6516
1183 6516 -626 -10614 -17430 -2270 14858 400 -18691 -7727 6302 1884 -745 -1124 -8501 -3035
1197 -3035 10853 2307 -10783 808 11471 -174 -6460 1368 5503 8930 6656 -9759 -10081 17684
1211 17684 23432 -6323 -18180 2576 16588 13104 2697 -12567 -10470 15764 21484 -4380 -13866
1224 -13866 509 8465 7668 5926 -5656 -10646 6343 11599 -5580 -7258 6746 3003 -6233 -39
1238 -39 4518 1439 2236 -3006 -11015 2105 17042 853 -16729 -4303 9498 7001 2922 -5033
1252 -5033 -11961 2556 18368 2857 -15623 -4210 8845 4573 736 -1733 -5566 3439 11095
1265 11095 -3340 -12363 4400 11224 -3858 -8639 -1792 777 5914 5577 -13050 -18204 6486 16057
1279 16057 -5837 -18970 -9758 1813 9295 3065 -19371 -22120 4622 13653 -8772 -18814 -8330
1292 -8330 -2306 734 1006 -11212 -16992 -1390 3905 -9930 -10726 -1863 -4891 -7920 -2792 -4641 -5610
1307 -5610 2147 -3933 -17718 -4864 14189 778 -19662 -12010 3975 8037 3087 -12767 -19313
1320 -19313 2976 19478 -904 -20422 -8331 5426 4400 1136 -7520 -14774 -198 13928 -1752
1333 -1752 -16891 -4822 6914 1416 -4367 -8778 -8071 6177 10062 -12266 -19150 5588 14060 -4740
1347 -4740 -13244 -4775 1704 6651 3484 -10665 -10851 7219 8801 -4129 -4294 245 -3469 2011 10488
1362 10488 -580 -8976 4112 9843 -474 -733 5239 592 -1168 4241 3850 3898 8524 -936 -9335
1377 -9335 8381 20046 49 -13521 256 11182 8496 4854 -4482 -10216 4840 17075 4366
1390 4366 -8211 -5004 -1218 5562 12791 -1363 -20181 -4923 18654 7031 -13006 -8859 2062
1403 2062 4222 1943 -6369 -10202 3014 7557 -8571 -11107 4991 3597 -9002 -4992 -174 -4418
1417 -4418 16 4952 -7365 -13289 1072 7039 -2268 -7754 -8128 -4037 7284 5269 -14279 -13437
1431 -13437 9011 7159 -12890 -8738 7163 2824 -9265 -9129 -2551 6576 5516 -13009 -18116 6441
1445 6441 18113 -3126 -17061 -8401 221 6592 10320 -6860 -23408 -5154 20468 11886 -12113
1458 -12113 -18179 -4933 14649 16061 -9084 -21864 2551 18950 856 -10423 1709 5132
1470 5132 -1376 2324 5274 374 1530 3220 -616 3371 8530 917 -1786 7998 5204 -3851 6294
1485 6294 14020 -1494 -7774 8897 13716 2149 -2308 2236 6781 10185 3795 -6954 2243 15639
1499 15639 3607 -8118 5391 14032 2063 -2232 3558 792 772 8658 4392 -6884 -2175 7564
1513 7564 9282 5522 -6611 -15273 4062 25520 4385 -26003 -11712 19130 16608 -5793 -15927
1526 -15927 -8951 9620 16116 -3710 -18519 -4524 8702 3134 -1199 -3384 -10886 -4820 11633
1539 11633 4647 -14525 -9891 6199 3169 -5381 -4602 -2225 -148 -1692 -9840 -5774 10183 3134
1553 3134 -19881 -10939 16780 10191 -16081 -16971 829 9045 4349 -8054 -14130 -580 11191
1566 11191 -503 -11368 -4554 -1248 -2050 5108 2552 -12466 -6894 12017 5328 -15065 -11903 6041
1580 6041 10407 374 -12124 -10171 10441 16329 -8157 -20565 1206 12800 94 -4644 1125
1593 1125 -2597 -3058 7763 6801 -4044 -7500 -2307 5464 12067 2731 -12340 -3448 14524 6668
1607 6668 -8200 -584 7049 -1809 -428 10948 8031 -3121 -4731 930 9342 12264 -2148 -12953
1621 -12953 3323 19205 7009 -5359 -973 734 101 10764 11689 -6614 -10898 6370 16599
1634 16599 7518 -7962 -13333 2615 21227 7012 -18734 -7467 19430 11254 -11443 -8682 5540
1647 5540 7041 1927 -5345 -7853 3728 11485 185 -8673 -2149 1965 2091 5592 -1977 -14750
1661 -14750 -2984 17108 6555 -13868 -8349 6969 6770 -2081 -7516 -4074 6179 4683 -8586
1674 -8586 -4237 13204 4125 -17629 -8812 13912 9599 -8656 -10858 -1547 7723 9752 -4289 -16358
1688 -16358 -6421 7645 6042 627 -4689 -12494 -3900 15522 7608 -19882 -17303 8031 12772 -2216
1702 -2216 -10761 -7531 1590 6052 -3656 -11570 -729 5359 -4873 -4280 6801 1024 -10742 -1756
1716 -1756 7289 -2019 -7314 -156 4647 3691 137 -4734 -784 9051 2277 -9837 -400 11688 1956
1731 1956 -4847 5832 8136 -1776 -971 6026 4489 1260 745 -223 5704 10849 564 -5943 4936
1746 4936 9172 -666 -68 6717 -808 -3693 10143 12739 -3534 -10679 535 12489 11594 -4439
1760 -4439 -17340 -419 24057 11511 -16477 -13072 9238 12203 2537 -3648 -7206 -2428 9548
1773 9548 8283 -3798 -5997 -1067 1840 6447 4679 -6561 -6025 7935 5892 -6716 -1032 8072
1787 8072 -1573 -9584 1355 9764 3447 -6279 -9075 634 13999 4080 -17487 -11487 11672 9315
1801 9315 -8864 -9096 726 1991 321 -3054 -9329 -5346 3961 146 -8375 -6272 -2227 -1031 1928
1816 1928 -5136 -17240 -7414 12973 4856 -17897 -15964 2256 7403 -865 -11377 -14395 -2931
1829 -2931 8860 1183 -9722 -6985 -3783 -4472 3931 6983 -8502 -15034 1866 10802 1096 -7818
1843 -7818 -7197 -1594 6505 5944 -4456 -5003 4202 1429 -4059 4016 6278 -5686 -6112 6625 7887
1858 7887 578 -1975 -3070 -1133 6596 6873 -3207 -5121 1488 3433 4276 4719 -5153 -9767 6677
1873 6677 15511 -2295 -13287 280 11341 5932 -5366 -8859 1084 14156 5588 -13046 -7078
1886 -7078 13201 10732 -5460 -7511 323 5559 9229 3088 -9146 -5147 10372 10821 -1360 -5479
1900 -5479 -2440 3823 10370 4381 -8784 -3207 10857 5173 -6611 -608 6377 -66 -4185 625
1914 625 3901 3895 -932 -8229 -3494 10785 5922 -11579 -10121 4789 6142 -961 -4505 -7769 -4948
1929 -4948 6566 6653 -7927 -11400 -1893 3357 2389 -2873 -11227 -7933 7367 7867 -7947 -10290 749
1944 749 2427 -2203 -1691 -3245 -4246 1650 2949 -3540 -3206 1058 -1323 -1858 2341 -1440 -4476 3990
1960 3990 5861 -5467 -6996 3903 5257 -915 -2896 -2361 908 6811 2665 -7475 -3177 7605
1974 7605 3559 -3543 -333 1981 -607 1296 1525 -2664 270 5592 -916 -5143 3354 6970 -716
1989 -716 -4837 -2460 1583 8766 6954 -8591 -11297 8773 17169 355 -12345 -5175 8584 15048
2003 15048 5900 -12034 -10219 11439 16691 -522 -8481 -6 7199 8945 5519 -3908 -3581 7820
2017 7820 8775 -1967 -1080 7210 5827 219 494 1575 4220 7772 1121 -6821 1893 12225 4027
2032 4027 -5683 -1703 3727 4347 3902 -1194 -5062 2150 7889 -908 -5294 2155 3805 -1435 -1495 -2
2048 -2 -1022 2045 2775 -5553 -5516 5228 5838 -3792 -5673 -2041 856 5139 3254 -8155 -9347 3645
2064 3645 8287 -258 -5330 -5637 -2749 5792 7501 -5799 -12721 -1091 6934 2017 -2825 -5021 -5198
2079 -5198 2218 6368 -2771 -9087 -1936 2660 -906 -1304 -1051 -4342 -2204 1774 -3159 -4983 2017
2094 2017 1423 -6092 -3260 3224 790 -4053 -4009 -3126 1272 5951 -1592 -9406 -531 8648 799 -7804
2110 -7804 -2831 2982 3681 2724 -2892 -4977 3894 8114 -1899 -6680 1738 6634 3809 980 -3028
2125 -3028 -1869 8621 9898 -4968 -9097 5512 12874 3657 -4970 -3818 3830 11219 6444 -6291
2139 -6291 -4395 9418 8950 -1324 -1218 2959 1812 3407 5118 1025 -106 3807 2497 -1244 3041
2154 3041 4987 -76 -564 2377 1569 3362 5471 -1527 -6945 3339 11015 1674 -6385 -2456 3614
2169 3614 6169 3693 -4674 -6583 3449 7404 -1004 -3249 148 -843 -885 5033 2102 -6006 -3205
2184 -3205 3490 1655 -2339 -1992 -1891 -321 2306 -2229 -5560 2647 4690 -6163 -7921 2254 4439
2199 4439 -1635 -4378 -4649 -2428 4307 4044 -5261 -7660 -207 2985 1748 -13 -6254 -7285 3841
2214 3841 8587 -3961 -9647 1185 5770 -696 -3743 -1523 1782 2809 -1782 -6136 1876 9245
2228 9245 -1159 -10244 -555 9483 4206 -3218 -3926 -2090 3577 8000 456 -7491 -1674 6515 6611
2243 6611 2130 -3341 -5155 3643 11212 1160 -7603 1795 10391 2388 -4009 817 5521 3473 -41
2258 -41 -2036 3029 9968 4606 -6008 -1809 8925 5363 -1139 1147 2196 649 4975 6563 -554
2273 -554 -3225 2240 5352 4368 2329 -2140 -796 6687 4712 -4321 -1736 7212 2927 -4288 1000
2288 1000 5459 1366 -2415 -1530 463 3733 2704 -3642 -3205 3361 2497 -2685 354 1565 -4741 -2452
2304 -2452 6842 3209 -6984 -5418 2981 5375 598 -6279 -6546 3243 7684 -2842 -8841 522 5041
2319 5041 -2051 -2820 1154 -1126 -2714 879 -287 -2893 -755 1160 -1320 -1793 -1160 -1957 1618 2253
2335 2253 -7034 -7816 5454 8028 -7114 -11642 679 7116 991 -7272 -7822 633 7407 -332 -9831
2350 -9831 -3566 5105 -269 -5440 -1674 -508 -2489 327 1007 -3399 -2594 2899 876 -4165 -3394 68
2366 68 3854 3486 -4391 -8492 3941 12254 -1762 -12816 -1991 9533 5217 -2884 -4230 147
2380 147 5244 4650 -2952 -3282 2430 1539 -1129 3526 4801 -2430 -2085 4586 2081 -3246 723 3839
2396 3839 385 -1697 944 3713 3656 -944 -7395 -1500 10003 4810 -8191 -4486 6783 4760 -1232
2411 -1232 -1288 -1078 -992 2637 3606 535 -671 -942 -767 4111 5168 -3712 -5323 5072 6487 -3295 -3180
2428 -3180 5085 3799 -2651 -2654 2169 4738 1855 -5570 -5202 5784 8609 -3020 -7150 1062 3721
2443 3721 -558 -20 -614 -4592 -2117 4726 2599 -4148 -5047 -2296 1059 2096 -4184 -7164 1658 5519
2459 5519 -5064 -8265 2557 4547 -6681 -8982 -762 4267 1412 -4818 -7276 -270 5663 -931
2473 -931 -8153 -2860 2044 -801 -331 1665 -3129 -5032 2718 4449 -2732 -4920 154 2927 2247 -908
2489 -908 -3440 1493 6159 -1828 -7044 2556 8755 -1076 -6531 1682 7142 2438 -2094 -3486 -106
2504 -106 5486 3998 -2818 -1947 3004 1777 1004 3582 -771 -5834 1824 8828 1922 -5077 -386 5303
2520 5303 4564 273 -3126 -583 6501 4886 -3137 -251 8002 3708 -4034 379 5844 2331 555
2535 555 2079 1280 1549 4381 3200 667 1207 412 1929 6911 3710 -5941 -2887 9354 7632 -4573
2551 -4573 -4872 3584 5574 1599 -1973 -2732 1882 3866 -1798 -3511 2755 2591 -3954 -2576 2168 58
2567 58 -2078 716 -984 -5039 -1211 3842 15 -5430 -5651 -915 5266 3662 -7761 -10366 3075
2582 3075 8328 -3244 -9169 -1212 3334 830 -1076 -2547 -2336 101 262 -2586 -404 2094 -1252
2597 -1252 -2780 1453 245 -3260 603 1868 -4351 -3919 4177 4600 -3520 -5504 -1857 3215 4293
2612 4293 -2690 -8374 -1169 7780 1638 -6395 -1880 2093 -808 -870 795 -1424 -1407 1023 -164 -1086
2628 -1086 1312 146 -2096 713 1424 -1933 848 5227 -1053 -6001 1817 7761 1403 -4842 -2326
2643 -2326 3290 6074 3553 -4192 -3574 5230 5955 -826 -1654 1750 698 1003 4684 1319 -3051 71
2659 71 4004 1343 -655 472 807 1631 1920 -2027 -1344 4848 2759 -6135 -2929 6597 3853 -3835
2675 -3835 -4182 348 3199 3414 -1311 -5484 -416 4853 916 -3260 -1242 -220 -206 3278 2030 -4719
2691 -4719 -2299 4587 2382 -3710 -2334 1912 2273 553 -2494 -2845 3345 4984 -3763 -6789 2161
2706 2161 6404 -969 -4455 -1832 345 2426 2074 -3766 -5396 1579 3823 -866 -3243 -3024 -2529 1832
2722 1832 3400 -4372 -7041 1016 4465 -2346 -5120 -1445 48 -109 -1417 -3833 -1293 3111 -333
2737 -333 -5996 -1622 3606 424 -3713 -1761 -501 370 3142 166 -5206 -2342 4412 3252 -1171
2752 -1171 -2862 -2732 1418 6030 1088 -6072 -1820 5808 2951 -2812 -1340 867 919 1535 300 -1723
2768 -1723 1520 3650 -1727 -2913 2511 3272 -365 -772 -573 -1197 2844 4784 -2083 -5375 1959 5960
2784 5960 2145 -1558 -2898 -851 4853 5623 -2332 -4320 3138 5209 300 -146 1438 628 1731 3034
2800 3034 408 74 3921 2211 -1937 846 4893 2314 -87 106 -599 1495 6140 1578 -4876 -1429
2816 -1429 5334 3820 -1130 -2114 -2321 1435 4108 284 -5365 -1653 3155 98 -2672 -612 -903 -1932
2832 -1932 -257 -1067 -3083 26 1397 -3901 -4638 789 1302 -1938 -2952 -3052 -2771 2027 1928 -5219 -6211
2849 -6211 717 3003 -893 -2940 -3675 -2676 1691 2427 -3697 -5220 509 1575 -1963 -1852 -1024 -1718
2865 -1718 -595 219 -3178 -2403 1940 -191 -4466 -1524 2323 -86 -1814 -2057 -2756 -321 3400 -563
2881 -563 -5997 -2078 3119 1407 -1701 -2347 -3248 485 4554 63 -5567 -1452 3546 1075 -1566 -621
2897 -621 -12 900 2712 -740 -2375 2195 3582 -1188 -1729 2841 3243 1100 1243 -628 -672 3841 5191
2914 5191 -1670 -3583 2364 4565 2595 209 -2591 -1112 5099 4955 -2958 -4079 2891 4196 -219
2929 -219 -1242 -377 -707 1300 1440 -1871 -1271 1793 -251 -2784 398 1205 -1622 -832 -121 -2590 -930
2946 -930 3316 -220 -5256 -2012 2328 1785 -1023 -3151 -3828 1438 4438 -1442 -6060 -725 3137 -498
2962 -498 -2177 -767 -1439 -1305 1360 -275 -2583 -605 516 -2176 -1348 113 -1140 -1156 684 -2411
2978 -2411 -3860 1970 3146 -3649 -5615 -595 2202 63 -2460 -4633 -3255 2666 1721 -4480 -4004
2993 -4004 321 -871 -2017 768 -995 -3962 -797 2034 -1123 -2202 -209 -846 -1416 204 245 -311
3009 -311 1208 -71 -3383 1099 5845 240 -5672 -1116 4792 3152 -393 -2311 -1487 3130 5158
3024 5158 72 -2963 766 2981 989 1520 1383 -1862 -76 4728 1747 -2859 368 3503 1376
3039 1376 -1302 -179 899 2880 2409 -3228 -2407 5215 4921 -3444 -3364 2547 3576 833 -283 -1130
3055 -1130 -457 3336 2991 -1117 -678 809 764 1538 2898 -696 -2374 3431 4029 -1362 -1561 3142 2390
3072 2390 -1245 -400 1408 2608 1735 -2456 -3356 2932 5650 -1599 -5274 726 3493 618 -663 -1277
3088 -1277 -2957 -351 3463 387 -3417 -2866 -477 1730 2286 -2750 -6302 -547 4988 -810 -5988
3103 -5988 -1217 2746 -712 -2463 -1218 -848 313 -328 -3156 -1901 2185 652 -2938 -655 858
3118 858 -1734 -722 1889 -1288 -3743 736 3991 -159 -3197 -1707 1326 2640 521 -4146 -1927
3133 -1927 4645 2369 -4053 -1893 3571 434 -2946 -804 1232 698 204 -1009 -1712 1494 2721 -912
3149 -912 -2286 448 589 704 3177 -87 -5256 -323 6448 2685 -4543 -3179 2299 4584 3209 -2440
3165 -2440 -3359 2983 5010 -784 -2182 2390 2418 -921 1164 3798 695 -768 1032 739 806 2114
3181 2114 611 -600 1513 1696 292 2380 2218 -3351 -2564 4930 4460 -3155 -3618 2078 3397 955
3197 955 -1657 -2354 447 2905 -1048 -3099 1416 2700 -2141 -2748 1811 479 -1864 -199 491 -2179
3213 -2179 -480 1971 724 -1661 -2744 -1864 2283 3740 -2903 -6927 615 6159 159 -5112 -2421
3228 -2421 995 843 91 -1140 -2541 -369 564 -869 -509 -163 -3233 -2788 2153 750 -3641 -1776
3244 -1776 1967 -1318 -3793 -364 1376 -1701 -3731 -2420 844 3308 -1173 -6587 -2148 5229 1562
3259 1562 -5649 -3311 1882 1738 151 -808 -2228 -819 2154 1129 -1842 -1357 199 389 2244 786
3275 786 -2966 -487 4890 1604 -4856 -1212 5087 3152 -2195 -2605 407 4144 2787 -2918 -3388 2897
3291 2897 4486 -707 -1471 1057 149 -521 2054 1562 -2064 -737 2144 1970 611 -127 -1001 640 2032
3308 2032 -207 -1683 1654 2195 -2410 -1000 4725 2696 -3122 -2681 1806 3270 1669 -1462 -2742
3323 -2742 2001 4909 775 -2325 236 592 -290 2327 2802 -2375 -2884 2491 3600 -727 -3137 -1807
3339 -1807 1481 2934 -276 -3883 -556 3594 -214 -4004 -120 1968 -1567 -2156 -11 -420 -558 45
3355 45 -617 -1991 -852 -34 -708 10 -1060 -3385 -204 3560 -757 -5234 -1016 3529 324 -2748
3371 -2748 -1127 783 1075 -128 -2327 -778 2683 275 -4032 -536 4119 1266 -2977 -1474 595
3386 595 994 1596 -295 -3631 -1697 3239 2838 -616 -2938 -3053 1114 5034 899 -6396 -3292 4748
3402 4748 3209 -3115 -3245 -175 891 1013 -1009 -1980 395 1289 -1748 -1542 1877 922 -2022 -175
3418 -175 1559 -305 -137 2227 -92 -2058 573 2512 1527 244 -914 -547 3173 3951 -1419 -2338
3434 -2338 2704 4052 -578 -345 1873 1595 232 1159 1033 719 1939 505 -1171 1170 1907 -34
3450 -34 346 1618 -764 -1278 3329 2810 -3047 -3331 1457 3525 1094 -1935 -3437 168 4555 1726
3466 1726 -4209 -2850 1911 1675 14 -214 -1946 -1802 1973 2158 -1805 -2317 1018 1318 388 -283 -1068
3483 -1068 -135 2226 371 -2871 509 3563 -539 -3402 12 3034 706 -1539 -2069 -1006 2398
3498 2398 1667 -3004 -3176 1439 2143 -1554 -1670 -879 -1252 207 644 -2262 -3206 154 1065 -1967 -2797
3515 -2797 -1318 40 512 -903 -3644 -1439 3189 699 -4494 -2527 2117 1738 -1156 -1751 -1598 297
3531 297 2748 717 -2221 -756 1684 921 1191 1100 -1205 -1071 2991 2889 -603 -268 1611 626 852
3548 852 2030 786 -380 862 1008 644 2552 1785 -1687 -1283 2809 2614 -317 -413 423 249 2195
3565 2195 2014 -1390 -1979 1200 2298 734 321 -1045 -1224 2187 3742 -1132 -2827 1274 2730 327
3581 327 -605 -271 -47 1543 1528 -1623 -521 3177 2209 -1811 -1020 1495 1574 1124 208 -2208 -488 4051
3599 4051 2472 -2423 -2164 1032 2197 1632 -523 -2427 -567 2672 1020 -2555 -799 1669 -794
3614 -794 -1443 269 287 -249 -425 -2068 -2097 1664 1819 -3335 -3859 167 2221 94 -2323 -3457 -2148
3631 -2148 2012 2257 -2810 -4515 189 1872 -17 -1542 -2756 -1642 1247 1669 -2102 -2039 958 797
3647 797 -961 -497 49 -474 360 316 -1548 -480 1930 -23 -1852 189 1257 42 76 124 -1193 -277
3665 -277 1786 418 -1607 -235 985 -189 899 881 -1254 -1082 1452 988 -881 97 781 -214 711
3682 711 1264 -464 -120 1306 127 -1249 1425 2235 -545 -1094 1240 1397 1171 1253 -744 -1277 2263
3699 2263 3644 -217 -1622 241 1827 2495 1643 -1746 -2049 2636 4121 -307 -2264 718 1836 1243
3715 1243 252 -583 -71 2133 1264 -1895 -563 1940 294 -2198 -152 1194 604 366 -664 -2566
3731 -2566 -11 2223 17 -3039 -1240 959 693 -211 -1922 -2969 -29 2293 -1276 -3796 -855
3746 -855 1599 -610 -2144 -1618 -147 410 -453 -2608 -1351 1379 381 -3334 -2416 843 460 -544 -787
3763 -787 -2017 -2090 957 1417 -2229 -3206 -934 566 979 -120 -2850 -2606 1466 1749 -1876 -1526 480
3780 480 -360 -761 616 285 -1598 -583 172 -7 742 894 -1645 -897 1773 258 -832 948 1229
3797 1229 -1560 -284 2814 1482 -1089 -1324 357 2254 2660 -751 -2693 706 3870 1306 -1918
3812 -1918 -40 1269 538 1156 934 -999 -47 2148 831 -612 444 1183 874 440 -597 -738 2676
3829 2676 3091 -1902 -3374 2027 4412 21 -2799 -1072 1950 3075 1301 -2608 -1513 2870 2142
3844 2142 -850 -863 511 -126 -193 1697 -316 -1213 538 950 -865 -351 1167 208 -766 -1134 -938 673
3862 673 1560 -1193 -3804 128 3486 -447 -4162 -1433 843 747 -982 -1973 -1853 385 595 -1628 -1286
3879 -1286 205 -526 -1381 569 422 -1946 -1406 1186 -331 -1799 -75 1197 50 -353 -790 -609 1021
3896 1021 609 -2429 -1041 2501 1349 -1935 -804 1079 156 -252 279 -197 -848 501 1295 434 -202
3913 -202 -1223 -1646 1363 2054 -1681 -2626 1504 2194 -953 -2064 714 981 43 -1020 -719 840 1571
3930 1571 -954 -2414 1066 2365 -266 -1375 154 306 679 1962 717 -1728 -242 2790 2538 -165
3946 -165 -1488 -656 2611 3603 -496 -2821 1451 4266 4 -1923 1593 2923 908 -817 47 1660
3962 1660 2264 55 -2304 -453 3159 1692 -1133 -880 149 283 1837 1670 -2512 -2776 1571 3028
3978 3028 -255 -2305 -1240 779 2147 -162 -3324 -735 2289 -253 -2971 218 2447 -807 -2154
3993 -2154 -358 906 272 -480 -1441 -1054 1099 1116 -667 -502 -22 -1226 -415 2155 211 -2808 -1148
4010 -1148 2537 1133 -1663 -1664 -486 755 947 -821 -1485 706 534 -1853 -786 1406 -903 -2770
4026 -2770 188 865 -946 -1020 214 -882 -1344 -752 -426 293 -139 -2107 -1952 2327 1906 -3170 -3657 1177
4044 1177 2837 -556 -1791 -530 670 1517 222 -1131 -374 1310 176 -512 1173 757 -723 716
4060 716 2006 -346 -644 2037 1591 -1278 -637 1725 1886 466 -1376 -1016 2718 3535 -1631 -3570 1191
4077 1191 3908 -107 -2000 -268 904 888 347 -828 -843 1059 714 -959 529 694 -704 -135 921
4094 921 -421 -1648 1229 1864 -1458 -1998 1119 2106 58 -1991 -1223 1197 3047 408 -2722 14
4110 14 3091 531 -1725 -118 755 -281 549 990 -141 -446 428 548 302 725 -1153 -1115 1177 1018
4128 1018 -1704 -407 1846 -452 -2524 -354 1326 -143 -1522 -1557 -385 1328 1127 -2108 -2481 365
4144 365 622 -1322 -1136 -385 -2115 -904 1983 -224 -3102 -2075 618 972 -388 -1889 -1767 956
4160 956 1590 -1587 -2178 1317 1422 -1853 -1583 1190 1103 -544 -1007 -1055 84 1858 616 -1564 -785 994
4178 994 564 665 467 -1989 -1430 2134 2577 -1834 -2195 860 2002 285 -785 -690 626 1304 -497
4195 -497 -1834 1238 2271 -1077 -2444 1324 2186 70 -1067 -633 -220 1109 1706 -154 -1451 458
4211 458 1217 1047 1172 -907 -1955 1329 3501 288 -2236 653 2035 645 135 617 198 1159 780
4228 780 -674 314 2126 355 -1263 465 2130 -85 -395 921 430 -384 623 1083 -714 -714 7
4245 7 579 1083 348 -1755 -1231 2028 846 -2251 -1257 1317 19 -1122 -320 -133 -703 -54 -715 -1166
4263 -1166 92 484 -948 -893 606 -384 -864 435 -769 -2025 -431 1917 -78 -2643 -1419 803
4279 803 1141 -210 -2179 -2157 1527 2351 -1464 -2930 107 953 -39 -566 -518 -1106 371 1201 -586 -1243
4297 -1243 316 -70 -815 -158 -118 -476 801 665 -1751 -1302 1947 858 -2059 -1409 1205 1643 756 -1093
4315 -1093 -1702 546 2329 595 -2071 -1 1121 331 -158 633 -329 -139 1591 912 -785 529 874
4332 874 -165 -239 628 114 985 1271 -365 -1242 1768 2758 -678 -1399 258 1604 1150 758 -762 -1119
4350 -1119 2002 2189 -251 -765 669 787 888 1527 421 -1005 284 1966 568 -271 877 546 168
4367 168 552 654 17 680 736 -1024 222 2168 340 -1697 -555 763 611 527 -184 -1651 -700 1598
4385 1598 666 -1563 -1227 -241 -278 625 -105 -2304 -1162 1259 314 -2007 -422 692 -892 -823 -412 -511
4403 -511 128 103 -1139 -2090 872 1463 -1405 -1829 -484 142 512 452 -1341 -1776 752 1963 -791 -1463
4421 -1463 -430 -140 451 634 -1086 -1488 662 1054 -1028 -998 689 10 -1316 -134 37 -187 150 -473
4439 -473 -1415 62 2113 59 -1886 -764 570 612 724 -151 -1827 129 1887 263 -1413 -247
4455 -247 890 376 1117 324 -1011 496 1830 574 -656 878 1609 465 594 1080 141 738 1666
4472 1666 -140 -995 1572 2421 -191 -471 689 763 1258 1009 -378 -1036 1792 2004 -526 -844 346
4489 346 362 778 765 -667 -1297 646 1055 -1041 -1072 -124 -303 -501 154 -779 -674 903 -14 -2396 -553
4508 -553 1245 -319 -1727 -868 -175 247 806 -872 -2220 -461 1452 195 -1687 -906 -745 21 1029
4525 1029 -136 -2235 -1118 1543 546 -941 -731 0 -245 273 -673 -1247 -222 800 -1636 -1644 950
4542 950 761 -1418 -1388 -95 -86 399 89 -1730 -1846 673 1136 -761 -1058 -1027 -1047 917 816 -1428 -2260
4561 -2260 829 1075 -978 -814 116 130 -23 203 -356 -190 1023 -475 -1393 413 2058 19 -926 224
4579 224 175 432 1404 645 -1229 -89 1834 1320 322 -63 -566 974 2383 721 -1789 -144 2440
4596 2440 999 -661 467 960 -204 169 754 142 58 544 -1048 -297 1439 268 -1035 -51 243
4613 243 -690 823 1518 -1167 -1979 394 1463 225 -685 -1026 -6 1630 948 -1821 -1332 1693 1417
4630 1417 -1020 -206 867 -182 -513 349 -139 -84 698 -46 -776 75 668 -228 -61 -200 -1177 -412 1820
4649 1820 133 -2539 -1201 1403 695 -1560 -1405 -1058 870 963 -1649 -2277 351 1078 -1019 -1308 205
4666 205 -639 -1239 -52 -20 -1349 -959 269 -682 -660 -186 -442 -189 492 -951 -1230 1224 1238 -1943 -2047
4685 -2047 1353 2137 -468 -1474 -290 490 1270 213 -1240 -422 1644 658 2 621 294 -811 715
4702 715 1686 -200 -1116 715 1335 75 -24 236 622 725 -323 -932 881 2528 -47 -2200 399
4719 399 2198 373 -988 -531 -205 812 1199 68 -963 -64 960 487 748 169 -1117 -27 2324
4736 2324 730 -1727 -400 1722 673 -785 601 732 537 -87 -876 -126 2097 598 -2232 -664
4752 -664 1886 1075 -522 -191 -75 -501 1003 1055 -624 -1107 -10 406 606 469 -1159 -1180 898 935 -1683
4771 -1683 -1348 814 567 -1609 -631 941 160 -1013 -1618 -776 1039 880 -1791 -1838 489 1069 -852
4788 -852 -658 -235 -1351 -568 1234 178 -1727 -1002 540 806 -2 -1107 -1648 299 1549 -796 -1664
4805 -1664 727 1106 -1124 -1404 741 672 -751 -249 -354 523 1066 -59 -1429 39 873 -121 -232 739
4823 739 -709 -1490 1077 1639 -964 -2268 373 1398 154 -584 -1209 211 1306 24 -1510 134
4839 134 1632 -303 -1281 731 1295 -234 -69 -188 114 307 864 -292 -704 -234 710 862 1338 99
4857 99 -1554 456 2985 596 -2153 -88 2059 1665 -346 -565 -385 1578 1132 -422 -456 1371 686
4874 686 -741 488 1156 -90 -352 756 372 -464 427 967 -208 -372 -120 546 1182 -95 -1558 -477
4892 -477 2268 1165 -2084 -1613 1341 1019 -883 -693 -584 -80 145 -30 -966 95 214 -994 -411 666
4910 666 -555 -1291 29 481 -929 -669 802 -230 -1440 -1043 100 662 514 -1294 -1832 1035 1758
4927 1758 -994 -2143 54 656 -306 -145 -180 -978 -699 360 153 -411 -564 -852 -429 799 148 -1657
4945 -1657 -342 1069 -398 -1330 666 867 -1106 -1311 299 808 -115 -955 -1315 153 1907 117 -1737
4962 -1737 -413 928 267 -183 515 -709 -1014 528 1275 -188 -642 104 380 706 120 -895 -187 1682
4980 1682 264 -1112 598 1978 438 -1240 168 1346 1142 52 -667 -468 1200 1794 -309 -661
4996 -661 539 -70 52 1442 214 -1217 -163 1770 578 -829 -233 220 -3 329 -313 25 803
5013 803 377 -1504 -680 1614 306 -1996 -1291 931 470 101 -934 -1176 -77 960 28 -1532 -461
5030 -461 -142 -87 777 471 -1590 -1326 1266 779 -1355 -1218 298 228 -220 -542 -992 -37 605 -625 -1254
5049 -1254 554 789 -1047 -565 374 -110 -364 27 -385 -1526 -514 617 -55 -941 -718 -842 393 1064
5067 1064 -1020 -2271 179 1213 -703 -1819 -592 240 -333 -202 -457 -501 345 -60 -1018 -199 792 -208
5085 -208 -876 1 230 248 698 186 -1325 -632 1192 1356 -689 -1092 -242 1345 1493 13 -1683 -24
5103 -24 2359 953 -795 -65 855 414 402 427 -198 378 817 175 -179 925 439 -382 182 585 67 388
5123 388 786 -635 -852 767 1958 41 -1036 -310 835 831 894 -924 -701 1175 983 -368 -759 817
5141 817 132 -138 544 158 -124 234 382 -402 536 864 -95 -373 75 408 446 924 10 -1295 -413 1330
5161 1330 824 -1041 -1053 -114 597 1022 -404 -1691 -768 992 357 -917 -664 -344 -393 532 138 -1019
5179 -1019 -786 209 -457 -823 -92 124 -749 -631 -176 -682 242 593 -1153 -1432 701 1275 -398 -1059 -505
5198 -505 83 915 432 -1230 -1216 522 1341 -165 -556 -262 139 652 601 -306 -407 1205 1079 -980 -252
5217 -252 1087 438 112 136 -109 557 1531 486 -1471 -240 1656 994 -546 -637 258 754 1268 125
5235 125 -1350 -155 1718 740 -420 183 270 234 882 242 -582 270 1173 57 -267 897 684 -141 135
5254 135 348 -9 1097 736 -257 -243 1254 1557 295 -46 -362 306 849 887 -808 -600 960 1056 -82
5273 -82 -535 168 55 738 927 -224 -480 300 663 -449 -380 -88 -487 -386 172 -628 -638 494 -22 -1138
5293 -1138 -599 462 107 -316 -557 -693 -483 735 -292 -1661 -395 575 -168 -681 -475 -644 -231 449
5311 449 -112 -998 -366 577 -186 -408 -88 -537 -251 23 -489 -811 511 931 -1008 -1344 566 1202 -583
5330 -583 -1073 -532 356 1328 254 -1472 -1344 886 1092 -408 -368 -615 -20 675 947 -942 -1154 466
5348 466 710 -353 -144 58 -53 199 -12 -530 591 1441 -147 -1300 -90 1434 648 -565 -327 88
5366 88 990 1228 -122 -732 149 844 278 279 243 -485 290 1332 484 -886 -343 804 213 -188 316 492
5386 492 386 399 -193 37 865 463 -650 -519 1086 797 -314 -385 -142 -481 174 915 -378 -1374 -370
5405 -370 571 793 334 -1352 -1138 964 1342 -672 -1404 234 551 -339 -510 -327 -425 238 -188 -747 -5
5424 -5 501 -259 -1113 -251 256 -111 361 -136 -818 -433 887 219 -1440 -1063 157 625 -68 -1040 -1435 481
5444 481 1581 -830 -1889 -43 822 -225 -1000 -231 200 10 -9 -862 -455 553 114 -756 -300 620
5462 620 -144 118 72 -547 -843 878 1069 -703 -1275 213 751 492 -518 -1161 276 1132 332 -925
5480 -925 -296 1340 11 -646 685 830 -420 -135 234 327 188 373 -369 125 571 558 9 358 308 -792
5500 -792 141 1526 274 -1171 -160 890 760 -87 -403 -227 837 1074 -307 -297 505 579 -342 525
5518 525 537 -535 -693 1060 619 -313 -45 176 -91 -20 -253 -16 753 503 -1110 -661 1826 1080 -1400
5537 -1400 -1134 1053 1262 136 -624 -846 -53 706 352 -620 -805 -29 -82 -4 182 -979 -974 567 581 -837
5557 -837 -869 498 615 -820 -845 208 646 109 -1266 -1446 1019 1720 -673 -1951 409 1510 404
5574 404 -437 -1141 -777 198 629 -235 -714 -297 -23 -143 604 -244 -1304 -228 771 -575 -1112 857 583
5593 583 -780 -978 -135 842 436 -635 -1211 384 1577 73 -1416 -135 925 -126 -109 444 37
5610 37 -690 565 933 390 -153 -209 178 1110 1089 -634 -183 1282 664 -831 183 1251 121 -572 45
5629 45 838 631 176 -193 -58 707 900 -260 34 672 413 195 1168 262 -1117 -390 1247 772 -439
5648 -439 -137 426 1303 617 -663 -883 669 1079 -560 -838 1017 937 -546 -477 569 145 -290 -79 -340
5667 -340 -95 876 204 -334 -165 108 -64 652 460 -1414 -788 1116 1170 -993 -1499 232 470 466 -907
5686 -907 -837 285 790 -822 -1290 509 857 -1153 -1168 296 611 -475 -275 -226 -587 265 594 -511 -486
5705 -486 -426 -235 208 285 -665 -1654 647 1241 -439 -1523 -82 595 404 -97 -388 -230 349 189 -724
5724 -724 376 894 -364 -868 444 811 -522 35 762 -54 -360 726 581 -97 -501 -469 738 1340
5742 1340 264 -1422 -865 1686 854 -675 -357 298 375 656 318 -232 -405 231 535 86 382 -46 -575
5761 -575 816 698 -490 -740 1001 503 -668 294 1437 598 -563 -559 369 1294 1206 -1178 -831 1310
5779 1310 1572 -292 -723 357 478 171 646 31 -701 160 767 294 -391 177 57 221 563 -620 -487
5798 -487 1136 473 -1326 -732 988 776 -653 -1246 -420 427 847 -448 -1542 -368 847 -177 -847
5815 -847 -159 -117 -535 70 270 -720 -614 262 -127 -434 -235 -168 -429 -119 128 -685 -78 569 -636 -986
5835 -986 732 860 -629 -1037 167 248 324 253 -937 -811 84 341 -230 -132 -350 -524 -394 743 -168 -1309
5855 -1309 -215 740 194 -559 -311 81 181 249 -253 -302 825 -5 -1126 -111 840 481 -449 280 251
5874 251 -113 904 162 -407 30 539 680 193 88 -428 175 1275 503 -912 -684 1625 603 -295
5892 -295 -41 510 407 432 20 -343 801 656 -836 -486 846 1070 -200 -297 -9 35 846 481 -555
5911 -555 -1038 352 1228 76 -582 -592 -231 1011 811 -1394 -1448 761 1036 -463 -425 19 244 -357 -79
5930 -79 -458 -128 486 -423 -700 65 782 -206 -675 -160 -153 10 814 -136 -1317 -641 822 209 -599 -693 -531
5951 -531 37 726 -337 -1202 -524 714 -227 -676 -75 21 -697 -366 -43 -442 -259 7 -712 -745 481 -48
5971 -48 -273 -325 -712 -647 585 876 -869 -1071 219 385 -14 -304 -1024 -333 421 1358 -655 -1244 282
5990 282 517 232 -23 206 -217 327 926 -16 -186 370 160 -47 151 596 733 24 374 -219 292 958
6010 958 564 -1018 -59 1073 740 -35 -169 -237 688 1305 -4 -951 -83 920 161 -349 45 323 410
6029 410 682 -90 -329 726 728 -188 -552 604 873 -114 10 -338 9 780 910 -672 -600 702 703 -155
6049 -155 -113 -347 -201 604 830 -499 -909 447 243 -156 -99 -16 -349 104 357 -378 -248 550 -110 -763
6069 -763 64 352 -78 -196 -268 -543 -252 929 -302 -1254 -336 502 191 -334 -464 -899 -82 714 -262 -1375
6089 -1375 -394 581 72 -463 -450 -723 307 715 -86 -756 -156 352 -285 -225 91 -305 94 280 -70 -716
6109 -716 482 780 -591 -553 18 541 603 -46 -586 -666 1175 973 -847 -721 523 540 12 91 -355 -436
6129 -436 356 296 -214 -171 134 38 -1 372 123 133 682 190 -393 477 1105 32 -1166 -200 658 820 -165
6150 -165 -586 -678 611 1208 -62 -880 285 1012 497 444 570 -302 98 1163 720 -255 161 511 -17
6169 -17 258 145 87 573 217 -355 -386 812 499 -842 -992 423 595 -173 -134 -343 -480 285 380 -711
6189 -711 -76 -65 -48 140 713 -332 -1214 443 499 -227 -318 -267 -64 -425 114 -478 -99 221 -437 -1096 38
6210 38 906 -502 -1311 -339 795 142 -69 -481 -609 -495 265 -21 -557 -153 -506 72 299 -329 -1446
6229 -1446 -455 1002 -191 -1103 -472 632 -16 -138 -335 -15 130 168 -656 -260 670 128 -847 -495 407
6248 407 -291 -345 35 -184 -494 576 710 35 -505 -157 121 577 238 -428 -133 1226 529 -1150 -407
6267 -407 1032 658 -345 32 489 559 488 -313 -695 688 864 -243 -223 359 436 234 881 123 -573 215
6287 215 1275 645 -635 -343 221 791 681 -520 -1088 517 1389 -297 -527 430 480 -498 -268 540 -18
6306 -18 134 -239 33 123 77 -201 -461 294 263 -236 480 300 -875 -858 847 570 -802 -1060 -197 483 516
6327 516 -248 -798 -157 638 192 -797 138 192 -355 -454 461 131 -465 -73 -580 -493 28 106 -95 -247 -338 -392
6349 -392 67 1109 -795 -1598 -168 1569 11 -1520 -621 442 548 -26 -769 -804 138 465 -551 -321
6367 -321 410 -355 -505 412 349 -527 -21 463 -180 -304 164 302 -455 -94 -512 289 1060 278 -980 -159
6387 -159 1327 632 -1044 -647 517 489 554 -36 -85 235 675 151 145 570 34 -337 453 548 -11 -639 908
6408 908 398 -707 -63 691 397 -263 -516 79 1328 797 -563 -954 738 1047 -242 -554 645 449
6426 449 102 439 85 -576 -77 463 190 4 -92 -448 183 648 -426 -836 172 539 -217 -856 307
6445 307 540 -333 -635 -353 111 506 -282 -1039 -74 1183 -188 -712 46 -210 -327 340 27 -664 -790
6464 -790 351 473 142 -858 -990 -29 428 -263 -1261 -138 888 -54 -1448 -86 771 -197 -965 -313
6482 -313 98 168 -274 -588 -903 204 195 -480 -431 96 -474 79 707 -286 -1379 -382 661 129 -823 -655
6502 -655 -218 645 253 -480 -365 437 437 -538 100 707 308 -910 132 549 132 39 262 -179 107 753
6522 753 184 102 196 -428 -19 1065 676 -910 -514 746 751 36 -249 103 433 693 16 -413 367 430 -218
6543 -218 -209 812 462 -438 -250 501 136 -124 299 9 -275 -69 578 327 141 -427 -524 696 859 -624
6563 -624 -952 583 792 -17 -609 -110 -95 256 4 9 -441 271 69 -357 188 256 -401 -577 332 -18 -535
6584 -535 280 429 -938 -549 355 305 38 -643 -706 -236 1120 139 -1337 -436 915 264 -824 -338 -178
6603 -178 -346 -91 207 -513 -241 1 -234 -122 203 -362 -655 135 -194 -734 -14 624 -285 -844 -139 924
6623 924 590 -638 -722 -257 700 776 -740 -632 335 858 -96 -252 -53 -145 -40 708 -50 -414 87 388
6643 388 -141 293 102 -418 507 424 -627 -254 828 300 -598 -147 840 854 -300 -215 -23 478 797 25
6663 25 -591 -43 1061 416 252 352 -389 -253 904 710 -449 -65 736 250 226 -108 -54 492 973 88
6683 88 -508 388 723 -468 -592 689 712 -100 -157 -68 -249 569 951 -447 -733 78 420 331 -104 -652 -630
6704 -630 422 884 -210 -683 -78 436 -72 -344 -184 -254 5 -81 -975 4 593 -223 -1243 -187 638
6723 638 191 -666 -464 -357 -65 479 -33 -871 -152 212 130 69 -271 -917 -249 646 56 -973 -516 241
6743 241 -192 -431 -63 -83 -433 -86 -600 -503 328 54 -859 -610 279 274 21 -16 -327 -727 185 752 -636
6764 -636 -874 153 351 195 1 -263 -418 413 377 -316 -626 167 407 -312 -55 457 10 186 21 -211
6784 -211 221 835 92 -637 -115 492 177 107 118 -334 72 1171 650 -833 -109 197 532 268 -113 -756
6804 -756 142 1137 177 -567 100 452 188 63 -61 102 -146 474 -314 -310 256 685 -263 -630 -237 0 594
6825 594 82 -738 -517 657 634 -448 -411 136 111 82 -104 -497 -570 389 481 -671 -459 31 -108 -159 110
6846 110 -442 -293 344 17 -475 -243 157 -193 -761 -94 30 116 177 -151 -818 -222 297 -44 -938 -362 25
6867 25 123 317 -402 -1030 -391 821 302 -589 -225 -245 -86 -77 104 -566 -361 -64 -196 -324 324 153 -564
6888 -564 -87 -118 -193 -130 104 -565 -443 219 703 -410 -208 288 428 480 356 -574 -197 873 1052 -208
6908 -208 -445 -27 119 216 718 113 -33 395 246 -189 379 596 61 247 313 139 28 354 260 -346 186
6929 186 1003 574 -491 -65 25 844 688 32 -834 322 838 571 -760 149 276 1 -56 283 -87 -162
6949 -162 372 -302 -56 439 21 -516 194 85 130 118 501 -441 -542 457 863 -178 -777 117 254 476
6969 476 -270 -797 -627 655 326 -513 -147 145 -88 -329 62 -6 -563 -39 65 -466 -94 -45 -304 -508
6989 -508 -25 -243 -133 403 -313 -961 -202 677 -85 -682 -463 -21 -153 495 -71 -777 10 313 -132 -447
7009 -447 243 -451 -167 411 217 -730 -204 420 102 -176 -78 97 110 88 -193 -254 695 299 -630 -385 707
7030 707 756 -342 -230 111 266 500 287 -330 -401 756 388 107 -74 151 -62 551 1006 -568 -711 362
7050 362 668 -342 -77 349 198 1 -387 92 519 702 -408 -771 341 913 -113 -731 -61 862 426
7069 426 420 97 -502 102 620 286 -54 -259 -401 281 668 -131 -610 256 289 -80 -435 332 201 -311 -278
7090 -278 -44 263 283 -354 -668 61 741 -111 -1064 207 -79 -332 61 157 -275 -486 81 427 -126 -604
7110 -604 -690 -99 553 216 -733 -528 559 36 -810 -302 172 -147 -398 -38 -267 243 71 -706 -682 207
7130 207 216 -278 -95 304 -505 -549 698 -184 -826 -474 1044 516 -503 -600 -343 534 389 -614 -769 580
7150 580 761 -323 -206 191 218 -314 -145 -9 113 122 381 -372 77 409 120 121 199 -400 -222 997 472
7171 472 -748 -758 958 1414 0 -655 -445 519 578 -177 -779 345 1013 15 -305 437 553 -363 -293 799
7191 799 19 10 328 125 -136 181 211 278 59 -425 -402 430 1159 -319 -1422 319 1022 344 -464 -188 358
7212 358 362 175 -81 -94 291 -167 -395 514 540 -451 -220 460 242 -571 28 353 -171 -299 172 146 207 -325
7234 -325 -609 122 640 -294 -1121 -374 676 241 -792 -60 -224 -448 41 147 -118 -406 -97 136 63 -395
7254 -395 -993 -793 369 200 -742 -535 630 190 -922 -108 198 101 35 -452 -295 787 570 -735 -828
7273 -828 522 746 -410 -215 -169 -82 -21 242 125 -416 -308 189 288 234 -249 -514 416 768 -326 -186 658
7294 658 372 -693 -383 843 421 -76 -697 -139 395 655 -325 -878 155 525 26 -34 239 -163 -324
7313 -324 547 795 -191 -311 51 180 336 78 -164 151 845 -57 -331 546 879 114 -601 415 662 85
7333 85 83 196 50 389 425 -497 -397 639 135 124 356 -201 -793 137 981 27 -1141 -416 385 115 -80
7354 -80 -263 -543 406 64 -668 -103 152 -177 -771 4 488 -323 -545 78 -528 -305 421 -148 -833 -501
7374 -501 -232 8 352 -175 -706 -679 1082 374 -1131 -557 177 627 -23 -170 -496 249 657 -237 -351 68
7394 68 356 -437 -606 361 1 -295 191 -164 -454 99 296 -21 -733 -265 54 448 18 -562 -641 687
7414 687 660 -510 -764 332 476 -109 -246 60 121 356 308 -135 103 462 -98 -224 539 375 -73 242
7434 242 304 -149 -139 709 514 4 -97 557 776 540 129 -539 351 1276 243 -355 287 314 94 11 553
7455 553 62 -335 542 356 -65 81 111 -133 62 394 -191 -108 221 -384 -376 335 603 -394 -630 70 446
7476 446 276 -87 -551 -427 328 658 -542 -554 54 68 234 -84 -388 -638 382 486 -203 -531 174 103
7496 103 141 118 -346 -333 146 250 -1012 -192 964 361 -912 -221 91 249 -67 -54 -553 -210 716 -229
7516 -229 -813 -233 138 -115 181 78 -514 -379 459 -118 -744 -288 181 -180 -130 485 195 6 138 -545
7536 -545 -384 739 658 -1041 -506 619 656 458 67 -285 -200 636 741 -211 -272 78 344 198 566 154
7556 154 -210 282 691 -162 -231 473 302 300 321 248 154 436 203 -255 331 809 221 -108 266 176 165 377 200
7579 200 -323 -214 650 583 -338 95 -63 -46 363 300 -498 -61 712 517 -178 265 592 121 14 207 -128
7600 -128 262 443 -219 -518 248 740 -385 -196 206 49 485 508 -493 -575 575 803 -236 -399 -171
7619 -171 360 107 299 -598 -872 184 83 -246 -557 171 24 -308 43 -493 -389 210 -44 -368 112 856
7639 856 -209 -429 -196 -116 125 152 -443 -806 49 529 -213 -864 -53 408 -78 173 -94 -566 295 561
7659 561 251 -430 206 130 -178 325 -111 -439 355 249 -200 -291 583 525 -426 -49 -168 147 279 86 -352
7680 -352 -33 184 738 -65 -268 -90 -178 646 625 -13 -588 438 741 94 -274 -107 16 339 500 -70
7700 -70 -4 236 175 -240 117 573 105 99 -19 -77 435 410 -54 -514 13 693 167 -111 215 -132 387 647
7722 647 72 -843 -159 721 206 -53 148 -169 76 332 70 -598 603 187 -521 -239 572 467 -339 -281
7742 -281 -157 -247 469 444 -559 -606 309 221 -215 -434 -397 -224 581 567 -986 -256 169 214 -567 -166 130 -437
7764 -437 -54 -100 -201 -20 -115 -541 -500 253 247 -535 -158 70 -309 -236 163 -157 -683 67 613 -197 -383 -424
7786 -424 -272 310 334 75 -610 255 799 -346 136 662 -302 -15 87 19 -122 99 120 -22 -5 330 -59
7807 -59 -14 369 -238 -334 243 677 -341 -553 424 636 461 -383 -319 182 809 -41 -492 -69 531 147 174
7828 174 313 -39 -322 242 621 -104 -146 285 297 0 220 -104 600 296 -2 -114 182 1259 -53 -940
7848 -940 147 861 526 -193 -259 244 819 669 -320 -491 379 488 318 3 243 -72 -255 639 -249 -547
7868 -547 5 533 -19 -345 -297 -84 -157 -140 -375 -124 692 -18 -1080 -312 677 -7 -372 -687 40 -326 86
7889 86 -137 -729 -190 -11 -419 -221 240 -522 -401 646 241 -509 -311 240 165 -374 -96 181 94 -89 -268
7910 -268 -203 341 653 -361 -685 270 206 -313 -390 24 -483 -100 469 95 -329 226 340 332 274 -414 -576 165
7932 165 648 195 -827 19 487 -284 -54 60 136 -366 -269 -165 35 310 -266 -441 380 826 331 -87
7952 -87 -30 -310 -345 489 742 115 -396 336 320 594 -32 -188 213 896 114 -519 251 1191 -79 -481 248
7973 248 601 363 -341 -125 243 823 618 -68 -192 711 380 14 422 163 -622 7 712 -78 -640 -416
7993 -416 254 480 -34 -253 -462 199 243 -659 -582 274 66 -614 117 412 -103 -141 113 -26 389 76 30
8014 30 -499 -153 137 47 247 -64 -379 -226 774 168 -682 -115 600 538 -200 -610 -247 9 252 -228 -145
8035 -145 101 79 -323 -275 156 -3 -724 -152 372 -477 -255 373 188 -417 -216 -94 163 116 -690 -1128 519
8056 519 609 -117 -835 282 429 311 136 -200 91 278 447 129 18 282 -198 -87 364 124 -339 67
8076 67 863 102 -146 304 543 -124 -87 138 870 789 -2 -721 392 844 266 -808 -192 653 306 78
8096 78 155 -131 7 525 573 -50 32 -181 -154 178 225 -459 -224 568 26 -248 173 542 -124 -332 -62 645
8118 645 332 -30 -404 -116 489 458 -618 -355 343 -71 -135 255 -116 -816 171 432 152 -473 -269 -112
8138 -112 313 279 -82 -567 346 -204 -600 -402 178 78 -473 -160 291 265 -52 -228 -826 -36 139 139 -642
8159 -642 31 -271 -315 38 313 -498 -715 427 480 -416 -670 -124 368 116 -434 -116 218 399 -371 -390 521
8180 521 419 -330 -357 273 370 214 272 -409 -78 183 25
8191B5
##END NTUPLES=NMR FID
##END=
