##TITLE=1H_TG-2270-1
 CDcl3, 8 sc, 
 16.12.2019
##JCAMPDX= 6.0         $$ Bruker NMR JCAMP-DX V2.0
##DATA TYPE= NMR FID
##DATA CLASS= NTUPLES
##ORIGIN= UXNMR, Bruker Analytische Messtechnik GmbH
##OWNER= root
$$ XWIN-NMR		Version 3.5
$$ Mon Dec 16 14:01:44 2019 Russian Standard Time (UT+4h)  she@DPX200
##.OBSERVE FREQUENCY= 200.1315
##.OBSERVE NUCLEUS= ^1H
##.DELAY= (6, 6)
##.ACQUISITION MODE= SIMULTANEOUS
##.ACQUISITION SCHEME= undefined
##.AVERAGES= 8
##.DIGITISER RES= 18
##SPECTROMETER/DATA SYSTEM= spect
##.PULSE SEQUENCE= zg30
##.SOLVENT NAME= CDCl3
##.SHIFT REFERENCE= (INTERNAL, CDCl3, 0, 15.7039)
##AUDIT TRAIL= $$ (NUMBER, WHEN, WHO, WHERE, WHAT)
$$ ##TITLE= Audit trail, XWIN-NMR		Version 3.5
$$ ##JCAMPDX= 5.01
$$ ##ORIGIN= Bruker BioSpin GmbH
$$ ##OWNER= she
$$ F:/spectra/data/she/nmr/H-F/1/audita.txt
$$ ##AUDIT TRAIL=  $$ (NUMBER, WHEN, WHO, WHERE, WHAT)
(   1,<2019-12-16 14:00:46.17 +0400>,<she>,<DPX200>,
      <created by zg, POWCHK disabled, PULCHK disabled
       terminated by command 'halt'
       configuration hash MD5:
       00 E9 B6 7A A2 85 ED C7 34 08 36 98 17 FE 4E 26
       data hash MD5: 16K
       4E 96 92 CF BC 28 85 CC 49 3A ED B4 5B 08 C8 99>)
$$ ##END=
$$ 
$$ hash MD5
$$ C7 72 25 2A 7D 25 63 DB 45 B8 BB FF E7 86 CF 46
##$RELAX= 
##$RELAX= 
##$RELAX= 
##$RELAX= 
##$RELAX= 
##$RELAX= 
$$ Bruker specific parameters
$$ --------------------------
##$DU= <F:/spectra>
##$EXPNO= 1
##$NAME= <H-F>
##$PROCNO= 1
##$TYPE= <nmr>
##$USER= <she>
##$AMP= (0..31)
100 100 100 100 100 100 100 100 100 100 100 100 100 100 100 100 100 100 
100 100 100 100 100 100 100 100 100 100 100 100 100 100 
##$AQSEQ= 0
##$AQ_mod= 1
##$AUNM= <au_zg>
##$AUTOPOS= <>
##$BF1= 200.13
##$BF2= 200.13
##$BF3= 200.13
##$BF4= 200.13
##$BF5= 200.13
##$BF6= 200.13
##$BF7= 200.13
##$BF8= 200.13
##$BYTORDA= 1
##$CFDGTYP= 0
##$CFRGTYP= 5
##$CHEMSTR= <none>
##$CNST= (0..31)
1 1 145 1 1 1 1 1 1 1 1 1 1 1 1 1 1 1 1 1 1 1 1 1 1 1 1 1 1 1 1 1 
##$CPDPRG= <>
##$CPDPRG1= <>
##$CPDPRG2= <>
##$CPDPRG3= <>
##$CPDPRG4= <mlev>
##$CPDPRG5= <mlev>
##$CPDPRG6= <mlev>
##$CPDPRG7= <mlev>
##$CPDPRG8= <mlev>
##$CPDPRGB= <>
##$CPDPRGT= <>
##$D= (0..31)
0 1.2 0 0 0 0 0 0 0 0.06 0 0.03 0 0 0 0 0.0002 0 0 0 0 0 0 0 0 0 0 0 0 
0 0 0 
##$DATE= 1576490445
##$DBL= (0..7)
120 120 120 120 120 120 120 120 
##$DBP= (0..7)
150 150 150 150 150 150 150 150 
##$DBP07= 0
##$DBPNAM0= <>
##$DBPNAM1= <>
##$DBPNAM2= <>
##$DBPNAM3= <>
##$DBPNAM4= <>
##$DBPNAM5= <>
##$DBPNAM6= <>
##$DBPNAM7= <>
##$DBPOAL= (0..7)
0.5 0.5 0.5 0.5 0.5 0.5 0.5 0.5 
##$DBPOFFS= (0..7)
0 0 0 0 0 0 0 0 
##$DE= 6
##$DECBNUC= <off>
##$DECIM= 24
##$DECNUC= <off>
##$DECSTAT= 4
##$DIGMOD= 1
##$DIGTYP= 9
##$DL= (0..7)
0 120 120 120 120 120 120 120 
##$DP= (0..7)
150 150 150 150 150 150 150 150 
##$DP07= 0
##$DPNAME0= <>
##$DPNAME1= <>
##$DPNAME2= <>
##$DPNAME3= <>
##$DPNAME4= <>
##$DPNAME5= <>
##$DPNAME6= <>
##$DPNAME7= <>
##$DPOAL= (0..7)
0.5 0.5 0.5 0.5 0.5 0.5 0.5 0.5 
##$DPOFFS= (0..7)
0 0 0 0 0 0 0 0 
##$DQDMODE= 0
##$DR= 18
##$DS= 0
$$ [...]
##$SUBNAM2= <"">
##$SUBNAM3= <"">
##$SUBNAM4= <"">
##$SUBNAM5= <"">
##$SUBNAM6= <"">
##$SUBNAM7= <"">
##$SUBNAM8= <"">
##$SUBNAM9= <"">
##$SW= 24.9337058887773
##$SWIBOX= (0..15)
0 0 2 0 0 0 0 0 0 0 0 0 0 0 0 0 
##$SW_h= 4990.01996007984
##$TD= 16384
##$TD0= 1
##$TE= 0
##$TE2= 300
##$TE3= 300
##$TEG= 300
##$TL= (0..7)
0 120 120 120 120 120 120 120 
##$TP= (0..7)
150 150 150 150 150 150 150 150 
##$TP07= 0
##$TPNAME0= <>
##$TPNAME1= <>
##$TPNAME2= <>
##$TPNAME3= <>
##$TPNAME4= <>
##$TPNAME5= <>
##$TPNAME6= <>
##$TPNAME7= <>
##$TPOAL= (0..7)
0.5 0.5 0.5 0.5 0.5 0.5 0.5 0.5 
##$TPOFFS= (0..7)
0 0 0 0 0 0 0 0 
##$TUNHIN= 0
##$TUNHOUT= 0
##$TUNXOUT= 0
##$USERA1= <user>
##$USERA2= <user>
##$USERA3= <user>
##$USERA4= <user>
##$USERA5= <user>
##$V9= 5
##$VALIST= <valist>
##$VCLIST= <CCCCCCCCCCCCCCC>
##$VD= 0
##$VDLIST= <DDDDDDDDDDDDDDD>
##$VPLIST= <PPPPPPPPPPPPPPP>
##$VTLIST= <TTTTTTTTTTTTTTT>
##$WBST= 1024
##$WBSW= 4
##$XGAIN= (0..3)
0 0 0 0 
##$XL= 0
##$YL= 0
##$YMAX_a= 903038
##$YMIN_a= -605197
##$ZGOPTNS= <>
##$ZL1= 120
##$ZL2= 120
##$ZL3= 120
##$ZL4= 120
##$ABSF1= 10
##$ABSF2= 0
##$ABSG= 5
##$ABSL= 3
##$ALPHA= 0
##$AQORDER= 0
##$ASSFAC= 0
##$ASSFACI= 0
##$ASSFACX= 0
##$ASSWID= 0
##$AUNMP= <proc_1d>
##$AZFE= 0.1
##$AZFW= 0.1
##$BCFW= 1
##$BC_mod= 2
##$BYTORDP= 1
##$COROFFS= 0
##$CY= 11.3945322036743
##$DATMOD= 1
##$DC= 2
##$DFILT= <>
##$DTYPP= 0
##$F1P= 16.9975609425685
##$F2P= -3.02152046262296
##$FCOR= 0.5
##$FTSIZE= 0
##$FT_mod= 4
##$GAMMA= 1
##$GB= 0.15
##$INTBC= 1
##$INTSCL= 1
##$ISEN= 128
##$LB= 0.24
##$LEV0= 0
##$LPBIN= 0
##$MAXI= 10000
##$MC2= 0
##$MEAN= 0
##$ME_mod= 0
##$MI= 1.114404
##$NCOEF= 0
##$NC_proc= 0
##$NLEV= 6
##$NOISF1= 3.799351
##$NOISF2= 2.8
##$NSP= 1
##$NTH_PI= 0
##$NZP= 0
##$OFFSET= 15.70392
##$PC= 1
##$PHC0= -9786.234
##$PHC1= 15.00086
##$PH_mod= 1
##$PKNL= yes
##$PPARMOD= 0
##$PSCAL= 0
##$PSIGN= 0
##$REVERSE= no
##$SF= 200.130013532006
##$SI= 16384
##$SIGF1= 3
##$SIGF2= 2
##$SINO= 400
##$SIOLD= 16384
##$SREGLST= <1H.CDCl3>
##$SSB= 0
##$STSI= 0
##$STSR= 0
##$SW_p= 3612.71676300578
##$SYMM= 0
##$S_DEV= 0
##$TDeff= 0
##$TDoff= 0
##$TI= <>
##$TILT= no
##$TM1= 0
##$TM2= 0
##$TOPLEV= 0
##$USERP1= <user>
##$USERP2= <user>
##$USERP3= <user>
##$USERP4= <user>
##$USERP5= <user>
##$WDW= 1
##$XDIM= 8192
##$YMAX_p= 0
##$YMIN_p= 0
$$ End of Bruker specific parameters
$$ ---------------------------------
##NTUPLES= NMR FID
##VAR_NAME=  TIME,          FID/REAL,        FID/IMAG
##SYMBOL=    X,             R,               I
##VAR_TYPE=  INDEPENDENT,   DEPENDENT,       DEPENDENT
##VAR_FORM=  AFFN,          ASDF,            ASDF
##VAR_DIM=   8192,          8192,            8192
##UNITS=     SECONDS,       ARBITRARY UNITS, ARBITRARY UNITS
##FACTOR=    0.0002004,     1,               1
##FIRST=     0,             0,               0
##LAST=      1.6414764,     0,               0
##MIN=       0,             -605197,         0
##MAX=       1.6414764,     903038,          0
$$ Real data points
##PAGE= N=1
##DATA TABLE= (X++(R..R)), XYDATA
$$ [...]
3143B302l959N64N47m309K450P126k479q536K038P973j315o502l7O074K685n544
3159i22n716O470R827o739j2227M579J3568k374j0111p6O551J981k326j768n68
3174A49J010L17J180K989q04p448P47R950j55j1436j28J0239P57p789j088N521
3190D011J989m869l881L787N601l602p286M085P953m715p625M597N589n712l594
3205c672N413K987n023k953L411M448k293p641Q14J0089Q30j1182j141J0128J459
3220E674q634o01N906q70l550J880L413r28m610j332N665L679o709o150P361O437
3236F631o032m910N651J390o092k43O969R04o916l400M790P449k670j0909q1J0699
3252C230J646r039q36O839j298m662K467M026k567m125Q2M130K898l063m098K332
$$ y = [2302, -1657, -1093, -546, -4855, -2405, 4721, 2242, -6294, -4256, 3717, 2402, -4100, -4137, 1937, 4622, -922, -6638, -168, 9659, 2920, -9307, -4728, 8840, 6466, -3645, -3721, 2830, 4811, 2485, 717, 149, 1159, 1476, 2656, 5645, 4841, -2607, -1860, 8090, 7935, -3501, -3629, 6610, 7367, -422, -1510, 4011, 6000, 1131, -2750, 1037, 6638, 3036, -4250, -165, 7788, 3073, -4552, 45, 5634, -78, -3672, 1741, 4728, -295, -3248, 163, 4611, 2318, -5323, -4509, 5580, 6410, -4772, -5913, 4215, 5674, -2960, -3561, 2345, 1475, -2075, -195, 3218, 2290, -2320, -3652, 2013, 5692, -1017, -7167, 194, 6631, 599, -4311, 1340, 2730, -3362, -3605, 3364, 4268, -2648, -6048, -1258, 6191, 3521, -7388, -7469, 3230, 4876, -4163, -4999, 1840, 542, -4120, -1653, 2373, -194, -4319, -4237, -107, 2791, -272, -4370, -2038]
3268b038L542l293o06N848j702r185K516J2210L36j1878m321Q596P895l346r008
3283d434k99Q845K065p254k99O668k867p546N083P698l035o803L49M423J798j242
3299C150k292o23l81m88L197N446m536j1318L084J4547K39j4797l895J1020N953
3314H306n473o131J455N160o63m255J111N079k600n797L981N888m739m595M451
3329A178K562m913l52N455J004n386l296M085P052j577j0585j611J1493L330q859
3344d20l277N529J207k812Q71O49k472j105K561K129k67m994k556O025L955o914
3360a891n706P250M998p030m617O088L469m586m231J604M863M04n287k869O283
3375a258L237n947k207L862O53k916K640K273m779k120N390L616m216n070R28
$$ y = [-2038, 1504, -1789, -2395, 3453, 1751, -7434, -4918, 7292, 7628, -4250, -8571, 25, 7920, 4574, -4434, -4733, 4112, 6177, -1077, -1376, 5292, 2425, -5121, -38, 7660, 4625, -2178, -1829, 2594, 4392, 3150, 858, 235, -146, -634, 2563, 8009, 3473, -7845, -4761, 9786, 10025, -4772, -8667, 2353, 8306, 2833, -3298, -1843, 3317, 2654, -1601, -490, 4589, 1989, -3808, 173, 6061, 1322, -3273, 1178, 3740, -1173, -1525, 3930, 4934, -452, -3748, 337, 7389, 5812, -4773, -6384, 5109, 8439, -420, -3697, 1832, 3039, 227, 1098, 1747, -725, -1830, 731, 2860, 2593, -2401, -4957, 1068, 5023, -1891, -7597, -347, 4651, -2379, -6996, -908, 2561, -2025, -6256, -4652, 211, 615, -4672, -7541, -1258, 1979, -3968, -6175, -2313, -1660, -4576, -1936, 337, -4442, -6562, -1172, 2444, -1772, -6842, -5914]
3390e914P278L078p592o159Q157P057n989n970N093L588m118j134L920J129l149
3405g25j742K119L468r32n123K62O209J1n641R08M454l375k959M304K681l853
3421F6k776K423K759q51k998m60L467N28m901J85P072j12r000j68Q883J838p620
3438a665l156L791M959P17m787l138L296K582j104j82N57k921j696O824K290p122
3454g55l360N247L459j894k740o90J684J486j777q91L115N8n579l54O829L12o202
3471b052q44L570P89q27p65j024q28K79O36K059L62n234l209O588N932o644o935
3488h147M546N449j085l833n79J273J714m81k354J393J569j842j192K994L62k102
3504b315O28J410l278o21O459J720o814l623M934N946o28p503m210P635Q014n366
$$ y = [-5914, 1364, 4442, -3150, -9309, -1152, 5905, -84, -6054, -961, 2627, -1491, -2625, 1295, 2424, -725, -2467, -348, 3120, 2188, -2935, -2673, 3536, 3547, -2094, -1186, 3268, -107, -3066, 1238, 3919, 66, -2710, -287, 2472, 1621, -1377, -1837, 1630, 2158, -2743, -2558, 4514, 4402, -4598, -4766, 4117, 5955, -1665, -4821, -1030, 3929, 4646, -141, -3279, 17, 2599, 1495, 1313, 1870, -1051, -2747, 4077, 6367, -755, -4115, 1132, 4591, 2697, -43, -733, 951, 2437, 660, -231, 2884, 2942, -2637, -2991, 3838, 4150, -2052, -2896, 674, 1463, 636, -129, -1153, -1981, -1702, -1066, 993, 1355, -3879, -7088, -500, 5432, -1212, -8147, -3601, 1848, 763, -3070, -3649, -2376, -662, -1143, -3497, -2104, -535, -2377, -3569, -575, -213, -2315, -1687, -277, -3555, -4176, 2283, 4003, -2811, -6434, -1500, 4446, 3818, -3685, -7895, -260, 7754, 2388]
3520B388q865K406P150p84k949m45n26O28K120Kj649N65Q8j532J25J731q43O4
3538c26N46k538r6N682M76o962k529O432M051l073m590p17M363L726l093n343
3554c991K467M884k234k721K657J182j517J65Q55j024K67J084j369j90K394q08
3570B101j338J139j73j617J728K122k627j510K817J28k723Q34J875q62p53m6j22
3587I73R09L68k791o08M545N02n706r12M534J563k486j890l51J466K551j034m155
3604b522O67L567k94j466R3j575j81L428O71l977q94K448M58O5M70j647j759K081
3622c67K217j642j345n32j72K948K697l468n204K837M480j314k703o4Q59J481
3638G08P84l181j259L610J302m561p37M122J279k565k188o07L027M882l736p093
$$ y = [2388, -6477, -4071, 3079, 2295, -654, -1099, -1625, -997, 1123, 1125, -524, 41, 129, -1403, -1278, 453, -390, -326, 220, -2318, -2414, 3268, 3744, -3218, -5747, 685, 4736, 1663, -2927, -3644, 719, 4445, 1352, -3991, -1524, 3360, 1126, -1595, 1062, 2244, 727, 892, 1747, 723, 990, 2074, 705, 515, 2909, 2101, 763, 1902, 1729, 112, 1840, 3962, 1335, -175, 2642, 2770, 47, 881, 2756, 1894, 1141, 1095, 973, 1882, 2250, -541, -1149, 3396, 3898, -1808, -2720, 1814, 3377, 891, -999, -1350, 116, 2667, 1633, -2522, -1855, 1712, 1418, -48, 45, -1530, -1711, 1717, 2388, -1589, -2483, -35, 423, 488, 958, -689, -2448, -367, 1850, 208, -1137, -1669, -1841, 1107, 3804, 336, -4868, -2031, 2449, 1135, -1568, -1632, -773, 708, 1492, -1689, -2948, 662, 1964, -2597, -3334, 788, 2067, -498, -2686, -3293, -266, 4616, 880, -6213]
3654f213J441Q114J335n552l197J201M165K472l822m745L583N451k104m836J587
3669a120K943oj784j622Q90M651M27o959k286P283M981m978o174J61N869N083
3685G359l419q063K17Q061K495n609l460K011K113J920k06l187j024K460j81j187
3701C00J365P74k053m05J355J99O6J69k988p10M375K140m717k523L010K011q48
3718A520j251j380J146J914j304k585K918K825m018l500L732K761j945k328l80
3733a875J140K278j8l654n77K983L35j682N05l43j384J492J545k212j511K905
3749g3l31k962L94K927l22j920n14O45K441k05m946r69O695K182o319k639M691
3766a225K744k223k836m00K565K447j558l337J482K628j250q13J248o56j705K252
$$ y = [-6213, -4772, 3342, 4677, -875, -4072, -2871, 1294, 3766, -56, -4801, -1218, 4233, 2129, -2707, -1120, 1823, 1817, 33, -1589, -699, 3952, 4379, -2580, -4866, 2417, 7398, 2420, -3754, -3593, 2276, 7359, 3940, -4123, -3906, 4155, 6650, 1041, -2419, -408, 1705, 3625, 3419, 232, -792, 1668, 1487, 300, 1665, 2439, 386, -19, 1336, 1535, 1601, 1770, -1218, -1928, 2447, 4587, -130, -2653, 357, 2368, 1520, 269, -1111, 35, 1949, 645, -1940, 978, 3803, -215, -3715, 17, 2778, 833, -1495, -1875, -735, 1543, 1525, -2129, -2706, 277, 612, -1070, -565, -908, -2292, -800, 745, -1467, -2978, -73, -404, -3366, -2972, -45, -367, -2287, -2801, -2156, 285, 80, -4866, -5835, 860, 3042, -3277, -5916, -1225, 1519, -704, -3540, -3940, -1375, 1072, -486, -3823, -2341, 287, -963, -1776, -528, -1184, -2889, -637]
3782f37J384k112J41J642r21j942J713J693m77j658n40J561L088j883n949J841
3798c056P615o66p653j49N847J917m229k521J237M239N66m940j465N111K074m303
3814c76j570K470O07K47n0k540j339M640L248m315m661J896M814J497l787m981
3830d200K902O793j173p702N49O700M2n909n3L921P18k296k461J007M261K38n367
3847b030j533M101J680j694m86j313j710K552L746k944m312J005M515R15k327
3862A65l270r2L935J142l387m94K553j325k384L613K997m589k934K895L282j365
3878G42k830j115L664L230l338m097L506L872l849l550L406L661k121k151p9K8
3894a021K103J221k313j936L77J934J802L94m823k882N627M565n214n045L608
$$ y = [-637, 747, -1365, -1224, 418, -503, -2445, -732, 961, 484, -1174, -1714, -153, 2935, 1052, -4897, -3056, 4559, 3893, -3760, -3909, 1938, 3855, -374, -2895, -1658, 2581, 3147, -1793, -3258, 1853, 3927, -376, -1946, 524, 1131, 1378, 1328, -1212, -2551, 2089, 5337, 1022, -3639, -1743, 3071, 4568, 781, -4200, -1298, 5495, 4322, -3380, -2831, 3869, 3911, -1998, -2051, 1870, 2588, 292, -2169, -1162, 3099, 3337, -2030, -3563, 538, 2218, 524, 38, -1275, -2985, -433, 3313, 369, -3943, -2938, 1577, 2492, 165, -3105, -3197, 738, 1880, -1507, -2001, 552, -773, -3157, 456, 3453, -1136, -4070, -1175, 2107, 742, -2088, -3203, 461, 3691, 353, -3744, -238, 3634, -215, -3765, -359, 3302, 1181, -970, -1049, -1021, 1082, 2303, -10, -1946, -1569, 365, 2167, 2561, -2262, -5144, 483, 5048, -166, -5211, -1603]
3909a603M534k049l480J206J828n38k569j5M019J265m444k643N157K702m755k134
3925c519L162J956j273m29J25p51J142L05K23pn14n45J434K199l162j230M341
3942C457J571m761j390M504K101l825j736K089K638p44l808p64N224J374n751
3957A79j695N541J525n031j314L131J270j385j118j334J281J320m93j143L40j018
3973E6j038K861N93m344o97N498Q69n818j579M577J828k960k543J338M181J02
3989B924n102j307N073J759m598k76L373j006k468K596K213k490k183J265K471
4004B244O53k712k383L073L439k751l278K535J608l104k94L867p94l158J53K005
4020A103K3j132j065K4J475m12k585J856K725l341l361M155L694m859m260L340
$$ y = [-1603, 2931, 882, -2598, -1392, 436, -102, -2671, -2686, 1333, 2598, -1846, -4489, 668, 3370, -1385, -3519, -357, 1599, 326, -103, 22, -729, 413, 718, 941, 934, 420, -125, 1309, 3508, 346, -884, 3457, 5028, 267, -1123, 3381, 5482, 1657, -79, 2010, 4648, 3904, 96, -668, 4556, 5930, 179, -1516, 4025, 5550, 519, -795, 2336, 3606, 2221, 1103, -231, 1050, 2370, 1877, 734, 1074, 56, -982, 1879, 2472, -1872, -2569, 2929, 3798, -2020, -3599, 978, 2806, -154, -2697, -1359, 2822, 2924, -2178, -3485, 1588, 3347, -1251, -1527, 1846, 840, -1628, 968, 3181, 691, -1492, -227, 2244, 2897, 185, -2198, 875, 4314, 1563, -1715, 820, 2428, -676, -970, 2897, 2103, -1055, -902, 1103, 1126, -6, -1071, -1047, 428, 16, -2569, -713, 2012, -1329, -4690, -535, 3159, -1700, -5960, -2620]
4036b620M408m89m050j720K667L343j992m381K053M576j456k832J139L87o45J846
4052B34R14k252o15K737R96j866j510M00L700J392l823m041M655N550m035n317
4068b881L208M382j259l263j62J394J613o67j572R14J366k798q70L451R49m401
4084e96o47L467j58k399M31J226j267m13J43L51K38j166q32K273K071l781k998
4101d057M230K087l942q64L846Q25l719j289K095J924m33l003l19M429Q99m091
4117a382j900L954J225k984M12J607j378l75J364R5j062K22r0j3L19q26p48K432
4135H72Q56m315j088M606P86m333o33K851P47j348l43p24K39J082j313k54K446
4152A34j317l632K254L862j770m050J541K748l91j732p00J030K001J49l144k53
$$ y = [-2620, 1788, 1299, -2751, -4471, -1804, 1539, -453, -4834, -2781, 1795, 339, -2493, -1354, -967, -1612, 234, 1148, -1104, -1719, 1018, 2014, 148, -1362, -962, 2738, 4130, 307, -3734, 921, 6471, 2436, -2881, 327, 4709, 3450, 187, 25, 1419, 3032, 2365, 793, 1707, 3073, 275, -595, 2856, 3805, -596, -1243, 2224, 2066, -333, 98, 1324, 57, -356, -213, 138, 376, -790, -1622, 651, 2722, -1059, -4057, 173, 2260, -1682, -2546, 1300, 2125, -1594, -2883, -788, 1136, 703, -2300, -2619, 1810, 2709, -1382, -3282, 672, 1897, -1087, -675, 932, -446, -821, 543, 638, -424, -202, -292, -305, 14, -812, -1560, 872, 1728, -2587, -3675, 931, 1717, -2616, -3249, -398, 349, -999, -1342, -2066, -1827, -745, -2058, -2312, 134, -1183, -4815, -2561, 1301, -469, -4519, -2978, -230, -621, -2353, -3053, -2023, -22, 127, -3017, -3270]
4168c270K744O80j776J83M80j34J240J581l142l109M450L926k170m241l88L430
4184D84L357k152n150J659N577m09n230N74L746m38j712l62O95J009K2j908m81
4201g19K186J053j585j075Ql69J492J991k252l936L320L518k707k832J376K052
4217A521J34j951j008J045K660j618l370K533L546k462l325J214K561l55m62j82
4233D81j471N89J639m87q87N79o16l7J866l2l047L13K464j020j176J236O77j810
4251g39O4J318j7o29m99r90R66K167j811j926K490J516k794j754K583O00j580
4268a035m09N94O09R28j454j850J103K232j410j177J674k33j371J240P36j499
4284a322l38J921j063j157J331O52l86l2m74p89K103P03l172p93L914J019l526
$$ y = [-3270, -526, 154, -1622, -1439, -959, -1093, 147, 1728, -1414, -4523, -73, 3853, 1683, -2558, -2946, 484, 3841, 1689, -3461, -1802, 3775, 3366, -1864, -1290, 2456, 2018, 306, -56, 639, 1648, 1670, -238, -719, 1467, 2520, 935, -140, -132, -501, 991, 2982, 730, -3206, 114, 3632, 925, -1907, -531, 1521, 1655, -296, -1304, -259, 2401, 783, -2587, -54, 3492, 1030, -2295, -1081, 1480, 1125, 663, 481, -990, -401, 1238, 751, -136, 443, -173, -210, 1656, 1624, -1423, -1110, 1354, 334, -842, 394, 1071, -739, -675, 643, 626, -3, -502, -1492, -526, 1641, -170, -2096, 394, 1910, -884, -2638, -55, 545, -1035, -1444, -850, -241, 687, -767, -2617, -1514, 718, -692, -1869, -195, -428, -1799, -559, 177, -1322, -1660, 261, -802, -1959, -628, 24, -362, -394, -868, -1657, 446, 1149, -2023, -2816, 1098, 2117, -1409]
4301a409k27K098l20l22l39k02P39J267j625j091K357J071k738m19K041Q4q48
4318A17O97o24k93J568O57k503k80K034N67j111j86k88N16J827j724k784J613
4335a97M165j628m007R67L038L42j400k232k2L522J957m235l330L409K934j082
4351B201k047j014M65K274J166l289k185L461K299j996j852m94P71K357J57k917
4367f43m23L170P9l148K73J680L75o69J0j262O79K070r71k123P80J365n65j50
4385E27N35j069l04J812O1k243j7J272r81Q25J206j818r16J439L98j506L26L73
4403h0j112R82J439j770j672K186J38j312N35P39r80j52M77m88M53J467j533k067
4421b750J693J833j357n79L87j60M60J364j351j538J821J367j027o31J266q05
$$ y = [-1409, -1636, 462, 142, -180, -519, -721, 18, 1285, -340, -1431, 926, 1997, -741, -1160, 881, 965, 117, 814, 190, -103, 1465, 2122, -381, -661, 1373, 1940, 829, 643, 355, 871, 2698, 974, -1810, -197, 3968, 2340, -1667, -700, 2338, 2680, 1280, -952, -974, 2548, 4505, 270, -3060, 349, 3283, 2201, 154, -860, -395, 1879, 3045, -244, -2429, 1032, 3331, 1335, -517, -1011, -240, 2117, 2274, -643, -1066, 2104, 2183, -965, -692, 988, 1363, 694, 704, -558, 121, 2191, 1220, -903, -123, 1242, 677, 527, 1062, -7, -311, 1501, 1562, -681, -698, 574, -407, 418, 1624, -194, -1110, 329, 727, -779, -453, -80, -1192, -210, 1229, -541, -2213, -27, 111, -1201, -666, 73, -907, -1059, -582, -1070, -617, 850, -683, -2750, -1057, 776, -581, -1160, -773, -933, -473, 891, -460, -1998, -177, 1190, 163, -468, 798, -7]
4437gl97J347m32j112J113P42j638O28J074o06q77J123j37r42O81K91r80J133
4455A004J033j541j130K032j65j550N64Q44n69R59J72j923j98K131o7k009P44
4472C31J226q13q37N97k69O46J204j872j495J926J782j838j275J257J25O54M5
4489A394j539j236K103J947j765j485J604n45k34O54n37p76J107J96k028O55K073
4506A588j036j910N36O73K92M9q47j888J942K384j541l079J078P71K42N99o72
4523h19k010J210K016j277k000R52P53k55L48M0j263N54J158j332n04J822L20
4540b87j721N44P26n8K77M77j445n36K082K61j201J47L98p14J175J055k263r84
4558b067K315J340j129o20j66o45J551J160j956j426J650R65r78J0J6p44K27J459
$$ y = [-7, -404, 943, 511, -601, 512, 1254, -384, 244, 1318, 712, -165, 958, 821, -121, 560, 851, -129, 1004, 2037, 496, -634, 1398, 1233, -317, 247, 1091, 522, 1481, 1653, -270, -468, 1663, 1596, -413, 331, 1557, 744, -93, 504, 235, 881, 2085, 213, -1282, 644, 2426, 588, -687, 570, 695, 1349, 1394, -145, -1381, 722, 2669, 904, -581, 1023, 478, 244, 898, 361, -415, 692, 888, -1140, -485, 1588, 552, -1358, -822, -149, 143, 192, -655, -2543, -601, 1783, 242, -2837, -1759, -988, -746, -147, -819, -2829, -1619, 397, -880, -2880, -1928, -1175, -1430, -1082, -1042, -2305, -1751, -593, -1925, -2429, -607, -287, -2008, -1464, -738, -796, -519, -42, -1487, -2023, 59, 320, -881, -734, -336, -1050, 125, 1180, -1083, -2067, 248, 1588, 459, -161, -327, -972, 579, 1739, -217, -1643, 7, 972, -6, 4, 20, -724, -497, 962]
4576I62j126j368J336N05j071J21J009p95J38m7p39J35K044q02j796R06J580r69
4594B3l86M60p02m1J925j58k107L74J484m79O29J08j781l89K580L33j530nO92
4613A030n93L10J371j594j254J534J030r39k19j17j065R99R94j613j24J350k46
4630H54j871Q02J096j133j55L19r12l25J754q95j941J188J709q29j151r5p20Q27
4648a478K360j430k404J027K384p62j169r1o25J133J706p37k114J046J383r50
4664g21K04O61p22m80J206M37r29O20J90j216M00J520p59r82J089j19n77J248
4682A070n8j783KJ365L0l07N68j139q80J256J439j363j276P81n5L04J121r83j907
4701a815J403K062j405j383O48n75N31J760m29j974O18Q33n18L00O61o56r50J508
$$ y = [962, -164, -1532, -196, 309, -762, -641, 368, -427, -289, -336, -1075, -940, 1104, 302, -1494, -588, 992, 23, -363, 97, -605, -646, 1279, 1121, -986, -612, 872, 393, 1022, 1130, -651, -1040, 1540, 1873, 343, 338, 1030, 437, 747, 2118, 524, -730, 804, 1834, 895, 676, 559, -506, 493, 1487, -126, -250, 1100, 854, -1017, -215, 881, -252, -407, -88, -1000, -1325, 429, -466, -2407, -1219, 490, -339, -1490, -1585, -2305, -1478, 882, -548, -2952, -1925, 459, -303, -1472, -1563, -2188, -1055, 651, -86, -2200, -1154, 229, -721, -517, 144, -578, -1058, 148, 585, -344, 276, 466, -750, -350, 1170, 411, -571, 518, 399, -178, 1070, 1012, -771, -769, 596, 626, 319, 887, -252, -1132, 124, 1563, 200, -1076, -295, -350, -46, 1075, 92, -1815, -412, 1650, 245, -1138, -490, -1065, -534, 1226, 797, -1177, -559, 274, -244, 56, 717, 61, -889, 619]
4719F19L53j021R92m4j292Q12J949j269j204P12R41l5O20m80j573J96J709r4j388
4738E03Q98m43l12J247O08k202l46J764m18m10O00k70j479Q16J542j158p65L77
4756E52p65l1J704q16j627L93J377j145K08P42j169j212J809N77q63J89j082l58
4774a517J094J613j736j550J086J438m63m54l22j271J149J878j254j273P19O91
4790a72n12O23n47r75O03J466j080n50J510J57j917K60R87J46m8o05j009J067
4808e96K792j461k807K96J709J37Q7k18j347NK623m9j778o75O65L84Q2L99r84
4827g36k75J631M9j210Q16R4j708J99K444j26j576J3Q02j3L43m89j036O88J427
4846A337m82l86J319p67j717Q62J862j423o64N71K05M09J293j028k256P19J436
$$ y = [619, 972, -49, 943, 899, -393, 419, 2368, 1099, -105, 607, 1548, 1513, 2133, 1653, 80, 276, 1985, 1891, 503, 1401, 958, 646, 1893, 2501, 299, -47, 1717, 1299, 889, 1489, 1219, -260, 556, 2098, 940, 175, 552, -213, -244, 1460, 644, -983, -590, 787, -358, -150, 592, -577, -1789, 20, 597, -266, -77, -1159, -1517, -423, 1190, -546, -2096, -1010, 428, -35, -489, -811, -2082, -933, 945, -309, -1582, -863, -172, -684, -61, -608, -1583, -980, 486, -594, -1144, 366, 523, -1394, -1134, -147, -1, -49, -654, -1663, -596, 2196, 735, -2072, -1776, -67, 70, 157, -61, -1408, -1403, 1220, 1171, -607, -1282, -617, -233, -151, 248, -736, -1011, 620, 669, -541, 275, 369, -1339, -1140, 1304, 1178, -398, -385, 417, 404, 747, 258, -778, -90, 1337, 855, 469, 1788, 1021, -696, 166, 2028, 605, -59, 512, 717, 1126, 2419, 1391, -865, -146, 1290]
4863A290L54k82m90j595P29K946o88l279n2K350k36j54l72m31p8J053m61j177
4881e73R93J38j538L30K234r38j598M52L79o55R08J4j619K40J419r9l26k27j181
4900a647o08K215R70k159r15J432J54l05O45p08j250P52J150L05K2r68j366J360
4918i21K488j705k662O63K572j66r05J40r8n61J017k25n72M21J68m51N02J342
4936A047j411j249J384K2p40J612k26j810l71K366Q03j537j175m9J169J839j040
4953F34k650P85K571m88j916Q26K70j227Q80J028m24m08J04o90N96J098n51j425
4971i87N09J178l53N94j40j399m49K028J223j882j526J201P72J008n16j493j91
4988d23J791m76p26J313J40j883l54K675M73k283q41M53J074J152n77k217L23
$$ y = [1290, 1644, 1362, 872, -723, 6, 2952, 2264, -1015, -1067, 1283, 1047, 893, 521, 90, 12, 1065, 604, -573, 420, 558, -980, -650, 1584, 646, -952, -500, -121, -776, 132, 146, -1473, -1233, 186, 87, -239, -466, -1647, -2255, -40, 930, -1229, -2144, -712, -558, -863, -218, -926, -2176, -1424, -274, 31, 53, -915, -2281, -921, 1567, -138, -2800, -2137, 435, 269, -636, -496, -594, -1155, -138, -363, -935, -514, -346, -797, -295, 1047, -364, -1613, -229, -207, -947, 665, 439, -1371, -1742, 624, 1427, -110, -1285, -1334, -165, 1674, 634, -2016, -1231, 1340, 852, -1064, -238, 32, -1195, -315, 713, 289, -119, -15, -705, -109, 989, 438, -987, -478, 700, 347, 941, 801, -598, -1047, 981, 2204, 322, -1204, -3, 769, 1777, 1261, -232, -423, 1368, 892, 166, 1479, 1619, -264, -618, 2057, 2530, 247, -594, -141, 933, 2085, 1508, -709, -386]
5005c86J942n77m76L66p22p33J112J589j797j082O24k1K25N66j29j081j87N26
5023b41K08R45n64k752p9L579Q37l268j141J833J080N1r68j066L32J333l09m84
5041f74Q25k40j527Q55J920r48j479O91L84n86J256L98j527j011J685Q29l50m04
5059I7j312n1K141P35k590l20J771j68p17P32L99j333m20Q39P71L87j094j655
5077a788O06K885j64k983k63J924N71J00k30j698q07K629P81j539m53l37M00J417
5095A051K3j622k87J842l08r67O27J343j341j157J360Q47K10p71j510m9K796O77
5113B764l022k69J676K74m00O00r60j205R93J470k25j629k29L86Q86L17o33j720
5131i26R52J131r35N93N20j982q13K029Q72j404j088P00J62O02K42j472n52J519
$$ y = [-386, 1556, 979, 503, 869, 147, -586, 526, 2115, 318, -764, -140, -161, 64, 630, 501, -580, -767, -241, -33, 912, 348, -2404, -2483, 1096, 1933, -1335, -2476, -643, 437, 488, -480, -1546, -1214, 119, -190, -674, 151, -89, -1616, -761, 1159, 211, -1268, -577, -193, -779, 477, 875, -652, -1663, 22, 851, 501, 97, -1215, -1266, 875, 1610, -980, -1300, 471, 303, -414, 318, 717, -616, -1036, -197, 574, 961, -133, -1788, -1182, 1703, 1539, -1444, -1707, 217, 788, 888, 658, -1040, -1847, 782, 1563, 24, -429, -766, -366, 1051, 1074, -548, -835, 1007, 699, -268, 359, 1702, 361, -796, 564, 1411, 1621, 850, -660, -709, 2087, 2764, -258, -527, 1149, 1423, 1023, 1623, 663, -542, 451, 1921, 1696, 67, -162, 224, 1110, 1427, 794, -926, 26, 1157, 222, 815, 1335, -647, -1460, 569, 1441, 37, -1051, -351, -189, 413, 655, -817, -1369, 150]
5149A50l10n30J070K77k208j71K357J69j154o10j74O62J499j28k405n11K055M46
5167D84l47q91m93m76K259Q46k337j100J764M63q67M18j86p47J24O99m34P22M1
5186e8j301n98K509J092k625j225J077J065P13j11k204q07K369O10p23m69l12
5203i98j50O92J278r94p37M17M0j18J605J99k362n66J920J257l28q84j414K07
5221i36K217J012j933j433J132P31J52M13q31j342Q73J234n60K42r6j090k24J934
5239A495L48r15j277M07M94J246M42k592p54J820J219r51j226l8O8P40O47l93
5257G80j249O14J53j41J093j79j807j45J007M07M0n07q55k41J672J119j728j213
5275a180J052M85K78k46m93r43P80O73o29M05j3p84q73J781P75j658j190Q07N58
$$ y = [150, -160, -690, 380, 657, -1551, -1722, 635, 804, -350, -960, -1134, -472, 1027, 899, -1506, -2017, 38, 484, 137, -754, -1247, -1723, 536, 1382, -955, -2055, -291, 172, -695, -277, -463, -1210, -1086, -387, -821, -99, -58, -1359, -1957, 552, 1644, -981, -2206, -1129, -64, 649, 538, -1666, -2473, -104, 506, -217, -686, -998, -1148, -456, 822, -172, -909, -492, -452, -570, 1035, 1234, -1128, -1694, 226, 1483, 1155, 271, -1143, -936, 1281, 2293, 360, -1073, 59, 790, 942, 1355, 524, -818, 55, 1289, 729, 971, 875, -215, -439, 1495, 1843, 928, -349, 58, 552, 1798, 2240, -352, -1106, 714, 1933, 982, -244, -282, -214, 526, 1173, 780, -469, 145, 298, 157, 1250, 1071, -736, -881, 126, 533, 573, 66, -789, -1030, 642, 1761, 33, -1180, -128, 357, 635, 389, -104, -1047, -267, 406, -223, 182, 169, -615, -1488, 293, 1068, -590, -1780, -973, -415]
5294d15J086j04j905n84K416M99j834n76M77K03P28K09j557o42J658O16j198m52
5312a375J051mn24K69j59M94L79j783o77K609J456k576j952J998J887j37j627
5329f71j210K53K617O26j800j193Q07P04K26M75q02j141J070R43n22o15P70l20
5347B17r51J119J441q95j126o63K29K636N98l127j528K303K265j656j383M88J99
5364A66M27M71l10l81mp64K73J649J00k307m08J652O91o56Pj106l63J155J987
5383B279j425j893J24J085J583k29j894j098K026R62j540l80J555q59j475J340
5399A61J543o70j929o16J506K040n45k988o28K764J036j653o62P1K27J79J515
5416A351q98j538J58R11L0J62q7q82J28O08q07R50J252k775j488K285L122k063
$$ y = [-415, 671, 567, -1338, -1922, 494, 993, -841, -1417, -940, -737, -9, 200, -1357, -1999, -341, 275, -923, -1375, -324, -328, -852, -583, -742, -248, 131, -1652, -2329, 280, 1736, -840, -2792, -794, 1093, 956, -671, -1881, -1628, 989, 1615, -185, -1378, -571, 133, 359, 834, 32, -1109, -39, 904, 382, -233, 537, 217, -734, 385, 1826, 931, -195, -858, -629, 2007, 2605, -522, -2050, 253, 2518, 862, -521, -33, 166, 593, 1064, 754, 373, 369, -395, -122, 1527, 1627, -680, -1088, 564, 1255, 599, 606, -500, -863, 292, 2279, 854, -1039, -915, 170, 1753, 1524, -370, -1468, 558, 1520, -20, -400, 1155, 296, -1179, 161, 1704, 1034, -895, -1511, -5, 2035, 1490, -1498, -2126, 638, 1674, 21, -641, -570, -343, -164, 1351, 453, -1085, -927, -16, 14, 176, 89, -793, -665, -57, -864, 86, 1338, -1437, -2925, -640, 2482, 419]
5434D19l251L84K994J398j970k786J091K830L21k623n20K112n80j299R16J153
5450E89p58n20K63k85R88P21j341r67K07J286J322r4k421j346K992K490k574l358
5468b806J599L056Qk280m77J433P10o99j404Q87J981j342k036J793K002j242k035
5485h52P11R53O37j48j114q09Q63J057J12r08r20l52J838J689k260k321J574K810
5503B560j591k025J196J514r44j176N27J293m4k265p11K938J685l343j861K772
5519E25K107j802j407L20O97k99M20K40p27l38K4M65J325p89k037P61J849j236
5537I8r70J371J72j986L48K311K86k357j938J950K947m76l450j226L404J602k948
5554h62j193J945O19j785M66J585o0k029q37J351K001j58k549o88J844J227j120
$$ y = [419, -2832, -2448, 546, 1944, -26, -2812, -1721, 1109, 1430, -1193, -1713, 399, -181, -1480, -564, 589, -169, -689, -426, -711, 277, 998, -343, -1310, -1103, 183, 1505, 1411, -1010, -2356, 636, 3126, 552, -2806, -1207, 1849, 1857, -423, -900, 533, 1243, 544, -860, 27, 2008, 666, -1370, 423, 2425, 1183, -852, -141, 812, 1449, 1301, 187, -622, 241, 1298, 1410, 502, -418, -770, 1068, 2757, 497, -1824, -250, 2560, 969, -1056, 140, 1654, 710, -466, 61, 1354, 1310, -955, -1666, 1272, 2957, -386, -2247, 525, 2632, 830, -577, -257, 440, 141, 561, 801, 74, -264, -240, 225, 1550, 761, -1276, -515, 1334, 98, -872, 499, 671, -1315, -967, 1344, 1630, -727, -2665, -715, 2232, 1756, -1694, -2920, 484, 2086, -862, -2055, -110, 509, -1276, -810, 775, 715, -1314, -2151, -800, 1201, 1043, -1506, -2194, -350, 877, -243]
5571b43J64o07j822J541K953q23l347l52K781J526j492k209J92K308L67k293K75
5588a081L102j454l238J307L803m09l426j097K789K175p89k663m39J360J452o48
5604G44j002M17n09m9K326j22l154j06K725K09j836p1J394L77j342j283J721K166
5622B605j724l930K028M586j116m249k92L176P55j334r09j61Q94L01j39n2N81
5639A020j941k63K242P67k264j082K616M72k088J72J250q36j131J052J118L15
5655A419j651k006K258K487j461l661J503K738q42j960Q73J001p12r19Q78P93
5671G38l48j911l32K671J014k665j738K594J337k092o53J137k13l02K93Q02o45
5688c13j032j00R21J392j198j900J503J590j832j421K506Q42k688p93K775J387
$$ y = [-243, -79, -686, -2508, -967, 1986, 1163, -2184, -2536, 245, 1771, 279, -1930, -1738, 570, 937, -1356, -1081, 2021, 567, -2671, -1364, 2439, 2030, -1396, -2493, 296, 2471, 1682, -981, -1420, -60, 1392, 744, -258, 159, -350, -399, 1927, 1805, -1349, -1455, 1270, 1479, -357, -428, 966, 1343, 1, -1282, 439, 2605, 881, -3049, -1021, 3565, 2449, -1800, -2092, 1084, 1839, 505, -404, -565, 329, 630, 491, 439, 1020, -921, -1184, 1058, 1825, -439, -1521, 1095, 1567, -521, -349, 901, 65, -1066, -14, 1104, 1419, -232, -2238, 20, 2507, 1046, -2615, -1112, 1626, 784, -1176, -303, 698, -14, -933, -55, 738, 390, -1521, -1853, 818, 1832, -833, -2571, 23, 1360, -732, -1385, -248, -461, -763, -470, 332, -313, -1345, -1445, -524, 868, -330, -2230, -727, 863, -969, -2390, 116, 958, -1730, -2523, 252, 1639]
5704A639k079j974N65K666P26k829j388K874J635j905j515J735o2j059Q42R71
5720H42o49j188M79J053M41p92j035O97P36o98m03J815j99l143M99L502O25l543
5738i61j839K886K401p27l017p09K796J283k336r39J699J87j533O99J933j157
5754F66j521L03J128M33n63m47n93Q66J89J21J082q72k279L32L799k84l446j207
5772b293L042J542j454j736N18N48L71l82K38R31r91k083J556K312o45k831M61
5789h96J774j51n38j05l62l91M05O45O88l86k272n76K893J301l195j250K062Q73
5807E19p13n3J0r75j71J111R02k17j816j079K103K526j830k616J064K313q53j718
5825a493J226M28o30p03P55Q83N33j835j289K222J344j597j604J245P36n23P25
$$ y = [1639, -440, -2414, -1849, 817, 1543, -1286, -2674, 200, 1835, -70, -1585, 150, 88, -971, -129, 842, 193, -995, -516, 537, 978, 186, -849, -152, 584, -114, -517, 1298, 1099, -2044, -1545, 1957, 2582, -961, -2800, 86, 2487, 1760, -1257, -1966, 830, 2113, -223, -1162, 537, 724, -809, -110, 1823, 666, -855, -552, 576, 1009, 446, -1, -594, 272, 461, 582, 1664, 792, -1487, -1155, 2644, 2360, -1086, -2293, 749, 2291, 837, -899, -381, 167, 538, 156, 394, 1325, 334, -1749, -193, 2119, 1474, -1357, -896, 878, 727, 189, 84, -278, -669, -264, 381, 1069, 683, -1589, -2165, 728, 2029, -1166, -2416, -354, 519, -194, -247, -237, -1212, -1383, -272, 630, 413, -1403, -2482, -379, 2147, 317, -2299, -1235, 1078, 225, -1493, -267, 161, -469, -1172, -417, 466, 999, -836, -2125, 97, 1441, -156, -1760, -515, 221, -302, 423]
5842D23K10j433m93J620Q94j175j303M44J201P79j268j636J986J449k165j021
5858a488J976J466k405j006J374J449n18j672l91J510J531j584j226R12J300o82
5874E46j14P1p85j69K081L75k307o33J229J294n15q65q50J194J009j381q28J553
5892I05R47k491KK294L33k086r33J208J383L0j447j444J215J240m32o63L12o31
5910b58q65J893Q82j496j452O21J226O6m36m06n62N84Q93k93n08m0j128N98J848
5929A167k09k278m82J899M49q03k73J86l32N18k45M20M53o91j843J135K583j090
5947E64k053J6J392P42oj042j199N51J464K04q40l66m04J23J642l1j688k9R15
5966d5o4n06J008M6j128o91J337P35J49j543j655J660K691p42k824j27J851P74
$$ y = [423, 633, -800, -1293, 327, 1221, 46, -1257, -813, 388, 1167, -101, -1737, 249, 1698, -467, -1488, 488, 1954, -451, -1457, -83, 1366, 848, -824, -1215, 295, 1826, 242, -984, -72, 1228, 546, 432, 503, -282, -451, 1630, 2005, -302, -935, 294, 1588, 1073, 208, -642, 552, 1561, 180, -648, 905, 1852, -639, -637, 1657, 1990, -96, -1029, 179, 1562, 1592, 145, -1299, -84, 1156, 724, 61, 373, -258, -1123, 770, 1652, 156, -1296, -675, 551, 617, 181, -225, -787, -203, 690, 397, -111, -151, -1279, -681, 1167, 958, -1320, -1802, 97, 546, -257, -530, -344, -676, -158, -403, 17, 470, -221, -2064, -929, 1654, 564, -1489, -1473, -81, 661, 655, -387, -1586, -1035, 429, 633, -207, -573, -977, -854, 788, 757, -931, -960, -45, -109, -615, 393, 439, -689, -1380, -43, 692, 841, -702, -2357, -697, 1994, 1252, -1572, -1699, 152, 926]
5984I26l70q58p53M92J320K82j444l1P65l87%O06l35l79K80k55l2J296M58k442
6004h61l40J971Q79n57j354o48R97J492k63j730m45J715L06r30K38M4p12K70Q09
6023H81p72L30L49q96l28R64O08j409l92N06K29J029o31j214q8J659M20j559m97
6042h11P01J98Q6K63r46j20J077L63q91k73M51n96J33J039l88m52m05K61j77O32
6062A45M40j518j76J409J15o88j04k92k54J215L34j378j17Q97l86Q1Q59o35j334
6081a387M72J221N7q40k50k80O24J000l97j559M1Q29Q11k94k40j208M21J779k63
6100E37j521Q9J319l11m57K22M68l02l41n42N27J650j13k421k83K330O01j339
6118A13o82o7K29J444M05k081n07J339Q26o3m65j074R1J539K90j195l74R49o05
$$ y = [926, 556, -302, -1055, -563, 757, 1039, -405, -436, 329, -58, -58, 548, 213, -166, 114, -141, -173, 1123, 1581, -861, -1201, 770, 1649, 1092, -262, -910, 87, 1579, 1316, -414, -859, 856, 1162, 232, 470, 514, -198, 72, 881, 109, 439, 788, -108, -436, 528, 1136, -273, -665, -159, 70, 1099, 468, -746, -834, 825, 1245, -314, -811, -110, 88, 174, 437, -509, -629, 448, 811, -80, -353, 98, -498, -365, 674, 286, -166, -571, -310, -487, 145, 585, -933, -1109, 300, 415, -273, -377, -669, -923, 292, 626, -752, -869, 28, -358, -277, 582, -53, -1387, -915, 306, 363, -477, -727, -1007, -383, 617, 220, -1339, -1298, -469, 342, 48, -192, -1400, -979, 800, 537, -984, -895, 424, 113, -344, -122, 346, 44, -297, -839, -312, 1338, 1225, -1196, -1479, 851, 1452, 113, -569, -636, -407, 1037, 1442, -639, -1146, 193, 1019, 956, 491, -583, -492, 1047, 1337, 142, -232, 717, 112]
6137A12p76R22J342j213j020J48J054J061n19k215K7K313O82k038o78P74j85O47
6155D38Q38p24j188J15J011N78m85n45p63R99O46m80o46P33k89j045R37J489j116
6174E03j695M11J497N29p84j331jJ263N93j059k90R66p23q43J325O91j938o95
6192a581J393J071o64q72n14P39M99k32m35P87k50j490Q61K038j017k198Q94J662
6210F91n6j242k7Q9J55O32k77j35J96j029o8J664P82k481j221K794O55j476q87
6229a241O77J239k7q27l31N71M20j171L8J369j91j529N74J370q44o32P36K55q12
6248c56K68P71M02q11j019J4K091N45k937n74K762J115k473j457J788J009o49
6265D89q58L11K10J59l62o5J110k66j265L39J520q12j189R83N41j349J28J396
$$ y = [112, -664, 258, 1600, 387, -633, -485, 569, 1630, 1111, -1104, -1077, 1236, 1918, -120, -798, -24, -209, 438, 1276, 552, -636, -521, 490, 1068, 583, 38, -725, 274, 920, 440, -206, 527, 238, -807, 130, 1619, 503, -1192, -781, 716, 1245, 461, -870, -871, 392, 985, -74, -364, 602, -121, -964, 361, 1052, -886, -1581, -188, 883, 219, -653, -1167, -428, 71, -161, -596, 191, -59, -1549, -688, 1350, 333, -1865, -971, 691, 635, -607, -634, -545, -390, 242, -35, -170, 26, -1003, -1071, 593, 1375, -1106, -2327, 467, 1122, -354, -1241, -564, 675, 648, -179, -510, 61, 481, -690, -652, 717, 526, -1003, -429, 941, 97, -535, 201, 456, -356, -88, 683, 1085, 274, -745, -731, 1360, 1905, -1032, -1606, 1156, 2271, -202, -1659, 129, 1138, 489, -369, -58, 152, 311, -51, -116, 994, 728, -537, -198, 1322, 510, -679, 304, 845, -504, -376, 1020]
6283A020J74j443m46P03J860l68k724o00L061J353k957j152J584R02j090R4Q03
6300G74q10p09M09J038J54r85j061J043J222m97j718Q62J091j443k54J661L38
6317A115k139o47K003J099p42k167m62J997J162j489r89J340k66j035R46J462
6333A188j164k125Q54K345m86j472m44N44J140k93r53O03P25j566m37K445M56
6350A360k477j186K339J387j129j286m1P82P86q10k22P58n11r21J213J953j720
6367B75k220J226K058q69j130L60P29N6r24j05J501R2k013m59K794P74k528j590
6385a973K333J301r17j234J92L44M03n8K8Qm29n22J131J016j307j559J246K289
6403B292k034j607J263J681j245j450J120J437k83j804l44K262Q11k600j493K196
$$ y = [1020, 1194, -249, -695, 8, 1868, 1500, -1224, -1824, 1237, 2590, -367, -1519, 65, 967, -123, -29, 774, -36, -745, -336, 702, 856, -129, -1190, -147, 1075, 578, -1140, -278, 813, -630, -884, 777, 1115, -1024, -1671, 332, 1431, 689, -1478, -1940, 57, 1219, -270, -1259, 81, -185, -1220, -274, 1188, 24, -2101, -1247, 1098, 612, -860, -1304, -760, 380, 87, -866, -263, 462, -1104, -1541, 904, 1360, -1117, -2303, 36, 1423, 294, -992, -1033, -251, 535, -275, -497, 261, -250, -1171, 42, 1995, 275, -1945, -719, 1339, 470, -660, -300, 429, 485, -439, -544, 957, 1049, -964, -1423, 1371, 2145, -383, -1973, 360, 1661, 744, -490, -298, 46, 449, 391, 419, 427, -2, -524, 607, 1623, 316, -1243, 3, 2292, 258, -1349, -86, 1595, 350, -1100, 20, 1457, 1174, -630, -974, 1288, 2099, -501, -1994, 202]
6419B02J702k055l25Q32K18j075N99O83p09q65N64J345M3j140j815J833K029j666
6437D00k071J733J120j316j106J418R44j240q28M76J125R0j594l62J478O45j581
6454f69n06J545l04j552J199J382j359j342N00J986M33k421r87J710K025j223
6470D17j922N66J582r00o91R28N54j613r0J358N90r59o20J4J536j8j619N48R07
6489E68o22j164J287J654j687k298J207K314P8k051p44J376J236m15j413M50J180
6506I56j505k2J501K70k174m4J858O01j731l16P54L7J30j36J81N77j591o99K043
6525F90J237j622k218J624K494p87k351j2J681K65q40pK01K30r37pJ527k35j423
6544d90m04J548L45j193P4O53l35o76L08J275o55j575k26J850J518j980j935J237
$$ y = [202, 1904, -151, -476, 356, 574, -501, 98, 781, 72, -793, -229, 1116, 1159, 19, -1796, 37, 2066, 400, -1671, 62, 1182, -134, -1240, 178, 1122, -118, -946, -470, 655, 745, -849, -1211, 267, 912, -669, -1175, 370, 66, -1486, -287, 1095, -264, -1606, -1106, 880, 1313, -1108, -2095, -385, 1640, 417, -1505, -939, 643, -257, -948, -20, 534, -1079, -1169, 189, 779, -180, -800, -786, 750, 732, -887, -339, 568, -54, -1218, 69, 1723, 36, -2262, -1055, 1259, 1337, -714, -1458, -82, 1154, 739, -674, -224, 956, -549, -571, 930, 1200, -974, -1018, 840, 1441, -290, -606, 148, 185, 315, 179, 360, 937, -654, -1353, 690, 1927, 305, -1913, -289, 2205, 1418, -933, -945, 736, 1001, 161, 154, 355, 585, -352, -359, 1168, 933, -490, -894, 654, 999, -194, -120, 533, 198, -478, -170, 1105, 450, -1125, -1351, 499, 2017, 37, -1898, -661]
6562f61K523j215j585K34J203l68j23J2J99j78r73M82J012q4j373K7J252Q4j391
6581i23M18R45n60j192J037J042o26j269l20J818Q85j271j610P01J785l88j675
6598a203O94P10o81p0Q41j56j075j87J276O09p37j439L69J569J25j733J19J740
6616G71n21j202N70J363p88j085K07J310N09r27j191O65J016l56o74M45J89n15
6634b14J95J279q59j725N30J917K12j891k14N44J024O1j196q8J264n06j329R70
6652b6J201p97j152N92J049n37q1n80K8P57M62m83j43r0n51O53R46p26j941O51
6672g68K189k24j556l76Q17M18r2l41m7J25l84l89J100O10j058j507R66J569l90
6691F62q35k68K11M14M85j12q54m75O11M73R67r32j513L26J289K44j369l5M82
$$ y = [-661, 1862, 647, -938, -704, 499, 131, 8, 20, 219, 41, -932, -450, 562, 478, -895, -868, 384, 468, -923, -505, 440, -120, -1312, -275, 767, 141, -1128, -1448, 370, 1255, -16, -1626, -925, 860, 472, -1203, -509, 201, -480, -550, 291, 135, -940, -1127, 149, 758, 21, -1418, -1049, 520, 645, -1088, -969, 771, 250, -952, -382, 981, 193, -892, -685, 625, 1134, 207, -984, -319, 697, 341, -333, 112, 301, -214, -19, 1260, 401, -1324, -794, 1123, 1335, -556, -770, -226, 798, 859, -337, -425, 839, 333, -996, -26, 1175, 378, -774, -182, 867, 330, 249, -331, -303, 454, 916, 433, 290, 200, -351, 302, 1248, 522, -1419, -768, 1421, 1197, -359, -735, 82, 500, 408, 67, 20, 145, -239, -628, 472, 1082, 24, -1483, -517, 1052, 662, -173, -441, -230, 184, 669, 557, -297, -772, -161, 312, 1279, 347, -1166, -840, 449, 693, -676, -711, -229]
6710b29R5k81J39L40l72k70k01N12R24p24j592Q17J459k97n13r9m76L70Q32M54
6730H88q35j170J90R30P82j9j753j63J530N76j242k56M65m3j28P38j78o06k31
6749e25L60K10L25j91n74J84O43k24m7K63m61p47O98J323l88j508l21J247M94
6768G61K61j254o25Q67R78n49q26M28j0k0M13J7r19N8J064j85m51N0J60j17K52
6789C53m6j70J97J94q74M42R60k62j099N9P51L09l95l49o17N64P18j18r27n6L63
6810cK74L8L23r88j51J216k10l41j61J90o00L23N21n29l83M85j21k50R96m99r75
6831h45M06N32K74l38k38n49J87Q97j05o30k59N42J2J1N2n96k10O33L93l17N0
6852i8j73l89O81N12m40j063N00K15L67K26j92j000K21Q83K51k64q28j56j38J352
$$ y = [-229, -134, -415, -276, 64, -308, -578, -779, -267, 657, -67, -1659, -842, 617, 320, -193, -292, -768, -398, 434, 888, 53, -1117, -927, 3, 785, 766, -987, -1150, 380, 956, -286, -542, -77, -120, -248, 490, 312, -294, -525, -165, 45, 370, 179, -395, -211, 432, 208, 161, 424, -37, -784, -86, 1237, 849, -659, -980, 267, 761, 1022, -232, -857, 10, 988, 439, -387, 41, 31, 11, 424, 441, -478, -420, 644, 459, 8, 58, 218, 101, 353, 307, 137, 334, 528, -346, 96, 1056, 794, -305, -246, 505, 814, 419, 70, -547, 17, 735, 617, -310, -366, -3, 271, 309, 632, -356, -507, 709, 499, 158, -3, 187, -413, -90, 431, -98, -481, 4, -117, -367, 629, 130, -845, -439, 93, 367, 29, -209, -758, -571, 326, 221, -409, -668, -126, -114, -103, -51, -647, -857, -224, 169, -148, -98, -271, -660, 21, 533, 93, -970, -470, -255, 112, 338, 146, -854, -633, 250, 501, 237, -591, -747, -885, 467]
6872D67M39j419k78M87Q98l45l20j74o00M39R43j56m15l69j96L52P51Lr30l41
6892g64L95M98J08L33o67o85M24J223R8j118q25P4J266Q27p95j301O59Q84l40
6911B94R0l20m79J35R12M57p96p34M30J23L64Q5n64l1M61n28P7J137m26j284n25
6932a122J607J047j230j230L75Q54O45k18j607L31P57J75M31l76r58k72J337M97
6950A043j258l81O93L7Op62K57M22L02p16l03J000K0p21m59R08M42o93k78p2M16
6971i7K39J64p72k36K05K14N52Kr40o12J292J278j351j061L11J261k08n23k16
6990d98l3K17K73K13l33J26o71J22J162Oj499L9J067K4n58J97J51j78l24M03N99
7011E05L9q63o72J236J090j170j517O76J393k48m10j47jm23K07P03J0j00j096
$$ y = [467, 906, -513, -791, -304, 594, 249, -71, -245, -845, -406, 537, 381, -34, -403, -599, -247, 504, 507, -423, -764, -369, 129, 237, 570, -97, -782, -358, 865, 963, -155, -980, -906, 360, 1187, 392, -909, -250, 634, 294, 384, 64, -415, -280, 632, 1089, 293, -441, -11, 112, 476, 561, -3, -34, 427, -101, -24, 1113, 687, -597, -1122, 485, 1532, 302, -928, -553, 301, 946, 728, -879, -548, 209, 384, 815, 439, -519, -791, 546, 1043, -215, -596, 97, 134, 140, -622, -365, 57, 359, -357, -660, 340, 360, -361, -820, 88, 530, -163, -441, -513, -97, 142, 306, -466, -702, -497, -283, 269, 271, -669, -1281, 11, 1289, -62, -1123, -812, 449, 241, -282, -498, -531, -314, -41, 172, -161, -35, -706, -584, 578, 584, -915, -876, 191, 215, -343, -146, 5, -173, -497, -94, 505, 544, -319, -991, 245, 1335, 165, -1352, -676, 717, 469, 59, -88, -89, -512, -305, 398, 408, 308, -788]
7030g88K01J629M84j816l26J003K03l19RM05j254k0J247N87j116p26k69J694N66
7049A394j226j514J178J222r46o04R88Q9j395K45J371o0n37q63K29R82L13q66
7067@p43O66j9j24Q52pj249p90J620J133j059j526L38J406R54j669p94Q26P28
7086E43n27k23N93l5j131k0J630j9j220p87J098K39J71n55j59L71m49J45P79M73
7106I17j807r59J665J740j237j871O20J303Q3m45r17L45K61k15O16N81m61j617
7124a398L85J979o6j669k63J148L86o02L3L52J03q29o3P40R03j485j371J664J420
7143A367o52j381J73Q37Kl33L88l48p33M49R04L71j001j235M47K122m50k037J61
7162i49K146p54p25j04J179m84r74N20J019L52j440o66R88J426j342j058P81R84
$$ y = [-788, -587, 1042, 1526, -290, -616, 387, 590, 271, 280, 685, -569, -589, 658, 1245, 129, -597, -866, 828, 1394, 168, -1346, -168, 1054, 108, -496, 492, 581, -814, -569, 802, 742, 205, -658, -429, 553, 866, 0, -743, -77, -96, -220, 632, 625, -624, -1414, 206, 1339, 280, -1246, -908, 498, 1452, -217, -1011, -185, 543, 16, -207, 386, 351, -780, -800, 830, 811, -409, -1196, -98, 141, 312, -243, -402, -31, -480, -335, 444, 917, -890, -1849, -184, 1556, 319, -1552, -932, 371, 454, 9, -908, -563, -302, -517, 99, 680, 219, -1398, -1013, 966, 900, -769, -1032, 116, 502, -100, -67, 285, 388, -441, -504, 236, 1139, -346, -1717, -53, 1367, 715, -666, -493, 344, 346, 13, 401, 53, -680, -231, 673, 1044, 43, -1192, -745, 1377, 927, -1110, -949, 1197, 443, -282, -386, 793, 309, -665, -145, 874, 1226, -214, -880, 108, 1534, 192, -866, -85, 899]
7180H99o18M1P10p79r66N28J012J2p13r15P85J429m73j889M79J188l92j081Q85
7199A42J179j121j130J101R20p07j192n28J612J243j163j370N87P64l40j27N39
7216D09o44l93R0J844p21j692Q8O28R82p26n69M66Q88q65n10J252N44j816j359
7235b104J774J766o84j889j79J476M32l14j213P8P51o5N64L86p61j500J205J687
7253A410o39k297L79J554O37p44m43j33N74o80l14J178L97j515m34J490J224j417
7271B27j654R42R97m93J1J32j2m42j48O40Q24o98k034O43K639N3j998p41J250
7290A38M68j91l42m07j12N01L81Q57n47j117k59J423N52j256j059J152P98q57
7308A23j91J001l2j498o10J810R37j077j719M63K151M53k201r17J359L63k79L17
$$ y = [899, 281, 322, 1032, 253, -713, -185, 827, 839, 126, -789, -4, 1425, 952, -937, -458, 730, 338, -743, 142, 1321, 200, -930, 171, 1091, 384, -808, -1336, 276, 1519, 356, -1014, -427, 337, -3, -130, 409, -235, -628, -538, 1306, 585, -1107, -1019, -391, 591, -135, -704, -238, 650, -215, -725, 527, 1071, -745, -2104, -330, 1436, 752, -1137, -1316, 160, 592, 278, -935, -857, -106, -171, 393, 779, 18, -1482, -277, 1410, 771, -1526, -1147, 407, 1044, 300, -143, -276, 298, -382, -696, 482, 879, -636, -1070, 420, 1644, 227, -1427, -485, 512, 19, 30, 162, 150, -292, -440, 200, 1024, 326, -1708, -1065, 1574, 1627, -371, -1112, 138, 606, 415, 73, -334, -446, 55, 436, 1293, 746, -371, -630, 793, 1345, 89, -970, 182, 980, 123, -68, 933, 901, -597, -1207, 603, 1540, 463, -1256, -793, 1358, 1811, -390, -1307, 52, 415, 136, 453]
7326D53r2q87M9R91M34q17j249L53J262L62j293k00M81K97r15M36J072o58j494
7345a415O55J567L52j576j010O33J839k26j810K41N55J93m67O75p8p22o11J450
7363B45N74m70r30J97N41j8m17m40O09J89p38R92Q04j176j400J082J358l16j717
7382a031j3J170N80n02j029K04Q51k31l32M06L73r16n33J083R29j043m98m5Q46
7401B69Q4n18J33k02O4n0Q00L95j240j383J440J827o39j864J20J205L44k87m91
7420Gq51O44L65K62L69j28j324j21K099l9j507o25R89K91k59r1J54l8m85N3O71
7441D36L58k35j772P45J335J22j136l96L87J08M71M21p88j249K46J499Q25j118
7459B59j629J66K032O71j330j395J207N45m17p4J82n82q9N5O34M94q58o32J19
$$ y = [453, 361, -526, -477, 514, 948, 131, -1118, -765, 497, 859, -434, -634, -153, 144, -771, -335, 737, 79, -1415, -760, 807, 1159, -417, -1427, -794, 1045, 819, -991, -750, -195, -2, -469, 206, 128, -594, -1205, 245, 819, 349, -581, -384, 157, 139, -278, -718, -109, 80, -658, 334, 1138, -38, -1438, -356, 1002, 686, -1031, -1044, 126, 706, 204, -825, -621, 230, -1, -333, 73, 446, -470, -1003, 80, 1009, -34, -532, -577, 269, 353, -165, -32, -234, -170, -220, 580, 975, -265, -1648, -208, 1619, 980, -884, -764, 441, 785, 498, 7, -844, -200, 165, 427, 796, 668, -656, -777, 1322, 1283, -224, -849, 140, 431, 172, 81, 235, 197, -288, -235, 436, 794, 559, -1213, -468, 867, 989, -147, -543, -156, -48, 423, 844, 56, -1193, -947, 552, 1377, 259, -1370, -1204, 828, 1499, 169, -1226, -19, 526, 109, 35, 217, -365, -454, -399, 235, 729, -129, -761, -642]
7478f42J080L10p03n59J56k95P34J134q69j727M72J202J020j102j528J73J539
7495C95M26n42j067L80M83l91L14N53r83p46R11J039m39n18o58J38Q22L63p54
7514b74n40K30N7M87Q10n94r84j96J406N35r20o88LQ97Jr4o06L00j22J94M82M80
7536H64q08r13P64J237l83p13m80J3N98Q59q33o78K01M96J10M55K6j646M9J613
7556H31K12q58o19J50M90L48P1p40j58J87M24L76nn54p18L30J039j11p22j93O3
7577a57K65N89O1r98l38K41O56O28m31j341PJ018R00o22j208K71J75Q92M2r70
7597c20n55P35N80k37l26k04j21j09R59k5q58K0J91l82Q49N05p47r32K42P91O67
7618G23l42j078n62R47J449m18j527R1L58Q38M11p91j172L31J233k3n71m72j54
$$ y = [-642, 438, 748, 45, -514, -358, -653, 81, 1215, 346, -1381, -909, 293, 1313, 211, -1317, -1144, 395, 821, 279, -788, -408, 75, -316, -2, 551, -432, -1178, -267, 772, 333, -185, -843, -705, 117, 480, -274, -814, -584, -527, -40, 770, 176, -808, -1004, 402, 937, 17, -671, -668, 229, 230, 136, -470, -170, -292, -98, 384, 864, 56, -857, -93, 1144, 761, 48, -432, -419, 179, 1038, 205, -473, -272, 224, 334, 789, 815, -831, -782, 831, 1043, 185, -434, -284, 206, 554, 625, -115, -273, -86, 338, 714, 709, 155, -563, -233, 806, 695, -27, -220, -157, 108, 697, 758, -240, -578, -337, 319, 947, 516, -825, -818, 200, 1100, 478, -730, -459, -284, 608, 650, -320, -875, -140, 440, 203, -123, -327, -448, -557, 402, 377, -481, -461, -270, -652, 197, 702, -45, -977, -735, 56, 723, 381, -697, -1259, -312, 1137, 719, -808, -717, -359, 479, 890, 99, -1073, -742, 491, 468, -103, -575, -729]
7637g29K86J054J39q02o12j47N68N54J8m62j105P09J127N5l23p13o50P17J183
7656H67R3j444m27N16Q15L82m65j095k19O20Q92K18p17o51l32J482O12n61j293
7675g07M6Q02N95J34j156j75J85P08K27l96j72p26K24J041L07j225n13K56J154
7694F09j05j24q05k6L20Q14k45j03p79o51J121Q76k96j078J41L80N11N20n45r53
7714d18m48O96O59L49r05j040K64J712K80j123j568R71J110Lk28j072j83P29O84
7733D72j3o26n07mL93R96n57p49K48O13m20k20O82l98n81k23J296O93q02j482
7753a189j01J888P07j103j967J007J243j65k17l62m19J70J063j60o40o17K48J019
7771D05K42n93o53j84R73j19k24K93N06j455n36K030L54j169q25J99J335M86j246
$$ y = [-729, -443, 611, 750, -52, -664, -811, -243, 311, 329, -133, -1238, -529, 598, 653, 330, -383, -1033, -316, 867, 960, -484, -911, -395, 420, 802, 337, -758, -977, -357, 535, 753, 36, -615, -947, 535, 1147, 586, -707, -661, 141, 736, 870, -286, -461, -276, 432, 659, 263, 91, -635, -411, 630, 937, -288, -801, -545, 609, 504, 380, -425, -451, -131, 683, 438, 335, -444, -1095, 26, 902, 606, -472, -331, 49, 560, 1080, 535, -418, -866, -170, 489, 838, -67, -1107, -843, 869, 1149, 26, -1542, -571, 539, 542, 314, -758, -941, -212, 472, 459, -167, -674, -678, -285, 711, 154, -595, -347, 266, -154, -374, 308, -90, -671, -894, 402, 1095, 293, -1189, -1290, 598, 1305, 202, -1765, -758, 485, 320, 103, -259, -678, -508, 555, 395, -245, -862, -614, 405, 647, 54, -599, -783, 190, 71, -153, 140, 646, -809, -1345, 685, 1039, -130, -955, -756, 579, 1065, -181]
7790a81m67R1R46P2j92j95o30k13J052J165j026j528N58J288O9m97q67OP80J19
7810C50k37K11J08j330N32J130M37j657o51R68R44R9j086k57L9L85n9K34M49j162
7830e53o66J217J796j011j892j85J766P37q99p76k43O95P6Q01k50m30j131K53
7848f95J650M94j878o88J372M16k97m42j86j39M3L27R60l2j556p71J365J748j044
7867F47j797m2J550J99m49M0n38k63J21J343M76j295j504N79J394R03j764j121
7885a521Q52P91P9K05L3r52q62J598J194m62j964o71J962J429j264j931N86J422
7903E24m21n77J94N26p64k98J207O81n25j673oJ454P39j042p16O61J26q5N14N20
7923A039j448j114J654J546o13k068l97K142O23q21j640P02Q60k30n65R78Lr16
$$ y = [-181, -648, -557, 389, 461, 269, 74, -556, -769, 283, 1448, 422, -1106, -548, 740, 809, 312, -555, -549, 231, 350, 113, 324, 432, -898, -366, 764, 1201, -456, -1107, -139, 805, 904, -182, -439, -400, -15, -74, 160, 609, -553, -1219, -2, 1794, 783, -1109, -1294, 472, 1209, 310, -466, -709, -14, 62, 863, 613, 183, -948, -695, 955, 1449, -429, -1117, 255, 671, 374, -68, -254, -393, -350, -23, 937, 905, -651, -1422, -57, 1691, 647, -1150, -1192, 358, 557, 108, 148, -390, -653, -532, 811, 1287, -8, -1512, -933, 461, 1364, -400, -1521, -669, 122, 201, 406, 439, -513, -1375, 223, 1417, 955, -1009, -1680, 282, 1711, 447, -1484, -898, 524, 103, -474, -280, 246, -518, -816, 391, 1072, 547, -1126, -1132, 322, 1061, 19, -697, -36, 90, 5, 519, 1039, -409, -1523, 131, 1677, 1064, -1004, -1401, 741, 1364, 543, -1097, -395, 465, 235, -330, 648, 651, -265]
7941b65o15J626L08r69j329R85J303l25p42j07M64j96n36O28Q10j328j115J358
7959d5K216r48k412j70J655R54j086o23J37P76j88j21Q19j63k096M19K281J75
7977A580k127p06J575R59p68j697R01P21l41k06O77L83j445j181J679J374r90
7994C88k139P90J244N59r12j64k28m3j5O87O85q02j861R84K469l53k236p25J465
8013b07J250j358j81O02k26m83J91R01J54j707q19J873K056j388j906J86J547
8030D85P1k85m11jp56M39J537L91j438j780J050K078o0k397j6J737m0r95L67M70
8050D46n12j359J134J845M1k627p26J917J320r40j679P18O95j68J36P93p68j431
8068a165M51K018K88j961j283J140J811m17j376j75R68pq32R33O07j040j669J437
$$ y = [-265, -880, 746, 1054, 85, -1244, -259, 1044, 719, -23, -130, 334, 138, -398, 230, 1040, -288, -1403, -45, 2171, 1223, -1189, -1359, 296, 1250, 164, -459, -322, 454, 266, 145, 964, 801, -1295, -876, 1405, 1580, -547, -1253, 322, 1281, 513, -1184, -283, 438, 97, -109, 568, 951, -494, -1675, 4, 1378, 388, -1751, -961, 283, 842, -70, -234, -462, -505, -520, 167, 852, 50, -1811, -827, 1642, 1289, -947, -1672, -207, 1043, -315, -496, 106, -120, -603, -412, 489, 643, -1064, -1883, -10, 2046, 658, -1248, -1062, 485, 556, 271, -140, -141, -897, -458, 1079, 1470, 32, -1748, -698, 1380, 1320, -1077, -1093, 644, 604, -391, -24, 446, -66, -1425, -291, 1554, 1595, -1032, -1758, 159, 1479, 539, -1140, -422, 273, 105, 241, 1034, 266, -1165, -714, 1304, 1592, -369, -1652, -512, 1299, 882, -494, -669, 299, 292, -540, 393, 1000, -40, -1709, -272]
8086b72J877m55k013p54J724J041p83n76m1M73n27K62J016n43k176L63K316P72
8104A704k048j190Q90J263J87j672K59Q10n38k69J068N98j548j201J134J691o00
8121E38j729K64J354l28n8p1K86n29p95Q91J329n91k233K43K780K23k310j030
8139a766J367J180n99n60L0j2K83o8N46K74j606j60J030J310j138j151L88J533
8157H81q91m19Q30j9r13n43J277J026j162j876Q72J973K68k092n24J354P78r35
8175a15J28O1k71p42M79J375m1j838l63J538J078j011j390N25J067k37
$$ y = [-272, 1605, 1150, -863, -1617, 107, 1148, 365, -211, -252, 221, -306, -44, 972, 429, -1747, -1384, 932, 1704, -344, -1534, -644, 619, 806, -866, -607, 203, -335, -604, 464, 1062, -486, -1687, -553, 1138, 538, -1191, -927, 427, 99, 41, -30, 256, -273, -1068, -177, 1152, 561, -1672, -1429, 1351, 1574, -736, -1766, -399, 781, 182, -378, -348, -360, -77, -145, 401, 675, -931, -1091, -61, 1249, 111, -1040, -652, 881, -10, -429, 401, 382, -531, -1074, 203, 1229, 67, -1809, -937, 1036, 1304, -788, -1312, 42, 820, -115, 13, 74, -197, -939, -460, 915, 874, -964, -1327, 211, 1289, 278, -1112, -587, 480, 243]
8191B43
$$ Imaginary data points
##PAGE= N=2
##DATA TABLE= (X++(I..I)), XYDATA
0@%%%qJ6j6K4m0M8n6P2q8J11j37J67k04K45k91L43m06M78n57O45p46Q62r87J123
27E98j278J452j641J848k081K334k606K911l251L615m014M460m947N479o065O715
43C529p437Q239r135J0145j1294J2609j4132J5923j8062K0670k3937K8168l3890
56a8604M2114n5016P8323j33595M94045M95771r15497l29886M07711N11160j78583
67C97943l63796r7131K26261J25015k73o9292q0545j40745K6887J78047M5277
78B47648j95397m0965J67373J7801j94154J2882K12818j3485l04842r7890L00364
89A12153K63933j82908l15228N9962K85110k6410k56659N494K22694O756j53458
100B1439L7632J53320m9139j80987m870J76137O9427j30851q5743J03062P1871
$$ y = [0, 0, 0, 0, -8, 8, -8, 16, -24, 24, -32, 40, -48, 63, -74, 93, -111, 134, -157, 186, -220, 258, -299, 346, -400, 462, -525, 598, -680, 772, -869, 979, -1102, 1232, -1374, 1537, -1714, 1901, -2113, 2347, -2600, 2879, -3186, 3529, -3908, 4331, -4804, 5341, -5953, 6656, -7476, 8447, -9615, 11055, -12882, 15286, -18604, 23510, -31506, 46817, -86778, 407267, 903038, -12459, -342345, 65366, 576526, 397943, 34147, -62984, 163277, 288292, 288019, 218727, 138182, -2563, 24324, 202371, 247648, 52251, 11286, 178659, 196460, 2306, 15188, 228006, 214521, -90321, -188211, 112153, 376086, 193178, -122050, -62088, 223022, 196612, -60047, -54553, 168141, 174897, 21439, 59071, 212391, 163252, -17735, -22605, 153532, 222959, 92108, 6365, 109427, 181298]
111A81298r0446k3798J18239k8800j96438J0043K42372M5861k31883j03883J89669
122A12234J51746j44939k26293K4362J99711M6760j13069k4234L8405p5672m8313
133e9302J39111O3207k07875j38179K11476K31606j38219k97205R700K93013J00592
144B07925k46055j71716J60431J64258q2867p5484Q8075R158j24741R799J51896
155I0679L521j56345j9858J81653J03439j38541j53946P1145J41407l5807q3121
166D226P4085N7492j16624m0946J71303O3608k01090j19699J77300J70451j22991
177A17115k06648N8106K25270K141k27584n6720J86152M5377j81736m5760J78008
188I3721P3168j42643j15907L6299P0226J3735j6751j7904l4420k8247N4982R9343
$$ y = [181298, 90852, 67054, 185293, 156493, -39945, -29902, 212470, 258331, 26448, -77435, 112234, 263980, 119041, -107252, -82890, 116821, 163581, 50512, 26278, 64683, -10989, -59302, 79809, 143016, -64859, -203038, 8438, 240044, 101825, -195380, -185680, 107333, 207925, -38130, -209846, -49415, 114843, 31976, -43508, 44567, 53725, -71016, -61217, 90679, 94200, -62145, -82003, 99650, 203089, 64548, -89398, -18253, 123154, 87347, 4226, 78311, 135803, 19179, -21767, 149536, 213144, 12054, -107645, 69655, 240106, 117115, -89533, -31427, 193843, 195984, -31600, -88320, 97832, 143209, -38527, -84287, 93721, 166889, 24246, -91661, -55362, 14864, 28599, 11848, -6056, -40476, -68723, -13741, 85602]
200H5602n3586j99393k1848K35272J06726j97869j49821J21804J34219n8564q1809
211g9267M8732M4827r2299p7493J37119J86873r8941k69288R531K84714Q7707
222A82215k26266j52640J18536J73816K9197r3899j12133l5537P9627J25980L3082
233A21978j31345j52291O8357K31217K4083k47717j06202K03636J41160j43112
243I764j47592P1443J15073l2462q2706K7203P4076m6930j15768K4995J31705
254B8801K666j07973l057O5518l9539n2444P7161N9800j02780r7907R2454J52199
266G4899k8650j80460o0228J57283J25536q8859j23269K1877N3288k724M5950
277e357O8430p3315j43056J9549J63035O7549j05497j11784L4197J12443K4970
$$ y = [85602, 32016, -167377, -189225, 46047, 152773, -45096, -194917, -73113, 61106, 2542, -79267, -30535, 14292, -78007, -155500, -18381, 168492, 69551, -199737, -190206, 94508, 182215, -44051, -196691, -78155, 95661, 124858, 30959, -81174, -116711, -37084, 88896, 121978, -9367, -161658, -93301, 137916, 161999, -85718, -191920, 11716, 152876, 9764, -137828, -66385, 48688, 16226, -66480, -39277, 34799, -12131, -127899, -102904, 28801, 31467, -76506, -79563, -14045, -53584, -106028, -28867, 30933, -71847, -169754, -77300, 74899, 46249, -134211, -194439, -37156, 88380, -479, -123748, -101871, -48583, -51307, -5357, 63073, -10242, -153298, -133749, 29286, 96835, -8662, -120446, -86249, 26194, 51164]
288E1164n8549k3983r961m8398L7013J59613K9378k09267j36633J57781K12469
299A60627l4972k05781q3945J30280J37340m0280j13919p086N5344Q980n53J3029
311A9064m2492m9373N4871P8439l2441p5727O984N1822q27m8587m771O8381L3758
324E9101p9023o2132P4223O7467p3614o1450Q1053O3313p8070p4853N8203R2402
336F6620j6677r8090k8919Q7134N7882o9994o6565N2248O1827k3888l6064l534
348a8020q590J0144M5304j233o1746r188O9182L0009p4979q4420M9156J48559
360I4178K2936j74608j10105J37215J61945n8614j56189k7299R7660Q1395j5853
371E2661q9167n7784M3577Q7352L3207m9813r2724l3917R2780J00542m7241j12436
$$ y = [51164, -7385, -31368, -41329, -89727, -52714, 106899, 136277, -72990, -209623, -51842, 160627, 125655, -80126, -164071, -33791, 103549, 63269, -50650, -57736, -2392, 6588, 6035, 19064, -23428, -72801, -17930, 60509, 28068, -47659, -40675, 11147, 10320, -38267, -43038, 25343, 59101, -19922, -82054, -7831, 59636, -13978, -75428, 5625, 68938, -9132, -83985, -25782, 66620, 49943, -48147, -77066, 10068, 67950, -2044, -68609, -16361, 45466, 21578, -14486, -18020, -26610, -16466, 28838, 27605, -34141, -43329, 25853, 55862, -19117, -103537, -54381, 94178, 117114, -57494, -167599, -30384, 131561, 72947, -83242, -110541, -12881, 68514, 52661, -36506, -94290, -50713, 36639, 69846, 20033, -72691, -106608, -13828, 86714, 39473, -72963]
383g2963J815P8193J6501l2719j0639J629o713K274J8700K2229q972n7202k6715
396g4582P1284O9299m6198q4067p319M8023M9928K7642l8783q4922j2812Q5838
408C331O1896m0587q5078k1360Q4803Q6113m8340j16513l164R4336L3292m0898
420G831j8652J1123m96j2097n298K1648M3210o258p4648l1390P3197P5178j9013
433F4335q3851n6932M5608J17065K5719j29179r8354Q1854J41215J3419j10354
444A0545r6042K3644J11251N2005o7692p1356J3786M1972J7527L696k0053l8363
456a9080k000L9761K7121j684l0504n0274j750P9563N0897o1932q4739J478P2393
469A9250O2123j6879q2619l8046O2408N8923k5244m8829j2498J5087L6533L0176
$$ y = [-72963, -71148, 7045, 23546, -9173, -19812, -18183, -24896, -22622, -3922, 18307, 9335, -47867, -74582, -3298, 66001, 19803, -64264, -71583, -23560, 26368, 54010, 15227, -69695, -82507, 3331, 65227, 24640, -60438, -81798, 3005, 89118, 40778, -75735, -78899, 15437, 48729, 7831, -10821, 302, -194, -12291, -17589, 4059, 47269, 41011, -33637, -65027, 8170, 83348, 64335, -19516, -76448, -30840, 86225, 111944, -17235, -115589, -33735, 107480, 120899, 10545, -85497, -61853, 49398, 101403, 33711, -37645, -23859, 18113, 35640, 39336, 19283, -19080, -21080, 18681, 45802, 44118, 13614, -36660, -38410, 41153, 92050, 30118, -54621, -53143, 19250, 81373, 64494, -18125, -56171, 6237, 65160, 39916, -8913, -21411, -6324, 30209, 60385]
481F0385k7665n4355l641L3980K1938J1276o604l8475k7374K2343L8061J7620
493D7489j6481n2568k7254N6918N9617l8499o9122O841M6803J4741j2288k0980
505d783k0650j642J4884J8492K1525o200n8249l2453N3799N5473k0448m5290j7841
518d3383J312K9657M6917j0045o9675k9359N6526O9679q145q8284n4609P5970
530b3439J05226k9742j09714j6107P2519L7810j9458k8489j4568J7665M2162M483
542C8348m9019l8220K4767O8391K9661o7838q0332M6341J11481j4730j14721j6848
554f2719R4205M0184n7679m9540K0813M6060Q86m1333p283L7056N059l8478o848
567a9617K9171J5079N641q372n6598l5331P6858R1925m7858j24328j2788J22381
$$ y = [60385, 32720, -21635, -25276, 8704, 30642, 41918, 35314, -3161, -30535, -8192, 29869, 47489, 31008, -21560, -48814, 8104, 67721, 29222, -39900, -33059, 13744, 28485, 16197, -4783, -25433, -27075, -12191, 6301, 27826, 21626, -36623, -69076, -15277, 40196, 19748, -25542, -43383, -42071, -12414, 34503, 24458, -45217, -74576, -18050, 51629, 43484, -44800, -99409, -23439, 81787, 52045, -57669, -73776, -1257, 36553, 17095, -11394, -25962, -8297, 33865, 38348, -10671, -48891, -24124, 44267, 73928, 6090, -74242, -27901, 83580, 68850, -45871, -62719, 31486, 71670, 13991, -35549, -14736, 31324, 32210, -9123, -16406, 20650, 25709, -12769, -19617, 9554, 24633, 30274, 21902, -34696, -70027, 6831, 98756, 50898, -73430, -86218, 36163]
579C6163Q2959q3082j33879K1239J45535L7067j11344n7571O4015M2744k9800
590A4046j3822K5081O611k6400k3044J5066M4438J8712l4389m0944r202K4519
602F72N5989K7679q0624r7340O4904J56981m485j72089q4275J16005J36640k6151
614I3906j34974n1022Q1585O8123k7580l5158k376k3548j5088N9201M7046o1380
626a265p5139K9141P3288P830m7849k7778J3306J1580n480K4918M5194l7733j00400
639i0387J2935J31729L4223j15502o5617P2893P4114j7690m5807n923J3665j346
651b713N878L9398J1194p0123m6374Q1541Q5470n6156q8995K4831N8839j5470
663B7320k3567L4994J9623n3484m5536M9166P8852l0891j12014q775J19896M6618
$$ y = [36163, 119122, 36040, -97839, -76600, 68935, 106002, -5342, -62913, 1102, 43846, 14046, 224, 25305, 31916, 5516, -17528, -2462, 41976, 60688, 26299, -14645, -23847, 672, 56661, 84340, 3716, -93624, -28720, 128261, 123776, -48313, -132588, -16583, 120057, 93906, -41068, -92090, -10505, 57618, 30038, -5120, -7496, -31044, -46132, 13069, 60115, -1265, -76404, -47263, 26025, 33855, -13994, -41772, -28466, -16886, -22366, 2552, 47746, 10013, -90387, -77452, 54277, 88500, -27002, -92619, -19726, 54388, 36698, -9109, -15032, -1367, -2713, 3165, 42563, 53757, -16366, -62740, 18801, 104271, 48115, -40880, -16049, 42790, 27320, 3753, 38747, 58370, 4886, -40650, 8516, 87368, 56477, -55537, -64312, 55584, 102202]
675A02202r4248o2104M4621L4796j8451j05J3401l0105l5520K9353O1071m130
687D0781p8409l4742P2065N7226o2172o3845N3566N8642m4196m1457M5697K5673
699B8829n8133k9979O7770O3180m7308q7207K0008J03644J0165j02323l0203Q9542
711B7985M0882n6324k3547L5299J447k4235K0224L3733k5546n1422J1095O7503
723E7094J4674p0460l1012P0118K9787q2765l3637R2261L9530r7670n2132Q9415
735B5203O7799p7607r9660L3082J07487R129r4087l5492O1916K7239l8546m293
747a7830J8011m0478k7514O9329N2078p3504p7223N3964R3057k4545j04700j2707
759i2062R8200L8381q1558l3457Q3924K7369r6235l5831R5626N0480p4838n4659
$$ y = [102202, 7954, -54150, -9529, 25267, 6816, 6711, 20112, -9993, -45513, -16160, 44911, 40781, -37628, -72370, -305, 56921, -5251, -69096, -15530, 43112, -1084, -42541, 3156, 28829, -29304, -59283, 8487, 71667, 24359, -62848, -42840, 60804, 70969, -31354, -61557, 27985, 68867, 12543, -11004, 24295, 25742, 1507, 21731, 55464, 29918, -21504, -10409, 57094, 71768, 1308, -29704, 40414, 70201, -12564, -46201, 46060, 85590, -12080, -64212, 25203, 93002, 15395, -84265, -51183, 56304, 65433, -28654, -64146, -2230, 25009, -13537, -17830, 181, -40297, -67811, 1518, 53596, -19908, -97131, -43167, 49890, 25345, -79355, -92062, 6138, 44519, -37039, -70496, 13428, 40797, -55438, -91269, 4357, 54837, -20001, -74660]
771g4660N2140O3415j6289n1919r575K1873O64K693M0116L804p9714k9538J09696
784C2706P3966j04238j17424N4394J20956J506q8343k7774N5982K9590l9997k2094
796c0770L5774j110n8704J1093R1302R599r4199l4931O4464L2376l8312j9259
808c2677K6482M621l1252O459O4584J3788r6272o0930R5202R8657o7171j04309
820h2818M1875R5668j1243o3451J277K9890j8872k7288M3544O5259l0690r4340
832e1189M494J03767J9239r4142l4112O8071K8461l2093Q373K7760m1087n5003
844d7461L9710Q4870j6112j09543k6871J16403P3902r2512r4886N5172P3597m6473
856I796n2475M7690M2906m8930l9522M5888M7039m1722o8826J3317P0253J0368
$$ y = [-74660, -22520, 40895, 24606, -27313, -36888, -15015, -14351, -11658, 28458, 32262, -47452, -76990, 32706, 106672, 2434, -114990, -60596, 60360, 61866, -26477, -54251, 1731, 31321, -8676, -30770, 5004, 3894, -54810, -43717, 47585, 57184, -37015, -71946, -7482, 24894, -13418, -32677, -6195, -1574, -32826, -26367, 38217, 52005, -44267, -105197, -9995, 88662, 21491, -82818, -40943, 54725, 43482, -19969, -18692, 11198, -7674, -34962, 8582, 73841, 43151, -51189, -46695, 57072, 76311, -17831, -51943, 16128, 44589, 12496, 20869, 48629, 7542, -47461, -7751, 77119, 61007, -48536, -75407, 40996, 114898, 22386, -72500, -17328, 56269, 9796, -42679, 5011, 47917, -1013, -40535, 5353, 52392, 10670, -58156, -44839, 25414, 35782]
868C5782m8615l052L0605k5433l1152N3465M2883p5425p2511P1868J07779k8137
880E8057j13402j9601R6642N0675p5515o7215N2884O6487l0422l9159L4141J9704
892C3276m7568j9295M6481K2500l3154j7504K8627J8306k6578k1773L1157K3361
904C7836n1263l8225P1548O8481p2000r3317N3757J04599k6146j06937j4916Q5053
916A8470M5715n0347m9836K7812L6260k4976k2595K7882J801m2918J3306O4645
928D5219j0231p5580m112O8917J3996o2127k5051N8123L9063n2767m9973N4503
940b0O2368n8983q0390N0032Q9365k8072p9311R178O2266Q507l7676j7029J0829
953h936K354j510K4938K3468m0013n5588L9887Q3777k8630j00431N308R6531J9686
$$ y = [35782, -12833, -15885, 14720, -10713, -41865, 11600, 54483, -20942, -93453, -21585, 86194, 58057, -55345, -74946, 21696, 72371, -3144, -70359, -17475, 49012, 18590, -20569, 13572, 33276, -14292, -33587, 12894, 35394, 2240, -15264, 13363, 31669, 5091, -16682, 14475, 37836, -13427, -51652, 19896, 88377, 16377, -76940, -23183, 81416, 55270, -51667, -66583, 18470, 64185, 13838, -35998, -8186, 28074, 3098, -19497, 8385, 10186, -32732, -19426, 45219, 34988, -40592, -44704, 24213, 38209, -23918, -48969, 9154, 48217, -4550, -54523, -20, 62348, 3365, -77025, -26993, 62372, 34300, -45011, -35833, 26433, 34940, -2736, -19765, -8936, -6582, -8092, 16846, 40314, 301, -55287, -15400, 68377, 39747, -60684, -55376, 41155, 60841]
966F0841p0927k7583M4705K2555l4974k0843L7685K5424m6769l7609N4053N5344
978F1902m5941o2546K3411M5004j0988j8158J4601j397k7474K517M4463J8648
990D4042n4513n7630L8294Q6522p083q7159j8267O3833J9379l5497m020J9065
1002F966k0697k6818L0237N0855j2092p1398k5664O7525N6854m8033o7855K1488
1014c8632N0745n023j7603J2694r406l7908Q022N3937J5796n1059m1883L1527
1026b8793N6764r036n3955l93M0092j1230l2788L5343M3895m7017o5394L3944
1038c8568Q0746K061p6156m0789M8413O2488r441m9473j3371J3926P084K0955
1050G875K3073l7317n7764K9641P9593k508p5764k5064N4452L9323l1652m1666
$$ y = [60841, -10086, -37669, 7036, 29591, -5383, -26226, 11459, 36883, -9886, -47495, 6558, 61902, 15961, -46585, -23174, 21830, 10842, -7316, 7285, 5888, -21586, -19069, 25394, 44042, -10471, -68101, -29807, 56715, 49632, -37527, -55794, 8039, 27418, -8079, -12099, 6966, -13731, -40549, -10312, 40543, 28451, -42947, -68611, -1086, 55768, 7735, -60120, -38632, 12113, 7090, -10513, 2181, -7225, -45133, -37111, 16826, 32622, -18437, -60320, -28793, 27971, 18935, -35020, -35413, 4679, -6551, -39339, -3996, 39899, -7118, -72512, -38568, 42178, 44239, -31917, -72706, -24293, 38195, 28754, -20719, -34090, -20164, -13080, 7875, 30948, -6369, -64133, -34492, 45101, 42593, -33171, -58235, -3783, 35540, 3888, -37778]
1062c7778K1594M1863k3322m6750K7468N6561k2893o2104P502N1987J2390k5145
1074A373k0800m811J1200K3015J1859j7494l5466j0010M8027M9254l8268p8380
1086f0501J5330Q7473J1202p4154l0070M9165L9308k1580l7589L314L3555O493
1098B1946k7177o499K1802J696j4821P116P214j6410K38K5164m711l1366J691
1111a4117L5290Q188l4421k5414K7533M4475j6947o1597n98O7560J7574o0318
1123a2792l1311L7939L4314j0111k6490j3315P617J9800P556r763j5486j1613
1135b3655R214L1272M307m0722j6724L8450J9352l0914j4138K4658P277k3628
1147a5251q345K4180K1611j8061l9220K952M9996J7017m3272k7707K0998K2936
$$ y = [-37778, -16184, 25679, 2357, -44393, -16925, 39636, 16743, -45361, -37859, 14128, 26518, 1373, -19427, -24238, -13038, 9977, 21836, 4342, -31124, -41134, 6893, 56147, 17879, -60501, -45171, 42302, 53504, -20650, -50720, -1555, 37753, 16173, -21416, -18102, 15453, 21946, -5231, -11730, 10072, 11768, -3053, 4063, 11277, -5133, -4895, 20269, 15558, -15808, -14117, 21173, 29361, -5060, -30474, -2941, 41534, 24587, -37010, -37608, 29952, 47526, -12792, -44103, -6164, 28150, 18039, -8451, -21766, -14149, 5651, 13207, 3444, -12042, -23655, -14441, 16831, 21138, -19584, -36308, 2142, 21494, -9420, -23558, 1100, 8377, -15251, -23596, 584, 22195, 4134, -35086, -32134, 17862, 34879, -8393, -36100, -15102, 7834]
1159G834M275j525j7401k4069J1488L9070R990l0785l1182O197L9259K0567l1337
1172B381l4828J5318K6961k871n266O092j2929j9692J3967K9924K299k5531k3379
1185b7554O395L3087J7431k5677k7317N814J7351J1761J0046j2115l4313k178
1197b7269M0212K2575k2806l0226n029K0975K6231j89k4197j1081P900N726J2349
1210A5171J5196j7111l5207N573M0464J6834k1569k9249r207K4942L3181l663
1222C5355l4913j5186J5323K0933J2542j0554l0265p316L0468J7239j7067j3865
1234B694L226J087K291P988J267o615q378r800O659K8670O042l6494k3215K3949
1248f29L1930J076k5697k8746N864M2207J7160l8545l3061J8436L4840O602k2467
$$ y = [7834, 12109, 10584, -6817, -30886, -19398, 19672, 29662, -1123, -32305, -26108, 13151, 33718, 2381, -32447, -17129, 9832, 6961, 1695, 7787, -5142, -24834, -10867, 19057, 21356, -4175, -27554, -21159, 11928, 29359, 3682, -23635, -17821, -470, 11291, 21337, 9222, -25091, -27269, 12943, 35518, 12712, -17514, -22543, -1568, 24663, 24474, 277, -10804, -2904, 2822, 15171, 30367, 13256, -21951, -16378, 24086, 40920, 19351, -9898, -19105, 5837, 39018, 35355, 442, -14744, 579, 21512, 34054, 23500, -6765, -14081, 16387, 33626, 16559, 2694, 5920, 7007, 9298, 17286, 18553, 11938, 3560, -6240, 419, 29089, 35131, -1363, -24578, -629, 31301, 32377, 6680, -22066, -16202, 26005, 43165, 4620, -28441, -10005, 24835, 31437, 8970]
1261H970k6629K682L4016J2636k8022j8883J5723J5178m649r093n766M349J4348
1274A4860j819k0196J137K3967n51k4989n699J8024J5485n094k3509j2743K4519
1287C392K7524j7698l2245L931K2788P347n712j1413j1431Q368K0249k141j9394
1300f435n671Q863J1584O507j0777j7273P473J8171o789j2636R683P074j2901
1313c127j685J4608K271j1871o853N061J4639O631j8067j6257J5802J8260p319
1326A2093r221Q00o622r85K2814Q963k5811k0382J5291K6356L918k4219k3409
1339b0414J3308L2292j316k5066l542Q020n897L548K0015l839k8794p988K0986
1352A313J8999l430k1438j5090J2229J9740j086q537n589j2898j764L1270J6711
$$ y = [8970, -17659, -14977, 19039, 31675, 3653, -15230, 493, 15671, 11022, 1929, -3837, 512, 14860, 13041, -7155, -6018, 17949, 17398, -7591, -13290, 4734, 20219, 15125, -8384, -21127, 3392, 30916, 13218, -19027, -15096, 7692, 15039, 9327, -2086, -13517, -5149, 15100, 12959, -6435, -12106, -3243, 8341, 14848, 4071, -13202, -5729, 12442, 5653, -6983, 2700, 9774, -3127, -4812, 9796, 12067, 196, -6657, -1596, 13043, 19674, 1607, -14650, 1152, 19412, 12093, 2872, 3672, -2950, -3935, 18879, 27842, 2031, -18351, -3060, 23296, 27214, 2995, -20414, -7106, 25186, 23870, -1196, -4738, 3282, -2615, 933, 20948, 17109, -11685, -19673, 1313, 20312, 16882, -4556, -19646, -7417, 12323, 11237, 2700, -2889, -15787, -17551, 13719, 30430]
1365C0430l5673l2656K2078L6193j239k6263j1570J2344J3642q108j0075J4515
1377C618Q487k6073j2995L3165K2602k6955k8831Q259K4181J3657o957k5162j5716
1390b8720J6573K8546R081k2071l5889l107M8785L2275m3549n0624K4594N1600
1402B7494l975l8536j1136J8550J2796q120p610J1017N615k3509j2727L0468K3163
1415B3490k6867k8157J0986J8072L918K208p015k2058m145K7894K2583j6828m0309
1428c6228p280M6848L5443l8390n1663K0985M8570o918l3936M093K1924m435j5057
1441a6044L520J4609J663j6483p048J7561J0842j5137m942J3784o679j7172K0900
1454f26K8177k6049m1137J6627M9512N544m3128k8159K7783M0432r511l8553j286
$$ y = [30430, -5243, -37899, -15821, 20372, 19133, -7130, -18700, -6356, 7286, -822, -10897, 3618, 12105, -13968, -26963, 6202, 28804, 1849, -26982, -18723, 5458, 19115, 12158, -13004, -28720, -12147, 16399, 25480, 3409, -32480, -35587, 13198, 45473, 1924, -48700, -24106, 27494, 23519, -15017, -26153, -7603, 5193, -2927, -10537, 480, 6095, -17414, -30141, 327, 23490, -3377, -31534, -20548, -2476, 1442, 3650, -3365, -25423, -29568, -1674, 20909, 4081, -36228, -43508, 3340, 38783, 393, -51270, -30285, 18285, 11367, -22569, -18476, 3448, -987, -16044, -12524, 2085, 3748, -12735, -19783, -2222, 8620, -6517, -11459, 2325, -4354, -21526, -626, 27551, 1502, -39635, -23008, 26504, 32048, -11080, -39239, -11456, 28976, 19465, -19088, -20374]
1467b0374K7155K142j0574O778j761k1011O257L1822O29l4143j2805K7092K4115
1480B5322j4594l0895O523L4163k607l6989J730L6685l377l3662N680L2725k532
1493A8172l0647o945K3795J7517j4309k2898P350K0692o255j3281J1845N084k2463
1506a2343n56L2639J577l7590q593L5377J8332k6226k6740J2616K9174n378k8937
1519a6648O834L0536j2284l4795J5581L6952j6109l8025J1234L5717k428l0945
1531a4380p113K3882J2523j9254j2876J9223R438k6257p458L3369R251l4735j0766
1544b5153K7365Q279j9387k530J5578k417j7689L060K8467M974m4073k5328N0826
1557A972N1684l9886o6258J5014O1329J0678l6911k2589P272J5946J1256L206
$$ y = [-20374, 6781, 8923, -1651, 5127, 3366, -17645, -11388, 20434, 21063, -13080, -25885, 1207, 25322, 10728, -20167, -13644, 20519, 17912, -19077, -17347, 19338, 15961, -17701, -12021, 20704, 18172, -12475, -19420, 4375, 21892, 7583, -15315, -7965, 12727, 6472, -6809, 5036, 10120, -12343, -12899, 19740, 21317, -16273, -24866, 10511, 28843, 2617, -24123, -11507, 17667, 12289, -16648, -9814, 20722, 8438, -26357, -10776, 26176, 10067, -27958, -16724, 18993, 16565, -14380, -21493, 2389, 14912, -4342, -17218, 2005, 11443, -14814, -22272, 11097, 20348, -14387, -25153, 2212, 10491, -8896, -11426, 4152, 1735, -15954, -12894, 15573, 20547, -23526, -48854, 1972, 53656, 13770, -52488, -37474, 23855, 34533, -2378, -24967, -17695, -1749, 9507, 12713]
1569A2713q306j9254j1051K5157L5948j5228n2289j418N0776J3986l3916j0651
1581a3533K0977Q35j9945K451K6817P834l0849k3913K8047L9860j5194m1591K613
1594a5591K7534n12q133J0913l049k4624J856L5862J4626l4542l6026J6986M7394
1607C2694K592m3221r420L6928N074l6162j6L6648j613l7545k701L6511J5932
1620C5701k7454k9447Q541K8939N131j5262n247k608r534J5837L4648j5364n8606
1633c4725j190O4777K3261n4127m0798L4269N1590j1577n2554q005M3003J4693
1645B8617l1645q052K6367l3k4442L961J9648o832j5289P884J2959o280j2861
1658e998N150J6459m114k4767N55L2042J137l9258l242M3854Q202m1490j5529
$$ y = [12713, 4407, -14847, -25898, -741, 35207, 19979, -32310, -33728, 17048, 31034, -2882, -13533, 7444, 8279, -11666, -9215, 17602, 25436, -5413, -29326, -1279, 38581, 23387, -18204, -15591, 11943, 11431, 3298, 14211, 11162, -13462, -11606, 24256, 38882, 4340, -31686, -14700, 32694, 35286, -7935, -17355, 19573, 24647, -11515, -11531, 25117, 23504, -14041, -16742, 19769, 35701, 8247, -21200, -12659, 16280, 21411, 6149, 902, -1706, -11240, 4597, 39245, 23881, -34725, -35915, 28862, 52123, -2004, -42802, -8533, 43057, 31480, -21074, -29079, 13924, 28617, -3028, -11080, 15287, 15254, -9188, -5227, 14421, 7589, -7700, 184, 13143, 6863, -5998, -848, 15611, 11497, -13270, -12715, 19327, 20464, -18794, -22036, 21818, 30020, -11470, -26999]
1671b6999L2175J7501k3886k2018J6980K7267q206l1067J616K7266m219k4615
1683a8205Q936K3694j2033k1999J2024J8998j0501j6991O139J4888l154j6465
1695a4669K138K3429M90l0638l699L6526P598l7932j2479L2254J6383j8166j0461
1708i226P901J836r578K780K0785N608l1080k0014L5724L7158k9202m5993J6128
1721a7173M1808k232k6352k413R709j765j579J2098R159j8486k7783J2307M2442
1734B9740K645m4964j3336L5379J5415k2974j0626R790l15m243R900R412j3229
1747B594k0821M563K8688P134l2266j6304L3492J9074l4366j9996L3401K1816
1759B7009l1717k6725K2743L3005q181l5253p692L1426K0279k2913k4103Q282
$$ y = [-26999, 5176, 22677, -1209, -23227, -6247, 21020, 12814, -18253, -16637, 10629, 6410, -18205, -9269, 14425, 2392, -19607, -7583, 11415, 914, -16077, -9938, 4950, 1796, -14669, -12531, 10898, 11388, -19250, -22949, 13577, 21175, -16757, -29236, 3018, 19401, 1235, -9226, -1325, 511, -9067, -6287, 14498, 20106, -10974, -30988, 4736, 41894, 12692, -33301, -17173, 24635, 22403, -3949, -6362, 3347, 1582, 3, 12101, 21260, 2774, -25009, -12702, 29740, 32385, -12579, -25915, 9464, 24879, 1905, -8721, 1069, 754, -3489, 6411, 15823, 2594, -18227, -13664, 15024, 22158, -10108, -26412, 7080, 26154, -8212, -28208, 5193, 27009, -4708, -31433, -8690, 24315, 16134, -19119, -26811, 4615, 24894, 1981, -22122, -13840]
1771a3840J5136M262N286n151k5362o030L2655J9838k5518k8380J1596L0604K342
1784A7438k7554j2401K2816J3024k2974q729K9777P557l9219j5315L9453K8953
1796C2826k6491l9326J863L6910J8412k2766k6782N825J8540M664k82o564j9478
1809b2649k745L1919J6528k9795k7122J7422K7515m207k1794k322J8769M697k0460
1822a4244n521K6675Q109k9729j0596K9176J2066k3128j0356J7547R444j1081
1834a638p618R577R093r683j4134J2278K2446q803k5833M011K0536j458r156N727
1848E345J659j1381J805J4964Q40j6192r201J5010K0167q600k9060l31L1449O392
1862B2866k6309p935J8571L958j2326L68Q104l180p411K512J1198J286j7465j1175
$$ y = [-13840, 1296, 5558, 10844, 5693, -19669, -25699, 6956, 26794, 1276, -27104, -15508, 15096, 17438, -10116, -22517, 299, 13323, -9651, -18380, 11397, 18954, -20265, -35580, 3873, 32826, 6335, -32991, -31128, 5782, 24194, 1428, -25354, -19529, -989, 3675, 3393, -3171, -22649, -25394, 6525, 23053, -6742, -33864, -16442, 11073, 6866, -14928, -17250, 1519, 6216, -14244, -19765, 6910, 15019, -14710, -25306, 3870, 15936, -7192, -17548, -1, 9443, -1638, -9256, 321, 9414, -269, -14403, -2125, 20321, 11518, -14315, -10304, 10232, 8774, -382, 5345, 7004, -4377, -2572, 12392, 13232, -2960, -12161, 2849, 23016, 14416, -14644, -14975, 16474, 22866, -3443, -11378, 7193, 11151, -1175, -807, 7297, 4117, -3294, -782, 10416, 11702, -5763, -16938]
1876a6938K1011K2962j7132k8279P775K3363M49j2567m020Q67K947P488J606o920
1890B612p153n60R822J1349q085j9724L173K1307l51j4476K834Q340j0232q496
1904i640J3194J4243q447k0209j843K3440J3564k4519k6305J8442L0926o536k5233
1917h923j890J2303L057l740m193o56N265J890p297l945P134N980p17r157j3531
1932a8420N779K7750N851l6593k1374L3251L5339j6791m1728q284L3043K9368
1944B7191j3040l3379l831K3278R212r277m684j113l205O322J0071m252q534L98
1958d843J980O19N111L008n753p186r58P534J3847J131k2408j2209K1180J9282
1972B0335j3126j8477L990J4378N248p012j1484o88J0488L953m390N4J05p213
$$ y = [-16938, 4073, 27035, 9903, -18376, -10601, 12762, 13211, 644, -3376, -2509, 438, 7926, 9532, 2612, -4541, -5101, 4721, 16070, 7985, -11739, -8566, 12741, 12390, -2086, 748, 9088, -1144, -9640, 3554, 17797, 9350, -10859, -12702, 10738, 24302, -217, -26522, -8080, 22846, 16310, -8923, -10813, 1490, 4547, 807, -3386, -4042, 1223, 3113, -4184, -8129, -995, 4985, 4268, -4889, -18420, -12641, 15109, 20960, -15633, -37007, -3756, 31583, 14792, -26936, -35220, -2177, 27191, 14151, -19228, -23059, 219, 9431, 154, -4530, -5643, -8848, -2526, 7545, 3293, -5241, -4843, -2863, -2244, 2867, 5875, 122, -7064, -8022, -488, 13359, 14490, -7918, -20127, 1053, 20335, 7209, -11268, -7278, 7100, 12348, 5336, -6148, -6836, 3652, 7605, 3215, 3269, 3374, -3839]
1986c839J682J1629k97j2352n14O987J785j655n42k314J791L654l293k435M379
2001D666o86o843L013Q514j141m412j096n814j058J3249Q505j2376j5344L386
2015g437J5858J0077r349k2061k660K5563J3162j8376j7761M315J3452R000k296
2028A1487j4370r689Q107J0970J015k911m993o827K954J1123l54r862l874L942
2042c282M663O537k146j4612l828J3260P163p284o544P68M165M457k020q168J790
2057e081R232l312r952K488R176R01m004l855k305N934N431q540p850J0300J0275
2072H838o767j0349J648O014L130k599p233K353J1452j185j4174j140J2168L169
2086E325o487l120j61K275M867k599o584M079Q118m337q773J152O026N131q22
$$ y = [-3839, -2157, 9472, 9175, -3177, -3691, 3296, 5081, 3426, 2884, 570, 2361, 6015, 2722, 287, 4666, 3980, -2863, 150, 8664, 7523, 3111, 2015, -3799, -4857, 8392, 16897, 4521, -10823, -7437, 8421, 18498, 9149, -12912, -15572, 9991, 23153, 4777, -12984, -8669, 4783, 13783, 11487, -2883, -12572, -4465, 6505, 7520, 4609, -384, -7211, -4257, 6866, 6512, -3350, -7224, -3282, 1381, 7918, 5772, -8840, -12668, 592, 7755, 471, -6073, -5305, -1140, 3317, 1297, -6871, -5081, 4151, 839, -9113, -6625, 2551, 3452, -552, -4407, -6712, -778, 4653, -3887, -11737, -1437, 8838, 2071, -8278, -6630, -616, 2514, -85, -7318, -4965, 6487, 5302, -8872, -10012, 2156, 5325, -1162, -4282, -4443, -2168, 2699, 100, -6484, -2405, 5713, 1376, -7397, -6245, -219, 4912, 4090]
2101D090j0514o105J5381J3649j5139k0726P343K2623O849j4099j8117q1K0055
2114E209J2691j2670j5701J5R127R547M983j0408j6826N314K0987K936j5839j0214
2128a0849M224J1339O443m014q741k55J036k535N540R105o166j3598L467J1331
2142F327J138n025l597m106K65R378N779n667j0109n898Q334J7731j251k3797
2156a0498q732J8664J2500r130p156K691M12k955M71L536L343m817r240K466J5408
2171F963K610j5605q424N843O391O669K506j2553j4733Q611K1318K959j9851j5825
2185b3121P835K2613N262k0982j2528J5782J2485r789q543M645Q49l573N131O777
2199B843l212q606l283O260Q851l241j0977K866J1488l338r536M565N940n429
$$ y = [4090, -6424, -12529, 2852, 16501, 1362, -19364, -12021, 10602, 17451, 3352, -14765, -14846, 5209, 17900, 5230, -10471, -10456, -1329, 8218, 13201, 2793, -14033, -8719, 12268, 15204, -635, -10849, -6625, 4714, 11157, 7143, -1598, -1853, -817, -3352, 2188, 11293, 5127, -8471, -5004, 6327, 7465, 2440, -1157, -5263, -4998, 4380, 10159, 4492, -5617, -11515, -3181, 14550, 13299, -10498, -19230, -566, 11934, 2804, -4352, -1661, -1249, -4204, -3733, -197, 3146, -1671, -10911, -8445, 6963, 9573, -6032, -14456, -8613, -2222, 4447, 6953, -5600, -20333, -11722, 9596, 12555, -7296, -23121, -15286, 7327, 12589, -8393, -20921, -5139, 7346, -2443, -10986, -6341, -5492, -9065, -3934, 2843, -369, -8975, -12258, -5998, 2853, -388, -11365, -8499, 2989, -349, -9885, -5320, 620, -4809]
2213d809k434Q881J85r490j323Q996O240o017r565K977J2899j328j5470J241J8189
2228I172n67j6721Q18J4904m72j1973j329R325N086n356p079J856P417j945l720
2243e84O894P64j3956j271J8740N440j8368q234J2893J0353o389j0826l04R055
2257D207M067n967j007N265n633r746R666J4634r066j5287O059J2780k634r370
2271b032L01N618O19n292j14Q554m30j5101j199K1823N189k4026j2283J9389J5893
2286A6909r153j5069p89J0623N427m968p520Q68K190J160O594K014j5217q494
2300a5425J7567J3174j6141j4997J1720J4260q183j4051M725J6207o77k0085n426
2313a7332K1911J0879k0644j4101J6390J3977r062r655J214J245J277P134L597
$$ y = [-4809, -7243, 1638, 1823, -7667, -8990, 6, 6246, 229, -9336, -6359, 6540, 5212, -10258, -9017, 9172, 8605, -8116, -7298, 7606, 7134, -4839, -6168, 3157, 8243, 2887, -4192, -2336, 5081, 3136, -584, 6310, 7074, -6882, -8153, 10587, 16027, -2341, -10575, 2318, 12671, 6282, -4544, -4848, 4207, 8274, 2307, 1300, 6565, 932, -8814, 852, 15486, 6420, -8867, -2808, 9972, 7338, -2032, -1731, 3887, 4506, -786, -900, 7654, 7224, -7877, -9076, 12747, 17936, -6090, -18373, 1016, 16909, 7756, -7313, -8102, 2521, 7948, 2980, -4540, -3672, -1482, -322, 6272, 8286, -6931, -15425, 2142, 15316, -825, -15822, -4102, 10158, 1975, -12076, -7351, 8856, 8179, -11906, -17332, 4579, 15458, -5186, -19287, -2897, 11080, 2018, -7637, -6423, -5178, -3901, 3233, 6830]
2326F830p583j0952J311J5448P955j5538j3842J3749J5577j1554j2063J1012P880
2339H230j2330n346J4817R055j4187j6345P492K3142L539k2541j1401J5914J1220
2352A1259q055l897M053n453n075J1775J0443j1016j6563L110J7930P505j4305
2365A711j4427Q204J4643l944q554N934J510j2620j023J7836M882j5868q761J1605
2379A128J1086o142j3146J007J3695R16j2300L456J3878p118j7987O827J9722
2392A5022k258j5997k140J0804M966n556l785L406J686p749j193J4745K775j9095
2406d369o304K1112R248j8073j2521J0507J0279l650n440R96K343m031l742P923
2420D278O466j3360j2034J6003J6760j6248k0906J2998K0142o466j9549k70J5014
$$ y = [6830, -753, -11705, -10394, 5054, 13009, -2529, -16371, -2622, 12955, 1401, -10662, 350, 8230, -4100, -9446, 5371, 14426, 239, -16106, -8614, 14528, 18067, -4474, -15875, 39, 11259, 3204, -693, 3360, -2093, -7168, 4607, 15050, 4034, -12529, -9419, 8511, 16016, 1711, -12716, -4512, 10131, 6187, -2367, 3567, 5077, -7543, -8566, 9270, 14152, -1716, -10477, 1128, 12214, 6072, -7074, -6067, 7628, 8544, -3756, -300, 13578, 6460, -11527, -4700, 15022, 12764, -3233, -5373, 5431, 10397, 4841, 1056, 4462, 6148, -1601, -2794, 11951, 14726, -4369, -10673, 10439, 19687, 1614, -10907, -400, 9879, 6229, 789, 1785, 4128, 97, -3645, 4278, 10744, -2616, -14650, 1353, 18113, 1865, -19041, -6043, 14099, 7633, -11916, -12186, 2828]
2433B828M271j1141o717J0835P008j1405p395J1129N051j1101k231J1579K57q643
2447e675J229O051m385n910O053J0910k908j6538l792K0898J3732k1984k0329
2460b2648J7363K4121j0195k1643K790J6404L472r726n681M547M150m090k658
2473c794P541J959q809n44Q037l238q960P372J0285r830j2971Q754J6360l406
2487H756j9461n965J8977J5030j4903k0691R452K0063l952j3900K610N555n991
2500d420r42R138K939r201o251P843J0684m704j5512Q22J7073J892j3411J059
2514b991J1273o239j1606Q607J3656o567j5179J263J5065N992j2759j0986Q384
2527b087J0871o301o729P178J811j1739J496J5949r92j9021m748J5050R945p654
$$ y = [2828, 7099, -4042, -10759, 76, 7084, -4321, -11716, -587, 4464, -6637, -8868, 2711, 2968, -5675, -4446, 1605, -2780, -8690, -2637, 8273, 5365, -11173, -14965, 5933, 19665, -2319, -22648, -5285, 18836, 8641, -13002, -10212, 6192, 9664, -62, -5743, -1196, 2954, -1136, -3794, 3747, 5706, -3103, -3647, 4390, 1152, -7808, -436, 9849, 19, -12952, -4198, 12162, 8756, -10705, -16670, 2307, 17337, 2434, -18257, -8805, 11258, 7306, -6594, -3984, 1571, -4420, -5362, 3776, 6715, -2486, -8737, -894, 9790, 5086, -10426, -9604, 7469, 9361, -4050, -2991, 8282, 2043, -9563, -956, 12700, 6133, -9046, -7783, 7282, 13274, 515, -10471, -2087, 8784, 2483, -4246, 2932, 4743, -6996, -5500, 10449, 9457, -9564, -14312, 738, 10683, 3029]
2541C029j2105J781J0148j109r651L067R915q019j0947R920J3707q875j5083L552
2555a0670J2015K076o235m245J289K258j015J870O875l944j4534K372J8407K170
2569H689j7699m521J2982N523o545m014K368J671l642p45Q569O003j2991j3120
2583a7472J2485J8995p945j8905J543J3455K646n583l653K04J346R03J019J532
2597E70k515o988L271J1848k238j3709J476J2635l486j1723M754J3161k480j4643
2611a0067k180J3537R365j0882j5094Q012J7614l725j5458J285J0422J14k981
2624c8J546j791m355L907P126j439p262j886P691P312p894j2364P778J6855n030
2639A0156j7783K910J5412n78j2231j636Q723M463m672p018K215P339q94o886
$$ y = [3029, -9076, -7295, 2853, 1744, -7907, -4840, 5075, -2944, -13891, -3971, 9736, 861, -14222, -10670, 1345, 3421, -2814, -7059, -5770, -3512, -4527, -2657, 4218, 274, -14260, -11888, 6519, 8689, -9010, -13531, -549, 4974, -1571, -5585, -3217, -1546, -5188, -5933, 2636, 8639, -4352, -17472, -4987, 14008, 6063, -12842, -11299, 2156, 4802, -781, -4434, -4230, -2884, -1981, -962, 570, -1945, -8933, -5662, 6186, 3948, -9761, -8285, 4350, 864, -10859, -6105, 7056, 4576, -10067, -12247, 1290, 10655, -227, -15321, -7309, 10305, 6580, -8878, -7593, 2829, 2943, -38, 1508, -283, -4638, -731, 6395, 4956, -2306, -4192, 3499, 10811, 2917, -9447, -1669, 15186, 10156, -7627, -4717, 10695, 10117, -2114, -3750, 4973, 9436, 4764, -2254, -39, 7300, 6406, -480]
2653d80J372L393k380L05M893m449r119N999J2660m094j4651k936J2594J0793
2667A3900o250j6186j233J5341M929j1411n163O615J766j997K784K28o832k067
2681e576N716M472o81m768l585L380L753l533j239N820j534j0212K272J4082J89
2696H556j4120m929R448Q215k072r725m279P344O145l021k465J160m535l527R136
2711A331O798q474q466M583O010L80j861j832j953O48J861K952L323n360j0452
2726a0512M461J6099j07j5725m625J0370O029k063l219k254Q46K577N03k11J803
2741C972l164m453N494P001l883o305J883J984j078M110K795o397n973L901Q350
2756H237K315o638r414K205J3428K365j2702m895Q423M434k763k352j726q61K938
$$ y = [-480, 892, 4285, 1905, 2210, 7103, 2654, -6465, -466, 12194, 8100, -6551, -9487, 3107, 13900, 7650, -8536, -9769, 5572, 10501, -910, -6073, 542, 2308, 311, 3095, 3323, -3509, -5576, 140, 4612, 3931, -837, -4422, -1042, 2711, -822, -2061, 3759, 2225, -7987, -5715, 8367, 8556, -5564, -10493, -1045, 7170, 5098, -4627, -8906, -1562, 4583, 1562, -903, 257, -4278, -7805, 1331, 8129, -345, -8811, -4228, 1782, 2162, 301, -1531, -3484, -2836, -975, 1977, 5300, -60, -10512, -6051, 10048, 9941, -5784, -10409, -39, 5990, 3927, 708, -1546, -700, 1877, 2380, 2169, 3972, 808, -3645, 1849, 8850, 4967, -1338, 545, 2529, 1451, 5561, 8356, 1959, -4014, -113, 8237, 10552, 3914, -5500, -3295, 10133, 12498, -204, -5099, 3324, 7758, 4995, 2643, 917, 56, 2994]
2771B994K303j966l64O78k429l01L146l48k205J820l77m960L010P381l120q615
2787c353R04O418L434l214o869j377Q630N736p569p261L691N069p37q35j163k591
2803a087K497M323l035n104J735L413q8p72j960j514L690J704n506k222P275J239
2819D588p239j370M841J469j107k480k992L107N754k209p533N29O107J862k013
2834A314l459m094L514Q185j331r031r69O122L028j716k912l555K573O478r59
2849C188o073K70L363j092L56J945j685j442J346j027p55M497J334o698k319N520
2865G28L354j669k740l404P67O870K254o670m548L082L009K712N85n625n007N361
2881i41O395k154m061q92l56J712M716m79n287q24J804J820L125k52p903j817
$$ y = [2994, 5297, 3331, 2967, 3645, 1216, 915, 4061, 3713, 1508, 3328, 2951, -2009, 1001, 8382, 5262, -3353, -2449, 3969, 7403, 4189, -2680, -4057, 4573, 10309, 2740, -4521, -830, 4239, 3502, 2667, 1504, -1087, 1410, 5733, 2698, -2406, -671, 2742, 2654, 1882, -78, -1592, 2098, 3802, -1704, -3926, 3349, 4588, -2651, -4021, 820, 2289, 1182, -1298, -4290, -1183, 4571, 2362, -5171, -4642, 1465, 3327, 1314, -2145, -6239, -2725, 5460, 4129, -4902, -5871, 251, 3279, 1563, -1349, -4904, -2331, 4147, 3188, -2885, -2615, 748, -344, 12, 1957, 272, -1170, 176, -851, -1606, 2891, 4225, -2473, -4792, 728, 4082, 2413, -327, -3731, -2964, 3906, 6160, -510, -5058, -1976, 1033, 3745, 4330, -1295, -6302, -941, 5454, 3300, -761, -1653, -2009, -297, 4419, 3940, -1347, -2171, -367, 1453, 4578, 4326, -3577, -5394]
2897e394Q497M537n183l408K48L57J971K760k354k742M54N41R60L285j127o890
2913c488M35O036N16k750k19k195l096M690O200l722p558k056M472P095P77r970
2929d833n975Q410P741n324o282P96J229J661L384j268o130l40M358J199m27k069
2945c870k684K139M080l327k820N049K158p892k012Q998L364o259n583J779O361
2960e19M536n412p914J736Q382J034l226j742l109p2Q245K595q852n657O970O702
2976C697l122n946j467M911M705l892o477M673O361o011o180O114N846m199m184
2991e171R16K353J669K08k875j944K380K000Q73L00m397l563P567P709q265r221
3007i461O643R708k972p209n08N136L636l349n069K873N583k471m713M442L324
$$ y = [-5394, 3103, 7640, 2457, -951, -703, -346, 1625, 4385, 2031, -711, -257, 284, 1244, 4529, 3402, -3488, -3053, 2983, 3499, 749, 530, -1665, -4761, -71, 6129, 2407, -5151, -7207, -2735, 4360, 5137, -4833, -10808, -2398, 5343, 19, -6263, -5467, -4238, -2577, 807, -461, -6591, -6931, -2573, -1374, -1801, -3870, -6554, -4415, -335, -3662, -6482, -1433, 725, -7167, -9179, -181, 3183, -3076, -8659, -6880, -519, 4017, -1395, -9309, -7573, 809, 1843, -1383, -3125, -6234, -6306, 1939, 4534, -4318, -9975, -3005, 3697, 575, -5371, -6838, -1927, 2778, -1114, -7591, -2918, 3443, -2568, -8748, -2634, 3212, -987, -5171, -4255, -1902, -233, -25, -2900, -4844, -2464, -464, 409, 709, -3688, -7251, 316, 8025, -240, -9461, -2818, 6890, 3918, -3291, -3799, 1337, 4973, 1624, -3445, -572, 5011, 2540, -2173, 2269, 5593]
3022E593o054q68N981j28n236Q74L751j288k789P70K793J280m291l873N286O943
3038H744o972r501O142R972m389p800J086M218J31o22j077k56r63r49J202M909
3054C875q57r170m14J0385J920r479j373N598O12l088J796J997j662l592l37N547
3070A758M758o112q545N113R858l234p569K366L057k555K04M605r83n962k002
3085e243N205O117j549r919j891R748L702q344j968N494k144m083M844N862o080
3100b49p452K008Q724L449p920p714N189R979l510p883K808M126m546j197P159
3115B971Q02p138j714N822K910j672l806LL553j062k846M999N512q145r301J0261
3131A149J2854p488j4449K218J2784M537p495q165K504Q306N15n620n66K419k312
$$ y = [5593, -461, -1329, 4652, 4524, -712, 162, 3913, 2625, -164, 606, 3399, 4679, 388, -3485, 1801, 8744, 1772, -7729, -1587, 8385, 3996, -3804, -2718, 1500, 1631, 1009, -68, -324, -1287, -2236, -1034, 3875, 3018, -6152, -6566, 3819, 5739, -3740, -5113, 485, 1097, -1991, -195, 1802, 140, -3452, -3789, 1758, 6516, 404, -8141, -3028, 6830, 3596, -3973, -1607, 1450, -1105, -901, 3704, 2721, -3241, -5243, -38, 6079, 4530, -5389, -7280, 2468, 6170, -2174, -4142, 1352, -792, -4875, -31, 5831, -249, -7701, -5693, 3031, 6480, -1440, -9154, -3965, 6014, 2504, -5379, -2571, 1555, -2991, -4188, 2971, 3773, -3365, -5079, 743, 3653, 1981, -1825, -1822, 1731, 669, -2177, 2822, 8334, 189, -9112, 1149, 14003, 6515, -7934, -5716, 7068, 11605, 4110, -4055, -1551, 6755, 7270, 1650, 1084, 3503, 1191]
3146A191Q68N968k184r300K384Q404j560p409M10O420J454o310m362O218P299
3161I491o685j1202N902J3169l621j2238J123Q349Q44m236j863L80J288J148J24
3176A973P26j079m736P37Q485l06j0474l05J0983Q90r468j035O792J120n387k501
3192c585M399M305l533o574L945P414m621p927M657O426n025m914N672K798n172
3207a735k981M057L155k932n760J524Q769j9j0540j530J0896J353r694j135O890
3222C18K02m154J438L148j993m056J32N643K533o345m852P365O628o228n992N919
3238b94L212o141k58P043Q0o553k202O224N766m007r335J094J1297J194j0119
3253b999j302P952Pn984K203M038k660m188J813M132J404l740l721K571L863k716
$$ y = [1191, 2059, 8027, 5843, -3457, -1073, 7331, 5771, -1638, -1228, 5192, 6646, 336, -4026, 2192, 9491, 2806, -8396, -2494, 10675, 7054, -5184, -4061, 4288, 5132, 896, -967, -587, 701, 1849, 1973, 2699, 1620, -3116, -2379, 6106, 5800, -4674, -4979, 6004, 6894, -2574, -3609, 3183, 4303, -1084, -3585, 814, 5119, 1586, -4988, -1043, 6371, 1750, -6177, -1520, 4906, -119, -5033, 639, 3437, -1735, -4716, -659, 2496, -436, -6196, -4672, 4097, 4078, -6462, -7992, 2904, 4257, -5437, -6572, 318, 520, -3634, -2196, 952, -1041, -5097, -4965, 678, 3211, -3134, -7986, -621, 6007, -221, -6213, -294, 2918, -3223, -3481, 3562, 3642, -2911, -5113, 1111, 6877, 2870, -6465, -5371, 5926, 7120, -2999, -4301, 3651, 3658, -2326, -123, 3915, 1255, -2933, -1120, 3012, 4416, 676, -3045, -474, 3389, 673]
3269F73k421M541r86p056K429J1364j806j2682k433J0798O373n867r219J604R545
3284D857J607q167j605P028j637o219L877P890m332p525K080N328J180k534k317
3299d89l09J554Q23J615K787m539q554L860J3557k042j5153j866J3179M723q460
3314F86o492L235N443r29m789O21M663j985n728L087O078m993n237M421L430m573
3330c062j539N207K23n455k075M531N513l043q764R2J1191K784j0324l760P055
3345a426L091m418k03J999j779l21K545J599j430l840p39N841L077o278m838P241
3361A21N355p365m790P023L948n396l773K746M824l77n373j755O069K519n945
3376b169l065N270J796l785J193K248l600k057N134L097n143m338K971O702J182
$$ y = [673, -1748, 2793, 1807, -5249, -2820, 8544, 6738, -5944, -8377, 2421, 8794, 2927, -6292, -4688, 4857, 6464, -1703, -3308, 3720, 2083, -4136, -259, 7631, 3299, -4226, -2146, 3182, 4362, 1828, -489, -798, 756, 1579, 3194, 5981, 1442, -7112, -3252, 10305, 8263, -6890, -8756, 4423, 9146, 686, -5806, -2571, 2872, 1943, -2846, -2225, 2438, 453, -5275, -2188, 3890, -1103, -6340, -1919, 1511, -3062, -4601, 606, 829, -4626, -6701, -2170, 3343, 300, -8464, -8372, 2819, 5603, -4721, -8481, -1426, 1665, -2753, -2956, -957, -2736, -3057, -512, 1087, -343, -4183, -4922, 919, 3996, -2282, -7120, 121, 5476, -1889, -6679, 344, 4292, -1104, -4877, -2131, 2693, 2316, -3057, -4812, 1257, 3776, -2169, -5234, 36, 1832, -1953, -760, 1488, -2112, -4169, 965, 4062, -1081, -5419, -2448, 4254, 5436]
3391E436q077m538P698P243o967o776N834M916m435k079M007J463l865j067K640
3406A433K918j291m330Q56N843K24o321P49M687k013l777L596L456m106l074L209
3422B059K111j345k839k49L162N22m513m62O119m94q377j56R436R2q417k594N526
3439d19M610j750m851k681L561L501j990k060R22j536q58M782J913p180l012O354
3455f94L994l641l546O42K295J555j353j736K486L29m212J16O845J47o384j067
3471d224N138J511k411n48o40M4J388J058K54L8m063k032O314M746o902o596N347
3488a578P046l032n048K01K648R11n69k298Q63K061j153j919K254J554k977j04
3504a140J485j594q63N399Q17o587k664O206N158l035o754j655P746O484o209
$$ y = [5436, -2641, -7179, 519, 7762, 795, -5981, -147, 4769, 334, -1745, 2262, 3725, -140, -1207, 1433, 4351, 3060, -1270, -414, 5429, 5653, -668, 81, 4768, 2755, -1022, 2574, 6030, 1924, -1150, 2059, 4170, 2825, -14, -263, 2899, 3421, -1092, -1554, 4565, 4071, -4306, -4462, 4974, 5066, -3351, -5945, -419, 4191, 2441, -2410, -5091, -1530, 1971, -19, -2079, -1157, -2693, -3551, 1231, 3144, -4036, -7048, -694, 3300, -341, -3887, -3245, -950, 605, -748, -2484, 2, 331, -3881, -3765, 3080, 3227, -3157, -4224, 914, 2425, 14, -534, -1174, -1130, 258, 1316, 1570, 1608, -2455, -4487, 1827, 6573, -329, -6925, -1578, 5468, 2436, -2612, -2411, 237, 1148, 579, -1719, -856, 1205, 52, -1867, 387, 1941, -1036, -1140, 345, -1249, -2112, 3287, 4104, -2483, -5147, 1059, 6217, 3182, -3572, -5227, 2519, 9003, 2794]
3519B794q882L829Q336j304m596n52J117R45J723l57k187L07Q12j034Q79J177
3535C007p54n95J091j584n53L973K10o540j683P207L148m813m868J367M391K178
3551E182l397n358K690N242k161l876J953J943k126p50J324n25l98J096j097l22
3567e80J858l86j944N86R44j429J029K046k657j407K504Q84k825R3K241q71j477
3584a391R19N49N3M93k201n65L709O96n406m93N059J059l546j827Q95J508J765
3601A276j534l755J263L874l95k293o16j19K52K710L13l859j078L339J104j031
3617e49j37r34j365K356K036k100j947R12Q98K037J577l696l915L441N149k266
3633A497l360O92J819Q37J68k522j114L286J648m021o61M571O66l350j922J262
$$ y = [2794, -6088, -2259, 6077, 4773, 177, -375, 742, 1687, 3410, 3053, 866, 1173, 1985, 951, 1830, 3007, 2253, 1658, 2749, 1165, 612, 4585, 4795, -1745, -3428, 3779, 6927, 2114, -2754, -1387, 3004, 5182, 1785, -3573, -883, 4359, 2198, -1678, 275, 2218, 92, -658, 666, 141, -257, 839, -258, -580, 1278, 892, -1052, -466, 478, -951, 78, 2124, -533, -1940, 564, 1448, -1377, -1284, 957, 86, -1391, -472, 77, 130, 623, -1578, -2143, 1566, 2262, -3144, -3637, 1422, 2481, -1065, -2892, -1997, -489, 1276, -258, -4013, -2750, 1124, 729, -1564, -2180, -2299, -2047, 663, 976, -2883, -3961, -622, 482, -549, -686, -1620, -2985, -629, 1407, -693, -2640, -1728, -830, 1207, 2784, -912, -4827, -1386, 3763, 1497, -1863, -1171, 648, 1485, 1653, -869, -1983, 1303, 2951, -1070, -1731, 2840, 3506, 156, -1766, -504]
3649e04K792K573l375o417K993P712Q5p566j787L355L580Q44m115l650L514N341
3665E375l008m999J736L492o87k287n57J391L445n70o174j493P879L543o590n815
3681e319K602O219L091n167o539J260Q925Q77p238k970L856K845M96j612k985
3696a659l80K728O91k116Q89J030k095r16K130J97r41j06j750p63M095R85m507
3713b488k414L971K360k253j927k16J069J876j138k761K482K536l820l156M223
3728a656L352l044k694Q91J780J313k34l373k79L159P71j883j37N45o05J219J026
3745A51j889j269K641L19k782N70L076k24k364K25P97J919q66l092n03O177J329
3762D215o320k870N556K988l255k656J182K272J766j955l023J213L294j078j967
$$ y = [-504, 2288, 4861, 1486, -4931, -1938, 5774, 5859, -1707, -3494, -139, 3441, 4285, 170, -3480, 34, 5375, 2367, -2632, -896, 2596, 1909, -378, -935, 456, 3901, 3331, -2843, -4336, 3543, 7086, 496, -5319, -2717, 3502, 6593, 1426, -5113, -3853, 5072, 5949, -1289, -4259, -403, 2442, 2938, 1326, -1659, -2039, 689, 1380, -736, 153, 1183, -912, -1828, 302, 499, -442, -548, -2298, -3061, 1034, 2019, -2488, -4902, -931, 1429, -824, -2751, -2967, -1898, -22, -1160, -3921, -1439, 1097, -2723, -5879, -1656, 1696, -1348, -4042, -3151, -1371, -58, -292, -3665, -3944, -785, -14, -1897, -2034, -1489, -2094, -875, 151, -1738, -3007, -366, -47, -2829, -2259, 817, 593, -1771, -1546, -749, 1170, 304, -2788, -3291, 2886, 4215, -2105, -4975, 581, 3569, 314, -2342, -1160, 1112, 2878, 923, -2100, -887, 2407, 1329, -638]
3777f38J518j70j290K060J321k270o71J996l39k059J369J697r77j333L73J207
3793A794J637j806m542K161O926j250p972l12P238O88m712j952K231L562p97m568
3809a674r01N162J690m689k122L400J074j122q99j336k20L899K069m786m301L211
3825a545N004k12m347l387L285O139k038p333J122P117m65n960l22M808O28k840
3841c46j981J819L349l64n079q22N348J601l116j051M3p12J977K791l000m247
3857c790K547M547o09k915k784Q48L934P74l501j288L074n76k600K857K411m200
3873a271k600L253L655k490l077Q8L222K763l805l839L359M446l864l799M616
3888F57L096k926k602J054J076J453N45k050j318J009K720M89m54l534j726N350
$$ y = [-638, 880, 710, -580, 1480, 2801, 531, -140, 1856, 1517, -542, 827, 2524, 1547, 214, 587, 1794, 3431, 1625, -2917, -756, 6170, 4920, -3052, -3364, 3874, 4562, -150, -2102, 129, 3691, 2894, -1674, -2575, 2587, 4277, -412, -2534, 866, 1940, 818, -81, -1417, -1637, 2262, 4331, -455, -4756, -1545, 3459, 3247, -1100, -4487, -1202, 4937, 2899, -4434, -3312, 3805, 3340, -2620, -2942, 1866, 2494, -346, -2327, -508, 2841, 2477, -2602, -3424, 1924, 3525, 409, -642, -599, -1311, 666, 3457, 457, -3790, -1243, 3304, 2695, -220, -3004, -2156, 1778, 2552, -949, -2237, 837, 261, -2339, 518, 2929, -1271, -3871, -618, 3037, 547, -2530, -2442, 780, 3543, -262, -4101, -742, 3704, -160, -3959, 657, 3753, 827, -1775, -721, 355, 1808, 2353, 303, -1015, -6, 2714, 3203, 2749, -785, -2511, 2839]
3904B839L995n469n011M458N237k943l945J348J943k85j955J7L406L25m134k489
3920b663M825K811m900k709M164K029k873n57O2k86L41R14l45o95o1q82J510J361
3938B046k507j866L927J518m761j660N318J642m090k131L387J796j414k939k4
3953a758M536J189n333j467N709J693n515j495M222J415k492j482L67R44J667
3968B200j130j433J30K73p24J701P80l614r74M736P54o040j361N112J481l870
3984a979k209K298L295j236m595o61N345R89m751j303L929p7l009J854K039k243
4000b314j987J952K232l60k356j138K691L122k659l309K614K815k875j81L355
4015A602k69l466P85K702Q3j698o35P89J585k31j792J017K342k381l222M171L272
$$ y = [2839, 6834, 1365, -3646, 812, 6049, 3106, -839, 509, 2452, 2167, 212, 229, 3635, 3960, -174, -2663, 2162, 4973, 73, -2636, 1528, 3557, 684, 127, 189, -97, 244, 1158, 813, 118, 57, -825, 685, 2046, -461, -2327, 1600, 3118, -1643, -3303, 2015, 3657, -433, -2564, 823, 2619, 1205, -1734, -1758, 2778, 3967, -1366, -2833, 2876, 4569, -946, -2441, 1781, 3196, 704, -778, -411, 533, 2200, 1070, -363, -233, 40, -684, 1017, 1797, -1817, -2791, 1945, 2699, -3341, -4702, 410, 1891, -1979, -4188, -1890, 1405, 169, -4426, -5087, 258, 1247, -3504, -4807, -878, -955, -3964, -2110, -71, -2314, -4301, -2349, -117, -477, -2833, -3971, -1280, 1842, -817, -4126, -1512, 1303, -1572, -1753, 1602, 1333, -2133, -1348, 1354, 1437, -261, -896, -107, 1478, 1247, -545, 472, 2814, 433, -2789, 1382, 4654]
4032D654m776l917M544L876k285l969r36L577K497l042l633K171M428k261l517
4047b589J124J779j143O95R17k098j094K820O77k458j084J304K523N70l674k914
4063d645M440N025m508n441L969N113k194l734M22K865Q16r12j428L46J872j760
4079B46r94K793R03l571j055M190L22l392K72J587p85q61O25O22o94q79k16J487
$$ y = [4654, -122, -4039, 505, 4381, 2096, -1873, -2809, 768, 3265, 223, -3410, -1239, 3189, 928, -2589, -1465, 314, -829, -134, 783, -1315, -2409, 411, 1088, -1370, -2454, -1150, 1373, 1943, -1731, -4645, -205, 4820, 312, -5129, -1160, 3953, 1759, -1975, -1553, 1312, 2128, 1216, -212, 134, 2006, 246, -748, 2045, 2948, -623, -1678, 2512, 2834, -558, -286, 1301, 516, -345, 280, 902, 208, -671, -887, 600]
$$ [...]
8191F7
##END NTUPLES=NMR FID
##END=
