##TITLE=1H_TG-2269-b2
 DMSO, 8 sc, 
 17.12.2019
##JCAMPDX= 6.0         $$ Bruker NMR JCAMP-DX V2.0
##DATA TYPE= NMR FID
##DATA CLASS= NTUPLES
##ORIGIN= UXNMR, Bruker Analytische Messtechnik GmbH
##OWNER= root
$$ XWIN-NMR		Version 3.5
$$ Tue Dec 17 13:49:13 2019 Russian Standard Time (UT+4h)  she@DPX200
##.OBSERVE FREQUENCY= 200.1315
##.OBSERVE NUCLEUS= ^1H
##.DELAY= (6, 6)
##.ACQUISITION MODE= SIMULTANEOUS
##.ACQUISITION SCHEME= undefined
##.AVERAGES= 8
##.DIGITISER RES= 18
##SPECTROMETER/DATA SYSTEM= spect
##.PULSE SEQUENCE= zg30
##.SOLVENT NAME= DMSO
##.SHIFT REFERENCE= (INTERNAL, DMSO, 0, 15.7039)
##AUDIT TRAIL= $$ (NUMBER, WHEN, WHO, WHERE, WHAT)
$$ ##TITLE= Audit trail, XWIN-NMR		Version 3.5
$$ ##JCAMPDX= 5.01
$$ ##ORIGIN= Bruker BioSpin GmbH
$$ ##OWNER= she
$$ F:/spectra/data/she/nmr/H-F/1/audita.txt
$$ ##AUDIT TRAIL=  $$ (NUMBER, WHEN, WHO, WHERE, WHAT)
(   1,<2019-12-17 13:48:13.96 +0400>,<she>,<DPX200>,
      <created by zg, POWCHK disabled, PULCHK disabled
       configuration hash MD5:
       00 E9 B6 7A A2 85 ED C7 34 08 36 98 17 FE 4E 26
       data hash MD5: 16K
       64 D4 1F 52 F8 88 EA C5 66 A1 B1 2E 95 1E 90 9A>)
$$ ##END=
$$ 
$$ hash MD5
$$ 91 3C D1 EC BB D8 A5 C1 D1 0C 85 51 7F CC 40 91
##$RELAX= 
##$RELAX= 
##$RELAX= 
##$RELAX= 
##$RELAX= 
##$RELAX= 
$$ Bruker specific parameters
$$ --------------------------
##$DU= <F:/spectra>
##$EXPNO= 1
##$NAME= <H-F>
##$PROCNO= 1
##$TYPE= <nmr>
##$USER= <she>
##$AMP= (0..31)
100 100 100 100 100 100 100 100 100 100 100 100 100 100 100 100 100 100 
100 100 100 100 100 100 100 100 100 100 100 100 100 100 
##$AQSEQ= 0
##$AQ_mod= 1
##$AUNM= <au_zg>
##$AUTOPOS= <>
##$BF1= 200.13
##$BF2= 200.13
##$BF3= 200.13
##$BF4= 200.13
##$BF5= 200.13
##$BF6= 200.13
##$BF7= 200.13
##$BF8= 200.13
##$BYTORDA= 1
##$CFDGTYP= 0
##$CFRGTYP= 5
##$CHEMSTR= <none>
##$CNST= (0..31)
1 1 145 1 1 1 1 1 1 1 1 1 1 1 1 1 1 1 1 1 1 1 1 1 1 1 1 1 1 1 1 1 
##$CPDPRG= <>
##$CPDPRG1= <>
##$CPDPRG2= <>
##$CPDPRG3= <>
##$CPDPRG4= <mlev>
##$CPDPRG5= <mlev>
##$CPDPRG6= <mlev>
##$CPDPRG7= <mlev>
##$CPDPRG8= <mlev>
##$CPDPRGB= <>
##$CPDPRGT= <>
##$D= (0..31)
0 1.2 0 0 0 0 0 0 0 0.06 0 0.03 0 0 0 0 0.0002 0 0 0 0 0 0 0 0 0 0 0 0 
0 0 0 
##$DATE= 1576576093
##$DBL= (0..7)
120 120 120 120 120 120 120 120 
##$DBP= (0..7)
150 150 150 150 150 150 150 150 
##$DBP07= 0
##$DBPNAM0= <>
##$DBPNAM1= <>
##$DBPNAM2= <>
##$DBPNAM3= <>
##$DBPNAM4= <>
##$DBPNAM5= <>
##$DBPNAM6= <>
##$DBPNAM7= <>
##$DBPOAL= (0..7)
0.5 0.5 0.5 0.5 0.5 0.5 0.5 0.5 
##$DBPOFFS= (0..7)
0 0 0 0 0 0 0 0 
##$DE= 6
##$DECBNUC= <off>
##$DECIM= 24
##$DECNUC= <off>
##$DECSTAT= 4
##$DIGMOD= 1
##$DIGTYP= 9
##$DL= (0..7)
0 120 120 120 120 120 120 120 
##$DP= (0..7)
150 150 150 150 150 150 150 150 
##$DP07= 0
##$DPNAME0= <>
##$DPNAME1= <>
##$DPNAME2= <>
##$DPNAME3= <>
##$DPNAME4= <>
##$DPNAME5= <>
##$DPNAME6= <>
##$DPNAME7= <>
##$DPOAL= (0..7)
0.5 0.5 0.5 0.5 0.5 0.5 0.5 0.5 
##$DPOFFS= (0..7)
0 0 0 0 0 0 0 0 
##$DQDMODE= 0
##$DR= 18
##$DS= 0
##$DSLIST= <SSSSSSSSSSSSSSS>
$$ [...]
##$SUBNAM2= <"">
##$SUBNAM3= <"">
##$SUBNAM4= <"">
##$SUBNAM5= <"">
##$SUBNAM6= <"">
##$SUBNAM7= <"">
##$SUBNAM8= <"">
##$SUBNAM9= <"">
##$SW= 24.9337058887773
##$SWIBOX= (0..15)
0 0 2 0 0 0 0 0 0 0 0 0 0 0 0 0 
##$SW_h= 4990.01996007984
##$TD= 16384
##$TD0= 1
##$TE= 0
##$TE2= 300
##$TE3= 300
##$TEG= 300
##$TL= (0..7)
0 120 120 120 120 120 120 120 
##$TP= (0..7)
150 150 150 150 150 150 150 150 
##$TP07= 0
##$TPNAME0= <>
##$TPNAME1= <>
##$TPNAME2= <>
##$TPNAME3= <>
##$TPNAME4= <>
##$TPNAME5= <>
##$TPNAME6= <>
##$TPNAME7= <>
##$TPOAL= (0..7)
0.5 0.5 0.5 0.5 0.5 0.5 0.5 0.5 
##$TPOFFS= (0..7)
0 0 0 0 0 0 0 0 
##$TUNHIN= 0
##$TUNHOUT= 0
##$TUNXOUT= 0
##$USERA1= <user>
##$USERA2= <user>
##$USERA3= <user>
##$USERA4= <user>
##$USERA5= <user>
##$V9= 5
##$VALIST= <valist>
##$VCLIST= <CCCCCCCCCCCCCCC>
##$VD= 0
##$VDLIST= <DDDDDDDDDDDDDDD>
##$VPLIST= <PPPPPPPPPPPPPPP>
##$VTLIST= <TTTTTTTTTTTTTTT>
##$WBST= 1024
##$WBSW= 4
##$XGAIN= (0..3)
0 0 0 0 
##$XL= 0
##$YL= 0
##$YMAX_a= 468117
##$YMIN_a= -236794
##$ZGOPTNS= <>
##$ZL1= 120
##$ZL2= 120
##$ZL3= 120
##$ZL4= 120
##$ABSF1= 10
##$ABSF2= 0
##$ABSG= 5
##$ABSL= 3
##$ALPHA= 0
##$AQORDER= 0
##$ASSFAC= 0
##$ASSFACI= 0
##$ASSFACX= 0
##$ASSWID= 0
##$AUNMP= <proc_1d>
##$AZFE= 0.1
##$AZFW= 0.1
##$BCFW= 1
##$BC_mod= 2
##$BYTORDP= 1
##$COROFFS= 0
##$CY= 11.3945322036743
##$DATMOD= 1
##$DC= 2
##$DFILT= <>
##$DTYPP= 0
##$F1P= 16.9975609425685
##$F2P= -3.02152046262296
##$FCOR= 0.5
##$FTSIZE= 0
##$FT_mod= 4
##$GAMMA= 1
##$GB= 0.15
##$INTBC= 1
##$INTSCL= 1
##$ISEN= 128
##$LB= 0.24
##$LEV0= 0
##$LPBIN= 0
##$MAXI= 10000
##$MC2= 0
##$MEAN= 0
##$ME_mod= 0
##$MI= 1.114404
##$NCOEF= 0
##$NC_proc= 0
##$NLEV= 6
##$NOISF1= 3.799351
##$NOISF2= 2.8
##$NSP= 1
##$NTH_PI= 0
##$NZP= 0
##$OFFSET= 15.70392
##$PC= 1
##$PHC0= -9797.495
##$PHC1= 29.40086
##$PH_mod= 1
##$PKNL= yes
##$PPARMOD= 0
##$PSCAL= 0
##$PSIGN= 0
##$REVERSE= no
##$SF= 200.130013532006
##$SI= 16384
##$SIGF1= 3
##$SIGF2= 2
##$SINO= 400
##$SIOLD= 16384
##$SREGLST= <1H.CDCl3>
##$SSB= 0
##$STSI= 0
##$STSR= 0
##$SW_p= 3612.71676300578
##$SYMM= 0
##$S_DEV= 0
##$TDeff= 0
##$TDoff= 0
##$TI= <>
##$TILT= no
##$TM1= 0
##$TM2= 0
##$TOPLEV= 0
##$USERP1= <user>
##$USERP2= <user>
##$USERP3= <user>
##$USERP4= <user>
##$USERP5= <user>
##$WDW= 1
##$XDIM= 8192
##$YMAX_p= 0
##$YMIN_p= 0
$$ End of Bruker specific parameters
$$ ---------------------------------
##NTUPLES= NMR FID
##VAR_NAME=  TIME,          FID/REAL,        FID/IMAG
##SYMBOL=    X,             R,               I
##VAR_TYPE=  INDEPENDENT,   DEPENDENT,       DEPENDENT
##VAR_FORM=  AFFN,          ASDF,            ASDF
##VAR_DIM=   8192,          8192,            8192
##UNITS=     SECONDS,       ARBITRARY UNITS, ARBITRARY UNITS
##FACTOR=    0.0002004,     1,               1
##FIRST=     0,             0,               0
##LAST=      1.6414764,     0,               0
##MIN=       0,             -236794,         0
##MAX=       1.6414764,     468117,          0
$$ Real data points
##PAGE= N=1
##DATA TABLE= (X++(R..R)), XYDATA
$$ [...]
2353i9r41Q18J732p46k156J053K151p82k875N58K710N11k454j114J792J096j008
$$ -99 -1040 -222 1510 764 -1392 -339 1812 1030 -1845 -1287 1423 1934 -520 -1634 158 1254 246
2370B46j018R2L58Q87P08p88j967k46K564J040j919j870J366J959p49j675L8J326
$$ 246 -772 -680 -322 565 1273 485 -1482 -1728 836 1876 -43 -1913 -547 1412 663 -1012 -974 352
2388C52J1o87n6N90q44O64J40o7p96K13J403K1j725q00J665J416j080j078L70
$$ 352 363 -324 -380 210 -634 30 170 103 -693 -480 923 944 -781 -1581 84 1500 420 -658 -288
2407b88N62l45j84J09Jl88O83Q82p08r32n66J412O43q32m37L43K15oj02k53n48
$$ -288 274 -71 -255 -146 -145 -533 150 1032 324 -608 -1174 238 881 49 -388 -45 170 164 62 -191 -739
2428g39M39P69M66j316j030J291J508l11k161k24J975P93n97j882r6J507Q07p51
$$ -739 -300 469 935 -381 -1411 -120 1388 1077 -1084 -1308 667 1460 863 -1019 -1115 392 1199 448
2446D48j142p51J267J291o81k106J78K173Q47j647k003J195K118k52j828l64J095
$$ 448 -694 -1445 -178 1113 432 -1674 -1496 677 1524 -123 -2126 -931 1187 935 -893 -1257 -162
2463a62P81n32m45J9k93Q50K24m90n99rP74N10m77o79q0M55M11j80K5n40N7P10
$$ -162 619 87 -358 -339 -632 218 442 -48 -647 -656 118 628 151 -528 -608 -153 258 78 103 -437 -380 330
2485C30N36j195j097J156J529m52j758p7J294Q25j032j201P50R93K05n49q18m07
$$ 330 866 -329 -1426 -270 1259 807 -951 -1028 266 1091 59 -1142 -392 601 806 257 -561 -968
2503i68N15J166J04j724l48J437J072m90j859L29J574J51j242k43M91L17J24n90
$$ -968 -453 713 817 -907 -1255 182 1254 764 -1095 -766 808 959 -283 -526 -35 282 406 -184
2521a84j1k68K44R60l53j274m44J575R09j102j312P49Q39J96o80l75m85N26J001
$$ -184 -195 -463 -219 741 388 -886 -1330 245 1154 52 -1260 -511 328 524 -156 -531 -1016 -490 511
2540E11P23j490j365P04K607k58k390q06J987J086j541r90P34R72n52J76J20o14
$$ 511 1234 -256 -1621 -917 1690 1432 -958 -1764 223 1309 -232 -1222 -488 484 -68 108 228 -386
2558c86n06J091R55j393j048J237J413j195j630Q22J693O6j428m03Q73r2j73L38
$$ -386 -892 199 1154 -239 -1287 -50 1363 168 -1462 -640 1053 1119 -309 -712 161 69 -104 234
2576B34P4j251K86K065Q0k320j223J989J650j020k046P48J259l39o0J92n74j159
$$ 234 308 -943 -657 1408 1488 -832 -2055 -66 1584 564 -1482 -734 525 186 126 318 -256 -1415
2594a415R67K746r19l375rL628N79k555j845K341J465j272j554J178R02m66k35
$$ -1415 -448 2298 1379 -1996 -2005 1623 2202 -353 -2198 143 1608 336 -1218 -40 862 396 161
2611A61K12p82o92J751R42k251j844K569K901k246l837J007M323J5l197n26J527
$$ 161 373 -409 -1101 650 1592 -659 -2503 66 2967 721 -3116 -2109 2214 2229 -968 -1494 33
2628C3M74q32O39N11j690n88K481R60k218k033J938J892j505j228J048J166k280
$$ 33 507 -325 314 825 -865 -1453 1028 1988 -230 -2263 -325 1567 62 -1166 -118 1048 -1232
2645a232l62K941O13l377j057L492J549l234k227L130J994k544j836K122J975
$$ -1232 -1594 1347 1960 -1417 -2474 1018 2567 -667 -2894 236 2230 -314 -2150 -28 1947
2660A947k301j685J568J696r01m86L96r69o72K014K288k685m075K392N172o67
$$ 1947 -354 -2039 -471 1225 324 -162 234 -735 -1407 607 2895 210 -3865 -1473 3699 3032
2676C032n895r78N107J686k760k006J811P4j135J333J700j913k750K312L243k270
$$ 3032 -2863 -3841 1266 2952 192 -1814 -3 71 -1064 269 1969 56 -2694 -382 2861 591
2692E91k847J438K691j568k320K150K270k481k823K633L473k531k936J790K572
$$ 591 -2256 -818 1873 305 -2015 135 2405 -76 -2899 -266 3207 676 -2260 -470 2102
2707B102k077j687K161J823k987k200L705K435k948l115J868K369r05q48J224
$$ 2102 25 -1662 499 2322 -665 -2865 840 3275 327 -2788 -920 1449 544 -304 920
2722I20r26k618J498M807j026n687j160O090K661m714l132K903J758j113o28J329
$$ 920 -6 -2624 -1126 3681 2655 -3032 -4192 1898 4559 -155 -3287 -384 1374 261 -367 962
2738I62j157k180J472L706j657l687Q66M173j185m250J665M223j794m291J147
$$ 962 -195 -2375 -903 2803 1146 -2541 -1675 2498 1313 -2937 -1272 2951 1157 -3134 -1987
2753a987M793O9n063o18L872O53k018L1J312k077j068L209K075l647l467L254
$$ -1987 2806 2875 -2188 -2806 1066 1719 -299 -268 1044 -1033 -2101 1108 3183 -464 -3931 -677
2769f77M427k353l384R08K026p57p65K103N11m025j179N070K258m402l862L532
$$ -677 3750 1397 -1987 -1079 947 190 -575 1528 2039 -1986 -3165 1905 4163 -239 -4101 -569
2785e69L620k443k404J839J012j953k29L100n3l612p37L790R79l611m66L502m47
$$ -569 3051 608 -1796 43 1055 -898 -1127 1973 1920 -1692 -2429 1361 2340 -1271 -1737 1765 1318
2802A318l985N45M768J97n182j514M640K393k899k235J133P35o07J537J380l508
$$ 1318 -2667 -2122 2646 2843 -2339 -3853 787 3180 281 -1954 -821 -86 -693 844 2224 -1284
2818a284k465L193M430k231n101R17M558R3l605M17K113p32k019J862K393k528
$$ -1284 -3749 -556 3874 1643 -3458 -2541 2017 2110 -1495 -1078 1035 303 -1716 146 2539 11
2834A1l120K311L341j754k671J415K064j977j526K964J567l453k271L006K916
$$ 11 -3109 -798 2543 789 -1882 -467 1597 -380 -1906 1058 2625 -828 -3099 -93 2823
2849B823k726k561K047J969k466p38L587m4m009j281M452K244l792k849K368K458
$$ 2823 97 -2464 -417 1552 -914 -1652 1935 1891 -2118 -3399 1053 3297 -495 -3344 -976 1482
2865A482j048r13N84n67j261J380L105j806m161J033M663k28l971o77K988Q00
$$ 1482 434 -479 105 -462 -1723 -343 2762 956 -3205 -2172 2491 2263 -1708 -2385 603 1403
2881A403j996j93J930m34k386J033K558q93k612O07K148p78k038J342K508k193
$$ 1403 -593 -786 1144 710 -1676 -643 1915 1022 -1590 -983 1165 387 -1651 -309 2199 6
2897Fk657K086L321j311l361N04K453l06r71N92L54j806l19L102J005l722k410
$$ 6 -2651 -565 2756 1445 -1916 -1412 1041 735 -236 356 710 -1096 -1415 1687 2692 -1030 -3440
2914c440L487L060k186k526N28J821o53o85J222K04k012J9K261N05k479o57K342
$$ -3440 47 3107 921 -1605 -1077 744 91 -594 628 832 -1180 -1161 1100 1605 -874 -1531 811
2931H11Q34k190m17K078K30k514j28K195M18k282k64J931J94j911L74K142q23
$$ 811 1645 -545 -962 1116 1346 -1168 -1296 899 1317 -965 -1229 702 896 -1015 -641 1501 678
2948F78k422Q57K810l76l291l89K797J187k068n17L44M00j4O91J41j719r45K243
$$ 678 -1744 -887 1923 1547 -1744 -2133 664 1851 -217 -734 -390 10 -4 687 828 -891 -1836 407
2966D07J448k011k061J682K119p07k114M43J834o98j235P89O92p38n34J093N92
$$ 407 1855 -156 -2217 -535 1584 877 -1237 -794 1040 342 -893 -104 588 -150 -684 409 1001
2983A001j217m30J006N06j535l94J468J142k061j151J629J443q62j381R08L14
$$ 1001 -216 -646 360 866 -669 -1063 405 1547 -514 -1665 -36 1407 545 -836 72 386
2999C86r72K09J042J90j737L90J127P06j579o34P68R53m24n73L72o54l70J263
$$ 386 -586 -377 665 855 -882 -492 635 1341 -238 -872 -104 849 425 -148 224 -430 -800 463
3017D63P95j322j530J344J660p11j939J43J905M05j729k30J022K76q06j87Q3j04
$$ 463 1258 -64 -1594 -250 1410 699 -1240 -1097 808 1213 -516 -746 276 552 -254 -441 -358 -462
3035d62M75M90m97q34J72J714M0j933q19J710J793j664j517L14J796p7j195q1
$$ -462 13 503 6 -828 -656 1058 1098 -835 -1654 56 1849 185 -1332 -1018 778 701 -494 -575
3053e75P02J35q0j09J84p8k13k4M07l32k26Q4L5J55o6L06m42n09L86J374o53j310
$$ -575 127 262 182 73 257 179 -34 -58 349 17 -209 -125 -90 65 -1 305 -137 -646 -260 1114 461 -849
3075h49L06J366J61j615k79J138P44o66j202M44J007j09o10k3kP2O57k46r81l22
$$ -849 -543 823 984 -631 -910 228 972 306 -896 -452 555 446 -164 -187 -189 -117 540 294 -687 -1009
3095a009J524M64q55j214M76J594j31j339m20J104L50l21o70J49R2P04l6m87k69
$$ -1009 515 979 124 -1090 -614 980 849 -490 -910 194 544 223 -447 -298 -206 498 462 -25 -294
3114b94j46P00K51o21m67N43M62n20j32L14K32l01k61K33O07r43M46L03k86l09
$$ -294 -440 260 511 -110 -577 -34 428 -92 -224 90 322 21 -240 -7 600 -343 103 406 120 -189
3134a89j37O49K11o20l55M23M19k84k22N11j95l12o1O49m7q35N2P88pn46o04O47
$$ -189 -326 323 534 -86 -441 -18 401 117 -105 406 211 -101 -162 487 440 -395 -343 445 438 -108 -712 -65
3156f5P34l68n66o6J06N69K4k77q36O83N47K4p93l76Q14O66m05j052N1J053p0
$$ -65 669 301 -265 -331 -225 344 368 91 -745 -62 485 509 -284 -660 154 820 415 -637 -586 467 397
3177C97n23MJ12M07K1l37K37o23J24O19k20p38k3N41R32q68q65J037O21p99k11
$$ 397 -126 -122 -10 397 418 81 318 -305 -181 438 218 -520 -543 -2 930 62 -803 234 855 56 -155
3198a55J26J56K86k78J65l44j75J50N86m61n63L55O81j7o75q0M24R9l90pO3L31
$$ -155 -29 127 413 135 300 -44 -219 -69 517 56 -507 -152 529 512 -163 -243 181 280 -110 -117 -54 277
3220B77p98N59O03l47p94K06P67j50q03M43M24n09l21M64M72p73o23R80O20q14
$$ 277 -521 38 641 294 -500 -294 473 323 -480 -37 387 -122 -443 21 493 -280 -903 77 697 -117
3240a17j092J188J202r78r44N78R99o54o37P8M69K41o09J38K93k27M14K56n51
$$ -117 -1209 -21 1181 203 -741 -163 836 182 -455 -377 92 333 -276 -138 155 -72 342 598 47
3259D7p01K57J153J51j443k36J139O45j205j46N94J39o88P9N83or44K01J304m33
$$ 47 -654 -397 756 907 -536 -772 367 1012 -193 -339 255 394 -294 -215 368 362 -582 -381 923 490
3279D90r93k18J331j17j259P06P83k48j261J80J618l19j683M00J172o40l72K21
$$ 490 -503 -721 610 493 -766 -60 723 475 -786 -606 1012 693 -990 -590 582 -58 -430 -209
3297b09Q84p43n93N19J222p31j417O77R44l13q25P17J36p23l48J385O96j878m30
$$ -209 675 -68 -661 -142 1080 349 -1068 -391 553 240 -585 132 268 -455 -803 582 1278 -600 -1030
3316a030J226Q91q08j679J256J249n67j065O38K56q39j33Q41N15j214l40J523
$$ -1030 196 1087 279 -1400 -144 1105 538 -527 111 367 -472 -605 236 751 -463 -803 720
3333G20m06q25K05J500r6k064J17K200J76k682l35K055R93j496j312J636M7q16
$$ 720 314 -511 -306 1194 1098 -966 -849 1351 1527 -1155 -1490 565 1558 62 -1250 386 433 -383
3351c83M89R34q89j365O53J498m40j080K48Q83o39n02J041L90j369j423K377J354
$$ -383 106 1040 151 -1214 -561 937 497 -583 -335 548 -91 -593 448 838 -531 -1954 423 1777
3369A777j230k317J086J872o07j645P58J119j034p27J115Q49j532q71J531P65
$$ 1777 547 -1770 -684 1188 581 -1064 -306 813 -221 -948 167 1016 -516 -1387 144 909
3385I09q72r08J402K08j532k91K279M16k757r97K868J410k224j707J827J117j049
$$ 909 37 -871 531 739 -793 -1084 1195 1611 -1146 -2143 725 2135 -89 -1796 31 1148 99
3402I9q63J097m16p12M60J441l20j938J31J790j52j462P11J160o72j753R74K395
$$ 99 -764 333 -83 -795 -335 1106 786 -1152 -1021 769 617 -845 -134 1026 354 -1399 -425 1970
3420A970j041k976Q16K589K06k499R2J192K93j127R53N87j418j125J464J968j894
$$ 1970 929 -2047 -1231 1358 1564 -935 -843 349 642 -485 468 1055 -363 -1488 -24 1944 50
3437E0j741J496J353j218r51J617P12j929j360J971K181k033k400J154K429m63
$$ 50 -1691 -195 1158 -60 -1011 606 1318 -611 -1971 0 2181 148 -2252 -1098 1331 868
3453H68j712J77Q64p74J79J531n53j738n33K808K11k170l18J716N23k071K99K367
$$ 868 -844 -667 197 -577 -398 1133 580 -1158 -1691 1117 1328 -842 -1160 556 1079 -992 -693 1674
3471A674m56k514q8K781M29k361q63J324J250j353k32J137p52j243R71K059j156
$$ 1674 1218 -1296 -1384 1397 1826 -535 -1398 -74 1176 -177 -409 728 -24 -1267 -296 1763 607
3488F07j755M86J964m83j612R69P31q92j280J529J515j578j802J280J901q25j910
$$ 607 -1148 -662 1302 819 -793 176 907 15 -1265 264 1779 201 -1601 -321 1580 755 -1155
3505a155N79J238j116M6Q92O29j547j009K012J015j777j118J047J317j041p64
$$ -1155 -576 662 -454 -408 484 1113 -434 -1443 569 1584 -193 -1311 -264 1053 12 -752
3521g52J327J43j645k12K210K91k031p64K259L98j236p54J086M46j681M10J562
$$ -752 575 718 -927 -1139 1071 1362 -669 -1433 826 1224 -12 -766 320 766 -915 -505 1057
3538A057J38k122l75K099P86j606j048J203M55q61J13J233r84j584J200J972q73
$$ 1057 1195 -927 -1302 797 1583 -23 -1071 132 587 -274 -161 1072 88 -1496 -296 1676 803
3555H03j866O20J293n36r61N00P15q02j016J258J572j220j551N99J467o57r90
$$ 803 -1063 -443 850 314 -647 -147 568 -234 -1250 8 1580 360 -1191 -592 875 218 -772
3572g72Q55O11r09n64J193N23j732q74J610J710j660j255J034R25o77o69R52L85
$$ -772 83 694 -215 -779 414 937 -795 -1669 -59 1651 -9 -1264 -230 695 18 -651 301 686
3590F86j498o2J011P37j128r30J388O67j091j27Q45m06r12N74J219j08j593m82
$$ 686 -812 -874 137 874 -254 -1184 204 871 -220 -347 498 92 -820 -246 973 865 -728 -1210
3608a210J987k4j062m17P86K42o14k8Q19l09j088O37J273n67j133K1J162k57r38
$$ -1210 777 753 -309 -726 60 302 -312 -340 479 170 -918 -281 992 425 -708 -687 475 218 -720
3627g20P97P94j107j077J204J198p61j817J142J256k60j332K12O47k60m81P42
$$ -720 77 871 -236 -1313 -109 1089 328 -1489 -347 909 649 -683 -471 176 -84 -565 177
3644A77P70j054o21O36J072p36o03L22J05l00k72J025j09j367J11J576K76j647
$$ 177 947 -107 -728 -92 980 244 -359 -37 68 -232 -504 521 412 -955 -844 732 1008 -639
3662f39l78J060O59q48m17Q93K10r68O8P01J80r87k62Q30K94p54m1Q95k70q67
$$ -639 -1017 43 702 -146 -563 330 540 -428 -360 341 521 -466 -728 102 396 -358 -399 496 226 -641
3682f41N91J007q09j142K44J259k00p04l26P57K98l93k29N58o7o39N3Q32j70o74
$$ -641 -50 957 148 -994 -750 509 309 -395 -721 36 334 -59 -288 270 203 -436 -383 449 279 -395
3702c95N59L43o07m07P50N87r78k50L62M85p04m15N35O70n03p68L05Q04m43j29
$$ -395 164 507 -100 -507 243 830 -148 -398 -36 449 -255 -670 -135 535 32 -736 -431 373 -70 -199
3722a99J55L20k91j65N42k80j5j45O20k79p09j02J044M9j275R7J124J27o33p78
$$ -199 -44 276 -15 -180 362 82 67 -78 542 263 -446 -548 496 545 -730 -633 491 618 -15 -793
3742g93O32O60j18q86J17P06o6l73J42k87J54K70Rl83K61M21j99m79o15P99P70
$$ -793 -161 499 381 -505 -388 318 252 -121 21 -266 -112 158 167 -216 45 466 267 -212 -827 -28 742
3763G42n13j098L56R74J53r94l26P02L70l3m57n6j53M61j51O4l13J01M64j31l83
$$ 742 229 -869 -513 461 614 -380 -706 -4 366 333 -124 -180 -333 128 -23 41 -272 -171 293 162 -221
3784b21k82R33N6p15m35N00Q26k96q85L92O27J17q60r5N15J62l25j74j77M1O27
$$ -221 -503 430 486 -229 -664 -164 662 366 -519 -127 500 617 -243 -338 177 339 14 -160 -337 -296 331
3805C31J47r13j14L05O54l27m77K00L04J16m96k69M92M72n36l96N08J23l02O0
$$ 331 478 -435 -549 -244 410 83 -394 -194 110 226 -270 -539 -47 425 -111 -507 1 124 -178 -118
3825a18L71r2J38k68J06n00j23P28L83n48m72K69M13L0r58L94O98K7n33k58L86
$$ -118 253 161 299 31 137 -363 -486 242 625 77 -395 -126 287 317 -641 -247 451 478 -55 -313 73
3846G3o0l92j16K50P0J87J1N0j20%L69j92n32K91K25k5m20P4K14N31k98n74N88
$$ 73 13 -379 -495 -245 -175 12 23 73 -47 -47 322 130 -402 -111 114 89 -331 -257 -43 488 190 -384 204
3869B04L11o45p3K68J16m69M06j56j73q1N6N44L59r12k79M74K45l57j03N05j48
$$ 204 515 -130 -203 65 181 -288 118 -38 -211 -292 -236 308 667 -245 -524 -50 195 -162 -265 240 92
3890I2j46o5K48K29m97J92q0O3k41j9L75l42J05K8K54Mn58L40K06j88q1k17L05
$$ 92 -54 -119 129 358 -139 53 -27 36 -205 -224 151 -191 -86 -58 196 200 -358 -18 188 0 -81 -298 7
3913Gj59j23L25K81m81mK24J30k81l18M17J75l39l48O41L62q67l22R85L43o82
$$ 7 -152 -275 50 331 -150 -154 70 200 -81 -399 18 193 -146 -494 147 509 -358 -680 305 648 -34
3934c4l59N27R8l12l86Q00k66k11k57L35M24l48k57K17L06p21N41O3k05n41L58
$$ -34 -393 134 232 -80 -466 334 68 -143 -400 -65 359 11 -246 -29 277 -444 97 160 -45 -586 -228
3955b28Q44m85p10N29N48J12r18N6N28m67k20L01O17m13k38J8M83j80p00N45L54
$$ -228 616 131 -579 -50 498 610 -308 -252 276 -191 -411 -110 507 94 -144 -126 357 177 -523 22 376
3976C76j65j73r8P31q48m74P29M98q31l02L78O90k83m79L28J62l39m82N99J94
$$ 376 211 38 -60 671 -177 -651 78 576 -255 -557 -179 511 228 -251 77 239 -100 -582 17 211
3996B11l79n33N43O34o02k28L27Q8m39O0Q02n85l48L6R29j42o66j47Q07n4p29
$$ 211 -168 -701 -158 476 -126 -354 -27 61 -378 -318 484 -101 -449 -413 516 374 -292 -439 368 314 -415
4017d15K94O40m38p65N27Q37j23o31l73O99k84m06O35L91q57m92Q56P12m76r83
$$ -415 -121 519 81 -684 -157 680 557 -74 -447 252 -32 -438 197 588 -269 -761 95 807 331 -652
4037f52N20N75O0r59L67M40m96J72n7M72o38m42P88L77o61n1M27k25l42r5J229
$$ -652 -132 443 503 -456 -89 351 -145 27 -30 442 -196 -638 150 527 -134 -185 242 17 -325 -420 809
4058H09m90j134k02J627N06j612o42J104Q94r88n19R43k13m81M93M73l33q95M68
$$ 809 319 -815 -1017 610 1116 -496 -1138 -34 860 -128 -647 296 83 -398 95 568 235 -660 -192
4077a92N33k46p52LJ236n41q95P64J087m77j585M56J421J15j498J07P25J48n72
$$ -192 341 95 -657 -654 582 41 -854 -90 997 520 -1065 -609 812 927 -571 -464 261 409 -163
4096a63M16P2o34l18J118N70r85p02O62M92p18k94P67M59j083m26R85Q64j141
$$ -163 253 325 -309 -627 491 1061 76 -626 36 528 -190 -484 283 742 -341 -767 218 1082 -59
4115e9j051J059R18m62j000O34L36p30n3Q99k50p12k16J131L85j242k80R81J70
$$ -59 -1110 -51 867 405 -595 39 375 -355 -408 491 241 -471 -687 444 829 -413 -693 288 458
4134D58q63j06O51Q9q46k29J271J56j190j95P82N84q85j11O36m05n19P21N67p7
$$ 458 -405 -511 140 229 -617 -846 425 581 -609 -804 -22 562 -323 -434 202 -203 -722 -1 566 489
4154D89j309N20R41k53j169N91P43k01j080O97Q30q74r32J009R38n35j122J22
$$ 489 -820 -300 641 388 -781 -190 553 352 -728 -31 799 -75 -1007 2 940 405 -717 -595
4172e95R41j59m05N81o5p13l8R58O47j044j125J021O81o43n58N24R8o59K06Q54
$$ -595 346 187 -218 363 298 -415 -453 505 1152 108 -1017 4 685 42 -516 8 106 -553 -347 507
4192E07J99j034l13Q56O78q02p75J000J26o88N2Q74j19r98j19R20L17j013k79
$$ 507 706 -328 -641 215 893 91 -684 316 442 -246 -194 680 561 -437 -556 364 681 -332 -611
4211f11R12Po52J47R03n54r02R29P86n14j348M33J291k76j123K93Q87j42r06K82
$$ -611 301 308 -344 -197 706 152 -750 179 965 451 -897 -464 827 551 -572 -279 608 466 -440 -158
4231a58P97l34j018N25Q32m98p34M43L54k48j54M74L65j020m04J003O20p71r27
$$ -158 639 305 -713 -188 644 146 -588 -145 209 -39 -193 281 646 -374 -778 225 845 74 -853
4250h53R27O26n44l11O0O31o59k19P31J69q15k13O96L89p07m98J135l40o38K60
$$ -853 74 700 156 -155 -95 536 -123 -342 389 558 -257 -470 226 615 -92 -590 545 205 -433 -173
4270a73Q74l54j001OJ175L33j041l57P56K78o76K69L73m90o12N93O09j49n73k23
$$ -173 701 347 -654 -648 527 860 -181 -538 218 496 -180 89 462 -28 -640 -47 562 413 -160 -383
4290c83O20j64k53j5N12m70l23N70O32n48j169P03Q50m84n79K83N67k95n64N92
$$ -383 237 73 -180 -195 317 -153 -476 94 726 178 -991 -288 562 78 -501 -218 349 54 -510 82
4310H2N04o08l43L02M94n63k69L22L18m22R9N53l46o46k13R13O45j091n95J266
$$ 82 586 -22 -365 -63 431 -132 -401 -79 239 -183 -84 469 123 -523 -736 177 822 -269 -864 402
4330D02K64n82n63N06M00n52k37L48M39n91K98l1L5j32r8J30m4k31N06K27l54
$$ 402 666 84 -479 27 427 -125 -362 -14 425 -166 132 101 136 4 -94 36 -8 -239 267 494 140
4351A40o45L80P44m64m45j73J135m94l01j32K91Q8k02k12N65k4n26QK72o7J17
$$ 140 -505 -125 619 155 -290 -463 672 178 -123 -255 36 124 -78 -290 275 251 -275 -267 5 -62 55
4372E5J83N9l49j15M30R9o08k97N69N41k12o34P9L11K12m63J1J51M6j17M4j56
$$ 55 238 297 -52 -167 263 362 -246 -543 26 567 355 -279 -200 111 323 -140 -129 22 68 -49 -5 -161
4394a61L72k61P1N1m52M97R8J6p24K75N47L46j145m7M95K72j33m40L38L90n20
$$ -161 211 -50 21 72 -380 117 215 231 -493 -218 329 675 -470 -517 -22 250 117 -323 15 405 -115
4415a15J02L9K86k84k18M32k83k96K71L63l71j75M58K63j87m41j76O49o3n03l22
$$ -115 -13 26 312 28 -190 242 -41 -337 -66 297 -74 -249 209 472 285 -156 -332 317 254 -249 -571
4436e71M46M36k67k94Q5M41j44m2j97k33K33L52ol87r9P02o9n45p7M05K92o81
$$ -571 -125 311 44 -250 -165 276 132 90 -107 -340 -107 245 239 -148 -247 455 386 -159 -236 169 461 -220
4458b20j73M02J81k77k02l0M65J05q4l82M7K46K55n8m50J02J23K37l37k50Q4O16
$$ -220 -393 9 190 -87 -289 -319 146 251 167 -215 -168 78 333 275 -175 -73 50 287 -50 -300 -216 400
4480D00j85l85k4J25K9j17l47K22O54l05k2j69R0L28ok65J97m02M07Jm31K10p1
$$ 400 215 -170 -194 -69 -40 -157 -504 -282 372 67 45 -124 -34 294 288 23 220 -182 225 226 -205 5 -66
4503f6J04L8l05P1K07O5l28o3L24oj40M0K68j07q1KP2K2k55K56n1R4l04L1L45
$$ -66 38 76 -229 -158 49 114 -214 -277 47 41 -99 -59 209 102 21 23 95 117 -138 118 67 161 -143 -112 233
4528B33k80j50M91k17J48o23M49J26k8k38K40k91K85NJ29l15J7r4K93k99J06K86
$$ 233 -47 -197 294 77 225 -398 51 177 149 -89 151 -140 145 150 279 -36 -19 -113 180 -119 -13 273
4550B73k59j01k33M36K6k39j30J25M91k80l73J29K08l4p2k21L67o0l01N1M29k48
$$ 273 14 -87 -320 116 142 -97 -227 -102 389 109 -264 -135 73 39 -33 -254 113 53 -248 -197 232 -16
4572a6m3R6R7j86K06p4k48J20j13K44m4k62N7K05J77m08k8L95K53l86n0j58M24
$$ -16 -59 37 134 -52 154 80 -168 -48 -161 83 39 -223 -166 39 216 -192 -220 175 428 42 -8 -166 258
4595B58Pk15Lj1K40k47k3oR7r7K13j90k94K86J82j01l27MN37R5o42k23P98m13
$$ 258 265 50 53 42 282 35 12 6 103 6 219 29 -265 21 203 102 -225 -221 316 411 -231 -454 344 -69
4619f9k3P2Ok2j05o9K22J69m74N7j37K82L1J56K80m75k00O55k66m7l25J59M45
$$ -69 -92 -20 -14 -36 -141 -210 12 181 -293 -236 -373 -91 -60 96 376 -99 -299 356 90 43 -282 -123 322
4642C22n36n3M08J31l32k10N16j32j37k77K13L74l71j75J6L06k84J16K06L20m63
$$ 322 -214 -267 141 272 -60 -270 246 114 -23 -300 -87 287 -84 -259 -243 63 -221 -105 101 421 -42
4663d2k77K44M56l96M4O8Qj30j48N13l33k00Q9K93K33n68j8L32M30l36m60LJ55
$$ -42 -319 -75 381 -15 29 97 105 -25 -173 340 7 -193 -104 189 422 -146 -164 168 598 262 -198 -195 -40
4686d0q1N2P3J1k86L09J87r4m99K95M65n10j37K47L79l45m20L55M24j63n79J54
$$ -40 -121 -69 4 15 -271 38 225 131 -368 -73 392 -118 -255 -8 371 26 -394 -39 385 222 -357 -203
4708b03M94m08R6j39K46m10j56M53L50l62l36L74N1N2n61P59J11q61M12L77L03
$$ -203 291 -117 -21 -160 86 -324 -480 -27 323 -39 -375 -1 50 102 -459 300 411 -450 -38 339 642
4729F42p15l06L24N51k36o63K13J65K28l22N49l16l00Q4M62j56p47N24M63k66
$$ 642 -73 -379 -55 496 260 -403 -190 -25 203 -119 430 114 -186 -102 360 204 -543 -19 444 178
4749A78m45K75J71j73n69K00P39j58n58j05M62J59l3m00L66j47k91O52J60m35
$$ 178 -267 8 179 6 -563 -363 376 218 -340 -445 17 176 143 -257 109 -38 -329 323 483 48
4769D8m73L42P05n00m62M09M92o54k32M45K46m06m02L99M51l58k73K18K06m01
$$ 48 -425 -83 622 122 -340 69 561 -93 -325 120 366 -40 -442 -43 408 50 -223 -5 201 -200
4789b00m9N27J15j148K26J083k03o47m95P92K30j58k91P24l26l57K77K03k0m73
$$ -200 -249 278 393 -755 -529 554 351 -296 -791 1 231 73 -218 506 180 -177 100 303 283 -190
4809a90j27N38J73k82k41M56j49l39L42N69o09m65l03J174n48n26J0O71J43l60
$$ -190 -317 221 394 112 -129 327 178 -161 181 750 141 -324 -627 547 -1 -527 -517 154 297 -63
4829f3J35P8m17j26O56Q0l62n38N99J87K9l48O21j25l84p14J131J58p22o71P13
$$ -63 72 150 -267 -393 263 343 -19 -557 42 229 258 -90 531 406 22 -692 439 597 -125 -796 -83
4850h3R01n96n32J25K75l67J27M77K18n81l35O56J4m87k46N75K44m39m17P11q3
$$ -83 818 222 -310 -185 90 -277 -150 327 545 -36 -371 285 299 -188 -434 141 385 -54 -471 240 157
4871A57m78j57Q18j7l90k90O41L2n20J60N16l74l49j42O66j29n86L27N92j01o07
$$ 157 -321 -478 340 323 -67 -357 284 316 -204 -44 472 98 -251 -393 273 144 -442 -115 477 376 -231
4892b31K2M08J41p29M32K16j57n07M85K95j49p31J16O27m5m32N91j68o63J60N01
$$ -231 -209 199 340 -389 43 259 102 -405 80 375 226 -505 -389 238 193 -239 352 184 -479 -319 182
4913A82M59q59j8J57J03L4o23N08M34n48k5L37K9l61p7M04K0O9k13n6K49m08J81
$$ 182 641 -218 -236 -79 24 58 -565 -57 377 -171 -196 141 170 -191 -268 136 156 225 12 -44 205 -203 -22
4936b2N48k88o12J54M63k53k38j22N18L9j68m23L83j56P6j18N39q4o70N77Q7J24
$$ -22 526 238 -374 -220 243 -10 -248 -370 148 187 19 -404 -21 -177 -101 -219 320 236 -434 143 230 354
4958C54k20k52L96l44J3LL70m73j54J63M03j19m98J71J63q2m50N81J18l05l47
$$ 354 134 -118 278 -66 -53 -50 320 -153 -307 -144 259 140 -358 -187 -24 -106 -556 25 143 -162 -509
4979e09M36j40J89k95K22K57j77J2K49l11l30M23L25qp19O8K82K76kl57J80N7
$$ -509 -73 -213 -24 -319 -97 160 -17 -5 244 -67 -397 26 351 343 -376 -308 -26 250 248 -109 71 128
5001A28j72r8K33m55M52J3q7R6k15J01L21P9m05L7M63m67j62j77R03l72o11J48
$$ 128 -44 -142 91 -364 88 101 14 110 -105 -4 317 396 -9 28 491 24 -138 -315 588 216 -395 -247
5023b47J68J74j20k69M77j45r0r2J80J4j60K14j85m2o1O3J77n23M14K79L77r53
$$ -247 -79 95 -25 -294 183 38 -52 -144 36 50 -110 104 -81 -123 -184 -121 56 -467 -53 226 603 -350
5045c50o8N71L03k77o49P5O94j60k19k22L61L30l61j26o5J92J63k40K8j16J96
$$ -350 -418 153 456 179 -470 -395 299 139 -80 -302 59 389 28 -98 -163 29 192 -48 -20 -136 60
5066F0L54m66m4o4M83jl90k08J78L88L3r45L68N18j44k4l63M30k99J13L07m55
$$ 60 414 -52 -96 -160 323 322 -68 -276 -98 290 323 -622 -254 264 120 96 -267 163 -136 -23 284 -171
5088a71j48L85J49j39M6K1j13m6J84k40K09l35q3K98L73j81j13k21j50L50J69
$$ -171 -319 66 215 76 122 143 30 -16 168 -72 137 -198 -281 17 390 209 96 -125 -275 75 244
5109B44l43L4J32j65K29k64j17L15J68l7l14k46L59M42o46N9J61ML79l43j11J06
$$ 244 -99 -65 67 -98 131 -133 -250 65 233 196 -118 -364 -5 437 -209 -150 11 15 394 51 -60 46
5131D6K66J3l43j21R9R3J97l08M7K91j30J54m99Q0K34oj20K89k05J70n65L27L01
$$ 46 312 325 -18 -139 -40 53 250 -58 -11 280 150 304 -195 -115 119 113 -7 282 77 247 -318 9 310
5154C10j10k91n2K85J73l87J47k16L55k72J0J13J18n24M23J13q1j12J14l35L20
$$ 310 200 -91 -143 142 315 -72 75 -141 214 -58 -48 65 183 -341 82 195 114 2 116 -219 101
5175A01m48O71j66j99NQ1K70k05k83M75m13L62l53J74l5K2L0K62j36j26j33J74
$$ 101 -347 324 158 -41 -36 45 315 110 -173 302 -111 251 -102 72 37 59 89 351 215 89 -44 130
5197A30m5m7j26l1L61o6J91l13j73P2n7j37L36p6k21K48K46m93K56l11N13jk15
$$ 130 85 38 -88 -119 242 176 367 54 -119 -47 -104 -241 95 19 -202 46 292 -201 55 -256 257 256 41
5220D1o8j93J71j39M53k48j13L55j85j35K8j28M79l54r5M12j26J19k05N6k79M30
$$ 41 -27 -220 -49 -188 265 17 -96 259 74 -61 -33 -161 318 -36 -131 281 155 274 69 125 -154 276
5242B76l06K07r5k68L76J59j49k65Q3OL88o22q2K64J21J2r9J89j76P8k27N95p32
$$ 276 -30 177 82 -186 190 349 200 -65 18 24 412 -210 -292 -28 93 105 6 195 19 97 -130 465 -267
5265b67J85k03M59j50n17K34L77Pk66Q5J33O8M2l01N13n66M11j90J10Q5m07J67
$$ -267 -82 -285 174 24 -493 -259 118 125 -141 -56 77 145 187 -114 399 -167 244 54 164 249 -158 9
5287Ij11L11j99j38M99n89J17o0K33K79o97O51l65J5j8K56O5j82j47N9K39k3l04
$$ 9 -102 209 10 -128 371 -218 -101 -161 72 351 -346 305 -60 -45 -63 193 258 76 -71 -12 227 204 -100
5310a00K18l0l51L62l18M65j45k58L50J5l75M27j24l5J28m05J60K05k86K72m74
$$ -100 118 88 -263 99 -219 246 101 -157 193 208 -167 260 136 101 229 -176 -16 189 -97 175 -299
5331b99L57N9j09m4J89m93N43k19K5l24P3L61J14j93n63L53K33k26k93L58K47
$$ -299 58 117 8 -36 153 -340 203 -16 9 -315 -242 119 233 40 -523 -170 63 -163 -456 -98 149
5352A49L23k34l46j19j06L80P2J06m02J61J79k78l17K52L56j8n23L30O4Q7j78
$$ 149 472 238 -108 -227 -333 47 119 225 -177 -16 163 -115 -432 -180 176 158 -365 -35 29 116 -62
5373f2q1J21J21k11K42J45l23J56N6J13o0rk07O26p38J47J02k19k04J13J37pJ51
$$ -62 -143 -22 99 -112 130 275 -48 108 164 277 217 208 1 627 -111 36 138 -81 -285 -172 -35 -42 109
5396A09m80L79L7M4l23o9K00K28l62j02L07O5k37L73j31k86L52j83K50l92J72
$$ 109 -371 8 45 89 -234 -303 -103 125 -237 -339 -32 33 -204 169 38 -248 104 -79 171 -221 -49
5417d9L28O4l65k35L54J80l88j00J37L33Q5l40p2j35OK44K35m45n9P6M36q8p76
$$ -49 279 343 -22 -257 97 277 -111 -211 -74 259 344 4 -68 -203 -197 47 282 -163 -222 -146 290 202 -574
5440e74O54L62k19m63l38L87J89l82M18N36o36k94L66M6p5r8K03r7l8K44j27j3
$$ -574 80 442 223 -240 -578 -191 -2 -384 34 570 -66 -360 6 52 -23 -121 82 -15 -53 191 64 51
5462E1k14Q8K92j05k84K38l50L54l90l9N58k7j03q1K6K24j33j63P1o4l4K9R8k92
$$ 51 -163 -75 217 112 -172 66 -284 70 -320 -359 199 172 69 -12 14 238 105 -58 13 -51 -85 -56 42 -250
5486b50Q5J88L81k98k24L3M39j23j89l12L19m43M4K01K52J58n54K46J07m3OjK04
$$ -250 -165 23 404 106 -118 -85 354 231 42 -270 49 -394 -350 -149 103 261 -293 -47 60 17 23 22 226
5509B26j14L2m77N32r7k15qJ60m1o2m25L48j40M1J49k9M8k55N97j76j62k18K05
$$ 226 112 144 -333 199 102 -113 -121 39 -2 -64 -489 -141 -281 -240 -91 -120 -72 -327 270 94 -68 -286 -81
5532h1L85l54j00J47K35j53l13K22l54K71R0R3L09m50J03k9k8j37P9o4L9o8L86
$$ -81 304 -50 -150 -3 232 79 -234 -12 -366 -95 -5 88 397 -53 50 21 -7 -144 -65 -129 -90 -158 228
5555B28N4k04n0J53L71k69k47J16J63l79j71J77q2L00k94k80L16R1k58K13J30
$$ 228 282 78 28 181 552 283 36 152 315 -64 -235 -58 -140 160 -134 -414 -98 -7 -265 -52 78
5576G8k34O0M36ln73o9K28K12l13N8K3J14o8K65k93K35l29k7J91J32l87Q1O79
$$ 78 -156 -96 340 337 -236 -305 -77 135 -178 -120 -97 17 -51 214 -79 156 -173 -200 -9 123 -264 -183 496
5599D96l44l71K44L8J61l75o1O22m06j25R5R3J53k03j33K86q6l57L42K99j95o42
$$ 496 152 -219 25 63 224 -151 -212 410 4 -121 -26 67 220 17 -116 170 84 -273 69 368 173 -469
5621d69L03K02L10m38Q0J85k28J45O0J31j04m00N90qn4o08K75M91k29j86M0j06
$$ -469 -166 36 346 -92 -12 173 -55 90 150 281 177 -223 367 359 305 -303 -28 463 234 48 88 -18
5643a8M5r5Q4J8K15l18Q2N1j13L03l66K52l44J02K87k86J27j43J28M2k83J60K2
$$ -18 27 -68 16 34 249 -69 13 64 -49 254 -112 140 -204 -102 185 -101 26 -117 11 53 -230 -70 -48
5666d8K70n55J00K38J27j21n2j61K94m44L62Rk5N7m3Q3k85L09j95K11m6k48L09
$$ -48 222 -333 -233 5 132 11 -41 -202 92 -352 10 19 -6 51 8 91 -194 115 -80 131 85 -163 146
5689A46l81M82p65K82K15Pn6m5J32L61l02k25k3J08J0J55j66J16l90M94J9m70
$$ 146 -235 247 -518 -236 -21 -14 -70 -115 17 378 76 -149 -172 -64 -54 101 -65 51 -339 155 174 -296
5711b96Q0L53K8j55k78M17J1j46r5J93j35j74O5N5R6j95K33j47M5Oj06K50j65
$$ -296 -216 137 165 10 -268 149 160 14 -81 112 -23 -197 -132 -77 19 -176 57 -90 -45 -39 -145 105 -60
5734f0j86p6L66L14k13j70J54Q2l52m5k7k1R3Mk14K25o6P8K12n0J03m44L38K87
$$ -60 -246 -322 44 358 145 -25 129 211 -141 -186 -213 -234 -141 -137 -351 -126 -192 -114 98 48 151 -293 45 332
5758C32m93L20j1m12J57j22N77j38o54N09m8O5K11n64L62J03L7k89l8Q4J49p8
$$ 332 -161 159 148 -264 -107 -229 348 210 -444 65 17 82 293 -271 91 194 231 -58 -96 -12 137 59
5780E9k6j08O1m9J55L3m00K09M27k11j82K57l05M83k28O2j24j44J89O4l21J66
$$ 59 33 -75 -14 -63 92 125 -275 -66 361 150 -32 225 -80 403 175 237 113 -31 158 222 -99 67
5802F7p5J73k51J52k87K63mj63J55N3N5%k64K03oJ36l90L11o2p7k65L42m4j95
$$ 67 -8 165 -86 66 -221 42 38 -125 30 83 138 138 -126 77 71 207 -183 128 66 -11 -276 66 22 -173
5826a73j47Q9J55R1M4L0j91M9K37j43O4k75J43K91O0l13j00K36K1j15j11k4j25
$$ -173 -320 -231 -76 15 59 89 -102 -53 184 41 105 -170 -27 264 324 11 -89 147 168 53 -58 -82 -207
5849b07J93O2j83M03j14m07R4J18p7K45o9O3l50r2M50k41J08K6j43j66K07p7J89
$$ -207 -14 48 -135 268 154 -253 -159 -41 -118 127 58 121 -229 -321 129 -112 -4 22 -121 -287 -80 -157 32
5872C2P1k01r9L55j47O3R9Pj07j74q0J41j38K34j24K3J49m1M3o8k98L01j4j19
$$ 32 103 -98 -197 158 11 74 173 180 73 -101 -181 -40 -178 56 -68 -45 104 63 106 38 -260 41 27 -92
5896i2j40N2L22o5j09k43L94J4k11m9K55J35q9n21N13m72j2R9L55m6L79o69N31
$$ -92 -232 -180 142 77 -32 -275 119 133 -78 -127 128 263 174 -347 166 -306 -318 -219 136 90 469 -200 331
5919C31j43k27Rj09L75k59Q0l60K39j7k5L48l45J8o9M33k97j37J52L2o3n3j5l7
$$ 331 188 -39 -30 -139 236 -23 57 -303 -64 -81 -106 242 -103 -85 -154 279 -18 -155 -3 29 -34 -87 -102 -139
5943a39L34k53jL6nq7J96J58l98j26M57k28J63j82L4N2N0l27K36j06K37N7j43
$$ -139 195 -58 -59 -23 -28 -115 81 239 -159 -285 172 -56 107 -75 -41 11 61 -266 -30 -136 101 158 15
5966A5J4l08M56M2j33L8j34m0J33k04K46O9q9L1L6k28J77k18l2L74l82m9K76M3
$$ 15 29 -279 177 219 86 124 -10 -50 83 -121 125 194 105 136 172 -56 121 -97 -129 245 -137 -186 90 133
5990A33k26k70J93K76k43K0P8p6J25K09k00r8l2mK62k1j72L9P1P9k33LJ26L10
$$ 133 -93 -363 -170 106 -137 -117 -39 -115 10 219 19 -79 -111 -115 147 126 -46 -7 64 143 -90 -87 39 349
6014C49l49p5K5K24P0J20k02j28l82L96J38o9k98j04N41k40j03J36N0k1P2k72
$$ 349 0 -75 -50 174 244 364 162 34 -348 48 186 117 -181 -285 256 16 -87 49 99 78 150 -122
6036a22K72K74n65j33K49n0r9J46l99N77N1n28L24j71m0L8K11k08M6J24J3L7l07
$$ -122 150 424 -141 -274 -25 -75 -174 -28 -427 150 201 -327 -3 -174 -214 -176 35 -173 -127 -3 10 47 -260
6059b60M69n4k13J44k95M83j5m06j32J48J35O1j62K41k86p4M36rj19M4%j12J7
$$ -260 209 155 -58 86 -209 274 259 -147 -279 -131 4 65 -97 144 -142 -216 220 211 92 136 136 24 41
6082D1j85L95j76p1l14M30k62J14l3K10j16r8l8L99k86q2RQ7q0J05mM3pk36N5
$$ 41 -144 251 75 4 -310 120 -142 -28 -61 149 33 -65 -103 296 10 -72 -63 24 -56 49 45 88 81 -155 -100
6107a00M05o6p6k82n2J82k21L84J0k21n8L75k12J58n52J30K73M9Q2l35K23J17
$$ -100 305 239 163 -119 -171 11 -210 174 184 -37 -95 280 68 226 -326 -196 77 126 208 -127 96 213
6129B13k65K5k0J89l15N14l02K33k99L99m39k87lL57j18J17n4j27K6J64R2J85
$$ 213 -52 -27 -47 142 -173 341 39 272 -27 372 -67 -354 -357 0 -118 -1 -55 -182 -156 8 100 285
6151B85l83J16j67K08J50l47J62R7j15k87L22k2J83k36J13P2k78j09K53q2r9K29
$$ 285 -98 18 -149 59 209 -138 24 121 6 -281 41 19 202 -34 79 151 -127 -236 17 -65 -164 65
6173F5qJ00o8k31K23K98m25m8J41K06j92k32M09k54j9J01O8R4n14J29K35k0j36
$$ 65 57 157 89 -142 81 379 -46 -94 47 253 61 -171 238 -16 -35 66 134 228 -286 -157 78 58 -78
6196g8q0K11j13J0J4J18M7l1q1j26Q5NK23j20k80M49l15J43j40j91L05M7K07l05
$$ -78 -158 53 -60 -50 -36 82 129 98 17 -109 -24 -19 204 84 -196 253 -62 81 -59 -250 55 102 309 4
6220Dm4J8K46l41k05O22l15K64k79J27nk05P2O3N1m27M16J60l90J01K55k71J91
$$ 4 -40 -22 224 -117 -322 300 -15 249 -30 97 92 -113 -41 22 73 -354 62 222 -168 -67 188 -83 108
6243A08o3K74k84o2l31N53m8m2m67K53M05l58MJ27r1Pj25L98l08O6j1K09n2m29
$$ 108 45 319 35 -27 -358 195 147 105 -362 -109 296 -62 -58 69 -22 -15 -140 258 -50 16 5 214 162 -267
6267b67L70k67M67k90qQ5k13L96n79n1P04k25o3k67O8K00l94L2K29j7j33K51o3
$$ -267 103 -164 303 13 5 90 -123 273 -306 -357 347 122 59 -208 -140 60 -334 -302 -73 -90 -223 28 -35
6290c5K71k29J06r0p0J14K0r0J15%J48j13j89K35k80M88l75j30n8M15m1n35M15
$$ -35 236 7 113 23 -47 67 87 -3 112 112 260 147 -42 193 -87 401 26 -104 -162 253 212 -323 92
6313I2M3m33K48R3p8M0n5K1j43N2J50l9j32K6K19k00Q7k35L50O0m7k63n1K60P0
$$ 92 135 -298 -50 43 -35 5 -50 -29 -172 -120 30 -9 -141 -115 104 -96 -9 -244 106 166 119 -144 -195 65 135
6338A35k59J29m0k09J75k2K8P1J47l69J98N4j31L87k32j07j57N32k54l96J51K50
$$ 135 -124 5 -35 -244 -69 -91 -63 8 155 -214 -16 38 -93 294 62 -45 -202 330 76 -320 -169 81
6360H1j51j40k6L75Q7j80l2m6K1k11qJ29N8j51K71l4j0j04L35j36l15p1L76k5
$$ 81 -70 -210 -236 139 226 46 14 -32 -11 -222 -230 -101 -43 -194 77 43 33 -71 264 128 -187 -258 118 93
6384I3k80K96k70L48j2j25p8k42J47J98O5k13N2N3R8k50R6K3L0q4Q6j42j3L66
$$ 93 -187 109 -161 187 175 50 -28 -270 -123 75 140 -73 -21 32 130 -120 -24 -1 29 -55 31 -111 -124 242
6408B42l97J34j08o5J89Q2j2J9mk43M07k28o3K86m4k88J33o7J92p3k33j18K75
$$ 242 -155 -21 -129 -194 -5 77 65 84 80 -163 244 16 -47 239 195 -93 40 -27 165 92 -141 -259 16
6431A6K3K2o7r8J24o7p2K6J46L4n39L90K3J38l9m00K93L06j70J9j10j30J98J5
$$ 16 39 61 -6 -104 20 -47 -119 -93 53 87 -452 -62 -39 99 60 -340 -47 259 89 108 -2 -132 66 81
6455H1o8K3j48O0J5k94K73p5K4k01J65J66J2M3j44L10o2l19J46j67L01j98K43
$$ 81 13 36 -112 -52 -37 -331 -58 -133 -109 -310 -145 21 33 76 -68 242 180 -139 7 -160 141 -57 186
6478A86l21K84l23J78m9l4p3O1K20P3l76J42J56k83K33j97K47l22K22J10p2k18
$$ 186 -135 149 -174 4 -45 -79 -152 -91 129 202 -174 -32 124 -159 74 -123 124 -198 24 134 62 -156
6500a56P3O7r9J52j5J4J16l86K84rj86O6q3J09J7q0q9L19k79J57j23R9n5J6R5
$$ -156 -83 -16 -115 37 22 36 152 -234 50 41 -145 -79 -162 -53 -36 -116 -205 114 -165 -8 -131 -32 -87 -71 24
6525B4J53k69k5N4Q4J35l64M24l20J64j0M8k4k95K09L4K14l29O8K46l0j89o2P0
$$ 24 177 -92 -117 -63 21 156 -208 216 -104 60 50 98 74 -221 -12 22 236 -93 -25 221 191 2 -60 10
6549A0Q2o40N27J32l5l3%j92M08l75P1j33j4L37m52M18Pk12L02j86n4Q4r3P9K9
$$ 10 92 -548 -21 111 76 43 43 -149 259 -116 -45 -178 -192 145 -307 111 118 -94 208 22 -32 52 -41 38 67
6574F7l0o5r1N1q3L48l5k96K1k6P3p6O5L94m93L10k69L18k94K6o1Q2k4r3J45O0
$$ 67 37 -28 -119 -68 -151 197 162 -134 -113 -139 -66 -142 -77 317 -176 134 -135 183 -111 -85 -146 -64 -88 -181 -36 24
6600B4J80k74J39k04N23m36o9K66j40J75m48L36K80o44K50M8p8n1j91L32j34J10
$$ 24 204 -70 69 -135 388 -48 -117 149 9 184 -264 72 352 -292 -42 6 -72 -123 -314 18 -116 -6
6622fn4K82r0M4k37K22k98K19j90K73n18N20j10J08J7j98K74l5o8j98J12j03K00
$$ -6 -60 222 132 176 -61 161 -137 82 -108 165 -353 167 57 165 182 -16 258 223 155 -43 69 -34 166
6645A66q2q1r8K65k11lR6J39l35K22j80J4L07k77R3rN4l14M14m5j09K57k24o5
$$ 166 84 3 -95 170 -41 -44 52 191 -144 78 -102 -88 219 -58 35 26 80 -234 180 135 26 283 59 -6
6669fq6o0J81r1J12M4n7O2m08j29K06J05r6M48j55j22L12q0j00K72m00ML19j54
$$ -6 -92 -152 29 -62 50 94 37 99 -309 -438 -232 -127 -223 225 70 -52 260 180 80 352 -48 -44 275 121
6693A21r3p5l9K1j07K50k1j03p4J79L01j33m76K08J80j05K69m08p1L81o01L80
$$ 121 28 -47 -86 -65 -172 78 57 -46 -120 59 360 227 -249 -41 139 34 303 -105 -176 205 -396 -16
6715a6j31J34k1l5j19K5oL28l15Q3LL45k17J06j31J57m76L24J20j22m1j60k9J41
$$ -16 -147 -13 -34 -69 -188 -163 -169 159 -156 -73 -70 275 58 164 33 190 -286 38 158 36 -5 -165 -194 -53
6739e3K6K3L32l65j67J81j0l91M3K7J84K54m64K67K5K73k84j21L36k4k00J89k44
$$ -53 -27 -4 328 -37 -204 -23 -33 -424 -381 -354 -170 84 -380 -113 -88 185 -99 -220 116 92 -108 81 -163
6762a63L37km50J03J89K4p4K0K41j63l85L53rk30J33p9J20o7n6O8P9k23K00j12
$$ -163 174 172 -278 -175 14 38 -36 -16 225 62 -323 30 21 -209 -76 -155 -35 -102 -158 -90 -11 -234 -34 -146
6786a46J63Qj6J6r8J78q1J04j73J66J6k79n2K79K4K6j67l90P86l84J55m0j97j4
$$ -146 17 25 9 25 -73 105 24 128 -45 121 137 -142 -194 85 109 135 -32 -422 364 -20 135 95 -102 -116
6810a16Ml3K78j81O8l40J83J91Lm22L98Q3q7k25K38j5j97j4K61j42m4N9q5M8L1
$$ -116 -112 -145 133 -48 20 -320 -137 54 57 -365 33 116 29 -196 42 27 -170 -184 77 -65 -109 -50 -135 -87 -56
6835e6Q2Q8J05l03J8k70M06lj95K33j21J71q3l18n0K17K49k90J46K3j29Q9j51
$$ -56 26 114 219 -84 -66 -336 70 67 -128 105 -16 155 72 -246 -296 -79 170 -120 26 49 -80 9 -142
6858a42L14n20J80K62m2l%K89k82p3j90L2j16K35M9N2j64p0K00j77J82q7J96L
$$ -142 172 -348 -168 94 52 49 49 338 56 -17 -207 -175 -291 -56 -7 45 -119 -189 11 -166 16 -71 125 128
6882A28MK13n02j69Q0K95r9r2M01l71K75j4m62J34N81m35j1q4J20k51L70n9M9
$$ 128 132 345 -157 -326 -246 49 -50 -142 259 -112 163 149 -313 -179 402 -33 -44 -128 -8 -259 111 52 101
6905A01j2o5J11r8J33l25O3l9J44P7P8q4lP5q5l4K08k07R2j11l2j38K1K4J87J67
$$ 101 89 24 135 37 170 -155 -92 -131 13 90 168 84 81 156 71 37 245 38 130 19 -13 -151 -130 -106 81 248
6931B48j91j79J60M0j86K65j66M00k25l18r9L9Q5p8K47J51J97n60K40j22j13K83
$$ 248 57 -122 38 78 -108 157 -9 391 166 -152 -251 -212 -127 -205 42 193 390 -170 70 -52 -165 118
6953A18j30J48k74K92j55Q9j15N6K53l22k49J48QN14j81j97m7k3P2L5k66J34K46
$$ 118 -12 136 -138 154 -1 88 -27 29 282 -40 -289 -141 -133 381 200 3 -44 -67 5 40 -226 -92 154
6976A54j58l91O79j95k6R5k40j22M00pR6r2l30K74j30J52l60N2J19K06j76J36
$$ 154 -4 -395 284 89 63 158 -82 -204 196 189 285 193 -137 137 7 159 -201 -149 -30 176 0 136
6998A36P0j04k89M33l18p7K57j63J15l50K71L7N5k80N1K77j57k27L83n5O5Kk31
$$ 136 206 102 -187 246 -72 -149 108 -55 60 -290 -19 18 73 -207 -156 121 -36 -263 120 65 130 132 -99
7021i9j7J32J30k41K89j83K75m54J11J26M3j37J99j35J8j21R7j41n1K59p2N1j26
$$ -99 -116 16 146 -95 194 11 286 -168 -57 69 112 -25 174 39 57 -64 33 -108 -159 100 28 79 -47
7044d7J76j32Kk6k09L52N8m27L10Pk1o1j49j8K44k24J85K11m19Q4J95k31L76m44
$$ -47 129 -3 -1 -27 -236 116 174 -253 57 64 43 -18 -167 -185 59 -165 20 231 -188 -104 91 -140 236 -208
7068b08K47J81k36J6k40M83j50j56K64j28mJ8J27k29J46l4j11P7l00K89j78M6
$$ -208 39 220 -16 0 -240 243 93 -63 201 73 69 87 214 -15 131 97 -14 63 -237 52 -126 -80
7090h0K83p5j81J39K0l1P5r1k56K38K91j31m11L57J2k78J2K36k81J20J67j82J65
$$ -80 203 128 -53 86 106 75 150 59 -197 41 332 201 -210 147 159 -119 -107 129 -152 -32 135 -47 118
7113A18k12L4M00m59oM5lJ22Kr1Q1K94j70j72n0Q7m4J14J73l13n9k6K95l47J64
$$ 118 -94 -60 340 -119 -125 -80 -83 39 41 -50 31 325 155 -17 -67 20 -24 90 263 -50 -109 -135 160 -187 -23
7138b3K93l01J85m30J37K18j94L66j69l7j50J4j48K68q2j94J51J43J03q7J67k32
$$ -23 270 -31 154 -276 -139 79 -115 251 82 45 -105 -91 -239 29 -53 -247 -96 47 150 63 230 -2
7160bL4k71M3J26MK04n1j83N6K0J34j7k31K8J46o4L0j71J42J23k27L60q1j32O3
$$ -2 32 -239 -196 -70 -66 138 87 -96 -40 -20 114 97 -134 -106 40 -24 6 -165 -23 100 -127 233 152 20 83
7185H3k16J91J09J9j05k42O7K28J14k28mo8P2N8j78l7K67p8J12l85L9K01J31k79
$$ 83 -133 58 167 186 81 -161 -94 134 248 20 16 -52 20 78 -100 -137 130 52 164 -221 -182 19 150 -129
7209a29M88l54q7J29kK6P7Jj9L3l43J22j01K29R4k97N1K24L0k78p4J28l9L14j90
$$ -129 359 5 -82 47 45 71 148 149 130 163 -180 -58 -159 70 164 -133 -82 142 172 -106 -180 -52 -91 223 33
7234C3n7K50L3l18L46j06m8j42J33k16L66k27k98N23m49K68k5J9l44K47k15J16
$$ 33 -24 226 259 -59 287 181 133 -9 124 -92 274 47 -251 272 -177 91 66 85 -259 -12 -227 -111
7256a11k10M54j75l01K10K09l10R7K96J8p8L0k0M3j51k28K39J47j26l03M29m30
$$ -111 -321 133 -42 -343 -133 76 -234 -137 159 177 99 129 109 152 1 -227 12 159 33 -270 159 -271
7278b71J06K35p5j24L56l31r6L73k38m5K45j31O4j82J81j02L92j43l00J17j9J23
$$ -271 -165 70 -5 -129 227 -104 -200 173 -65 -110 135 4 68 -114 67 -35 357 214 -86 31 12 135
7300A35J37n75l8M37q8O2m2l7K87O1k81k50J76K7l01K49L9J30k10N2o6K33j99
$$ 135 272 -303 -341 96 8 70 28 -9 278 339 58 -192 -16 11 -290 -41 -2 128 -82 -30 -96 137 -62
7323f2M8N3k78L10r8K07l50K68l78L18M2j20P9k7r6J25m30M41q8L25j84m14M12
$$ -62 -14 39 -239 71 -27 180 -170 98 -280 38 80 -40 39 12 -84 41 -389 52 -36 289 105 -309 103
7346A03k90K05J4j48J72l8P9m79N11N4m19J44N2J26j13PJ57M4o5j43j66K70R2
$$ 103 -187 18 32 -116 56 18 97 -382 129 183 -236 -92 -40 86 -27 -20 137 181 116 -27 -193 77 169
7369A69ml5N5j48o8n7RJ87l36L87k66nK37l40M06k74l6K07k71M11l34J9R9j69
$$ 169 165 130 185 37 -31 -88 -79 108 -228 159 -107 -112 125 -215 191 -83 -119 88 -183 228 -106 -87 12 -157
7393a57L73k77K48k1n3l6j50J21M2k56K32lK28n92L47L2JM6j83k08K89j43K64
$$ -157 216 -61 187 166 113 77 -73 48 90 -166 66 63 291 -301 46 78 79 125 -58 -266 23 -120 144
7416A44q4l8mK05k65J21N8q9n3Q2l2o9Pj12J74P8j56Q0J08k4n6j16K12n7j29l31
$$ 144 60 22 18 223 -42 79 137 48 -5 77 45 -24 -17 -129 45 123 -33 47 155 131 75 -41 171 114 -15 -346
7442c46R1J18L49k41K86l53n9J82l0K41j22m3m4j47J51k31k20M84Nj33k34L12
$$ -346 -255 -137 212 -29 257 -96 -155 27 -3 238 116 73 29 -118 33 -198 -418 66 71 -62 -296 16
7464A6M8r8j74J01k8j5M2L40l86L76k37j6J11k28O2j5L77l81j44K43k25K34J28
$$ 16 64 -34 -208 -107 -135 -150 -108 232 -154 222 -15 -31 80 -148 -86 -101 276 -105 -249 -6 -231 3 131
7487A31n5l90J71K76k54o1J58K3j08J18j20k54N5J04K01J91k01l40O66m98L95
$$ 131 76 -314 -143 133 -121 -182 -24 -1 -109 9 -111 -365 -310 -206 -5 186 -15 -355 311 -187 208
7508B08j31J13k05m4r8J95j91L78k31QK16j97j93o4K15J63k94r8J07J99p6J16
$$ 208 77 190 -15 -59 -157 38 -153 225 -6 2 218 21 -172 -236 -21 142 -152 -250 -143 56 -20 96
7530I6l99L04q1p0J61O7pj06N6r8j5L1L90M4j90k5k6k30J27m5j05n4O8l7l4J19
$$ 96 -303 1 -80 -150 11 78 71 -35 21 -77 -92 -61 329 373 183 158 132 -98 29 -16 -121 -175 -107 -144 -178 -59
7556e9J69j66J66j10j39K61k05Q9J00k55N1J7N6J10o7m5n1P3k45K32j67K18k30
$$ -59 110 -56 110 0 -139 122 -83 6 106 -149 -98 -81 -25 85 18 -27 -78 -5 -250 -18 -185 33 -197
7579a97L1J34l3P8k38J32J86K7RK7o0k2k85O5r2J74q8K17P0k01L8K26l42M10j24
$$ -197 -166 -32 -65 13 -225 -93 93 120 129 156 96 74 -211 -146 -238 -64 -152 65 135 -66 -28 198 -144 266 142
7604A42J76n20L87p1m3L63n01K11j94M58o04L70J54m63J53J71k32K5R6J23p0q2
$$ 142 318 -202 185 114 71 434 -67 144 -50 408 -196 174 328 -135 18 189 -43 -18 78 201 131 49
7626D9l06K86j01L28k40J26J39k96n4j41M48k29j6K06r0q6L00m7R7l50J35q4q
$$ 49 -257 29 -72 256 16 142 281 -15 -69 -210 238 9 -7 199 109 23 323 276 373 23 158 74 66
7649F6N7q4K2j49J67j23M5K8l38K94k44M40j44l18K28L00r5p6Ko7M6J66l03Q8
$$ 66 123 39 61 -88 79 -44 1 29 -309 -15 -259 181 37 -281 -53 247 152 76 78 11 57 223 -80 8
7673Hk15J21R0K54j40k05J71m2J37m7m4o0j5p5J70N0m03j13L53k42M16k83j6q5
$$ 8 -207 -86 4 258 118 -87 84 42 179 132 88 28 13 -62 108 158 -245 -358 -5 -247 169 -114 -130 -215
7697b15K18JN6p0K04k34k18K26K51m20J41J38q7J39j28K07j80qp1L22k05J47j09
$$ -215 3 4 60 -10 194 -40 -258 -32 219 -201 -60 78 -9 130 2 209 29 21 -50 272 67 214 105
7720A05n37M09K78k26m5J31K5j22j89J46j32J98m07K78J18Q8j48j5J29j94Q8Q2
$$ 105 -432 -23 255 29 -16 115 140 18 -171 -25 -157 41 -366 -88 30 118 -30 -45 84 -110 -22 60
7742F0J51k10J24j81P1j40J06j5j56M05J58l13J07J23k00j70o4N54p72M83q7l62
$$ 60 211 1 125 -56 15 -125 -19 -34 -190 215 373 60 167 290 90 -80 -144 410 -362 121 34 -328
7764c28K06q9M73k31j97M10l53n2K37J70j63l08L52P4k94J86n2J19n21M70j0n1
$$ -328 -122 -211 262 31 -166 244 -109 -161 76 246 83 -225 127 201 -93 93 41 160 -361 109 99 48
7786D8L8M1k10j99n3M96j84p2L14k19J4K2r7l9J06J46k02Q3R0j20P9o1K4j60J48
$$ 48 86 127 -83 -282 -335 161 -23 -95 219 0 14 36 -61 -100 6 152 -50 33 123 3 82 21 45 -115 33
7811C3Q0j73q5J53k43J3j6J04P4L35k98J07l14J80K8m2jM0k88L40K7L86m62j61
$$ 33 113 -60 -145 8 -235 -222 -238 -134 -60 275 -23 84 -230 -50 -22 -64 -65 -25 -313 27 54 440 -22 -183
7835a83Mk9K30l3J99j31K75k81N6L6P3l00J9j50Q8K53m0n5K34k40j08LK99k22
$$ -183 -179 -208 22 -11 188 57 332 51 107 143 216 -84 -65 -215 -127 126 86 31 265 25 -83 -80 219 -3
7859cj90J56O1k6J0J78J12l20P7J91m14n5M56l35J11o1p6K61l82J54J54k5o3q5
$$ -3 -193 -37 24 -2 8 186 298 -22 55 246 -168 -223 233 -102 9 -52 -128 133 -249 -95 59 34 -29 -114
7883a14J3J0P1J97j5J39n81L44K08j90J50n50M76l94K31m7Q9L9p2J73q7k51L95
$$ -114 -101 -91 -20 177 162 301 -280 64 272 82 232 -318 158 -236 -5 -52 37 76 4 177 90 -161 234
7906B34m46k13L04K48O1j61r4M43m49j47J49K09j52Mk78N2M20K8j84Q6k37K97
$$ 234 -212 -425 -121 127 188 27 -67 376 -73 -220 -71 138 -14 -10 -288 -236 184 212 28 114 -123 174
7928A74m70J94l6J75L9Q8J34k05q1J77l15j02J29kJp6K86j08J67k1Q7l94J40J02
$$ 174 -296 -102 -138 37 76 164 298 93 12 189 -126 -228 -99 -101 -100 -176 110 2 169 148 235 -159 -19 83
7952H3j14j64L60j4k60L42q9k18L06m38K62j00P4O8p9J03j31l18L36l6j71L70
$$ 83 -31 -195 165 151 -109 233 144 -74 232 -206 56 -44 30 98 19 122 -9 -327 9 -27 -198 172
7974A72k21j4j98N37k93K33l39J50J72l15J83Q2m5O7j46q2J63j96L81m14J04J96
$$ 172 -49 -63 -261 276 -17 216 -123 27 199 -116 67 149 104 171 25 -57 106 -90 291 -123 -19 177
7996A77j50k26J63N5k75Q8L53L9j91j63l7k42J95J72M4M4r4j34J86l2l45L85j29
$$ 177 27 -199 -36 19 -256 -168 185 224 33 -130 -167 -409 -214 -42 2 46 -48 -182 4 -28 -373 12 -117
8019a17Pj61R3J22k22O9r4K88p9j9R9rK38r8O4j38j6k6P1k64L39j60j36J89l2
$$ -117 -110 -271 -178 -56 -278 -209 -303 -15 -94 -113 -14 -23 215 117 181 43 27 1 72 -192 147 -13 -149 40 8
8044HK77l51J50R5R2k33j3k7j0l50J91NQ0j79J44L5J30J7j90M3Q9L2J47l2Mj32
$$ 8 285 -66 84 179 271 38 25 -2 -12 -362 -171 -166 -86 -265 -121 -86 44 61 -129 -86 3 35 182 150 154 22
8070B2K8p8K47k46R5r8j51N8j39L26P9p7p9L70k75q7rj94L23rl04K49J16l73J64
$$ 22 50 -28 219 -27 68 -30 -181 -123 -262 64 143 66 -13 357 82 -5 -14 -208 115 106 -198 51 167 -206 -42
8095d2K2q0mM9M7K16n6l56L73l63M48l32j55L28PJ30j34R7j0N5k57M2O6R6k57
$$ -42 -20 -100 -104 -55 -8 208 152 -204 169 -194 254 -78 -233 95 102 232 98 195 185 240 -17 25 91 187 -70
8120g0R6M92l37j87m6o3L8J24j04j51K86O9l31k7j1J93p9O7J29j74J64k34K92
$$ -70 26 518 181 -6 -52 -115 -77 47 -57 -208 78 147 -184 -211 -222 -29 -108 -41 88 -86 78 -156 136
8143A36k22R5J56k90o3L11k01J3r5K05N1J11o42J86L96n4k34L49q7q1k40KK48
$$ 136 -86 9 165 -125 -188 123 -78 -65 -160 45 96 207 -435 -249 147 93 -141 208 121 40 -200 -198 50
8166E0j41P3N0J57j47j22n3L4R6lJ20j15M1N2nr6k84M51j50l3L1j15j29M05k06
$$ 50 -91 -18 32 189 42 -80 -133 -99 -3 -6 114 -1 40 92 87 -9 -293 158 8 -25 6 -109 -238 167 -39
8191c9
$$ Imaginary data points
##PAGE= N=2
##DATA TABLE= (X++(I..I)), XYDATA
0@%%%qJ6qQj6K4l2M0m8N6p2Q8j06J30j55J82k17K56l00L48m01M63n29O01o84P76
$$ 0 0 0 0 -8 8 0 8 -8 16 -16 24 -24 32 -40 48 -58 72 -83 99 -118 138 -162 186 -215 248 -281 320 -364 412
29D12q78R90j113J250j401J563j741J940k156K393k653K939l255L602l987M420
$$ 412 -466 524 -589 661 -740 823 -918 1022 -1134 1259 -1394 1545 -1710 1892 -2095 2325
45B325m902N442o058O764p580Q539r684J1080j2829J5091j8146K2533k9410M1804
$$ 2325 -2577 2865 -3193 3571 -4009 4530 -5154 5926 -6903 8188 -9958 12575 -16835 24969
59B4969p1134K63383K50899m69124j65506J64931J99004o3582m1800J7516l1467
$$ 24969 -46165 217218 468117 -1007 -166513 -1582 197422 133840 92040 109556 78089
70G8089j06937L9090J03436n70q7933J5206L4489n7235n2442R2110N8887j03937
$$ 78089 -28848 10242 113678 113108 25175 40381 74870 17635 -34807 57303 116190 12253
82A2253r0916J00390R0797r4320j01228Q8941J03312p2977j05310M8615P9282
$$ 12253 -78663 21727 112524 18204 -83024 5917 109229 36252 -69058 -20443 58839
93E8839l5137m3164N3550J6085q8979k3859J16651N8297r9883p2394O5818N0414
$$ 58839 23702 -19462 34088 50173 -38806 -62665 53986 112283 12400 -59994 5824 56238
105E6238m6716o589O4933k4688j05793K6494J49568N948j68379n4330J51920R1291
$$ 56238 9522 2933 67866 43178 -62615 -36121 113447 119395 -48984 -103314 48606 139897
117A39897j06384r6393N6376O3163l3282k1800M0457o428n9362J2919P0264j4864
$$ 139897 33513 -62880 -6504 56659 23377 1577 42034 35606 -23756 -10837 59427 44563
129D4563p4473J3800O8705k3604p0513L4459P8028m3013r8490L2870J10625p505
$$ 44563 -29910 -16110 52595 28991 -41522 -7063 70965 27952 -70538 -37668 72957 65452
141F5452j00744j6726O4699J1827l1133J5364J3591n2591k1651Q1941M7602r0794
$$ 65452 -35292 -52018 12681 24508 -6625 8739 22330 -30261 -51912 30029 77631 -13163
153a3163p8004P3225R1258m3963q0230K2358M8436k8024k2508N5411K0741p8126
$$ -13163 -91167 -17942 73316 29353 -50877 -28519 19917 -8107 -30615 24796 45537 -32589
165c2589l6757Q6043N8270p5394p0448N3838O6388l3707m7706K7397K8938l2350
$$ -32589 -69346 16697 74967 -427 -70875 -17037 49351 15644 -32062 -4665 24273 -8077
177h077j7334M2687J9397m0086j7459L1969M218l0370J2883M3400k1991o0548
$$ -8077 -25411 17276 36673 -3413 -20872 11097 15315 -15055 -2172 41228 19237 -41311
189d1311K0317P7497l440q0942j7750O5647L0502l8329k3735J0863m859m476L7047
$$ -41311 -20994 56503 53063 -27879 -45629 20018 50520 12191 -11544 -681 -5540 -10016 27031
202B7031K2039n4962m8264N2598O9910l6678p9190J4396P1656J030n3177j999
$$ 27031 49070 -5892 -54156 -1558 68352 31674 -47516 -33120 38536 39566 -13611 -15610
214a5610L4671r284k7420K3324L3543k6344l9429K1334L7659j8020l3879J9237
$$ -15610 19061 9777 -17643 5681 39224 12880 -26549 -5215 32444 14424 -19455 -218
226b18L1358j8896k8579J9439K8028j7174k7197J0994K0140m981o759N258j1012
$$ -218 31140 12244 -16335 3104 31132 13958 -13239 -2245 17895 12914 6155 11413 401
239D01k0219J9700M0782j1515n3922o298N2427K0012m2111k7257K3850K2914r922
$$ 401 -19818 -118 40664 29149 -24773 -31071 21356 41368 -743 -28000 -4150 18764 8842
252H842p242N150j1731j4643K4509L1663k3084m5439J2555M9851k490m9335o900
$$ 8842 1600 6750 -4981 -19624 4885 36548 13464 -31975 -19420 30431 27941 -21394 -28294
265b8294M4868J7200l4503k0866K3369J9152j2703j4773M661P383J950K290m927
$$ -28294 16574 33774 -729 -21595 1774 20926 8223 -6550 -1889 5494 7444 9734 4807
278D807j5392k98K5870J2795k4553k2628J5202K3597o880k0074J39J1089J782
$$ 4807 -10585 -10883 14987 27782 3229 -19399 -4197 19400 12520 -7554 -7415 3674 5456
291E456j133L138p706j3888P124K4547R71k8318j0880K2563J3018j7009j3289
$$ 5456 4323 7461 -245 -14133 -7009 17538 18509 -9809 -20689 1874 14892 -2117 -15406
304a5406J2085J1158o822m742M813l520j0837P886J9930n109k7337l867K8590
$$ -15406 -3321 7837 1015 -3727 1086 -2434 -13271 -5385 14545 9436 -17901 -21768 6822
317F822J2018k3802j8549J7294K4187n640k3362p591J3992J3847k274j2504o246
$$ 6822 18840 -4962 -23511 -6217 17970 12330 -11032 -18623 -4631 9216 6942 -5562 -11808
330a1808R362J2971l263j6137n409J6154J3387q265j7030k021J1785P166k259
$$ -11808 -2446 10525 7262 -8875 -14284 1870 15257 6992 -10038 -12059 -274 6892 4633
343D633o390m996K841J2074N922j4958j7612Q802K5560K872k6204j3462J9306
$$ 4633 -1757 -6753 -3912 8162 14084 -874 -18486 -9684 15876 18748 -7456 -20918 -1612
356a612K0388j0572k0914L256J9798M120j5493j0195N812Q670J525l533l136r51
$$ -1612 18776 8204 -12710 -9454 10344 14464 -1029 -11224 -5412 3258 4783 1250 -1886 -2837
370b837K844M669M26o660n011M600R986P68j1807r470O260J3558K878j1414q051
$$ -2837 7 4676 5102 -1558 -6569 -1969 8017 8785 -3022 -12492 -6232 7326 10204 -1210 -9261
385i261P618J1940k853j3815l433J0846P444n789p645N42M473M50k00K031p39
$$ -9261 -1643 10297 7444 -6371 -9804 1042 8486 2697 -4948 -4406 67 517 317 2348 1609
400A609l800o4O311l47j0841n234J2919J2569p979j7476j03J8111P812j3406j3633
$$ 1609 -2191 -2255 4056 3709 -7132 -12366 553 13122 5143 -12333 -12436 5675 13487 81 -13552
415a3552O728J6133J709j4985j0317P608J4257J994j0136q451M414J0835J702
$$ -13552 -6824 9309 11018 -3967 -14284 -6676 7581 9575 -561 -9012 -4598 6237 7939
428G939j0372p793N778J2385J902j2131r825O121J4682L890j2935j1584Q475J5985
$$ 7939 -2433 -10226 -4448 7937 9839 -2292 -12117 -5996 8686 12576 -359 -11943 -3468 12517
442A2517j460j8810q023J6264J6209p865j8321O48J5787L486j1785n285Q470M948
$$ 12517 11057 -7753 -15776 488 16697 8832 -9489 -8841 6946 10432 -1353 -6638 1832 6780
456F780n580l168L052J45l950K389Q407l16j0296l383R050N139p303o702M413
$$ 6780 1200 -1968 1084 1229 -2721 -332 8075 7759 -2537 -5920 3130 8269 966 -5736 -1323
471a323P442q25n853l053K043M280L143k621n574o92M761J249n983k821N243M742
$$ -1323 6119 5294 -559 -3612 -1569 2711 5854 3233 -2341 -3033 1728 2977 -3006 -5827 -584 4158
487D158k944l691J155n12k700L601N676n816j1390N906J5336k759k0484k360K3685
$$ 4158 1214 -2477 -1322 -1834 -4534 -933 4743 -1073 -12463 -6557 8779 6020 -14464 -16824 6861
502F861J0599j9191j6232J1145J5497m602j1426K201N661k289J29O667k932j1202
$$ 6861 17460 -1731 -17963 -6818 8679 4077 -7349 -5148 513 -1776 -1647 5020 2088 -9114
516i114K538J6240J886j6917o603J3692P165j0311n753Q961O015n953m816K557
$$ -9114 -6576 9664 11550 -5367 -11970 1722 8887 -1424 -7177 1784 7799 1846 -2970 -413
530d13J693p69L386m88r344j326J4251N500j8044j1835J8701J8266j4255k0755
$$ -413 1280 511 3897 3409 -5935 -7261 6990 12490 -5554 -17389 1312 19578 5323 -15432
544a5432Q271J6375o036j2269Q436R217j3378r141J7417J3431k0300j8847J8367
$$ -15432 -7161 9214 3178 -9091 -655 8562 -4816 -13957 3460 16891 -3409 -22256 -3889
557c889K3710j2523k3849N099J7123k772r562O218N621j1213m786J5106O104j6980
$$ -3889 19821 7298 -16551 -11452 5671 2899 -6663 -445 5176 -6037 -10823 4283 10387 -6593
571f593q516J5289Q633j3247o039J3266K376j6308j259K1080M624k0913q101J5459
$$ -6593 -15109 180 8813 -4434 -10473 2793 5169 -11139 -12398 8682 13306 -7607 -15708 -249
585b49N864r893J228R895r962j4794J6422K4053j4363l2483P626L5705J037l0584
$$ -249 5615 -4278 -3050 6845 -3117 -17911 -1489 22564 8201 -24282 -16656 19049 20086 -10498
599a0498m874K1329J192j5415Q989J8266j4949k4721J5357L1159j0509l2684L478
$$ -10498 -15372 5957 7149 -8266 723 18989 4040 -20681 -5324 25835 15326 -17358 -13880
612a3880K7949M45k0371K600J3482r718j2735J7294J7279j9339k2587J4691K1568
$$ -13880 14069 14514 -5857 -3257 10225 507 -12228 5066 22345 3006 -19581 -4890 16678
625A6678j1723j5861J1469J0554j7208q171K3690J1628k7662j8552K4424K2483
$$ 16678 4955 -10906 563 11117 -6091 -14262 9428 21056 -6606 -25158 -734 21749
637B1749j6061j9153P622O927q766P110J9831j2470l4464P497M4906K521m5752
$$ 21749 5688 -13465 -5843 1084 -7682 -572 19259 6789 -27675 -20178 24728 27249 -18503
650a8503j4010L8930J7591k8787j2626K3668M070k6157J090L3816J691l7322j0153
$$ -18503 -32513 6417 24008 -4779 -17405 6263 10333 -15824 -14734 19082 20773 -16549 -26702
663b6702L2397J4403k1382r863J2795k031j0090J4792J7986k2208k9465J9536
$$ -26702 5695 20098 -1284 -11147 1648 -383 -10473 4319 22305 97 -29368 -9832
675i832L7272r469l5377J093K5080k015j4553J3367J2705k3565k0242K7150K9048
$$ -9832 27440 17971 -17406 -16313 8767 6752 -7801 5566 18271 -5294 -25536 1614 30662
688C0662k1958l2248J2190K5522o842j2126J2043J264k6574j344M1883J2680m7656
$$ 30662 8704 -23544 -11354 14168 7326 -4800 7243 8507 -18067 -19411 22472 35152 -12504
701a2504k8471L8427L6392k5215l2496J4979K0851j4607j0270K1249O373k9732
$$ -12504 -40975 -2548 33844 8629 -23867 -8888 11963 -2644 -12914 8335 14708 -15024
713a5024j1176L0647J6660k4878j7174J5211Q290j2115M861J9031j2097l1705
$$ -15024 -26200 4447 21107 -3771 -20945 -5734 2556 -9559 -4698 14333 2236 -29469
725b9469R180M1313L67m2167j0451L2603J4428j9061o578J1232o439j2157J9186
$$ -29469 -20289 21024 21391 -20776 -31227 1376 15804 -3257 -9835 1397 -5042 -17199 1987
738A987K2825k1556l3202J4864L6087o553k8813M385K0876j0449j5296K1903J9830
$$ 1987 24812 3256 -29946 -15082 21005 14452 -14361 -9976 10900 451 -14845 7058 26888
751B6888k9563l1577K8037M1583j6350m2077L623L1580J587j6610M793P584j6731
$$ 26888 -2675 -34252 -6215 35368 19018 -23059 -19436 12144 13731 -2879 1914 9498 -7233
764g233r093K4709J6569k5674k2744J8703K0975j1470j2611J1854K551k0493P66
$$ -7233 -16326 8383 24952 -722 -23466 -4763 16212 4742 -7869 3985 6536 -13957 -13191
777a3191L0996M288l6730j5096L1948K1511k1036j8580J1744P896q735L865J5459
$$ -13191 17805 22093 -14637 -29733 2215 23726 2690 -15890 -4146 3750 -4985 -1120 14339
790A4339j1729k6693R686L5303j875l5132n146K8410N491k0021J440J9171r754
$$ 14339 2610 -24083 -14397 20906 19031 -16101 -21247 7163 12654 -7367 -5927 13244 3490
803C490k5074J3199L2895q199l6703j774L2747R194k1183o836R880k763o769J3811
$$ 3490 -21584 -8385 24510 16311 -20392 -22166 10581 19775 -1408 -8244 1636 -1127 -7896 5915
817E915J2954j9490k1882J5528K5416p991k0417M505J1361p116m697J6014M408
$$ 5915 18869 -621 -22503 -6975 18441 10450 -9967 -5462 5899 -1217 -5914 10100 14508
830A4508k4868j1649K6242J9621k1049k1595J2115J6442p821o517J0845j178j8401
$$ 14508 -10360 -22009 4233 23854 2805 -18790 -6675 9767 1946 -4571 6274 5096 -13305
843a3305J221K5348L214k8145r065K4566J2258j8840r279J5222L133j6689Q95
$$ -13305 -12084 13264 16478 -11667 -20732 3834 16092 -2748 -12027 3195 6328 -10361 -9466
856i466K1901k01k6661n207K5842J0696j9215j1337J1101P170o231P12O174p343
$$ -9466 12435 12234 -14427 -19634 6208 16904 -2311 -13648 -2547 4623 -1608 -896 5278 -2065
870b065j1332R478J5922o697j6494K739J3043k766p646O889O795j3359j0132J6492
$$ -2065 -13397 -3919 12003 5306 -11188 -8449 4594 1828 -5818 1071 7866 -5493 -15625 867
884H67J5839j4975j9703J0155J9582m430j4243K496P895n610m167J1075M686j4921
$$ 867 16706 1731 -17972 -7817 11765 7335 -6908 -4412 3483 -2127 -6294 4781 9467 -5454
898e454p851J4358J1127j2241j0149R602Q630r304n718J1330M158j4447n900J5481
$$ -5454 -13305 1053 12180 -61 -10210 -608 8022 -1282 -7000 4330 8488 -5959 -11859 3622
912C622R160j3097j0830Q386R647l663n347K884n73m618L044P717l160j0304J713
$$ 3622 12782 -315 -11145 -2759 6888 3225 -2122 762 189 -4429 -1385 6332 3172 -7132 -5419
927e419J0759k75q946J106O868l929o479O162Q671p128j1370N493J2139k850j0488
$$ -5419 5340 5065 -3881 -2775 4093 164 -6315 -153 8518 1390 -9980 -4487 7652 4802 -5686
942e686J827Q285k300o826L924P248o642q400P172J0147n656j0968L655J0093
$$ -5686 -3859 4426 2126 -4700 -776 6472 -170 -8570 -1398 8749 3093 -7875 -4220 5873
956E873j418p739N29N704j579m128K320L980l348l831L325L701k228k603J660
$$ 5873 4455 -3284 -2755 2949 1370 -2758 -438 3542 194 -3637 -312 3389 1161 -1442 218
971B18P91k599Q22M366j164o686K85P281J488o122k076M746J775m071K10L786
$$ 218 1009 -1590 -768 3598 2434 -4252 -3967 3314 4802 -1320 -3396 1350 3125 -946 -736 3050
987C050j467n572K252O801j483p204L49P112O06o559o78N988k48n460q11N563
$$ 3050 1583 -3989 -1737 5064 3581 -3623 -3274 3838 4444 -2115 -2793 3195 2947 -2513 -3324 2239
1003B239J666n197k063M182K764k314k611P76J181j73KJ28j362p82K268J471j478
$$ 2239 3905 -1292 -3355 827 3591 1277 -1334 -558 623 450 452 580 -782 -1564 704 2175 697
1020F97k055J512K004j592j898R63J396n18j105N02K44k66Q67M89j693j489K506
$$ 697 -1358 154 2158 566 -1332 -369 1027 509 -596 -94 150 -116 751 1240 -453 -1942 564
1037E64K542k450m635J860N392m25n869p57N909K745n427l860L640N009k360n475
$$ 564 3106 656 -3979 -2119 3273 2848 -3021 -3778 2131 4876 -551 -4411 -771 4238 1878 -3597
1053c597O01N271J083m132k561K544K873o4k566j632J979J957l45k539m84K203
$$ -3597 -2996 2275 3358 -774 -3335 -791 2082 2018 -548 -2180 -201 1756 1411 -1128 -1612 591
1069E91J472j465j791Q17J321O44j097j431L62R23R10l85k091l05K370K132k589
$$ 591 2063 598 -1193 -376 945 1589 492 -939 -577 346 1256 871 -1220 -1525 845 2977 388
1086C88l017J322L836j99l782j512L504K634k932k822J408L385k74l713L40K453
$$ 388 -2629 -1307 2529 2330 -1452 -2964 540 3174 242 -2580 -1172 2213 1939 -1774 -1434 1019
1102A019O40k012j597J052J845k05j365p5N49O81r1o74l32j92M47K18p35R9K4
$$ 1019 1659 -353 -1950 -898 947 742 -623 -698 -149 532 441 -233 -565 -757 -310 -92 -827 -728 -704
1121g04L47K75L9n89k00K83Q41r66j263J145J848j009k507J11L509J356l879k207
$$ -704 -357 -82 -43 -632 -832 -549 292 -674 -1937 -792 1056 47 -2460 -2349 1160 2516 -1363 -3570
1139c570L571L249k811m444K052M713o00n191K1M900J508l985j557K898K055k000
$$ -3570 1 3250 439 -4005 -1953 2760 2160 -3031 -3010 1890 3398 -587 -2144 754 2809 809
1155H09k178J089J792n92q69J46O37O32L55j076j647P87K797o82l138o50L695
$$ 809 -1369 -280 1512 920 51 197 834 1466 1821 745 -902 -115 2682 2000 -1138 -1788 1907
1172A907M57k718p67K260M56k513j59K798K38l606j015L856J365l667j096L238
$$ 1907 2364 -354 -1121 1139 1595 -918 -1077 1721 1959 -1647 -2662 1194 2559 -1108 -2204 1034
1188A034J01k663O53L372j662m874J477O070l14o997j113O840K093n360k171M429
$$ 1034 1135 -1528 -875 2497 835 -4039 -2562 3508 3194 -3803 -4916 1924 4017 -1343 -3514 915
1204I15J307m267o57M447L25m462p93L828R28k041j29J275k176o90M105J571m977
$$ 915 2222 -2045 -2702 1745 2070 -2392 -3185 643 1571 -470 -599 676 -1500 -2190 1915 3486 -1491
1221a491m198N543N098l700n916K974M356k498k963L794K416n714l592O918M771
$$ -1491 -5689 -146 4952 1252 -4664 -1690 2666 168 -2795 999 3415 -2299 -5891 1027 5798
1236E798o389m945M500N068m226l008M845R68o147j294Q623K465r778m673Q908
$$ 5798 -591 -5536 -1036 4032 -194 -3202 1643 2611 -3536 -4830 3793 6258 -3520 -8193 715
1251G15O217o851n569M793M249m776j891N204O27o369j104P080K164o784j810
$$ 715 6932 81 -5488 -695 3554 -1222 -3113 2091 2718 -3651 -4755 2325 4489 -2295 -4105
1266d105M989M53l727K285M540n093p797N801J0933l959j2244J112J1215Q86q011
$$ -4105 884 1337 -2390 -105 4435 -658 -8455 -2654 8279 4320 -7924 -6812 4403 5289 -2722
1281b722K66M736k959m825O787O359q414r257P390J0700m920r749M520P327n592
$$ -2722 -2456 2280 -679 -5504 1283 7642 -772 -10029 -2639 8061 3141 -6608 -2088 5239 -353
1296c53o291P674P182r696r276R276J1412o328j1359L392Q092j998l663L807O33
$$ -353 -6644 1030 8212 -1484 -10760 -1484 9928 3600 -7759 -4367 3725 1727 -1936 1871 2504
1311B504p983o25J1893K541j2369n395J0886O676q360m718O802J032p928J833
$$ 2504 -5479 -6104 5789 8330 -4039 -9434 1452 8128 -232 -4950 1852 2884 -5044 -3211
1325c211J1467j691j4413j050J3747M478j0756l799O975j8n470M475Q266q041
$$ -3211 8256 6565 -7848 -8898 4849 9327 -1429 -5228 1747 1729 -3741 734 9000 959
1339I59j3297P829J7265l755j7538n42J4172J778j0612J165P961m352r863O518
$$ 959 -12338 -4509 12756 9001 -8537 -9079 5093 6871 -3741 -2576 5385 1033 -8830 -2312
1353b312J2235m723j4290K403J1668p7p128J376K868o689j044J1963M314j5190
$$ -2312 9923 5200 -9090 -6687 4981 4904 -2224 -848 2020 -4669 -5713 6250 10564 -4626
1367d626r437J4177J2765r611j2028N753Q432n454l495P954J383j2775k357J5264
$$ -4626 -14063 114 12879 3268 -8760 -3007 5425 -29 -3524 4430 5813 -6962 -9319 5945
1381E945O463j4596q562J1032P169p963k446P989j615j2364K834J6888J74j9008
$$ 5945 12408 -2188 -10750 282 7451 -512 -2958 5031 3416 -8948 -6114 10774 10948 -8060
1395h060m461J6718P384j1929o326P941J262p714L787J0564n144j5033L101J6281
$$ -8060 -12521 4197 11581 -348 -6674 1267 2529 -5185 -1398 9166 4022 -11011 -7910 8371
1409H371L79j3307k103Q554q30n335N517O270j0483r951J1216J4610p999j6483
$$ 8371 8750 -4557 -6660 1894 1064 -4271 1246 7516 -2967 -12918 -1702 12908 4909 -11574
1423a1574L708J3498j170q427L372L785p988l777J2831P349j4328j0983J2351
$$ -11574 -7866 5632 4462 -3965 -593 3192 -4796 -8573 4258 11607 -2721 -13704 -1353
1436a353J2585q498j0526O398N944p793k553J2449L345j6199p109J5879J1483
$$ -1353 11232 2734 -7792 -1394 4550 -3243 -5796 6653 9998 -6201 -13310 2569 14052
1449A4052j2129j1614P261P137n000j404P022k429j1891K692J5554J423j6106
$$ 14052 1923 -9691 -2430 4707 -293 -1697 5325 2896 -8995 -6303 9251 10674 -5432
1462e432m701J2063M854p770j068O007l679q470O424J3259o371j5886L546J4810
$$ -5432 -10133 1930 6784 -986 -2054 3953 274 -8196 -1772 11487 5116 -10770 -7224 7586
1476G586J02j2114m29Q685k887p013O583R134r108j1754P989J3770m903j3055
$$ 7586 7688 -4426 -4855 3830 943 -6070 513 9647 539 -11215 -3226 10544 5641 -7414
1490g414K475R752k865o030N345N098r764o191J1846R831j0816j1780O967J0886
$$ -7414 -4939 4813 1948 -4082 1263 6361 -3403 -9594 2252 12083 1267 -10513 -3546 7340
1504G340m014p045L577L543o793j407J0585K219j1958n594J1086P590q158o307
$$ 7340 3326 -3719 -142 3401 -3392 -4799 5786 8005 -3953 -9547 1539 9129 971 -5336
1518e336N377K495n689J456Q093k246j2067P56J3494K135j1891m000R200K694
$$ -5336 41 2536 -3153 -1697 6396 4150 -7917 -7161 6333 8468 -3423 -7423 1777 4471
1532D471p205J64P178k775r404M054J1947k837j2649L51J1418Q19q258l06O744
$$ 4471 -2734 -2570 4608 1833 -7571 -3517 8430 5593 -7056 -6705 4713 5532 -2726 -3032 3712
1547C712k883o448M612Q584m741j0302L307J0196r21q278R8M467j540j995M800
$$ 3712 829 -5619 -1007 7577 2836 -7466 -4159 6037 5116 -3162 -3064 1403 -137 -2132 2668
1562B668K559q253m039Q411O868p053p895N262O434m438m336N131K853o696k902
$$ 2668 5227 -3026 -7065 1346 8214 1161 -6734 -1472 4962 524 -3812 1319 4172 -2524 -5426
1577e426Q096M533q064n994O169N674m158l307L688O53n142L60P655m92q728j298
$$ -5426 2670 7203 -861 -6855 -686 4988 830 -2477 1211 1864 -3278 -2918 4737 4245 -4483 -5781
1593e781R325K680p888l957O113L033m779p79M413l39n833Q01O402M6o170o88
$$ -5781 3544 6224 -1664 -5621 492 3525 -1254 -2033 2380 2041 -3792 -2991 3411 3457 -2713 -3401
1609c401N042O03l833o8L414j815l481L602M562l887o144K950O186j516n177J995
$$ -3401 1641 2244 -1589 -1657 1757 -58 -3539 63 4625 738 -5406 -2456 3730 2214 -2963 -968
1625i68L255k555l086L874L133m757l319M669M048l946m417L032L655k765k708
$$ -968 2287 -268 -3354 520 3653 -1104 -4423 246 4294 348 -4069 -1037 2618 -147 -2855
1640b855L769K732m570l500M294M298l320l886J648L130j061j582R46K80j994
$$ -2855 914 3646 -924 -4424 -130 4168 848 -3038 -1390 1740 679 -903 43 323 -1671
1655a671J224K674o11m019K5M407N27l742o15L111L45l208l06L404K11k676m62
$$ -1671 -447 2227 1616 -2403 -2378 2029 2556 -1186 -1801 1310 1655 -1553 -1859 1545 1756 -920 -1382
1672a382K465L49k242o74J708J60j247Q64J607k197j681K120K797k196l017K076
$$ -1382 1083 1432 -810 -1484 224 384 -863 1 1608 -589 -2270 -150 2647 451 -2566 -490
1688d90L057j551l313O05L002M11k471p07K228M53j630l97Q73L21k98K85l8j014
$$ -490 2567 1016 -2297 -1692 1310 1721 -750 -1457 771 1224 -406 -803 70 391 93 378 340 -674
1706f74K6J578L3j386l02J526R20k112j165J504J784j102j442R62N52j9q61k01
$$ -674 -648 930 963 -423 -725 801 1721 -391 -1556 -52 1732 630 -812 150 702 683 -178 -379
1724c79O86J96j99K19n52l29M36J147j037j378J165J913o46k547m59K662J457
$$ -379 307 503 304 523 -29 -358 78 1225 188 -1190 -25 1888 1242 -1305 -1764 898 2355
1741B355k060j790J126J831n48j651K83J287K05p19o41K45N34K1n30n03O30P55
$$ 2355 295 -1495 -369 1462 914 -737 -454 833 1038 319 -322 -77 457 478 -52 -555 75 830
1759H30J05j437o81P77J486l18j222r9J142J15j127L24N32J21m7k70K52m84J61
$$ 830 935 -502 -1183 -406 1080 762 -460 -559 583 698 -429 -105 427 548 501 231 483 -1 160
1778A60n3M3j15L69L41l71j165M6J398O40q57j159J013Q83q03j001K41J287k11
$$ 160 107 150 35 404 745 374 -791 -745 653 1293 436 -723 290 1173 370 -631 -390 897 686
1797F86o18l59Q78o8l45p11Q23K08n1n6k40l38lN12p6k16J82K34n65m65L33R36
$$ 686 68 -291 587 519 174 -537 286 494 443 387 147 -191 -194 318 242 26 208 442 -123 -588 -255 681
1819F81l13q76p3J048k96j015j02J018K22q65N84P06j158j026J425J197r64j724
$$ 681 368 -508 -581 467 171 -844 -946 72 294 -571 13 719 -439 -1465 -40 1157 193 -1531
1837a531J255J527r15j604J01J697r3j221N30L41m11m24P37Q45q68q39P35O75
$$ -1531 -276 1251 336 -1268 -1167 530 437 -784 -254 87 -324 -748 -11 834 -34 -873 -138 537
1855E37n79m96J127l15j334O76J942m41k533k17K584R09k035q61J549M08j774
$$ 537 -42 -538 589 274 -1060 -384 1558 1117 -1416 -1633 951 1860 -175 -1036 513 921 -853
1872h53K39J600kj737m0K133k3k143J46J884p44j186R01J754k196k040J580L147
$$ -853 -614 986 984 -753 -793 1340 1317 -826 -680 1204 460 -726 175 1929 -267 -2307 -727 2420
1890B420r78l275Q88K355m29k517P80K137j147j735J613J882j814k345J144K501
$$ 2420 1442 -1833 -945 1410 981 -1536 -756 1381 234 -1501 112 1994 180 -2165 -1021 1480
1906A480o92j886J543M55k212j92K907O31l389j293L305K134k993k336K390J506
$$ 1480 788 -1098 445 900 -1312 -1504 1403 2034 -1355 -2648 657 2791 -202 -2538 -148 1358
1922A358j515o84K008n14k887O02L856R6m160l72L579O59l618j98L666n51l402
$$ 1358 -157 -841 1167 653 -2234 -1632 2224 2320 -1840 -2212 1367 2026 -1592 -1790 1876 1325 -2077
1939b077N22M526p35n084k93N146O61l413q77K191l31j737J898J789k847l102
$$ -2077 -1555 2971 2236 -2848 -3141 2005 2666 -747 -1624 567 236 -1501 397 2186 -661 -3763
1955c763L350M185k786m374J738L973j541l126L024J982l689l231M408M411l603
$$ -3763 -413 3772 986 -3388 -1650 2323 782 -2344 680 2662 -1027 -4258 150 4561 958
1970I58m960K621M042j936k426K025Q85l059q98N595J223o629k646O023L592m248
$$ 958 -4002 -1381 2661 725 -1701 324 1209 -1850 -2748 2847 4070 -2559 -5205 818 4410 162
1986A62l474L106J673l659j2M833N2n861j164O019K163n513j974L773R70k391
$$ 162 -3312 -206 1467 -2192 -2204 2629 2681 -3180 -4344 1675 3838 -1675 -3649 124 1094 -1297
2002a297P20L854k933n563K471P845j429p733n53O774J097n121l24L936j587l362
$$ -1297 -577 3277 344 -5219 -2748 5097 3668 -4065 -4618 2156 3253 -1868 -2192 1744 157 -3205
2018c205L380M241l741o083L387O243k198n039J955L643l656l071N905L749p019
$$ -3205 175 4416 675 -5408 -2021 4222 2024 -3015 -1060 2583 -1073 -4144 1761 5510 -1509
2033a509n652O528P627n106p524K791N734j170l185K423O29m504j200O857K891
$$ -1509 -7161 -633 6994 1888 -5636 -2845 2889 1719 -1466 957 1586 -2918 -4118 2739 5630
2048E630p466l513N765L872n180j635M383P7n823Q59Q515n15r633k362R840M228
$$ 5630 -1836 -5349 416 4288 -892 -2527 1856 1933 -3890 -3031 5484 4969 -4664 -7026 2814 7042
2064G042p506m332M325K280k926M78M289k692o026K660P441r90q078J69O311m29
$$ 7042 -464 -4796 -471 1809 -1117 -639 3650 958 -5068 -2408 5033 4043 -4035 -3866 2445 2016
2080B016m470K554M143m833o095O060Q393m414r891J781Q958k06n890K6L187k377
$$ 2016 -2454 100 4243 -590 -6685 -625 7768 3354 -6537 -4756 4202 3996 -1894 -1868 1319 -1058
2096a058j748N364K692o821n371O546O713m822o064L729L857l909k227N367K202
$$ -1058 -2806 2558 5250 -1571 -6942 -396 6317 1495 -4569 -840 3017 -892 -3119 2248 4450
2111D450p749l041Q180N227p291n878N490M345l509k594L989J18n995N20P794
$$ 4450 -3299 -6340 1840 7067 -224 -6102 -612 3733 224 -2370 1619 1737 -4258 -3738 4056
2126D056R03q193k278P116K849n999j516N013l89m894J624O882k386q795R31R510
$$ 4056 4959 -3234 -5512 1604 4453 -1546 -3062 1951 1562 -3332 -1708 5174 2788 -6007 -5076 4434
2142D434J126p680j707M634J189l659J865K987l700m766M778P138m439p827K160
$$ 4434 5560 -2120 -3827 807 1996 -1663 202 3189 -511 -5277 -499 6639 2200 -5627 -3467
2157c467P595j604n212K017M021m455m001N363O209n609o760L879O315k217m624
$$ -3467 4128 2524 -2688 -671 3350 -1105 -5106 257 6466 857 -5903 -2024 4291 2074 -2550
2172b550J660K590k966j613N831J864p436l897P089N413n301n200L276L513l305
$$ -2550 -890 1700 -1266 -2879 2952 4816 -2620 -6517 572 5985 684 -4516 -1240 2273 -1032
2187a032q46M270k99o113l40P775J738p421l481O083L301l480k464L762l08m417
$$ -1032 -1878 2392 2093 -4020 -4360 3415 5153 -2268 -5749 334 3635 155 -2309 1453 1145 -3272
2203c272J584N607j285o887J73O429J190n760o07M338k87m035J742M454k559n233
$$ -3272 -1688 3919 2634 -4253 -4080 2349 3539 -2221 -2828 1510 1223 -2812 -1070 3384 825 -4408
2219d408J912N819q36n008M63L681j689k686L063L077m553m013M916N617l954
$$ -4408 -2496 3323 2487 -2521 -2058 1623 -66 -2752 311 3388 -1165 -5178 -262 5355 1401
2234A401o508K162N791n44m343P78K233j746r57L179J331m610j835M853K280m122
$$ 1401 -5107 -2945 2846 2302 -2041 -1263 970 -776 -1733 1446 2777 -1833 -3668 1185 3465 -657
2250f57k600L400K517l666j123L797J248n339j276N315K329m433l001L001K502
$$ -657 -3257 143 2660 -1006 -2129 1668 2916 -2423 -3699 1616 3945 -488 -3489 -488 2014
2265B014k440j115K465k89k910R94L946p56m254l80L489J294k565k85J735j130
$$ 2014 -426 -1541 924 635 -2275 -1281 2665 1909 -2345 -2725 764 2058 -507 -792 943 -187
2281a87k966K794L771k405m616J133N089J15m302j116L003J022j394k11R33j424
$$ -187 -3153 -359 3412 1007 -3609 -2476 2613 2728 -1574 -2690 313 1335 -59 -270 663 -761
2297g61r52K092J713k378j696K557J658k865j993K681K791k604l092K036L434
$$ -761 -1713 379 2092 -286 -1982 575 2233 -632 -2625 56 2847 243 -2849 -813 2621
2312B621j202l155Q6K359L55j531M30j34j008M98J981l37k267o37K669J053k560
$$ 2621 1419 -1736 -1650 709 1064 -467 -37 -171 -1179 -681 1300 963 -1304 -1941 728 1781 -779
2329g79j438J955J779j879o47J292K38j732J1J795N21k381q35K460J035k113m91
$$ -779 -2217 -262 1517 -362 -1009 283 521 -1211 -1200 595 1116 -1265 -2100 360 1395 -718 -1209
2346a209J398K92r06k93J174p51r95R97J799j006k156R87J976n33k717R77K265
$$ -1209 189 481 -425 -718 456 -295 -1290 -293 1506 500 -1656 -669 1307 774 -1943 -966 1299
2363A299k8k299j68J295J191j414r41N39P94K81L63j201j114J95K355M54k099
$$ 1299 1271 -1028 -1196 99 1290 -124 -1065 -526 268 549 912 -289 -1403 -1208 1147 1601 -498
2380d98j306J697J635j119j543J17J535P7j009l5K66l91J23M28K66r12j51J272
$$ -498 -1804 -107 1528 409 -1134 -1017 518 595 -414 -449 -183 -574 -451 -23 243 -669 -820 452
2398D52j24j196l67J439P33r96j027K52P49K25l64k96J57k02L83L13J79j401K33
$$ 452 328 -868 -1235 204 937 -59 -1086 -834 -85 140 -224 -520 -363 -565 -182 131 310 -1091 -858
2417h58J204K50o67q90L78Q34j28k25q4l12M71O20k9j147o80J364J479r52j854
$$ -858 346 596 -71 -961 -583 251 123 -102 -186 -498 -27 593 564 -583 -1263 101 1580 628 -1226
2436a226N0J839P56j449j369Q79J500J52q91j390J74J151J102j113j515M03K050
$$ -1226 -1176 663 1419 -30 -1399 -520 980 1132 241 -1149 -975 176 1278 165 -1350 -947 1103
2453A103L55k219j074J592J549o68j824j38J536Q08p33r66K83K79N11j0p65n35
$$ 1103 1458 -761 -1835 -243 1306 638 -1186 -1324 212 1020 287 -679 -396 -117 394 384 -381 -916
2471i16L34R12M69n10j076J48P89P1n0k94l83K48J290m36r48r66J331J231q25
$$ -916 -582 330 799 289 -787 -639 150 221 171 -123 -506 -258 1032 596 -352 -1318 13 1244 419
2490D19j505kJ596O59j629p12M34J357K85j011n54k96P36J135k18j466n4J086
$$ 419 -1086 -1088 508 1167 -462 -1174 -740 617 902 -109 -663 -959 -223 912 694 -772 -826 260
2508B60J171j162j495P41J750n24r53m88O14P68n38k56K2l48N06M38k39j294J88
$$ 260 1431 269 -1226 -485 1265 741 -212 -700 -86 682 144 -112 -90 -438 68 506 267 -1027 -839
2527h39J684P30j554j060O20J178l04p59j10pK43J017k10r52j337J404J921n30
$$ -839 845 1575 21 -1039 -419 759 455 -304 -414 -421 -178 839 629 -323 -1660 -256 1665 1135
2545A135k521k49K566O91k269o69J202R81m67n44K75p82K9Q05J031j376q96J278
$$ 1135 -1386 -1635 931 1622 -647 -1316 -114 867 400 -144 131 -651 -622 183 1214 -162 -1058 220
2563B20J181j138j726R89J869l26j680lJ030K84o78j10J78n47j7J722R3k444q00
$$ 220 1401 263 -1463 -474 1395 1069 -611 -614 416 700 22 -88 90 -457 -474 1248 1341 -1103 -1903
2582a903K371J653j066k680J034J762o53m04K9k97p71Q95J823p02l312K54L552
$$ -1903 468 2121 1055 -1625 -591 1171 518 114 143 -154 -925 -30 1793 1091 -2221 -1967 1585
2599A585J019l269j573K407J733j717j872J400J292j048l18N60r3r32P56J029
$$ 1585 2604 -665 -2238 169 1902 185 -1687 -287 1005 -43 -361 199 106 -826 -70 959
2615I59j545j312K162K355k265l880K081M093m17l882q00K679P07o36o35O47p76
$$ 959 -586 -1898 264 2619 354 -3526 -1445 2648 2231 -1651 -2451 228 935 299 -336 311 -465
2632d65o83J906J255k946j611K430K149j542j652P82J386j368n41K134P67l339
$$ -465 -1148 758 2013 -933 -2544 -114 2035 493 -1159 -377 1009 -359 -900 1234 2001 -1338
2648a338j067L575J728l672k010L288J968k559j987K094K218k181k046K109J762
$$ -1338 -2405 1170 2898 -774 -2784 504 2472 -87 -2074 20 2238 57 -1989 120 1882
2663A882j013j491O80l00m88J359K053k680l320K552M906j529n586j96N267J573
$$ 1882 869 -622 58 -242 -730 629 2682 2 -3318 -766 4140 2611 -2975 -3171 2096 3669
2679C669m271j567K104J170j165K75J083j534k307K357L170k385k939J479L310
$$ 3669 -602 -2169 -65 1105 -60 215 1298 -236 -2543 -186 2984 599 -2340 -861 2449
2694B449j769k182J461K287k273k599K732K993k404l215J790K986j874k012K209
$$ 2449 680 -1502 -41 2246 -27 -2626 106 3099 695 -2520 -730 2256 382 -1630 579
2709E79J655l039j586L115K526l015l193K317K623j172j867J249j31k214J462
$$ 579 2234 -805 -2391 724 3250 235 -2958 -641 1982 810 -1057 192 61 -2153 -691
2724f91M009j263n507j90O034K054n010l497L560K967j904j379J128j31j875J520
$$ -691 3318 2055 -3452 -3642 2392 4446 -564 -4061 -501 2466 562 -817 311 180 -1695 -175
2740a75K973j928l627J134M118j090l611R32L821j365m514J700M890r97n224L12
$$ -175 2798 870 -2757 -1623 2495 1405 -2206 -1274 2547 1182 -3332 -1632 3258 2261 -2963 -2651
2756b651M227R30l360k8J491j393p66K442J811l393l270L855L644k571l895J569
$$ -2651 1576 2506 -854 -882 609 -784 -1550 892 2703 -690 -3960 -105 3539 968 -2927 -1358
2772a358K857q17j596J771O24l565l67M464J969m994l045L591L832k794l040J897
$$ -1358 1499 682 -914 857 1481 -2084 -2451 2013 3982 -1012 -4057 -466 3366 572 -2468 -571
2788e71J883j595m56K351r7l550k13L992Q15l681p58L420Q2l647M09M626m66n175
$$ -571 1312 -283 -739 1612 1515 -2035 -2248 1744 2559 -1122 -1880 1540 1622 -2025 -1616 3010 2544 -2631
2806b631j133N220K254m111k344J896J850q80M33P41k396k375L806L721k968n319
$$ -2631 -3764 1456 3710 -401 -2745 -849 1001 121 554 1295 -1101 -3476 330 4051 1083 -4236
2822d236J689M989O3m292l6L125q58k154J765K139k729k614K400L444j970k844
$$ -4236 -2547 2442 2505 -1787 -1823 1302 444 -1710 55 2194 -535 -3149 -749 2695 725 -2119
2838b119J374K261j616j572K224J946l063k479L380K426k646k819K304K492k285
$$ -2119 -745 1516 -100 -1672 552 2498 -565 -3044 336 2762 116 -2703 -399 2093 -192
2853a92j369K661N08l584n47M359J714m158k687K840K993j847j416M58M77j007
$$ -192 -1561 1100 1608 -1976 -2523 1836 3550 -608 -3295 -455 2538 691 -725 -267 210 -797
2869g97J139K307j863l865J467M945l21n146k09L611R39k988O5J957m52k376J040
$$ -797 342 2649 786 -3079 -1612 3333 3012 -2134 -2343 1268 2207 -781 -716 1241 789 -1587 -547
2886e47K474j140k332L95K787q95k262J300J914j739k307J926L043j653l481Q18
$$ -547 1927 787 -1545 -1150 1637 742 -1520 -220 1694 -45 -2352 -426 2617 964 -2517 -1699
2902a699L147j10k110K43J003j253j31K450L75l132j743L201L007k627l055J287
$$ -1699 1448 1338 -772 -529 474 -779 -910 1540 1915 -1217 -2960 241 3248 621 -2434 -1147
2918a147K420n85j260R19K84j594p4K463k2k495r66K551Q58k148p42K464J86k311
$$ -1147 1273 688 -572 347 631 -963 -1037 1426 1404 -1091 -2057 494 1352 -796 -1538 926 1112 -1199
2936a199j10K403L86k382p58K369K55j924rK152n89k019Q66K309m74l016j08K865
$$ -1199 -1309 1094 1480 -902 -1660 709 964 -960 -969 1183 594 -1425 -559 1750 1276 -1740 -1848 1017
2954A017O70j964j021R14J052m17J96k33j215l78K282J219k401j873J562K208
$$ 1017 1687 -277 -1298 -384 668 251 447 214 -1001 -1379 903 2122 -279 -2152 -590 1618
2970A618o94k156M80J795o07j122M88R40o51j003J207P48j631n21J606K15j378
$$ 1618 924 -1232 -752 1043 436 -686 -198 742 91 -912 295 1043 -588 -1109 497 712 -666
2987f66n53J993N58k048p32J460J368j305j036N28J007n76l75N53J13j282J15
$$ -666 -1219 774 1332 -716 -1448 12 1380 75 -961 -433 574 -2 -377 176 289 -993 -878
3004h78K061J27j723r06J446J034j071n02L93k9M4M75P88j404j200J309J663r42
$$ -878 1183 1310 -413 -1319 127 1161 90 -412 -19 -48 -4 471 1259 -145 -1345 -36 1627 685
3022F85j941K88J982o9j391l63J395P1j025j43M12J72P7K44q19j57L87J141l48
$$ 685 -1256 -968 1014 945 -446 -809 586 657 -368 -511 -99 73 150 394 -425 -582 -195 946 598
3041E98j359n58J542J363j237j776Q08J719l70j299j45J244p6r80J89O79m26l51
$$ 598 -761 -1319 223 1586 349 -1427 -619 1100 730 -569 -714 530 454 -526 -337 342 -84 -435
3059d35O10J93l17P6k36K93L9m15K67k81n02P53P75n17j156N37J341k18j138n05
$$ -435 175 368 51 127 -109 184 223 -192 75 -206 -708 45 820 303 -853 -316 1025 807 -331 -836
3079h36J289O85j184o90L12J157J10q38l66L81M20r1j27j028K79Q30Q42j047j365
$$ -836 453 1138 -46 -736 -424 733 843 5 -361 20 440 349 222 -806 -527 303 1145 98 -1267
3098a267Q26J284p2j109n34R38O68n99m39l43P99o5j24k69P8j5M86M27q91k63
$$ -1267 -441 843 771 -338 -872 66 734 135 -304 -647 152 87 -37 -306 -228 -243 243 670 -221 -484
3118d84O61n0n40L24j34L52j0K2l02J63r2J67n5M80p63L6O64m2m90o8L66K18m76
$$ -484 177 127 -413 -89 -223 129 119 141 -161 2 -90 77 22 502 -261 -225 439 397 -93 -161 205 423 -53
3141e3j18J26K14km13M31K62p49k49J054L24r56m69N97N34k98p01j20J038n27
$$ -53 -171 -45 169 167 -246 185 447 -302 -551 503 827 -129 -598 -1 533 235 -466 -586 452 -75
3161g5K93l79j21L54O23M0r12k70N94N77l60j236J69R71L51n14m27O13j85jj81
$$ -75 218 -161 -282 72 695 735 -177 -447 147 724 364 -872 -703 268 619 105 -322 291 106 105 -76
3182g6R4l20J03O54p2p86j09N95P87j101o19P81R27n79p91JO10K61m12mK51l89
$$ -76 18 -302 -199 455 383 -403 -512 83 870 -231 -850 -69 858 279 -512 -511 99 360 -52 -56 195 -194
3204a94L42M83m37o07o8R31K89q96j54M23J08q5l00J86J47m46K47M52q4r27L35
$$ -194 148 631 194 -413 -481 450 739 -157 -311 112 220 135 -165 21 168 -278 -31 421 337 -590 -255
3225b55Q36j49m83j7O23k98n67Q50o6o54l06P05N04p91o23P60R12r99q00P48R29
$$ -255 581 432 -51 -68 555 257 -310 540 474 -180 -486 219 723 -68 -691 69 981 -18 -818 -70 859
3246H59m69j291N83J207o33n72J92J8K47j73J15j11n27L09J097k47j453J74J239
$$ 859 390 -901 -318 889 256 -316 -124 -106 141 -32 83 -28 -555 -246 851 604 -849 -675 564
3265E64O47j134n91J052k16n15J01L83j31p16K35R49%j233L27P45j39r64K53J366
$$ 564 1211 77 -514 538 322 -193 -92 291 160 -556 -321 628 628 -605 -278 467 328 -636 -383 983
3285I83p21q51K37J458n85j513M46J334j65j354L52R69l37j091Q10Q00o64j271
$$ 983 262 -589 -352 1106 521 -992 -546 788 623 -731 -379 590 253 -838 -28 772 108 -1163
3303a163P69J155k77r27K60M37o80k55J191M71j678n78J747J010j635j333J043
$$ -1163 -394 761 484 -443 -183 254 -426 -681 510 981 -697 -1275 472 1482 -153 -1486 -443
3320d43J548r37o51O30K58p02m0R46k0p73r24J726O6j456J80J350K51k189K30
$$ -443 1105 168 -483 147 405 -297 -337 609 589 -184 -1108 618 684 -772 -592 758 1009 -1180 -950
3339i50K370k53k353j98K134P77j963p25J539O70j320j42R25j42j351M66J396
$$ -950 1420 1167 -1186 -1384 750 1527 -436 -1161 378 1048 -272 -414 511 369 -982 -516 880
3356H80j61j407k04J336k13p41Q11M52j346j218K166J542k056j895J584J931r68
$$ 880 719 -688 -892 444 231 -510 301 753 -593 -1811 355 1897 -159 -2054 -470 1461 493
3373D93j372J75J178m74p79Q83P95j181r28J361Q72j039r93J322P2j403M26J878
$$ 493 -879 -704 474 0 -779 104 899 -282 -1210 151 1023 -16 -1009 313 385 -1018 -592 1286
3391A286k81k389n48K567J449k452j678J768K049j415j165R20j17o62N74Q99m38
$$ 1286 1005 -1384 -1932 635 2084 -368 -2046 -278 1771 356 -809 111 -6 -668 -94 805 367
3408C67j641N94J627J1j453O7J479p64j626J119J998j259k578J048K680J00k760
$$ 367 -1274 -680 947 958 -495 -428 1051 287 -1339 -220 1778 519 -2059 -1011 1669 1769 -991
3425i91j59J809Pj137O73N62j227r75J852J469j534j763J095J292q14j174J516
$$ -991 -1150 659 666 -471 202 764 -463 -1438 414 1883 349 -1414 -319 973 159 -1015 501
3442E01O31k044q95K521J499k219k343J774K291q70j525J41O95ll2P28l63j852
$$ 501 1132 -912 -1807 714 2213 -6 -2349 -575 1716 846 -679 -538 157 154 122 850 487 -1365
3460a365K67K265N4j868j154K481J26j638J85J703k94k394K95K706M13k414r84
$$ -1365 -1098 1167 1221 -647 -1801 680 806 -832 -647 1056 762 -1632 -1337 1369 1782 -632 -1616
3477a616K253O49j447k58J267n11j321J058J162n95k265J010K421r71j872N23
$$ -1616 637 1286 -161 -419 848 337 -984 74 1236 641 -1624 -614 1807 836 -1036 -513
3493e13J364q99q89J561R49j628j607J202K172p85k253P06J245o79n08P01O86
$$ -513 851 -48 -937 624 1573 -55 -1662 -460 1712 927 -1326 -620 625 -54 -562 139 825
3510H25j545k53J507J193j920j670J733J168r76o15P45n6j053o3K037K07k373
$$ 825 -720 -973 534 1727 -193 -1863 -130 1038 62 -553 192 136 -917 -980 1057 1264 -1109
3527a109n72K499O68j938p52J399N22j406k82J944j30k286j12K489M44j821q72
$$ -1109 -1681 818 1486 -452 -1204 195 717 -689 -971 973 843 -1443 -1555 934 1378 -443 -1315
3544a315J345M15q08K53P37o02j314R20J640q99j722N19J623j14j206K28J022
$$ -1315 30 445 -363 -110 627 25 -1289 -369 1271 372 -1350 -831 792 678 -528 -300 722
3561G22q50j042J491O62o95j969J058J640m54j462Q09P77j223J80P08N83j498
$$ 722 -128 -1170 321 983 288 -1681 -623 1017 563 -899 -90 687 -536 -356 352 935 -563
3578e63q03J333J562j640j308J240J305o16j048O07N16j246j29J529L52j377q68
$$ -563 -1366 -33 1529 -111 -1419 -179 1126 510 -538 69 585 -661 -790 739 1091 -286 -1154
3595a154J313Q86j118o79R03l1q20L17J290k48j445k56J840L45j635l22J296P9
$$ -1154 159 1045 -73 -752 151 120 -700 -383 907 659 -786 -1042 798 1143 -492 -814 482 561
3613E61n39k70O82p42m88K69J631j130q16K94J417p99r25P42J160j032j054J136
$$ 561 22 -248 434 -308 -796 -527 1104 -26 -842 -548 869 70 -855 -113 1047 15 -1039 97
3631I7J149r39j514P27J557n73j191J50J092n40o46O63N35o53m39N71Q79m11j288
$$ 97 1246 307 -1207 -480 1077 504 -687 -537 555 15 -631 32 567 -86 -525 46 925 514 -774
3650g74N61P64o46j34P64j16j139j09J375L22j319n71P60J016r41n25J025k1q34
$$ -774 -213 551 -95 -229 535 419 -720 -829 546 868 -451 -1022 -262 754 -187 -712 313 292 -542
3669e42j01J416k47r96K0O92n9n99r3O74M8q42L61Q54m15j214O48J027k41j010
$$ -542 -643 773 526 -470 -450 242 183 -416 -509 165 213 -629 -268 586 171 -1043 -395 632 391 -619
3689f19q0J154Mj250M71M49J18n54L23K43n40p4K09L45l28j05N17K03n57m94Q42
$$ -619 -699 455 459 -791 -320 129 247 -307 16 259 -281 -355 -146 199 -129 -234 283 486 -71 -565 277
3710B77M53j059j94K85J053o96o49N21M29j88o74K67L06j49Q9J45n9j47p8M07
$$ 277 730 -329 -523 -238 815 119 -530 -9 420 232 -442 -175 131 -18 71 216 157 10 -68 339
3730C39J77r38J71Q08mj117R7J017J66r81q24Q43Q88o08m25j2O96k86K7J38k88
$$ 339 516 -422 -251 557 553 -564 -467 550 716 -265 -1089 -246 642 34 -391 -403 293 7 34 172 -116
3751a16L44k70j38K84n06O17o5k16m32P50L16n55p52K62J215k77q42k49P87L67
$$ -116 228 -42 -180 104 -402 215 150 -66 -498 252 568 13 -739 -477 738 461 -381 -630 157 524
3771E24l84l10L4Q8J84j2k69l7o1L45K90n49K1M55Mr87J62P21L80q42k91N04K80
$$ 524 140 -170 -136 -48 136 124 -145 -182 -243 102 392 -157 -136 319 323 -664 -502 219 599 -243 -534 -30 250
3794B50M3o18k03M24N74l88L7l47O31n0j53l88L1M73K06n37n24M94L60N6r11P8
$$ 250 293 -325 -528 -104 470 82 119 -228 403 353 200 -188 -157 316 522 -15 -539 -45 315 371 -540 -462
3816d62O45R9n19j20K55L01n9j71k8J00J35J07j62k82K96J61K64m05n50N82K90
$$ -462 183 282 -237 -357 -102 199 140 -31 -59 41 176 283 121 -161 135 296 560 155 -395 187 477
3837D77k76m16j4O31M9n94k37N40K08l36l08L03m8N0j93M09m29J85K75l05o8J67
$$ 477 201 -215 -229 402 451 -143 -380 160 368 32 -276 27 -21 29 -164 245 -184 1 276 -29 -97 70
3859G0K34k92j96J98J11L90n58l50J68N20m10n29N78L47o5m90L55j96k76M30k8
$$ 70 304 12 -184 14 125 515 -43 -393 -225 295 -115 -644 -66 281 216 -274 81 -115 -391 39 11
3880A1M90p01j27K04L6j8J31j82R8k44K0M74j08j94j95J73j5q1J55L3j39J21L1
$$ 11 501 -200 -327 -123 -87 -105 26 -156 -58 -302 -282 192 84 -110 -305 -132 -147 -228 -73 -40 -179 -58 -27
3903b7K34l23l06L42M38n25j67J36L09p9q8J94O7j12j92K63P5m40k07N26q8r0
$$ -27 207 -116 -422 -80 358 -167 -334 -198 111 32 -56 138 205 93 -99 164 239 -201 -408 118 30 -60
3925f0mK75K78r30k25Q54K39m28m79M16P03p08o59P44J56l65n3M85P9l90j30j8
$$ -60 -64 211 489 -441 -666 188 427 -1 -480 -64 639 -69 -728 16 172 -193 -246 239 318 -72 -202 -220
3947b20N04n52O5o9R4j04K96P48m86m56K27L63k78j048N74N90k31p53O28M81k83
$$ -220 284 -268 -203 -272 -178 -282 14 762 276 -180 47 410 132 -916 -342 248 17 -736 -108 373 90
3968I0n54M92L83j55o59M18L57j00m62p0N41n52k77R85K19q79J6K28O95q46m84
$$ 90 -464 28 411 256 -403 15 372 272 -190 -260 281 -271 -548 437 656 -223 -207 21 716 -130 -614
3989f14R37j20k69l50P06J95q52k86P58O80q51l15M13J66o90K80Q42n39q33O81
$$ -614 323 203 -66 -416 290 485 -367 -653 105 785 -66 -381 32 198 -492 -212 630 91 -742 -61
4009f1M75k92o09n4Q11J64p06K48L96q4j042O50Q60m17q08K66K32Q7p05R07P5
$$ -61 414 122 -487 -541 270 434 -272 -24 372 288 -754 -104 756 339 -469 -203 29 116 -589 318 393
4030C93m45o54J011J032j121j349O90J113o53n44j35R71j74n73P61L7o27j17M48
$$ 393 -52 -706 305 1337 216 -1133 -443 670 17 -527 -662 309 135 -438 323 360 -267 -384 64
4049F4M81p13k07Q17k89l96J15Q17n29p28j01J527N40j746r17J310O08o03m75
$$ 64 545 -168 -375 442 153 -243 -128 689 160 -568 -669 858 1398 -348 -1265 45 653 50 -425
4068d25N08M47o52P5O24j30p66mO65P5r42M22N63k62q64Q07N87o71j045L45J489
$$ -425 83 530 -122 -47 577 447 -319 -323 342 417 -525 -103 460 198 -666 141 728 57 -988 -643 846
4089H46N0j483k48J108K75p81M7K74J4n32O61N88r54n98M82J348j146p06P50P35
$$ 846 896 -587 -835 273 548 -233 -186 88 102 -430 231 819 -135 -733 -251 1097 -49 -755 -5 730
4109G30j026k14Q46L65r01j002J241O63n57r53P26L88k36o03Q90k4j272J64J596
$$ 730 -296 -510 336 701 -200 -1202 39 702 145 -808 -82 306 70 -533 357 333 -939 -775 821
4128H21q0j323l35J278M28j153M2Q56p0j111Q5J235n7q52o05J171J34o48j61N57
$$ 821 741 -582 -917 361 789 -364 -322 534 464 -647 -562 673 616 -236 -841 330 464 -184 -345 212
4148B12j76n27Q49L66p42o42O33P95n53p98m5J323n44q74O45M54P4j286K72J448
$$ 212 36 -491 358 724 -18 -660 -27 768 215 -583 -628 695 151 -723 -78 376 450 -836 -564 884
4168H84o48j055P29N65k45m19K11m2l13k87R30M73j092m89J016O96n67j027Q16
$$ 884 236 -819 -90 475 230 -189 22 -20 -333 -620 310 783 -309 -798 218 914 347 -680 136
4187A36L47o14j49O41J62r36o10J277N02q33n75Q68M40q04J66L44J32r81K8R99
$$ 136 483 -131 -280 361 523 -413 -1023 254 756 -77 -652 216 656 -148 18 362 494 -487 -459 540
4207E40R8r75j39P56J01q22N27M71l64j080R40Q23n90j447Q25J161m16j050J41
$$ 540 638 -337 -476 280 381 -441 86 557 193 -887 53 876 286 -1161 -336 825 409 -641 -500
4226e00Q49j05n90j5Q32l01r87R10M99l96q39M30M05j77l16N12N57j246n26J426
$$ -500 349 244 -346 -361 471 170 -817 93 592 196 -643 -213 192 15 -301 211 768 -478 -1004 422
4246D22N00j135p32J082N92p14o35L43O88q47J68O06l43l18j04O88J33n98J45
$$ 422 922 -213 -945 137 729 15 -620 -277 411 -436 -268 338 -5 -323 -427 261 394 -204 -59
4265e9L76N8p80L33Q40o3j394J44J197J35j395k10Q11M72p63o0O49k30n05L3Q24
$$ -59 317 375 -405 -72 768 705 -689 -545 652 787 -608 -818 -7 465 -298 -358 291 61 -444 -411 413
4286D13j20q79L09N66l1p76P08M37m95m39P51K24l62j134Q07M17k20n91J36M39
$$ 413 293 -586 -277 289 258 -518 190 627 132 -307 444 668 306 -828 -21 396 176 -415 -279 160
4306A60l45k30J38P88p14n66P97O48n16o62L99M58m73J9N40j08n18j17R18Q8p58
$$ 160 -185 -415 -277 511 -203 -769 28 676 160 -502 -103 355 -118 -99 441 333 -185 -302 616 704 -54
4327e4k52M14N84p44l29J82N28n18J00J83M18o70n6M29l0q0k61J30J71l33L25
$$ -54 -306 108 692 -52 -381 -199 329 -189 -89 94 512 -158 -214 215 185 105 -156 -26 145 -188 137
4348A37j4k86m05P34M51o17m82J79O03k72n08J30N89o0k45l98Q27l74n0K04n1
$$ 137 123 -163 -568 166 617 0 -482 -303 300 28 -480 -350 239 179 -66 -464 363 -11 -61 143 92
4369I2J64p40P64k13n58K28N16K33o97l03P51L55o70n78N67N57l74l91J46K88
$$ 92 256 -484 280 67 -491 -263 253 486 -211 -514 237 592 -78 -656 -89 468 94 -297 -151 137
4389A37r6j49J18j54J58j16pJ02n5K79J71j72r25P59K97r6m62m17P08N91o62k65
$$ 137 41 -108 10 -144 14 -102 -109 -7 -62 217 388 216 -709 50 347 251 -211 -628 80 671 9 -256
4411b56N6J85j6M0j70J91m7n4L13m54K67l59L93j70m57N8P85m21k24q9J081k34
$$ -256 -200 -15 -31 9 -161 30 -17 -71 242 -212 55 -304 89 -81 -538 -480 305 -116 -340 -429 652 418
4433D18n29m46O36L80l37o34N31r8P1L7k95L3L08J39K05k71p02Q98j38l98j65
$$ 418 -111 -557 79 459 122 -512 19 -79 -8 29 -266 -233 75 214 419 148 -554 344 206 -192 -357
4454c57N64K14l40n17N97P1k6n43M13K96l6o76j20L67K87J33m68q9m2K47L26k05
$$ -357 207 421 81 -436 161 232 206 -337 76 372 336 -340 -460 -93 194 327 -141 -230 -272 -25 301 96
4476I6l03K94J76j35l07m21Q61K71p86l2K52N93l13o48o9M78J50l3r8k96L43N6
$$ 96 -207 87 263 128 -179 -600 261 532 -254 -286 -34 559 246 -402 -471 7 157 124 26 -270 73 129
4498A29m13K06J09N5J89m65k16L82K17l10m2j73K93n5j64J10O4K16l81L32P7m46
$$ 129 -284 -78 31 86 275 -190 -406 -24 193 -117 -159 -332 -39 -94 -258 -148 -84 132 -249 83 160 -286
4520b86O7K55P5k94l54P21j72k95R7P0J24r5j24l8O43l73j0J46p3J94j35j91j23
$$ -286 -219 36 111 -183 -537 184 12 -283 -186 -116 8 -87 -211 -249 394 21 11 157 84 278 143 -48 -171
4543a71P9L7K62j09j28J66J0k12K9J9J78j18l03L25J46l7n22L08J75l5j79p5L93
$$ -171 -92 -55 207 98 -30 136 146 -66 -37 -18 160 42 -261 64 210 173 -349 -41 134 99 -80 -155 238
4566B38J17l28j70J83K58n04k72K78M04k93j35M67n75L00n5L53l40o2J79J88m31
$$ 238 355 27 -143 40 298 -206 -478 -200 204 -89 -224 243 -332 -32 -87 266 -74 -136 43 231 -200
4587b00l44P29k04j4p7j17N97j50m16Q6K40j35m9J59m51QO2L85j2p0K42L0j58
$$ -200 -544 185 -19 -33 -110 -227 370 220 -196 -110 130 -5 -54 105 -346 -338 -276 109 97 27 269 299 141
4610A41m27J74M67q1m95K29K95j38k23r0L44Jn31K9J78O10k63p1j0J74n51L47
$$ 141 -286 -112 355 274 -221 8 303 165 -58 -148 196 197 -334 -305 -127 483 220 149 139 313 -238 109
4632A09n1k54r0L45K21k34l75M49k6j11J5R3L3l8k36L90n5n68J61L28m4l65n2
$$ 109 58 -196 -286 59 280 46 -329 120 94 -17 -2 91 124 86 -150 240 185 -383 -222 106 62 -303 -355
4655c55M29rj76Q8J35P2l28p9R3J23k75o2J57L46j75J7J81k32m2J9M49j27m07
$$ -355 74 65 -111 -23 112 184 -144 -223 -130 -7 -282 -344 -187 159 -16 1 182 -50 -92 -73 376 249 -158
4678a58q0M09L83m97k72J56L80n37L43n2J63j05j92L01p5P1j07K39l86n1J61K54
$$ -158 -238 171 554 57 -215 -59 321 -216 127 75 238 133 -59 242 167 238 131 370 -16 -67 94 348
4700C48m67m04M44N17l80l43m9N89J38o34K69L2j54o8M47K74o08l61O34l2n77
$$ 348 -119 -523 -79 438 58 -285 -334 255 393 -241 28 60 -94 -162 285 559 -49 -410 224 192 -385
4721c85K88M18k13j92l71Q51p1p12l45P12Q45p10m40L48nJ02k48M67q4o11K9M41
$$ -385 -97 321 108 -84 -455 396 325 -387 -732 -20 825 115 -325 23 18 120 -128 339 255 -356 -327 114
4743A14Q3m15lM46k22l32N07L70j74r97L10J237n57p59J47M94K72m77J64Q3M1
$$ 114 197 -218 -221 225 3 -329 178 548 374 -623 -313 924 367 -392 -245 249 521 44 208 291 332
4764C32l72J55K94l13o91O01M57n75m68N03N42o61l95P98J93m78m14M73P01m64
$$ 332 -40 115 409 96 -595 6 463 -112 -580 -77 465 -196 -591 207 400 -78 -492 -19 682 218
4784B18l13K60L13p05K1L29j11j84J67J75K22o15j20L75P02p06k47M73K9m65Q2
$$ 218 -95 165 478 -227 -206 123 12 -172 -5 170 392 -223 -343 32 734 28 -219 254 283 -182 -100
4805a00K26p9n76K14P77Q4p21k9K07J26l54k4M94k97l91L41O73l10p79P0Q74n
$$ -100 126 47 -529 -315 462 546 -175 -204 3 129 -225 -249 245 -52 -443 -102 571 261 -518 -448 426 421
4827D21n59l8N04k88k79M90P3l68k99K54L60k3n99L99K97m31m56P30P97j077o22
$$ 421 -138 -176 328 40 -239 251 324 -44 -343 -89 271 248 -351 48 345 -86 -542 188 985 -92 -714
4848g14O56L83J06q32J26Q62n89q4K75J02o55k61O86K38m55m25P14K34m36R7K39
$$ -714 -58 325 431 -401 -275 587 -2 -86 189 291 -364 -625 61 299 -156 -581 133 367 -69 28 267
4869B67P7r42K25P84j15n69j38N50K04o95K47N69m64o9M1M21j88o92K61N35J86
$$ 267 344 -598 -373 411 296 -273 -411 139 343 -352 -105 464 0 -69 -28 393 205 -487 -226 309 495
4890D95p08N8K36Q8m50K64J63k6q06N11Q04k46p23L44M01p15K78q6K40m53k9N18
$$ 495 -213 -155 81 169 -281 -17 146 120 -686 -175 629 383 -340 4 405 -310 -32 -118 122 -331 -360 158
4912A58L72o93m1M49K14m44l97N66j74m7l36L51M12l50n09N87N84o98l89L91J42
$$ 158 530 -163 -204 245 459 15 -382 184 10 -37 -373 -22 390 40 -469 118 702 4 -385 6 148
4933A48op7J78J3o35M18J14L20o78k88O04J39m17J39K03j90k77M43p0K97p08n
$$ 148 142 65 243 256 -379 39 153 473 -205 -493 111 250 -167 -28 175 -15 -292 151 81 378 -330 -335
4955c35O67P2j033M72L30p1j94J44J07k49j6O1J65k42j10N9J27K42p74N44L05
$$ -335 332 404 -629 -157 173 102 -92 52 159 -90 -106 -45 120 -122 -232 -173 -46 196 -578 -34 271
4976B71k60l53L61K75j62l32kJ77L96k49j16j9m13L54M40l15j76k05M38K90o47
$$ 271 11 -342 19 294 132 -200 -202 -25 371 122 6 -13 -426 -72 368 53 -123 -328 110 400 -247
4997b47L2K07N63o22j47K62pp1j06P1M81o17J03L85P9m90j75M54o0n25M28J76
$$ -247 -215 -8 555 -67 -214 48 41 -30 -136 -65 416 -201 -98 287 366 -124 -299 155 95 -430 -2 174
$$ [...]
8191b13
##END NTUPLES=NMR FID
##END=
