##TITLE=1H_TG-2269-b1
 CDcl3, 8 sc, 
 16.12.2019
##JCAMPDX= 6.0         $$ Bruker NMR JCAMP-DX V2.0
##DATA TYPE= NMR FID
##DATA CLASS= NTUPLES
##ORIGIN= UXNMR, Bruker Analytische Messtechnik GmbH
##OWNER= root
$$ XWIN-NMR		Version 3.5
$$ Mon Dec 16 14:07:14 2019 Russian Standard Time (UT+4h)  she@DPX200
##.OBSERVE FREQUENCY= 200.1315
##.OBSERVE NUCLEUS= ^1H
##.DELAY= (6, 6)
##.ACQUISITION MODE= SIMULTANEOUS
##.ACQUISITION SCHEME= undefined
##.AVERAGES= 8
##.DIGITISER RES= 18
##SPECTROMETER/DATA SYSTEM= spect
##.PULSE SEQUENCE= zg30
##.SOLVENT NAME= CDCl3
##.SHIFT REFERENCE= (INTERNAL, CDCl3, 0, 15.7039)
##AUDIT TRAIL= $$ (NUMBER, WHEN, WHO, WHERE, WHAT)
$$ ##TITLE= Audit trail, XWIN-NMR		Version 3.5
$$ ##JCAMPDX= 5.01
$$ ##ORIGIN= Bruker BioSpin GmbH
$$ ##OWNER= she
$$ F:/spectra/data/she/nmr/H-F/1/audita.txt
$$ ##AUDIT TRAIL=  $$ (NUMBER, WHEN, WHO, WHERE, WHAT)
(   1,<2019-12-16 14:06:13.31 +0400>,<she>,<DPX200>,
      <created by zg, POWCHK disabled, PULCHK disabled
       configuration hash MD5:
       00 E9 B6 7A A2 85 ED C7 34 08 36 98 17 FE 4E 26
       data hash MD5: 16K
       EF FE F8 53 9E AE EA 3A 16 F9 A5 24 64 E7 00 20>)
$$ ##END=
$$ 
$$ hash MD5
$$ 4A 2B 22 82 EC 23 F8 89 EA 4A 3A 06 22 BB 3A 43
##$RELAX= 
##$RELAX= 
##$RELAX= 
##$RELAX= 
##$RELAX= 
##$RELAX= 
$$ Bruker specific parameters
$$ --------------------------
##$DU= <F:/spectra>
##$EXPNO= 1
##$NAME= <H-F>
##$PROCNO= 1
##$TYPE= <nmr>
##$USER= <she>
##$AMP= (0..31)
100 100 100 100 100 100 100 100 100 100 100 100 100 100 100 100 100 100 
100 100 100 100 100 100 100 100 100 100 100 100 100 100 
##$AQSEQ= 0
##$AQ_mod= 1
##$AUNM= <au_zg>
##$AUTOPOS= <>
##$BF1= 200.13
##$BF2= 200.13
##$BF3= 200.13
##$BF4= 200.13
##$BF5= 200.13
##$BF6= 200.13
##$BF7= 200.13
##$BF8= 200.13
##$BYTORDA= 1
##$CFDGTYP= 0
##$CFRGTYP= 5
##$CHEMSTR= <none>
##$CNST= (0..31)
1 1 145 1 1 1 1 1 1 1 1 1 1 1 1 1 1 1 1 1 1 1 1 1 1 1 1 1 1 1 1 1 
##$CPDPRG= <>
##$CPDPRG1= <>
##$CPDPRG2= <>
##$CPDPRG3= <>
##$CPDPRG4= <mlev>
##$CPDPRG5= <mlev>
##$CPDPRG6= <mlev>
##$CPDPRG7= <mlev>
##$CPDPRG8= <mlev>
##$CPDPRGB= <>
##$CPDPRGT= <>
##$D= (0..31)
0 1.2 0 0 0 0 0 0 0 0.06 0 0.03 0 0 0 0 0.0002 0 0 0 0 0 0 0 0 0 0 0 0 
0 0 0 
##$DATE= 1576490772
##$DBL= (0..7)
120 120 120 120 120 120 120 120 
##$DBP= (0..7)
150 150 150 150 150 150 150 150 
##$DBP07= 0
##$DBPNAM0= <>
##$DBPNAM1= <>
##$DBPNAM2= <>
##$DBPNAM3= <>
##$DBPNAM4= <>
##$DBPNAM5= <>
##$DBPNAM6= <>
##$DBPNAM7= <>
##$DBPOAL= (0..7)
0.5 0.5 0.5 0.5 0.5 0.5 0.5 0.5 
##$DBPOFFS= (0..7)
0 0 0 0 0 0 0 0 
##$DE= 6
##$DECBNUC= <off>
##$DECIM= 24
##$DECNUC= <off>
##$DECSTAT= 4
##$DIGMOD= 1
##$DIGTYP= 9
##$DL= (0..7)
0 120 120 120 120 120 120 120 
##$DP= (0..7)
150 150 150 150 150 150 150 150 
##$DP07= 0
##$DPNAME0= <>
##$DPNAME1= <>
##$DPNAME2= <>
##$DPNAME3= <>
##$DPNAME4= <>
##$DPNAME5= <>
##$DPNAME6= <>
##$DPNAME7= <>
##$DPOAL= (0..7)
0.5 0.5 0.5 0.5 0.5 0.5 0.5 0.5 
##$DPOFFS= (0..7)
0 0 0 0 0 0 0 0 
##$DQDMODE= 0
##$DR= 18
##$DS= 0
##$DSLIST= <SSSSSSSSSSSSSSS>
$$ [...]
##$SUBNAM2= <"">
##$SUBNAM3= <"">
##$SUBNAM4= <"">
##$SUBNAM5= <"">
##$SUBNAM6= <"">
##$SUBNAM7= <"">
##$SUBNAM8= <"">
##$SUBNAM9= <"">
##$SW= 24.9337058887773
##$SWIBOX= (0..15)
0 0 2 0 0 0 0 0 0 0 0 0 0 0 0 0 
##$SW_h= 4990.01996007984
##$TD= 16384
##$TD0= 1
##$TE= 0
##$TE2= 300
##$TE3= 300
##$TEG= 300
##$TL= (0..7)
0 120 120 120 120 120 120 120 
##$TP= (0..7)
150 150 150 150 150 150 150 150 
##$TP07= 0
##$TPNAME0= <>
##$TPNAME1= <>
##$TPNAME2= <>
##$TPNAME3= <>
##$TPNAME4= <>
##$TPNAME5= <>
##$TPNAME6= <>
##$TPNAME7= <>
##$TPOAL= (0..7)
0.5 0.5 0.5 0.5 0.5 0.5 0.5 0.5 
##$TPOFFS= (0..7)
0 0 0 0 0 0 0 0 
##$TUNHIN= 0
##$TUNHOUT= 0
##$TUNXOUT= 0
##$USERA1= <user>
##$USERA2= <user>
##$USERA3= <user>
##$USERA4= <user>
##$USERA5= <user>
##$V9= 5
##$VALIST= <valist>
##$VCLIST= <CCCCCCCCCCCCCCC>
##$VD= 0
##$VDLIST= <DDDDDDDDDDDDDDD>
##$VPLIST= <PPPPPPPPPPPPPPP>
##$VTLIST= <TTTTTTTTTTTTTTT>
##$WBST= 1024
##$WBSW= 4
##$XGAIN= (0..3)
0 0 0 0 
##$XL= 0
##$YL= 0
##$YMAX_a= 655274
##$YMIN_a= -390259
##$ZGOPTNS= <>
##$ZL1= 120
##$ZL2= 120
##$ZL3= 120
##$ZL4= 120
##$ABSF1= 10
##$ABSF2= 0
##$ABSG= 5
##$ABSL= 3
##$ALPHA= 0
##$AQORDER= 0
##$ASSFAC= 0
##$ASSFACI= 0
##$ASSFACX= 0
##$ASSWID= 0
##$AUNMP= <proc_1d>
##$AZFE= 0.1
##$AZFW= 0.1
##$BCFW= 1
##$BC_mod= 2
##$BYTORDP= 1
##$COROFFS= 0
##$CY= 11.3945322036743
##$DATMOD= 1
##$DC= 2
##$DFILT= <>
##$DTYPP= 0
##$F1P= 16.9975609425685
##$F2P= -3.02152046262296
##$FCOR= 0.5
##$FTSIZE= 0
##$FT_mod= 4
##$GAMMA= 1
##$GB= 0.15
##$INTBC= 1
##$INTSCL= 1
##$ISEN= 128
##$LB= 0.24
##$LEV0= 0
##$LPBIN= 0
##$MAXI= 10000
##$MC2= 0
##$MEAN= 0
##$ME_mod= 0
##$MI= 1.114404
##$NCOEF= 0
##$NC_proc= 0
##$NLEV= 6
##$NOISF1= 3.799351
##$NOISF2= 2.8
##$NSP= 1
##$NTH_PI= 0
##$NZP= 0
##$OFFSET= 15.70392
##$PC= 1
##$PHC0= -9788.667
##$PHC1= 20.00086
##$PH_mod= 1
##$PKNL= yes
##$PPARMOD= 0
##$PSCAL= 0
##$PSIGN= 0
##$REVERSE= no
##$SF= 200.130013532006
##$SI= 16384
##$SIGF1= 3
##$SIGF2= 2
##$SINO= 400
##$SIOLD= 16384
##$SREGLST= <1H.CDCl3>
##$SSB= 0
##$STSI= 0
##$STSR= 0
##$SW_p= 3612.71676300578
##$SYMM= 0
##$S_DEV= 0
##$TDeff= 0
##$TDoff= 0
##$TI= <>
##$TILT= no
##$TM1= 0
##$TM2= 0
##$TOPLEV= 0
##$USERP1= <user>
##$USERP2= <user>
##$USERP3= <user>
##$USERP4= <user>
##$USERP5= <user>
##$WDW= 1
##$XDIM= 8192
##$YMAX_p= 0
##$YMIN_p= 0
$$ End of Bruker specific parameters
$$ ---------------------------------
##NTUPLES= NMR FID
##VAR_NAME=  TIME,          FID/REAL,        FID/IMAG
##SYMBOL=    X,             R,               I
##VAR_TYPE=  INDEPENDENT,   DEPENDENT,       DEPENDENT
##VAR_FORM=  AFFN,          ASDF,            ASDF
##VAR_DIM=   8192,          8192,            8192
##UNITS=     SECONDS,       ARBITRARY UNITS, ARBITRARY UNITS
##FACTOR=    0.0002004,     1,               1
##FIRST=     0,             0,               0
##LAST=      1.6414764,     0,               0
##MIN=       0,             -390259,         0
##MAX=       1.6414764,     655274,          0
$$ Real data points
##PAGE= N=1
##DATA TABLE= (X++(R..R)), XYDATA
$$ plain form
0 0 0 0 0 0 -8 8 -8 8 -16 16 -16 24 -32 33 -46 56 -64 77 -93 109 -126 149 -174 198 -230 262 -300 339
28 339 -386 438 -492 552 -620 692 -774 865 -962 1068 -1185 1315 -1457 1612 -1785 1978
44 1978 -2186 2429 -2695 3000 -3349 3756 -4231 4798 -5493 6362 -7485 9006 -11188 14609
58 14609 -20785 35513 -146293 -9245 199946 -172093 -390259 -297244 -42380 -9569 -171219
69 -171219 -303284 -146139 19902 -81215 -274502 -191798 16295 66256 -76221 -195696
79 -195696 -127066 106595 162958 -84344 -247290 -31461 212022 151629 -32911 -57748 53980
90 53980 154599 127036 33691 72930 218594 181911 -20542 -52411 144240 292737 244360
101 244360 72720 -43174 64596 279273 262073 39139 -15684 146668 223732 121847
$$ packed form
0@%%%%qJ6j6J6k4L2l2M0n6O5p9J02j20J41j70K02k35K75l23L72m28M92n62O39
28C39p25Q24r30J044j172J312j466J639j827K030k253K500k772L069l397L763
44A978m164M615n124N695o349P105p987R029j0291J1855j3847J6491k0194K5797
58A4609l5394N6298j81806J37048K09191l72039k18166R3015K54864L2811j61650
69a71219j32065J57145J66041j01117j93287Q2704K08093M9961j42477j19475
79a95696O8630K33661N6363k47302j62946K15829K43483o0393j84540k4837J11728
90E3980J00619k7563r3345L9239J45664l6683k02453l1869J96651J48497m8377
101B44360j71640j15894J07770K14677j7200k22934n4823J62352P7064j01885
$$ plain form
111 121847 11861 16253 123232 187339 85721 -22260 68154 184260 89644 -64273 -51717
122 -51717 63018 136742 106384 -34876 -128011 -13473 136127 88096 -29777 -22744 27223
133 27223 9506 -34279 -45551 13819 108726 79107 -74825 -95330 64871 141288 53846 -17062
145 -17062 -5110 45646 108525 96769 -3736 -17170 98845 145500 85063 71826 110239 106581
157 106581 73633 50681 69286 162653 216962 96548 -34325 42950 193368 201735 125177
168 125177 75983 61135 93725 135079 96560 52955 107591 143930 67348 12517 58688 108976
180 108976 112217 72337 3306 4911 101914 112118 -16678 -71697 15687 79916 66362 40092
192 40092 875 -26389 -1930 10234 -11463 22615 67044 3034 -82259 -55687 20498 59625
$$ packed form
111A21847j09986M392J06979O4107j01618j07981R0414J16106r4616j53917J2556
122e1717J14735P3724l0358j41260r3135J14538J49600m8031j17873P033M9967
133B7223j7717m3785j1272N9370R4907k9619j53932k0505J60201P6417q7442p0908
145a7062J1952N0756O2879j1756j00505j3434J16015M6655o0437j3237L8413l658
157A06581l2948k2952J8605R3367N4309j20414j30873P7275J50418Q367p6558
168A25177m9194j4848L2590M1354l8519m3605N4636L6339p6582n4831M6171N0288
180A08976L241l9880o9031J605R7003J0204j28796n5019Q7384O4229j3554k6270
192D0092l9217k7264K4459J2164k1697L4078M4429o4010q5293K6572P6185L9127
$$ plain form
204 59625 59367 2089 -60678 -15720 61921 23791 -38047 5279 51043 12640 -18406 755
216 755 32171 65712 55532 -15852 -21571 73481 97090 3214 -49930 -12599 44645 96936 95647
229 95647 7679 -42898 15800 55826 33127 49513 74508 17294 -43218 -26508 17819 57002
241 57002 72503 16002 -44415 -2558 55432 22708 -14720 862 -5995 -24516 -1024 9124
253 9124 -13276 -6001 -3765 -39934 -19378 54395 38043 -56870 -91643 -52453 3541 49185 23607
266 23607 -64958 -82546 -18316 3557 -6876 22552 20020 -48586 -75348 -36949 -9586 7210
278 7210 11002 -35181 -59481 2183 39388 -9518 -42448 -24918 -14419 -1591 10951 -22840
290 -22840 -46903 -9960 -1176 -39614 -11928 53236 28484 -47169 -68408 -41728 9678 57151
$$ packed form
204E9625k58n7278o2767M4958P7641l8130o1838M3326M5764l8403l1046J9161
216G55L1416L3541j0180p1384n719R5052K3609r3876n3144L7331N7244N2291j289
229I5647q7968n0577N8698M0026k2699J6386K4995n7214o0512J6710M4327L9183
241E7002J5501n6501o0417M1857N7990l2724l7428J5582o857j8521K3492J0148
253I124k2400P275K236l6169K0556P3773j6352r4913l4773L9190N5994M5644k5578
266B3607q8565j7588O4230K1873j0433K9428k532o8606k6762L8399K7363J6796
278G210L792m6183k4300O1664L7205m8906l2930J7530J0499J2828J2542l3791
290b2840k4063L6943Q784l8438K7686O5164k4752p5653k1239K6680N1406M7473
$$ plain form
302 57151 16264 -77348 -74689 3298 19500 -9494 -8243 -2700 -6331 -6457 -39545 -68591 -8218
315 -8218 53358 -8578 -82358 -37399 33028 26462 -20485 -59410 -48476 27597 59319 -24334
327 -24334 -85643 -31591 17532 -2593 -13999 1381 9302 13397 -14606 -67681 -34762 72193
339 72193 71864 -45027 -91731 -26303 39045 52766 15915 -35015 -16994 43660 20989 -47542
351 -47542 -22894 45331 34805 -13305 -25190 -4248 40185 56479 -16736 -75902 7301 109341
363 109341 62934 -49622 -77296 -18549 58008 78428 7105 -48420 5738 54433 1016 -35910
375 -35910 17813 57676 27968 -22391 -54060 -20139 71669 83740 -19941 -66835 10443 65367
387 65367 29468 -20128 -34700 -3263 51124 37210 -35756 -30995 41778 34526 -29988 -19436
$$ packed form
302E7151m0887r3612K659P7987J6202k8994J251N543l631j26l3088k9046O0373
315h218O1576o1936p3780M4959P0427o566m6947l8925J0934P6073L1722q3653
327b4334o1309N4052M9123k0125j1406J5380P921M095k8003n3075L2919J06955
339G2193l29j16891m6704O5428O5348J3721l6851n0930J8021O0654k2671o8531
351d7542K4648O8225j0526m8110j1885K0942M4433J6294p3215n9166Q3203J02040
363A09341m6407j12556k7674N8747P6557K0420p1323n5525N4158M8695n3417l6926
375c5910N3723L9863k9708n0359l1669L3921R1808J2071j03681m6894P7278N4924
387F5367l5899m9596j4572L1437N4387j3914p2966M761P2773p252o4514J0552
$$ plain form
399 -19436 42140 57432 14133 -56942 -84880 3305 103293 53702 -60005 -59254 15841 39889
411 39889 11479 -20730 -22408 20931 32953 -43467 -80107 11524 77439 9688 -67348 -45488
423 -45488 22113 58716 17301 -72057 -77707 27178 70838 -11479 -66689 -30722 8745 14665
435 14665 7808 -5486 5484 28859 -15335 -81216 -33925 69949 66236 -22335 -63440 -32090
447 -32090 31898 68918 21953 -44465 -14361 48685 22103 -29757 -10557 26998 24687 7945
459 7945 -8063 1815 54697 61205 -24279 -61649 22951 88655 43302 -30164 -53617 -14171 59039
472 59039 73336 2007 -28484 23224 34750 -17402 -22574 23288 42273 22538 -18714 -50388
484 -50388 -8176 67057 46687 -35890 -37024 24564 40850 11569 -22228 -39301 -6292 43714
$$ packed form
399a9436O1576J5292m3299p1075k7938Q8185R9988m9591j13707P51P5095K4048
411C9889k8410l2209j678M3339J2022p6420l6640R1631O5915o7751p7036K1860
423d5488O7601L6603m1415q9358n650J04885M3660q2317n5210L5967L9467N920
435A4665o857j3294J0970K3375m4194o5881M7291J03874l713q8571m1105L1350
447c2090O3988L7020m6965o6418L0104O3046k6582n1860J9200L7555k311j6742
459G945j6008R878N2882O508q5484l7370Q4600O5704m5353p3466k3453L9446P3210
472E9039J4297p1329l0491N1708J1526n2152n172M5862J8985j9735m1252l1674
484e0388M2212P5233k0370q2577j134O1588J6286k9281l3797j7073L3009N0006
$$ plain form
496 43714 21118 -29367 -5632 36619 8928 -25638 -5069 28359 40804 19673 -39219 -56143
508 -56143 23550 82106 30722 -28017 -11905 20797 29288 23072 1036 462 42320 40293 -27569
521 -27569 -38530 35117 67169 22692 -16468 -13635 23556 60482 26632 -50907 -43099 40057
533 40057 56661 812 -26230 -15742 -1866 13482 4903 -21270 -3709 26019 -17597 -73038
545 -73038 -40350 21638 24212 -14057 -53949 -63881 -15191 29689 -10391 -63370 -39805 -7031
557 -7031 -27048 -43399 -31705 -24645 -14821 -11146 -38465 -42634 3691 9781 -48863 -66022 -18667
570 -18667 16484 15677 -10756 -52893 -49128 13812 36872 -4606 -17093 4876 -4706 -20666 -4676
583 -4676 10358 16915 25334 3708 -28953 -1008 47305 33349 -3703 -5596 1443 8860 27711
$$ packed form
496D3714k2596n0485K3735M2251k7691l4566K0569L3428J2445k1131n8892j6924
508e6143P9693N8556n1384n8739J6112L2702Q491o216k2036n74M1858k027o7862
521b7569j0961P3647L2052m4477l9160K833L7191L6926l3850p7539P808Q3156
533D0057J6604n5849k7042J0488J3876J5348q579k6173J7561K9728m3616n5441
545g3038L2688O1988K574l8269l9892r932M8690M4880m0080n2979K3565L2774
557g031k0017j6351J1694P060R824L675k7319m169M6325O090n8644j7159M7355
570a8667L5151q07k6433m2137L765O2940K3060m1478j2487K1969r582j5960J5990
583d676J5034O557Q419k1626l2661K7945M8313j3956l7052j893P039P417J8851
$$ plain form
596 27711 17575 -17273 -6982 26214 18164 4223 17196 6219 -22037 -13212 7033 5159 7503
609 7503 3822 -30378 -41326 -6556 10257 -25 592 -13441 -47834 -40838 -5141 -6165 -23414
622 -23414 -23173 -34830 -43984 -13887 4485 -24441 -38711 -22681 -22892 -25811 -11914 -21583 -42881
635 -42881 -29987 -14783 -21345 -7146 10457 -20228 -49612 -23683 4526 4658 3346 -14236 -46623
648 -46623 -33743 10098 13195 -4545 640 -1482 -18223 -9561 1823 -6560 -210 7217 -23390
661 -23390 -35450 8364 28750 -6550 -28902 -17680 -2680 16167 14902 -29837 -51690 -12374
673 -12374 11266 -11309 -20249 -10195 -16446 -20885 -16149 -23016 -12196 14736 -9383 -63325 -53177
686 -53177 -1355 6617 -15400 -26153 -32560 -23360 1090 -8456 -37809 -24035 3099 -13627 -33070
$$ packed form
596B7711j0136l4848J0291L3196q050j3941J2973j0977k8256Q825K0245j874K344
609G503l681l4200j0948L4770J6813j0282O17j4033l4393O996L5697j024j7249
622b3414K41j1657r154L0097J8372k8926j4270J6030k11k919J3897r669k1298
635d2881J2894J5204o562J4199J7603l0685k9384K5929K8209J32j312j7582l2387
648d6623J2880M3841L097j7740N185k122j6741Q662J1384q383O350P427l0607
661b3390j2060M3814K0386l5300k2352J1222J5000J8847j265m4739k1853L9316
673a2374K3640k2575q940J0054o251m439M736o867J0820K6932k4119n3942J0148
686e3177N1822P972k2017j0753o407R200K4450r546k9353J3774K7134j6726j9443
$$ plain form
699 -33070 -19621 -9354 -9037 -4971 -20069 -30406 8551 36263 -7542 -48186 -22575 12432 17539
712 17539 9300 -12281 -23673 5051 24926 -961 -8962 24364 25673 -9665 -19139 -1599 16992
725 16992 34480 19132 -26094 -19862 35162 39712 -5579 -14193 9507 17687 13942 3326 -12166
738 -12166 1331 25046 3465 -21192 12062 41303 11910 -20989 -18719 -1913 25394 37916
750 37916 -1084 -37394 -5995 32948 19213 -492 6521 10153 9298 9367 -3925 -836 34241 34584
764 34584 -11550 -16743 28025 43736 23109 5102 -4426 9718 46743 43696 -5129 -12432 29153
777 29153 40317 19372 16262 24647 29294 29531 6906 -11351 26327 65928 28702 -24803 -9548
790 -9548 32059 42065 29670 4145 -12612 13137 40152 11315 -18891 4635 26450 6740
$$ packed form
699c3070J3449J0267L17M066j5098j0337L8957K7712m3805m0644K5611L5007N107
712A7539q239k1581j1392K8724J9875k5887q001L3326J309l5338r474J7540J8591
725A6992J7488j5348m5226O232N5024M550m5291q614K3700Q180l745j0616j5492
738a2166J3497K3715k1581k4657L3254K9241k9393l2899K270J6806K7307J2522
750C7916l9000l6310L1399L8943j3735j9705P013L632q55O9j3292L089L5077L43
764C4584m6134n193M4768J5711k0627j8007r528J4144L7025l047m8825p303M1585
777B9153J1164k0945l110Q385M647K37k2625j8257L7678L9601l7226n3505J5255
790i548M1607J0006j2395k5525j6757K5749K7015k8837l0206K3526K1815j9710
$$ plain form
802 6740 -10573 -6250 7292 25839 15892 -29569 -32765 25406 41352 -13570 -45604 -21621 8198
815 8198 21063 9049 -22912 -23044 13615 12197 -24468 -18385 17915 17516 -11348 -28373 -23400 12779
829 12779 45185 10469 -42879 -17698 41742 34994 -8958 -19541 -2635 18610 27079 4358
841 4358 -13453 16077 39040 8315 -12220 16326 38796 26209 2781 -18095 -8705 40737
853 40737 56398 1574 -30382 8196 38804 23923 6229 2227 7226 20041 11208 -17957 -7547
866 -7547 32693 25227 -15002 -17139 9211 22428 19630 -4135 -33987 -14505 32883 22054 -26259
879 -26259 -27161 3448 9389 1369 -4643 -8290 3155 10229 -17913 -33833 5138 30653 -2177
892 -2177 -30464 -20568 -2179 15105 20157 -9558 -30268 -643 19810 -5739 -19843 -458 6653
$$ packed form
802F740j7313M323J3542J8547r947m5461l196N8171J5946n4922l2034K3983K9819
815H198J2865j2014l1961j32L6659j418l6665O083L6300l99k8864j7025M973L6179
829A2779L2406l4716n3348K5181N9440o748m3952j0583J6906K1245Q469k2721
841D358j7811K9530K2963l0725k0535K8546K2470j2587k3428k0876R390M9442
853D0737J5661n4824l1956L8578L0608j4881j7694m002M999J2815q833k9165J0410
866g547M0240p466m0229k137K6350J3217k798k3765k9852J9482M7388j0829m8313
879b6259r02L0609N941q020o012l647J1445P074k8142j5920L8971K5515l2830
892b177k8287R896J8389J7284N052k9715k0710K9625K0453k5549j4104J9385P111
$$ plain form
905 6653 -2186 -6374 -9942 96 22303 8009 -30314 -18932 24002 21394 -10905 -18357 -12366
918 -12366 -2694 15438 11843 -14139 -10732 10113 -1046 -17040 -351 12290 -53 -11594 -18662
931 -18662 -16184 11804 25382 -11162 -34962 -4965 15971 -2262 -12062 -8667 -11949 -5690 3185
944 3185 -9224 -13103 6574 2913 -22698 -17862 6529 9070 -843 -13809 -29321 -14050 22834
957 22834 15141 -24185 -21761 6643 4410 -8520 -5214 -2734 -2045 1914 -11627 -21164 7075 25970
971 25970 -4510 -27246 -8583 10721 12276 5789 -15782 -24596 6638 25098 -4119 -19814 5014
984 5014 13372 -4975 -7874 1501 8036 14218 72 -26288 -11809 27770 22635 -10577 -12919 1490
998 1490 7756 15100 9890 -12275 -7887 17168 8451 -13885 89 19321 7732 -4775 -3764
$$ packed form
905F653q839m188l568J0038K2207j4294l8323J1382M2934k608l2299p452N991
918a2366R672J8132l595k5982L407K0845j1159j5994J6689J2641j2343j1541p068
931a8662K478K7988J3578l6544k3800K9997K0936j8233r800L395l282O259Q875
944C185j2409l879J9677l661k5611M836K4391K541r913j2966j5512J5271L6884
957B2834p693l9326K424K8404k233j2930L306K480O89L959j3541r537K8239J8895
971B5970l0480k2736J8663J9304J555o487k1571q814L1234J8460k9217j5695K4828
984E014Q358j8347k899R375O535O182j4146k6360J4479L9579n135l3212k342J4409
998A490O266P344n210k2165M388K5055q717k2336J3974J9232j1589j2507J011
$$ plain form
1011 -3764 886 15804 22586 -6672 -25701 2981 25058 6646 -6855 -1628 -2426 3938 14966
1024 14966 3471 -8369 7591 11304 -13013 -14031 10094 13255 43 -6018 -11774 -3398 20244
1037 20244 15009 -16008 -14379 9196 4616 -7224 -139 -327 -7595 544 3621 -6720 2819 16327
1051 16327 -2463 -18912 -2982 9063 3739 1185 -6529 -15771 1251 18124 1103 -10911 6505
1064 6505 7521 -11240 -6297 8578 4269 -1027 -2664 -12437 -4881 19692 12946 -14411 -10291 8067
1078 8067 5404 741 1348 -7462 -6059 8015 -724 -14319 5860 20779 -5396 -21045 -1130
1091 -1130 12295 8320 315 -14777 -17306 8249 18101 -6459 -13815 5258 6336 -5440 -841
1104 -841 2120 -803 6453 1549 -18770 -8006 22833 15548 -13698 -13557 3411 11917 14686 2228
$$ packed form
1011c764M650J4918O782k9258j9029K8682K2077j8412j3501N227p98O364J1028
1024A4966j1495j1840J5960L713k4317j018K4125L161j3212o061n756Q376K3642
1037B0244n235l1017J629K3575m580j1840P085j88p268Q139L077j0341R539J3508
1051A6327j8790j6449J5930J2045n324k554p714r242J7022J6873j7021j2014J7416
1064F505J016j8761M943J4875m309n296j637r773P556K4573o746k7357M120J8358
1078H067k663m663O07q810J403J4074q739j3595K0179J4919k6175j5649J9915
1091a130J3425l975q005j5092k529K5555R852k4560p356J9073J078j1776M599
1104h41K961k923P256m904k0319J0764L0839p285k9246J41J6968Q506K769j2458
$$ plain form
1118 2228 -16503 -4161 20245 7965 -12131 1032 15559 5502 -1194 -382 -447 14161 22264
1131 22264 -5435 -23507 6481 30261 11047 -9112 -6763 3608 17471 18325 -6448 -13046 15087
1144 15087 20566 -8305 -11602 12109 16231 4981 -3829 -11634 -195 25771 16384 -19697 -18069
1157 -18069 12856 16027 -214 -6829 -7756 691 14668 2428 -18812 -2756 19774 -212 -22621
1170 -22621 -8479 8608 8497 2086 -14009 -21559 4238 23304 -2915 -25260 -8116 7155 376
1183 376 -5713 -9527 -9339 5863 7429 -18738 -19689 13450 17084 -13111 -22121 -7031 3982 9847
1197 9847 223 -21616 -15390 14426 12470 -13714 -12028 4002 698 -4829 -5239 -8699 -360 11536
1211 11536 -6148 -25137 -2902 20902 4877 -14685 -12096 -5521 3186 8567 -8284 -20990 -469
$$ packed form
1118B228j8731J2342K4406j2280k0096J3163J4527j0057o696Q12o5J4608Q103
1131B2264k7699j8072K9988K3780j9214k0159K349J0371J3863Q54k4773o598K8133
1144A5087N479k8871l297K3711M122j1250q810p805J1439K5966r387l6081J628
1157a8069L0925L171j6241o615r27Q447J3977j2240k1240J6056K2530j9986k2409
1170b2621J4142J7087j11o411j6095p550K5797J9066k6219k2345J7144J5271o779
1183C76o089l814J88J5202J566k6167r51L3139L634l0195r010J5090J1013N865
1197I847r624k1839O226K9816j956k6184J686J6030l304n527m10l460Q339J1896
1211A1536j7684j8989K2235K3804j6025j9562K589O575Q707N381j6851j2706K0521
$$ plain form
1224 -469 11581 -9009 -16671 2366 7346 -2848 -8311 -14615 -10256 11753 9274 -23379 -25042 6613
1238 6613 13861 -4454 -11885 -11402 -5458 8531 3513 -17892 -10724 11970 505 -20752 -8519
1251 -8519 9201 7761 1432 -8813 -16382 3190 22978 1948 -21247 -5464 11637 4570 -1225
1264 -1225 -95 -1381 7534 12638 -4883 -9884 14958 19333 -7095 -13346 4520 13608 12852 4712
1278 4712 -12691 -8909 19431 22025 -5548 -10086 6260 5861 -497 772 -2907 201 12555 2056
1292 2056 -18719 -5728 18546 8374 -12472 -12973 -6273 2501 11442 -3841 -24883 -9537 13515
1305 13515 1504 -14767 -7772 -2875 -5354 -1986 -7238 -14908 -990 7892 -13770 -22803 441
1318 441 11070 -1176 -8645 -12393 -11514 4874 10279 -10741 -15304 6409 7453 -9772 -6455 4778
$$ packed form
1224d69J2050k0590p662J9037M980j0194n463o304M359K2009k479l2653j663L1655
1238F613P248j8315p431M83N944J3989n018k1405P168K2694j1465k1257J2233
1251h519J7720j440o329j0245p569J9572J9788k1030k3195J5783J7101p067n795
1264a225J130j286Q915N104j7521n001K4842M375k6428o251J7866R088p56q140
1278D712j7403L782K8340K594k7573m538J6346l99o358J269l679L108J2354j0499
1292B056k0775J2991K4274j0172k0846n01O700Q774Q941j5283k1042J5346K3052
1305A3515j2011j6271O995M897k479L368n252p670J3918Q882k1662r033K3244
1318D41J0629j2246p469l748Q79J6388N405k1020m563K1713J044j7225L317J1233
$$ plain form
1332 4778 2760 1716 847 -8843 -1457 16530 6611 -14547 -5088 11961 8200 2891 1335 -6010
1346 -6010 -72 14975 6407 -9421 1844 12629 -145 -4380 5293 4380 3069 8663 -1230 -11552
1360 -11552 2857 13096 421 -4080 2868 -1457 -3421 6666 2880 -7690 1385 6530 -5518
1373 -5518 -4307 8597 792 -9218 -362 4398 -77 4419 3698 -8513 -3473 9652 1770 -5912
1387 -5912 5747 6145 -6153 -1256 7493 2774 4503 10192 -2519 -8615 8586 13858 133 -170
1401 -170 6063 1400 3704 10957 2719 -1078 10937 8874 -3570 4956 14387 988 -4630 5958
1415 5958 6350 4267 11533 6296 -7439 1149 13868 4547 -1851 5082 2276 -2435 4619 2724 -4031
1430 -4031 7748 12944 -6487 -11964 7728 12107 -623 -2779 -3900 -5440 5861 9413 -7992
$$ packed form
1332D778k018j044q69r690P386J7987r919k1158R459J7049l761n309j556p345
1346f010N938J5047q568j5828J1265J0785j2774m235R673r13j311N594r893j0322
1360a1552J4409J0239j2675m501O948m325j964J0087l786j0570R075N145j2048
1373e518J211J2904p805j0010Q856M760m475M496p21j2211N040J3125p882p682
1387e912J1659L98j2298M897Q749m719J729N689j2711o096J7201N272j3725l03
1401a70O233m663K304P253q238l797J2015k063j2444Q526R431j3399n618J0588
1415E958L92k083P266n237j3735Q588J2719r321o398O933k806m711P054j895o755
1430d031J1779N196j9431n477J9692M379j2730k156j121j540J1301L552j7405
$$ plain form
1443 -7992 -10245 7354 7835 -4268 -1668 710 -4013 276 1143 -9280 -3316 13815 3651 -15913
1457 -15913 -7258 7312 3859 1353 579 -8318 -5896 7179 1640 -8311 613 4482 -5847 -3497
1471 -3497 5421 -87 -2005 4811 -3364 -10935 4414 10303 -6301 -9822 2364 3162 793 4493
1485 4493 -2603 -8854 2662 6593 -4613 -1119 8546 -1474 -9395 306 2295 4 8452 6001
1499 6001 -10747 -5945 11788 6120 -5493 -566 1945 -768 6070 6006 -5070 -1083 9046 773
1513 773 -2766 8866 6117 -6427 575 8885 943 1084 8127 1109 -4289 6878 7402 -1908 4090
1528 4090 9682 -553 -3085 3506 1088 2415 11991 2872 -10137 1498 13354 961 -5919 2968
1542 2968 2940 848 6619 1095 -8711 666 9836 -1123 -5854 2447 1114 -2042 2047 -2121 -8537
$$ packed form
1443g992k253J7599M81j2103K600K378m723M289Q67j0423N964J7131j0164j9564
1457a5913Q655J4570l453k506p74q897K422J3075n539r951Q924L869j0329K350
1471c497Q918n508j918O816q175p571J5349N889j6604l521J2186P98k369L700
1485D493p096o251J1516L931j1206L494R665j0020p921R701J989k291Q448k451
1499F001j6748M802J7733n668j1613M927K511k713O838o4j1076L987J0129q273
1513G73l539J1632k749j2544P002Q310p942J41P043p018n398J1167N24r310N998
1528D090N592j0235k532O591k418J327R576r119j3009J1635J1856j2393o880Q887
1542B968k8k092N771n524r806R377R170j0959m731Q301j333l156M089m168o416
$$ plain form
1557 -8537 4193 9835 -7896 -12491 2606 2900 -5819 -1418 -286 -6599 -2888 -640 -9595 -5333
1571 -5333 8530 551 -13307 -7398 -746 -3282 -699 -3272 -14628 -5910 11305 -628 -19403
1584 -19403 -8286 5473 -514 -6254 -6860 -8880 -1292 5314 -9254 -17885 788 10800 -4322
1597 -4322 -12584 -7387 -4118 4405 8084 -9381 -19188 477 10410 -5828 -11112 1238 3644 -516
1611 -516 -2203 -8421 -6218 8896 6067 -11553 -7268 8602 3974 -5566 -3440 -3821 -828 11099
1625 11099 7244 -11325 -6762 9551 3907 -7227 -1128 4626 3343 3005 -3324 -8452 6284 16436
1639 16436 -1436 -13809 53 8011 2009 1696 -880 -7141 2151 11662 -2537 -10413 3869 10189
1653 10189 -521 -3199 -1355 -2061 3908 4775 -8956 -7820 11753 10938 -6676 -6748 214 -901 3584
$$ packed form
1557h537J2730N642j7731m595J5097K94q719M401J132o313L711K248q955M262
1571e333J3863p979j3858N909O652k536K583k573j1356Q718J7215j1933j8775
1584a9403J1117J3759n987n740o06k020P588O606j4568q631J8673J0012j5122
1597d322q262N197L269Q523L679j7465r807J9665R933j6238n284J2350K406m160
1611e16j687o218K203J5114k829j7620M285J5870m628r540K126l81K993J1927
1625A1099l855j8569M563J6313n644j1134O099N754j283l38o329n128J4736J0152
1639A6436j7872j2373J3862P958o002l13k576o261R292R511j4199p876J4282O320
1653A0189j0710k678J844p06N969Q67j3731J136J9573q15j7614p2O962j115M485
$$ plain form
1668 3584 7900 -4379 -8912 4465 5532 -5699 -1743 5632 506 -1256 1697 -2522 -502 8610
1682 8610 847 -10544 173 10422 -651 -5836 2502 1888 -551 5800 2037 -6641 -15 6330
1696 6330 -3220 -4179 6372 4314 -2311 -309 -3011 -5127 7152 10472 -6369 -9376 5305 4930
1710 4930 -3849 -1416 -312 -4278 2877 6155 -5302 -7230 3641 2229 -3859 51 -745 -5639 1652
1725 1652 3478 -7793 -5135 8107 2145 -9272 -2685 2781 -3063 -1437 4094 -1568 -2516 2097
1739 2097 -3678 -6919 4916 7245 -3744 -2382 3720 -698 -957 5271 -977 -4711 8016 9521
1753 9521 -5292 -5005 7293 5772 1117 3271 491 446 10395 7484 -5621 -677 10949 6504 894
1768 894 3654 -332 -1138 11508 11980 -3127 -2463 8314 3312 -1925 4924 6004 2452 4358 1836
$$ packed form
1668C584M316j2279m533J3377J067j1231L956P375n126j762K953m219K020R112
1682H610p763j1391J0717J0249j1073n185Q338o14k439O351l763q678O626O345
1696F330r550r59J0551k058o625K002k702k116J2279L320j6841l007J4681l75
1710D930q779K433J104l966P155L278j1457j928J0871j412o088L910p96m894P291
1725A652J826j1271K658J3242n962j1417O587N466n844J626N531n662r48M613
1739B097n775l241J1835K329j0989J362O102m418k59O228o248l734J2727J505
1753I521j4813K87J2298j521m655K154k780m5R949k911j3105M944J1626m445n610
1768H94K760l986q06J2646M72j5107O64J0777n002n237O849J080l552J906k522
$$ plain form
1783 1836 -5168 1815 9385 -71 -3924 6574 5217 -4059 -239 2818 -3591 -472 5810 -1375 -5307
1798 -5307 4374 2143 -7637 -2612 4778 995 -1099 -1144 -7924 -4600 8038 2773 -9658 -3838 2874
1813 2874 -3719 -3241 3739 -1777 -5679 1971 320 -8573 -3476 2404 -2765 -1994 2461 -3782 -5683
1828 -5683 2285 -474 -8693 -1894 4179 -3480 -3474 1593 -6144 -10147 2414 5507 -4700 -5118 -1746
1843 -1746 -4514 -1906 2506 -5042 -8693 1684 208 -9543 -5560 2227 -2765 -3945 -120 -6651 -8507
1858 -8507 2057 1085 -11015 -6219 3228 -1639 -6377 -4151 -6380 -5522 2852 117 -7821 -2043 2480
1873 2480 -7792 -9017 2459 2055 -4271 -1527 -1796 -6251 1173 5916 -4335 -6853 3472 3088 -4070
1888 -4070 -1211 -142 -2121 3952 5106 -5575 -5020 7060 4426 -3952 994 5120 -114 1770 3668
$$ packed form
1783A836p004O983P570r456l853J0498j357r276L820L057o409L119O282p185l932
1798e307R681k231r780N025P390l783k094m5o780L324J2638n265j2431N820O712
1813B874o593M78O980n516l902P650j651q893N097N880n169P71M455o243j901
1828e683P968k759q219O799O073p659ON067p737m003J2561L093j0207m18L372
1843a746k768K608M412p548l651J0377j476r751L983P787m992j180L825o531j856
1858h507J0564r72j2100M796R447m867m738K226k229Q58Q374k735p938N778M523
1873B480j0272j225J1476m04o326K744k69m455P424M743j0251k518J0325l84p158
1888d070K859J069j979O073J154j0681N55J2080k634q378M946M126n234J884J898
$$ plain form
1903 3668 -5117 -4103 8563 8383 -1423 -646 923 -1100 4126 5981 -3665 -2709 8826 5017 -5748
1918 -5748 -1610 3221 419 3093 5196 -3265 -3573 6819 4396 -5321 -807 4935 634 -577 1193
1933 1193 -3159 675 8845 1106 -8279 1098 7949 -1692 -4685 2018 3056 2888 4523 -3889 -8774
1948 -8774 3803 10010 -913 -4102 3499 3717 110 -228 -4350 -3015 9233 8878 -8004 -8056 6389
1963 6389 6539 -2262 -2707 -1369 402 7079 3421 -9317 -4787 8403 4280 -5484 -2037 1261 -881
1978 -881 1895 467 -5388 1599 8575 -3626 -12284 -35 7472 578 -1900 -1590 -3295 553 3673
1993 3673 -4767 -6459 5965 6175 -5513 -4600 2195 -333 -1213 1543 -2790 -2327 7232 3202 -8555
2008 -8555 -3362 7002 2696 -1306 1540 -1365 -2201 4871 3163 -3050 3037 7281 -1623 -4076 4331
$$ packed form
1903C668q785J014J2666j80r806P77J569k023N226J855r646R56J1535l809j0765
1918e748M138M831k802K674K103q461l08J0392k423r717M514N742m301j211J770
1933A193m352L834Q170p739r385R377O851r641k993O703J038j68J635q412m885
1948h774J2577O207j0923l189P601K18l607l38m122J335J2248l55j6882n2J4445
1963F389J50q801m45J338J771O677l658j2738M530J3190m123r764L447L298k142
1978h81K776j428n855O987O976j2201q658J2249P507o894k478L10j705L848L120
1993C673q440j692J2424K10j1688R13O795k528q80K756m333M63R559m030j1757
2008h555N193J0364m306m002K846k905q36P072j708o213O087M244q904k453Q407
$$ plain form
2023 4331 3647 324 5398 3626 -3399 1370 6510 -93 -1179 6409 4663 -337 3980 3351 -2701
2038 -2701 1561 6213 264 535 6973 1924 -4884 2027 5808 234 1517 4422 -1681 -2584 4980
2053 4980 1749 -3083 2482 3880 -3325 -2328 3176 -1159 -568 5359 141 -6262 -125 2842 -3896
2068 -3896 -2166 3096 -1250 -2128 3653 -1186 -8061 -1523 3810 -877 -854 1434 -4834 -4793 2535 -248
2084 -248 -5848 1313 4452 -3499 -3755 1189 -1287 -2389 2727 -788 -5383 994 2892 -4828 -2500
2099 -2500 4515 195 -4276 251 -265 -3193 2489 2926 -4134 -1393 5099 -1919 -6817 515 3674
2114 3674 686 2608 1105 -5802 -2280 4942 -942 -4866 2811 4811 -1374 -1021 14 -4012 651
2129 651 7141 780 -4861 1809 2910 -2493 241 3338 -1234 -200 4544 -267 -3149 4449 4149
$$ packed form
2023D331o84l323N074j772p025M769N140o603j086P588j746n000M317o29o052
2038b701M262M652n949K71O438n049o808O911L781n574J283K905o103r03P564
2053D980l231m832N565J398p205R97N504m335N91N927n218o403O137K967o738
2068c896J730N262m346q78N781m839o875O538N333m687K3K288o268M1P328k783
2084b48n600P161L139p951k56M944k476j102N116l515m595O377J898p720K328
2099b500P015m320m471M527n16k928N682M37p060K741O492p018m898P332L159
2114C674k988J922j503o907L522P222n884l924P677K000o185L53J035m026M663
2129F51O490o361n641O670J101n403K734L097m572J034M744m811k882P598l00
$$ plain form
2144 4149 -2322 1795 5503 -1097 -2102 3719 2135 1312 5787 2908 -3226 1917 5657 -561 64
2159 64 8154 4897 -1143 1574 2123 -1083 4741 7300 -249 -264 6659 3207 -2140 3066 5600 636
2175 636 2711 4239 -711 628 5914 833 -2319 6315 7281 -2864 -2490 3778 2766 2633 4501 -870
2191 -870 -3556 3577 3513 -4449 -668 7228 3240 -1801 -840 -2279 -1311 5341 2194 -6610 -1148 7286
2207 7286 186 -6812 -1839 975 843 2917 -989 -7211 -732 4755 -3468 -7032 1204 1829 -3474
2222 -3474 -2923 -2818 -4786 1347 4261 -5761 -8860 364 1047 -5703 -3518 417 -2214 -1336 -1094 -7629
2238 -7629 -5996 2996 836 -6780 -2401 1258 -4277 -5247 -1950 -4520 -2372 4906 -76 -8642 -3488
2253 -3488 2102 -2165 -3608 -96 -1821 -1915 1886 -3111 -7294 1283 5657 -2544 -4875 683 -956
$$ packed form
2144D149o471M117L708o600j005N821j584q23M475k879o134N143L740o218O25
2159F4Q090l257o040K717N49l206N824K559p549j5O923l452n347N206K534m964
2175F36K075J528m950J339N286n081l152Q634R66j0145L74O268j012j33J868n371
2191h70k686P133o4p962L781P896l988n041R61j439R68O652l147q804N462Q434
2207G286p100o998M973K814j32K074l906o222O479N487q223l564Q236O25n303
2222c474N51J05j968O133K914j0022l099R224O83o750K185L935k631Q78K42o535
2238g629J633Q992k160p616M379L659n535r70L297k570K148P278m982q566N154
2253c488N590m267j443L512j725r4L801m997m183Q577M374q201k331N558j639
$$ plain form
2268 -956 -1636 2719 -24 -5153 1000 4058 -3476 -5192 1681 1926 412 2300 -1717 -5193 934 3055
2284 3055 -4001 -2432 5073 1784 -4476 -1425 -1062 -3038 2279 4055 -3601 -3228 3183 -335 -5463
2299 -5463 -643 1656 -384 1321 -372 -6112 -1796 6452 -167 -6725 71 4242 -2077 -2874 -583
2314 -583 -2021 1984 5795 -1903 -6924 1047 5055 -1171 -1761 1639 459 1667 2610 -5483 -5840 6261
2330 6261 7538 -3515 -3831 2752 1175 -869 132 -1597 -985 5632 1654 -7665 -3205 5434 2104
2345 2104 -3031 -748 -1238 -520 3555 -1204 -7644 186 8542 -900 -8222 -2272 2217 -13 710 -1126
2361 -1126 -3055 2004 3466 -5800 -7115 3073 4843 -1019 -1456 -1678 -3498 1811 3815 -3556 -3936
2376 -3936 5818 4394 -4198 -3377 1027 337 1764 2201 -3027 -1587 5657 1633 -4811 436 5599 939
$$ packed form
2268i56o80M355k743n129O153L058p534j716O873K45j514J888m017l476O127K121
2284C055p056J569P505l289o260L051L63j976N317J776p656L73O411l518n128
2299e463M820K299k040J705j693n740M316Q248o619o558O796M171o319p97K291
2314e83j438M005L811p698n021P971M008o226n90L400j180J208R43q093l57J2101
2330F261J277j1053l16O583j577k044J001j729O12O617l978r319M460Q639l330
2345B104n135K283m90P18M075m759o440P830Q356r442p322N950M489k230P23j836
2361a126j929N059J462r266j315J0188J770n862m37k22j820N309K004p371l80
2376c936R754j424q592Q21M404o90J427M37n228J440P244m024o444N247N163m660
$$ plain form
2392 939 -47 973 -3067 -798 7394 4069 -4685 -676 4400 435 -1183 1733 825 2165 5761 -113
2408 -113 -5922 939 5564 -154 -104 4423 765 -1200 2701 183 -4230 2212 7017 233 -2697 1045
2424 1045 -129 -678 2953 727 -1962 3234 3933 -3363 -2810 4471 2619 -1281 1797 222 -3176 1937
2440 1937 4635 -1807 -1744 4617 1900 -3157 -1023 473 -119 3613 2892 -4275 -2170 4304 -298 -4735
2456 -4735 1388 3703 -315 -82 574 -4816 -2535 4433 1137 -4004 -512 955 -2511 -847 395
2471 395 -3388 -636 3481 -2402 -6898 126 2234 -3119 -1514 1257 -3086 -3510 1106 -1904 -5119
2486 -5119 993 2472 -2970 -3135 -1267 -3761 -1810 2496 -1425 -4100 1997 1381 -5728 -2907 2693
2501 2693 -915 -2274 2007 -620 -4293 266 2025 -1930 -131 2684 -1110 -1499 2136 -626 -2211
$$ packed form
2392I39r86J020m040K269Q192l325q754M009N076l965j618K916r08J340L596n874
2408a13n809O861M625n718N0M527l658j965L901k518m413O442M805o784k930L742
2424A045j174n49L631k226k689N196O99p296N53P281j852l900L078j575l398N113
2440A937K698o442O3O361k717n057K134J496n92L732p21p167K105O474m602m437
2456d735O123K315m018K33O56n390K281O968l296n141L492J467l466J664J242
2471C95l783K752M117n883m496P024K108n353J605K771m343m24M616l010l215
2486e119O112J479n442j65J868k494J951M306l921k675O097o16p109K821N600
2501B693l608j359M281k627l673M559J759l955J799K815l794l89L635k762j585
$$ plain form
2516 -2211 3617 3676 -3341 -1102 3790 191 -1362 3619 2885 -793 2801 2412 -2765 -401 5801 2867
2532 2867 32 2812 942 -1388 3211 2670 -1656 2432 7793 480 -4018 2039 3041 54 1922
2547 1922 2974 -1401 799 4533 -248 -2875 3254 3341 -531 1244 1013 -2937 796 4889 -607 -3061
2563 -3061 3324 2457 -3901 -862 3079 339 333 2233 -2639 -3712 2188 1537 -2641 1352 3741 -1541
2579 -1541 -1541 1546 -2141 -1705 4733 2523 -4018 -280 3526 -1736 -2924 1964 1304 169 2991 168
2595 168 -4312 1034 4004 -831 -1319 2821 -449 -2644 2171 1040 -2682 1832 4443 -2599 -4203
2610 -4203 1539 1057 -1633 928 484 -2773 247 1224 -4033 -2295 4336 952 -3526 159 152 -3980
2626 -3980 -377 2814 -2459 -2586 3248 -47 -4840 -628 1387 -560 843 1621 -3413 -2139 3452
$$ packed form
2516b211N828N9p017K239M892l599j553M981p34l678L594l89n177K364O202k934
2532B867k835K780j870k330M599n41m326M088N361p313m498O057J002k987J868
2547A922J052m375K200L734m781k627O129Q7l872J775k31l950L733M093n496k454
2563c061O385q67o358L039L941k740oJ900m872j073N900o51m178L993K389n282
2579a541%L087l687M36O438k210o541L738L806n262j188M888o60j135K822k823
2595A68m480N346K970m835m88M140l270k195M815j131l722M514K611p042j604
2610d203N742m82k690K561m44l257L020R77n257J738O631l384m478L685pm132
2626c980L603L191n273j27N834l295m793M212K015j947J403P78n034J274N591
$$ plain form
2641 3452 -217 -3497 2249 3263 -2185 -707 2100 -1221 -263 5223 1850 -3088 1137 3495 -1674
2656 -1674 -373 3370 1345 1461 3966 -823 -3347 3444 4862 -957 643 4640 601 -1353 2333
2671 2333 965 -1325 3903 4499 -2206 -1163 3116 962 -157 2625 600 -1592 3030 2307 -3729
2686 -3729 -437 5325 931 -2182 1682 526 -2261 2025 2885 -1951 118 3951 -478 -3422 958
2701 958 1751 28 2519 1976 -3225 -508 3296 -1440 -3436 3132 3162 -2141 -607 675 -2406 -398
2717 -398 3511 -1052 -2996 1328 1014 -3683 -1386 809 -2426 -564 2035 -3405 -4734 1608 1098 -3988
2733 -3988 -1687 645 -3260 -3317 93 -2768 -3717 1672 275 -5148 -2861 -63 -2954 -2005 1024 -2196
2749 -2196 -3837 1014 -799 -6114 -1286 3343 -1081 -2358 1259 -1242 -2693 1487 693 -2759 1036
$$ packed form
2641C452l669l280N746J014n448J478K807l321R58N486l373m938M225K358n169
2656a674J301L743k025J16K505m789k524O791J418n819J600L997m039j954L686
2671B333j368k290N228N96o705J043M279k154j119K782k025k192M622p23o036
2686c729L292N762m394l113L864j156k787M286Q60m836K069L833m429k944M380
2701I58P93j723K491n43n201K717L804m736j996O568L0n303J534J282l081K008
2717c98L909m563j944M324l14m697K297K195l235J862K599n440j329O342n10n086
2733c988K301K332l905n7L410k861r49N389j397n423K287K798k891R49L029l220
2749b196j641M851j813n315M828M629m424j277L617k501j451M180p94l452L795
$$ plain form
2764 1036 3520 -1520 -2134 2256 874 -621 3542 2098 -2518 866 4333 -641 -972 4152 2412
2779 2412 -813 1889 1974 -1727 2067 4923 264 -527 3325 998 -1796 2528 2577 -1168 1857 4041
2795 4041 -1399 -2477 3261 1727 -1392 1954 2243 -1870 185 2250 -1486 -1144 3688 1273 -2396
2810 -2396 1037 1642 -2051 725 3938 -424 -1591 2914 387 -2962 1423 3205 -910 480 2853
2825 2853 -1270 -1712 3107 1669 -1545 2707 2922 -1747 -133 3187 -146 -1236 4093 1889 -2380
2840 -2380 1350 2475 -1783 -171 3452 -337 -1392 2347 399 -2729 1350 2620 -1935 -419 2536
2855 2536 -1471 -2347 2320 663 -3119 216 1683 -3254 -2203 1515 -1158 -2006 2260 367 -4269
2870 -4269 -1008 964 -2822 -1681 1882 -998 -3010 1203 -679 -4127 -119 2338 -2022 -1721 1794
$$ packed form
2764A036K484n040o14M390j382j495M163j444m616L384L467m974l31N124j740
2779B412l225K702Q5l701L794K856m659p91L852k327k794M324M9l745L025K184
2795D041n440j078N738j534l119L346K89m113K055K065l736L42M832k415l669
2810b396L433O05l693K776L213m362j167M505k527l349M385J782m115J390K373
2825B853m123m42M819j438l214M252K15m669J614L320l333j090N329k204m269
2840b380L730J125m258J612L623l789j055L739j948l128M079J270m555J516K955
2855B536m007q76M667j657l782L335J467m937J051L718k673q48M266j893m636
2870d269L261J972l786J141L563k880k012M213j882l448M008K457m360L01L515
$$ plain form
2885 1794 -1275 -3045 1232 503 -3045 282 2470 -2376 -2077 2315 -447 -1886 1811 441 -3347
2900 -3347 110 2152 -1879 -1524 2697 -38 -2541 1035 452 -2482 888 3020 -1821 -1745 1947 -594
2916 -594 -3031 1390 1505 -2396 510 2114 -2556 -2333 2167 -18 -2236 1232 1129 -3071 -438 1908
2932 1908 -2007 -1460 2999 259 -2862 1290 1479 -2162 377 2730 -1438 -1377 2907 -44 -2713 1848
2948 1848 2755 -1300 489 2565 -1602 -1398 3345 1020 -1954 1624 2551 -1508 -324 2280 -686 -589
2964 -589 3252 684 -2752 954 1924 -2023 74 2349 -1549 -1762 2455 -240 -3602 690 2116 -2460
2980 -2460 -1972 787 -2444 -2439 1317 -1073 -3664 108 1343 -3563 -2552 863 -2261 -2228 1109 -1493
2996 -1493 -4825 -285 1182 -3334 -2157 1388 -1200 -2807 915 -790 -3630 936 1814 -2876 -1621
$$ packed form
2885A794l069j770M277p29l548L327K188m846K99M392k762j439L697j370l788
2900c347L457K042m031L55M221k735k503L576n83k934L370K132m841P6L692k541
2916e94k437M421J15l901K906J604m670K23M500k185k218L468j03m200K633K346
2932A908l915N47M459k740l121M152J89l641K539K353m168O1M284k951k669M561
2948A848R07m055J789K076m167K04M743k325k974L578R27m059J184K604k966R7
2964e89L841k568l436L706R70l947K097K275l898k13M217k695l362M292J426m576
2980b460M88K759l231NL756k390k591L772J235m906J011L415l124L3L337k602
2996a493l332M540J467m516J177L545k588j607L722j705k840M566Q78m690J255
$$ plain form
3011 -1621 2407 -1086 -2444 1474 766 -2052 1474 2125 -2545 -1139 3316 106 -1693 2002 1478 -1643
3027 -1643 1266 2133 -1622 366 4041 130 -2294 1744 1844 -1371 1562 2516 -1915 -214 3806 171
3043 171 -2731 1623 2678 -826 618 1383 -1990 -418 3275 -444 -2423 2033 1931 -2043 -44 2099
3059 2099 -1498 -211 3566 -285 -3152 1975 2161 -1505 148 2352 -638 109 2875 -213 -1635
3074 -1635 3206 2472 -1997 496 3169 -556 -733 2949 381 -1337 2785 2657 -2474 157 3429 104
3090 104 -377 2165 -8 -1507 2393 1227 -3360 353 3660 -993 -2378 1266 -36 -2312 940
3105 940 462 -3552 -506 2156 -1732 -2822 987 -577 -2476 448 -509 -4096 -954 1856 -2760 -3359
3121 -3359 1130 -314 -3491 -237 610 -3006 -985 1864 -1881 -3269 791 -168 -2434 36 569 -2769
$$ packed form
3011a621M028l493j358L918p08k818L526O51m670J406M455l210j799L695n24l121
3027a643K909Q67l755J988L675l911k424M038J00l215K933R54m431J701M020l635
3043A71k902M354J055l504J444P65l373J572L693l719j979M456j02l974J999K143
3059B099l597J287L777l851k867N127J86l666J653K204k990P47K766l088j422
3074a635M841p34m469K493K673l725j77L682k568j718M122j28n131K631L272l325
3090A04m81K542k173j499L900j166m587L713L307m653j385L644j302k276L252
3105I40m78m014L046K662l888j090L809j564j899K924r57l587L142K810m616n99
3121c359M489j444l177L254Q47l616K021K849l745j388M060r59k266K470N33l338
$$ plain form
3137 -2769 -548 2086 -2092 -2440 2502 953 -3081 427 2009 -2086 -498 2113 -860 -1674 2560
3152 2560 1093 -2207 634 2122 -1303 -172 2216 -879 -997 2638 674 -2592 1050 2979 -1077
3167 -1077 -945 2309 -240 -968 2658 756 -2293 1293 2793 -857 -526 2716 -257 -572 3204 938
3183 938 -2729 1847 4009 -998 -1052 3042 1208 -369 2406 1110 -1148 2395 3477 -874 -311 3356
3199 3356 839 -813 2228 1762 -1215 1912 3045 -1494 -556 4014 671 -2093 1511 2303 -530 312
3215 312 1585 -1179 323 3377 -206 -2590 1637 1972 -1737 60 1186 -1886 -549 2456 -960
3230 -960 -3685 1371 1967 -2188 -1269 967 -826 -648 1682 -1284 -2858 1506 1426 -3213 -1197 1317
3246 1317 -1628 -1590 1725 -1114 -3186 1138 1572 -3095 -1356 1854 -701 -1615 881 -594 -1660 1581
$$ packed form
3137b769K221K634m178l48M942j549m034L508J582m095J588K611k973q14M234
3152B560j467l300K841J488l425J131K388l095j18L635j964l266L642J929m056
3167a077J32L254k549p28L626j902l049L586J500l650L31L242k973l15L776k266
3183I38l667M576K162n007n4M094j834j577K775j296k258L543J082m351N63L667
3199C356k517j652L041m66k977L127J133m539R38M570l343k764L604P92k833Q42
3215C12J273k764J502L054l583k384M227L35l709J797J126l072J337L005l416
3230i60k725N056N96m155R19K236j793J78K330k966j574M364q0m639K016K514
3246A317k945L8L315k839k072M324M34m667J739L210k555r14K496j475j066L241
$$ plain form
3262 1581 218 -3495 -205 2618 -1133 -2421 1526 138 -2098 1098 969 -2928 -444 2889 -773
3277 -773 -2719 1409 1001 -1030 820 42 -2242 668 3030 -1707 -2360 2718 1914 -1669 267 933
3293 933 -1589 660 3315 -1099 -2541 2528 2234 -1715 -242 1323 -238 1621 2475 -1711 -1608 3819
3309 3819 2207 -2501 275 2835 -28 465 2117 -607 -588 3348 1438 -2438 668 3296 -61 -625
3325 -625 1588 13 -83 2860 209 -2698 2140 4471 -771 -1466 1845 715 -355 1328 208 -1679
3341 -1679 2031 3199 -1729 -1954 1895 1026 -241 1345 -384 -2287 1999 2575 -2964 -1921 2898 591
3357 591 -1813 337 39 -1671 809 1722 -2434 -1850 2163 -522 -2234 300 167 -2159 545 1266
3373 1266 -2982 -1970 2482 -255 -2817 258 1003 -2124 -455 977 -1753 -935 2062 -807 -2951
$$ packed form
3262A581j363l713L290K823l751j288L947j388k236L196j29l897K484L333l662
3277g73j946M128m08k031J850p78k284K910K362m737o53N078q04l583J936O66
3293I33k522K249K655m414j442N069k94l949J473J565j561J859Q54m186J03N427
3309C819j612m708K776K560k863M93J652k724J9L936j910l876L106K628l357n64
3325f25K213j575r6K943k651k907M838K331n242o95L311j130j070J683j120j887
3341a679L710J168m928k25L849q69j267J586j729j903M286N76n539J043M819k307
3357E91k404K150k98j710K480R13m156N84M013k685j712K534j33k326K704P21
3373A266m248J012M452k737k562L075P45l127J669J432k730Q18K997k869k144
$$ plain form
3388 -2951 513 752 -2132 -372 853 -2251 -909 2219 -1130 -3612 1212 2043 -1729 -1456 732 -1232
3404 -1232 -772 1731 -1249 -2712 1555 1744 -2065 -1626 1007 -740 -56 1584 -1365 -2937 1757 2296
3420 2296 -2699 -1604 2405 155 -1114 811 -1041 -1812 1911 1574 -2625 -403 2394 -462 -1334 1527
3436 1527 330 -864 2029 1599 -2319 -165 3616 101 -1158 2006 1423 -466 1820 1646 -503 1340
3452 1340 3801 -231 -789 2764 1957 -712 1853 2385 -365 1086 3192 -453 -1651 2830 2657 -506
3468 -506 598 1744 -515 721 2068 -997 -1160 2390 1170 -2026 -79 1342 -1630 -56 1852
3483 1852 -1374 -2375 1124 1015 -2604 -1067 571 -1510 -957 362 -1970 -2496 1655 262 -2934 -829
3499 -829 566 -2147 -1525 1257 -1130 -1919 1779 637 -3240 -854 1719 -791 -949 1513 -286 -1293
$$ packed form
3388b951L464K39k884J760J225l104J342L128l349k482M824Q31l772K73K188j964
3404a232M60K503k980j463M267J89l809M39K633j747O84J640k949j572M694N39
3420B296m995J095M009k250j269J925j852p71L723l37m199K222K797k856q72K861
3436A527j197j194K893m30l918K154L781l515j259L164n83j889K286j74k149J843
3452A340K461m032n58L553q07k669K565N32k750J451K106l645j198M481j73l163
3468e06J104J146k259J236J347l065j63L550j220l196J947J421k972J574J908
3483A852l226j001L499j09l619J537J638k081N53J319k332n26M151j393l196K105
3499h29J395k713O22K782k387p89L698j142l877K386K573k510j58K462j799j007
$$ plain form
3515 -1293 1204 259 -2051 1123 2473 -938 -1063 1923 682 -1298 1501 528 -1470 1340 2400 -1605
3531 -1605 -1341 2528 1236 -969 541 3 -1153 991 1571 -1982 -1379 2822 698 -2424 11 731
3547 731 -864 867 1704 -1818 -1250 1885 52 -2406 312 1555 -881 38 1264 -1638 -265 2574
3563 2574 -59 -1646 1846 2224 -1386 -139 2473 645 349 2585 430 -930 2476 2512 -781 869
3579 869 2880 401 -467 1733 575 -537 2677 2250 -1361 184 2797 237 -678 1447 580 -611
3595 -611 1534 921 -2119 -603 2192 -121 -1432 1073 -125 -1759 395 526 -2669 -805 1863 -1128
3611 -1128 -2777 -60 -347 -2017 377 310 -2686 -1472 878 -1575 -2323 611 148 -2012 203 77
3627 77 -2878 -664 1946 -1055 -1889 991 644 -2406 -595 331 -1249 -320 2050 -1261 -1644 1033 460
$$ packed form
3515a293K497r45k310L174J350l411j25K986j241j980K799r73j998K810J060m005
3531a605K64L869j292k205J510n38j156K144N80l553O03M201k124l122K435P20
3547G31j595J731Q37l522N68L135j833k458K718J243k436R19J226k902J373K839
3563B574k633j587L492L78l610J247K612j828k96K236k155j360L406L6l293J650
3579H69K011k479q68K200j158j112L214m27l611J545K613k560r15K125q67j191
3595f11K145o13l040J516K795k313j311K505j198j634K154J31l195J864K668k991
3611a128j649K717k87j670K394o7k996J214K350k453p48K934m63k160K215j26
3627G7k955K214K610l001q34K880l47l050J811R26j580R29K370l311l83K677n73
$$ plain form
3644 460 -2362 -567 1210 -749 -371 417 -2207 -1728 2247 767 -3111 -1120 1209 -588 -1243 577
3660 577 -1161 -1028 1340 -182 -3708 -656 1855 -751 -1079 425 -1023 -1525 767 -702 -2972 518
3676 518 2649 -1720 -2365 653 -115 -1189 634 169 -1346 921 1707 -2080 -1956 2017 921 -1316
3692 -1316 96 451 -1015 765 1490 -1633 -929 2839 973 -1914 411 1288 -293 967 1264 -1390
3708 -1390 -743 2470 197 -2078 1157 2156 -1030 -201 665 -1055 -357 2485 94 -2207 1174 1168 -1581
3725 -1581 -742 1322 -305 -304 1757 -543 -2370 789 1040 -1352 -681 1293 -645 -990 784 -414 -1708
3742 -1708 1482 1500 -2071 -1407 1097 -478 -961 1198 -168 -1783 751 607 -2591 -885 1775 -195
3758 -195 -1716 416 -920 -2137 437 396 -2626 -647 2048 -863 -2616 -194 -146 -1617 403 220
$$ packed form
3644D60k822J795J777j959L78P88k624M79L975j480l878J991K329j797o55J820
3660E77j738J33K368j522l526L052K511k606l28J504j448n02K292j469k270L490
3676E18K131m369o45L018p68j074J823m65j515K267P86l787J24L973j096k237
3692a316J412L55j466J780P25l123P04L768j866k887K325Q77j581J260K97k654
3708a390O47L213k273k275L235R99l186Q29Q66j720O98K842k391k301L381ok749
3725a581Q39K064j627JK061k300j827L159K51k392O71J974j938l45J774j198j294
3742a708L190J8l571O64K504j575m83K159j366j615K534j44l198J706K660j970
3758a95j521K132j336j217K574m1l022J979K695k911j753K422M8j471K020j83
$$ plain form
3774 220 -2518 -713 1442 -961 -2585 591 483 -1361 -236 -460 -2417 -260 2386 -1035 -2573 707
3790 707 762 -1847 -223 797 -1037 348 1553 -1367 -2217 1483 1467 -1333 64 1320 107 -61 1041
3807 1041 -1477 -772 3020 1661 -1695 121 2124 119 -673 1183 286 519 2533 450 -2216 1134
3823 1134 3409 189 -843 1612 636 484 2180 924 -1115 1626 3358 -610 -1241 1527 1156 157
3839 157 1700 948 -1218 921 2160 -1373 -398 2717 1426 -920 973 697 -1022 838 1856 -816
3855 -816 -614 2326 412 -1992 663 1329 -409 598 984 -1600 -878 1933 -106 -2180 662 1402
3871 1402 -1155 -545 690 -1343 -786 2042 -108 -2523 -165 999 -1386 -551 814 -926 -936 1269
3887 1269 -1028 -2939 329 1451 -1400 -1020 720 -1127 -1197 680 -916 -2269 568 911 -1954 -1588
$$ packed form
3774B20k738J805K155k403j624L176j08j844J125k24j957K157K646l421j538L280
3790G07N5k609J624J020j834J385J205k920q50L700j6k800J397J256j213j68J102
3807A041k518P05L792j359l356J816K003k005p92J856q97K33K014k083k666L350
3823A134K275l220j032K455r76j52J696j256k039K741J732l968o31K768l71r99
3839A57J543p52k166K139J239l533R75L115j291k346J893k76j719J860J018k672
3855h16K02K940j914k404K655O66j738J007L86k584P22K811k039k074K842P40
3871A402k557O10J235k033N57K828k150k415K358J164k385Q35J365j740j0K205
3887A269k297j911L268J122k851L80J740j847p0J877j596j353K837L43k865L66
$$ plain form
3903 -1588 416 -898 -896 1376 -1099 -2267 725 697 -2551 -1342 1490 46 -1207 -67 -999 -1645 1260
3920 1260 1425 -1577 -627 1709 -601 -1820 240 521 -99 1531 884 -1706 -146 2298 -616 -1756
3936 -1756 1422 1636 -623 622 435 -1145 489 2754 -334 -1540 1720 1603 -929 -13 834 -364
3952 -364 758 1864 -1297 -2175 2343 2062 -1338 -355 1274 -460 -362 939 -720 -479 2241 1248 -1808
3969 -1808 -95 1044 -802 -33 1550 -293 -896 1569 112 -2438 -75 1981 -385 -622 1379 -390
3985 -390 -1083 869 200 -1303 633 1478 -1326 -1062 1365 223 -1032 1284 385 -1743 118 1596
4001 1596 -1004 -1149 1345 630 -1305 556 -145 -1640 722 1627 -787 -961 1331 -390 -1558 417
4017 417 600 -1648 261 1300 -1717 -2286 802 150 -1817 113 251 -1205 -205 516 -1878 -1369 1598
$$ packed form
3903a588K004j314KK272k475j168K992k8l248J209K832j444j253J140r32o46K905
3920A260J65l002R50K336k310j219K060K81o20J630o47k590J560K444k914j140
3936a756L178K14k259J245j87j580J634K265l088j206L260j17k532R16Q47j198
3952c64J122J106l161q78M518k81l400R83J629j734R8J301j659K41K720r93l056
3969a808J713J139j846P69J583j843o03K465j457k550K363K056k366k37K001j769
3985c90o93J952o69j503J936Q45k804K64K427j142j255K316q99k128J861J478
4001A596k600j45K494p15j935J861p01j495K362R05k414j74K292j721j168J975
4017D17J83k248J909J039l017n69L088o52j967J930J38j456J000P21k394N09K967
$$ plain form
4034 1598 -73 -2453 -282 361 -1420 150 498 -1344 -1214 1949 -216 -2480 64 1457 -274 -195
4050 -195 167 -1246 -483 1599 -187 -1565 1196 1898 -1032 -808 1010 4 24 1729 207 -1592 1647
4067 1647 2177 -1193 -172 2030 591 -325 1359 -237 -666 1856 1582 -1431 118 2309 -89 -1151
4083 -1151 1179 1189 -313 1480 961 -1717 -586 2252 95 -1036 1093 1167 -406 946 692 -1291
4099 -1291 752 2608 -185 -1463 986 828 -1477 534 1496 -854 13 1788 0 -1104 1408 1011
4115 1011 -676 679 1190 -825 90 1926 10 -834 1987 1014 -1544 389 1623 -635 278 1722
4131 1722 -338 -1479 947 773 -1276 102 1317 -282 -211 609 -1213 -1607 1067 1080 -1948 -39 1276
4148 1276 -1193 -1341 336 -706 -986 980 203 -2494 -654 1026 -1263 -1250 327 -759 -1171 860
$$ packed form
4034A598j671k380K171O43j781J570L48j842J30L163k165k264K544J393j731P9
4050a95L62j413P63K082j786j378K761P02k930K24J818j006K0J705j522j799L239
4067A647N30l370J021K202j439r16J684j596m29K522k74l013J549K191k398j062
4083a151K330J0j502J793n19k678J131K838k157j131K129P4j573J352k54j983
4099a291K043J856k793j278K449j58k305K011R62k350Q67J775j788j104K512l97
4115A011j687J355N11k015R15J836j916q44K821r73k558J933J234k258R13J444
4131A722k060j141K426j74k049J378J215j599P1Q20j822l94K674J3l028J909J315
4148A276k469j48J677j042k80J966p77k697J840J680k289J3J577j086m12K031
$$ plain form
4164 860 -260 -2284 113 1628 -1454 -2056 445 -319 -1161 218 278 -1426 69 1041 -1799 -1522 1468
4181 1468 724 -1184 575 81 -1339 265 1521 -1142 -599 2026 734 -1332 653 1206 -692 386
4197 386 1481 -346 -367 1711 2 -1370 1284 2006 -877 132 1421 -442 -285 1927 345 -891
4213 -891 1689 1746 -940 -331 1628 181 238 1425 -21 -1206 1022 1123 -1105 149 1727 -54 -861
4230 -861 1189 143 -1546 750 1416 -919 -678 1337 -566 -1008 1088 214 -1384 284 713 -1659
4246 -1659 -713 1222 -591 -907 1177 51 -1948 -504 1321 -1361 -477 1021 -686 -1594 369 -357
4262 -357 -2050 495 548 -1574 -734 668 -1863 -1578 625 378 -1514 -193 631 -1811 -990 720 -715
4279 -715 -1646 488 185 -1913 -426 472 -1552 -956 908 -1020 -1916 675 153 -1952 -441 987 -1391
$$ packed form
4164H60j120k024K397J515l082o02K501p64q42J379O0j704J495R72k840K77K990
4181A468p44j908J759m94j420J604J256k663N43K625j292k066J985N53j898J078
4197C86J095j827k1K078j709j372K654P22k883J009J289j863J57K212j582j236
4213h91K580N7k686O09J959j447N7J187j446j185K228J01k228J254J578j781q07
4230h61K050j046j689K296O66k335K41K015j903m42K096q74j598J668M29k372
4246a659R46J935j813l16K084j126j999J444J825k682Q84J498j707r08J963p26
4262c57j693K545N3k122Q40J402k531K85K203k47j892J321Q24k442Q21J710j435
4279g15r31K134l03k098J487Q98k024N96J864j928q96K591n22k105J511J428k378
$$ plain form
4296 -1391 -1214 876 -1040 -1508 1051 395 -1820 -375 923 -1070 -1168 1041 14 -882 1240 55
4312 55 -1695 248 1638 -1023 -1019 1400 619 -1029 681 480 -962 486 1693 -789 -371 1674 252
4329 252 -977 1167 1282 -790 742 1091 -663 -390 2105 611 -1132 1220 1494 -750 -46 1322
4345 1322 -92 128 2120 528 -1378 1140 1599 -470 293 1646 -93 -172 1678 -9 -1436 1374
4361 1374 1800 -982 -385 1262 -223 -820 1083 -106 -878 940 405 -1713 -502 1384 -247 -946
4377 -946 925 -146 -1493 249 825 -1646 -504 1294 -1054 -1719 463 -341 -1385 255 466 -1818
4393 -1818 -778 810 -1218 -1713 210 354 -1659 215 646 -1976 -796 909 -757 -1673 778 219
4409 219 -1414 -71 1014 -1274 -116 1302 -389 -1385 1045 846 -991 669 1161 -857 -188 1284
$$ packed form
4296a391J77K090j916m68K559o56k215J445J298j993r8K209j027q96K122j185
4312E5j750J943J390k661MK419p81j648J710k01j442J448J207k482M18K045j422
4329B52j229K144J15k072J532L49j754K73K495j494j743K352K74k244P04J368
4345A322j414K20J992j592j906K518M59k069P63J353j739p9J850j687j427K810
4361A374M26k782N97J647j485n97J903j189p72J818n35k118J211J886j631o99
4377i46J871j071j347J742N76k471J142J798k348o65K182q04j044J640K11k284
4393a818J040J588k028m95J923J44k013J874M31k622J180J705j666r16K451n59
4409B19j633J343J085k288J158J418j691r96K430j99j837J660M92k018O69J472
$$ plain form
4425 1284 -362 -1043 1556 1171 -1099 297 657 -681 -15 1257 -146 -732 1414 750 -1733 -85
4441 -85 1295 -562 17 1121 -329 -1350 1007 321 -1337 -4 1413 -915 -748 956 -390 -1205
4457 -1205 928 335 -1407 523 1266 -1117 -589 1650 314 -675 471 548 -1088 795 1406 -481 -170
4474 -170 1736 181 -906 589 1113 -389 1202 1736 -393 -52 1808 379 -859 1522 1679 -579
4490 -579 455 1670 -989 -80 1715 441 -1512 998 1196 -1001 316 1340 -525 -621 1182 -418
4506 -418 -1427 730 818 -1309 -90 1290 -953 -1268 764 -364 -1439 429 444 -1787 -449 726
4522 726 -1213 -1525 701 -93 -1565 152 348 -1626 -232 1087 -984 -1184 581 -29 -1626 415
4538 415 688 -1136 56 1250 -664 -1510 756 411 -1077 445 730 -1213 -515 1316 -719 -1045 1122
$$ packed form
4425A284j646o81K599l85k270J396L60j338O66J272j403n86K146o64k483J648
4441h5J380j857N79J104j450j021K357o86j658J333J417k328J67J704j346q15
4457a205K133n93j742J930P43k383N28K239j336r89J146P7j636J883O11j887L11
4474a70J906j555j087J495N24j502J591N34k129L41J860j429j238K381J57k258
4490e79J034J215k659R09J795j274j953K510J98k197J317J024j865r6J803j600
4506d18j009K157Q8k127J219J380k243l15K032j128j075J868J5k231J338J175
4522G26j939l12K226p94j472J717J96j974J394J319k071k00J765o10j597K041
4538D15K73j824J192J194j914q46K266l45j488J522K85j943O98J831k035l26K167
$$ plain form
4555 1122 408 -1207 296 611 -1256 -410 1297 -584 -1422 920 413 -1534 78 440 -933 -358 1151
4572 1151 -448 -1086 1092 289 -1244 233 1128 -886 -247 974 -522 -925 1291 1217 -1042 619 1424
4589 1424 -712 -244 1530 355 -355 1311 318 -952 984 1880 -179 -219 1581 310 -516 1475 916
4606 916 -177 955 1891 -369 -229 1638 354 -466 1173 975 -800 688 1417 -711 -528 1680 500
4623 500 -1001 762 479 -1245 318 1259 -818 -789 1019 -5 -1215 686 497 -1186 -10 608 -994
4640 -994 -1101 1058 -109 -1431 578 533 -1510 -414 566 -866 -827 969 -299 -1641 270 246 -1562
4657 -1562 -347 818 -1081 -1019 813 -490 -1662 338 635 -1700 -416 707 -757 -942 530 -232
4673 -232 -1472 606 232 -1311 -557 1053 -971 -1026 828 -12 -1660 199 823 -1451 -409 1024 -921
$$ packed form
4555A122p14j615J503L15j867Q46J707j881q38K342n07j947J612L62j373N75J509
4572A151j599o38K178q03j533J477Q95k014O39J221j496m03K216p4k259J661Q05
4589A424k136M68J774j175p10J666r93j270J936Q96k059m0J800j271q26J991n59
4606I16j093J132R36k260J40J867j284q20J639j98j775J488P29k128J83K208j180
4623E00j501J763k83j724J563R41k077K9J808j024j210J901j89j683J176O18j602
4640i94j07K159j167j322K009m5k043J096R80j432L9J796j268j342J911k4j808
4657a562J215J165j899O2J832j303j172K000K97k335J284J123j464j85J472p62
4673b32j240K078l74j543P54J610k024n5J854q40j648J859O24k274J042J433j945
$$ plain form
4690 -921 -722 847 271 -1150 478 574 -932 -337 1102 -313 -623 962 224 -1204 917 826 -1125
4707 -1125 21 1294 -207 -256 1301 422 -844 844 1174 -577 325 1670 17 -291 1311 648 -941
4724 -941 711 1430 -537 125 1188 -85 -1125 1017 811 -1025 559 1463 -617 12 1264 -346
4740 -346 -718 1443 711 -1138 258 874 -615 -218 1173 -343 -983 776 675 -1097 302 524 -871
4757 -871 -669 798 -422 -1104 896 472 -1239 191 852 -903 -916 1085 -446 -1311 582 271 -1408
4774 -1408 30 701 -959 -552 901 -62 -1324 470 8 -1486 28 838 -1128 -1290 588 -447
4790 -447 -1236 313 124 -1492 -419 596 -1105 -941 1015 -435 -1155 286 164 -1289 -356 833 -847
4807 -847 -540 1292 -105 -1492 556 711 -889 103 1092 -713 -471 1300 -57 -1118 569 749 -932
$$ packed form
4690i21J99J569n76j421J628R6j506N95J439j415l10J585p38j428K121r1j951
4707a125J146J273j501m9J557q79j266J688L30j751R02J345j653l08J602o63j589
4724i41J652P19j967O62J063j273j040K142k06j836J584R04k080O29J252j610
4740c46l72K161p32j849J396O16j489L97J391j516o40J759j01j772J399K22j395
4757h71K02J467j220o82K000m24j711J430O61j755j3K001j531q65J893l11j679
4774a408J438O71j660M07J453r63j262J794m62j494J514Q10j966j62J878j035
4790d47p89J549j89j616J073J015j701J64J956j450p20J441j22j453R33J189j680
4807h47L07J832j397j387K048J55j600R92R89j805K42J771j357j061J687J80j681
$$ plain form
4824 -932 -11 1020 -216 -304 1198 81 -1288 981 1019 -984 -162 975 131 -455 1290 256 -874
4841 -874 900 891 -740 181 1434 -84 -424 1167 80 -824 1013 954 -826 -164 1396 -146 -794 1009
4859 1009 405 -653 292 709 -869 164 1522 -558 -863 1023 547 -796 663 815 -1057 -129 1207
4876 1207 -657 -864 770 853 -896 143 567 -571 -352 771 -741 -852 953 311 -1066 325 675
4893 675 -895 -168 1105 -830 -1265 855 1 -1254 -446 344 -936 -403 594 -789 -977 1028 -296
4910 -296 -1528 -311 607 -1053 -816 338 -728 -1157 414 -191 -1682 -372 475 -994 -725 342 -384
4927 -384 -961 448 -104 -1414 -30 792 -1031 -1047 695 -285 -864 502 -40 -957 -78 1099 -595 -1126
4945 -1126 1023 22 -998 409 282 -990 545 1048 -640 -530 1524 45 -825 737 1001 -632
$$ packed form
4824i32R21J031j236q8J502j117j369K269L8k003Q22J137q44n86J745j034j130
4841h74J774rj631R21J253j518l40J591j087r04J837n9j780O62J560j542o48J803
4859A009o04j058R45M17j578J033J358k080l05J886m76j343J459J52j872R28J336
4876A207j864k07J634Q3j749J039M24j138K19J123j512j11J805o42j377J391L50
4893F75j570P27J273j935m35K120q54j255Q08P90j280N33R97j383j88K005j324
4910b96j232J217R18j660K37J154j066m29J571o05j491J310Q47j469K69J067p26
4927c84n77J409n52j310J384Q22j823j6J742r80n79J366n42r17Q79J177j694n31
4945a126K149j001j020J407j27j272J535N03j688J10K054j479q70J562K64j633
$$ plain form
4961 -632 545 1111 -443 -247 1237 634 -689 832 1259 -306 535 1149 -124 2 1228 156 -782
4978 -782 1060 1060 -765 260 1372 -441 -435 1234 346 -694 940 1058 -331 -10 1272 -44 -98 1126
4996 1126 -69 -871 612 866 -915 140 1419 -342 -428 1048 51 -828 591 1110 -1164 -273 749
5013 749 -41 -552 463 -49 -899 652 595 -775 -273 750 -237 -843 420 231 -1063 444 505 -953
5031 -953 -173 562 2 -803 672 387 -647 141 431 -1115 -412 865 -804 -1141 200 408 -1135 -54
5049 -54 527 -1100 -327 421 -584 -823 543 102 -1288 233 366 -941 -315 387 -721 -1270 702 216
5067 216 -1206 -293 720 -435 -582 546 -437 -1004 830 -89 -1186 190 844 -564 -232 855 89
5084 89 -782 1017 493 -1020 532 989 -433 -330 1071 150 -512 599 703 -650 291 832 -460 -167
$$ packed form
4961f32J177N66j554J96J484o03j323J521M27j565Q41O14j273J26J226j072r38
4978g82J842%j825J025J112j813OJ669q88j040J634J18j389L21J282j316n4J224
4996A126j195q02J483K54j781J055J279j761q6J476r97q79J419N19k274Q91J022
5013G49p90n11J015n12q50J551n7j370N02J023r87o06J263j89j294J507O1j458
5031i53P80P35n60q05J475k85j034P88K90j546P03J277j669l37J341K08j543J081
5049e4N81j627P73P48j005k39J366m41j390J521J33j307O26P02j108n49J972m86
5067B16j422R13J013j155j47J128r83n67J834r19j097J376O54j408L32J087p66
5084H9q71J799n24j513J552M57j422J03J401r21o62J111J04j353R41N41j292K93
$$ plain form
5102 -167 1211 409 -462 792 662 -665 220 1181 -232 -414 1141 259 -667 681 650 -428 349 849
5120 849 -603 -462 1180 142 -693 609 762 -560 251 1262 -695 -412 1182 138 -621 357 801
5137 801 -701 458 804 -700 -410 753 198 -761 219 787 -719 -277 860 -614 -726 693 -10
5154 -10 -1040 342 792 -549 -580 283 -186 -636 848 -297 -1468 582 598 -1005 -402 819 -502 -1120
5172 -1120 306 -32 -989 496 334 -1194 -263 662 -465 -1050 444 -83 -939 383 706 -1000 -700
5189 -700 713 -310 -790 680 -14 -821 218 635 -921 -474 788 -432 -733 356 -129 -573 514
5206 514 688 -737 -109 897 -320 -841 591 563 -467 485 692 -300 -162 1236 -376 -724 547 767
5224 767 -99 350 680 -607 177 1253 -16 -660 960 690 -617 391 1052 -50 88 1304 359
$$ packed form
5102a67J378q02q71J254j30j327Q85R61j413j82J555q82r26J348l1j078P77N00
5120H49j452J41J642j038q35J302J53j322Q11J011j957K83J594j044p59R78M44
5137H01j502J159L46j504K90J163n55r59R80N68j506M42J137j474j12J419p03
5154a0j030J382M50j341l1Q63m69m50J484j145j171K050J6j603O03J221j321o18
5172a120J426l38r57J485j62j528R31R25j127n85J494n27q56J322L23j706L00
5189g00J413j023m80J470o94q07J039M17j556M47J262j220l01J089m85m44J087
5206E14J74j425O28J006j217n21J432k8j030R52K07r92J38J398j612l48J271K20
5224G67q66M49L30j287P84J076j269o44J620k70j307J008O61j102J38J216r45
$$ plain form
5241 359 -670 1293 883 -728 355 863 -349 38 878 -34 -341 1063 432 -683 154 1113 -255
5258 -255 60 799 -33 -550 729 169 -899 194 819 -440 -559 565 -70 -583 632 218 -1029 243
5276 243 848 -550 -416 789 -10 -830 470 183 -748 -323 553 -605 -826 464 -198 -1097 132 438
5294 438 -1077 -65 491 -728 -485 628 -268 -870 -152 285 -1270 -341 321 -471 -794 634 -33 -957
5312 -957 -71 328 -916 -298 287 -564 -548 421 75 -805 -191 467 -596 -80 410 -657 -766 530 -9
5331 -9 -1316 197 421 -835 -475 470 -355 -313 714 -70 -998 650 756 -640 -903 706 -350 -326 797
5350 797 141 -599 747 784 -465 -245 1087 139 -698 691 440 -463 823 758 -601 -291 1224 16
5368 16 -471 657 841 -381 347 299 -418 125 1081 -95 -649 628 407 -631 174 665 -612 -251 532
$$ packed form
5241C59j029J963m10j611J083N08j212L87Q40r12l07J404o31j115Q37R59j368
5258b55L15P39q32n17J279n60j068J093O25j259j19J124o35n13J215m14j247J272
5276B43O05j398J34J205p99q20J300k87r31M25Q76j158k21J290o62q99J229L06
5294D38j515J012N56j219K43J113q96o02P18M37j555R29O62p92l23J428o67r24
5312i57Q86L99j244O18N85q51J6R69l46q80O14O58j063N16M90j067j09J296n39
5331ij307J513K24j256L60R45q25M2J027p84r28J648J06j396k63J609j056K4J123
5350G97o56p40J346L7j249K20J332r48q37J389k51r03J286o5j359L10J515j208
5368A6m87J128J84j222P28m8p17N43R56j176n54J277k21j038Q05M91j277L61P83
$$ plain form
5387 532 -332 -633 671 522 -716 -45 847 -200 -319 747 -364 -527 517 -53 -805 119 438 -844
5405 -844 -345 384 -376 -557 414 127 -1069 26 823 -691 -365 458 -394 -850 373 399 -1077 -167 571
5424 571 -753 -659 454 -503 -1078 72 -96 -1111 -307 690 -509 -575 542 -213 -792 443 187 -668
5442 -668 -98 542 -561 -760 164 76 -882 544 242 -761 -17 926 -439 -545 736 97 -874 370
5460 370 536 -391 262 452 -524 -232 812 312 -484 288 433 -334 251 586 -275 -213 928 543 -687
5479 -687 100 694 -159 -285 660 -32 -227 828 -86 -960 770 1138 -406 50 748 335 -159 769 121
5498 121 -396 899 1012 -467 -181 859 263 -239 414 114 -144 528 541 -444 160 951 -61 -713 700
5517 700 561 -340 313 379 -661 -147 1013 -46 -609 681 507 -588 240 173 -765 -179 780 -340 -657
$$ packed form
5387E32q64l01J304j49j238O71Q92j047j19J066j111j63J044n70p52R24L19j282
5405h44M99P29p60j81R71k87j196J095P97j514L26Q23q52m56J223K6j476R10P38
5424E71j324R4J113r57n75J150j68j015Q04R97j199o6J117p55n79J235k56q55
5442f68N70O40j103j99R24q8r58J426l02j003P44R43j365j06J281o39r71J244
5460C70J66r27O53J90r76K92J044n00p96P72J45p67N85L35q61O2J141l85j230
5479f87P87N94q53j26R45o92j95J055r14q74J730L68j544M56O98m13m94R28o48
5498A21n17J295J13j479K86J040n96n02O53l00k58O72J3r85O04P91j012o52J413
5517G00j39r01O53O6j040N14J160j059n63J290j74j095Q28o7r38N86R59j120l17
$$ plain form
5536 -657 437 -16 -614 -175 182 -322 -258 653 -290 -975 309 194 -762 -195 56 -1070 -361 644 -308
5555 -308 -880 302 35 -750 -271 114 -938 -348 512 -682 -914 338 -57 -982 -235 375 -454 -414 544
5574 544 -584 -736 499 204 -924 -75 410 -401 -428 -81 -334 -501 605 394 -905 -162 818 -194
5592 -194 -392 -130 -114 -385 476 67 -907 83 1213 -395 -588 342 717 -389 492 294 -224 335 1273
5611 1273 -200 -601 873 599 -313 109 139 -205 254 660 -396 -329 1068 507 -751 133 624 -258 28
5630 28 464 -154 -361 518 176 -740 415 744 -517 50 904 -322 -242 876 2 -433 626 804 -736
5649 -736 -224 523 -166 -598 445 -248 -692 244 586 -705 -347 409 -234 -552 551 137 -807 346 845
5668 845 -864 -432 515 -137 -495 195 -178 -630 -44 310 -517 -469 397 -271 -668 415 -66 -1201 50
$$ packed form
5536f57J094m53n98M39L57n04O4R11r43o85J284j15r56N67K51j126P09J005r52
5555c08n72J182k67p85M79L85j052N90Q60j194k32J252l95r25P47O10q29M0R58
5574E44j128j52J235k95j128Q49M85q11k7L47k53j67J106k11j299P43R80j012
5592a94j98K62J6k71Q61m09r74R90J130j608j93R30L75j106Q81j98n18N59R38
5611A273j473m01J474k74r12M22L0l44M59M06j056O7J397n61j258Q84M91q82K86
5630B8M36o18k07Q79l42r16J155L29j261N67Q54j226Q0J118q74m35J059J78j540
5649g36N12P47o89m32J043o93m44R36L42j291L58P56o43l18J103m14r44J153M99
5668H45j709M32R47o52l58O90l73m52N86L54q27M8Q66o68l97J083m81j135J251
$$ plain form
5687 50 562 -1088 -670 962 -306 -1049 -281 -115 -635 -55 220 -1004 -435 415 -478 -850 99 136 -714
5706 -714 257 170 -757 -135 883 -22 -896 212 419 -542 -245 727 -520 -76 489 -230 -514 742 580
5725 580 -504 138 674 -268 -287 869 -128 -751 787 430 -760 28 1030 -40 -55 501 63 -223 621
5744 621 441 -647 237 989 -228 -417 637 72 -266 826 578 -600 515 1020 -200 -270 927 178
5762 178 -412 456 720 -557 25 597 -318 -56 949 112 -501 661 315 -598 71 947 -99 -643 312
5781 312 7 -541 260 617 -496 14 680 -161 -413 333 70 -599 262 153 -639 -216 628 -673 -683 513
5801 513 55 -892 -334 -21 -952 -92 519 -605 -713 990 32 -1139 -336 211 -189 -262 252 -583 -734
5820 -734 500 155 -1285 -189 541 -314 -417 246 -433 -473 646 -141 -978 274 550 -394 -750 175 -288
$$ packed form
5687E0N12j650M18J632j268p43P68J66n20N80K75j224N69Q50q93l72R49L7q50
5706g14R71q7r27O22J018r05q74J108K07r61K97R72j247M44N65p19k84J256j62
5725E80j084O42N36r42j9J156r97o23J538l57j190P88J002j070j5N56m38k86Q44
5744F21j80j088Q84P52j217j89J054n65l38J092k48j178J115N05j220p0J197p49
5762A78n90Q68K64j277N82N72r15K62J005q37o13J162l46r13O69Q76j046n44R55
5781C12l05n48Q01L57j113N10O66q41k52P46k63o69Q61j09p92M23Q44j301j0J196
5801E13m58r47N58L13r31Q60O11j124j08J703r58j171Q03N47m00p3N14q35j51
5820g34J234l45j440J096P30q55j03O63o79m0J119p87q37J252K76r44l56R25m63
$$ plain form
5839 -288 -513 194 -132 -685 369 825 -306 -434 552 -223 -549 375 193 -563 676 585 -859 -265 716
5858 716 167 -317 80 299 -462 369 100 -587 -259 1005 -244 -469 335 338 -535 188 717 -441 -5 897
5878 897 238 -533 564 602 -352 -1 436 -193 107 556 -129 -596 906 435 -399 -132 663 -88 -203 828
5898 828 121 -566 621 423 -469 134 588 -231 -152 451 -45 -487 405 218 -678 16 522 -527 -561 388
5918 388 2 -632 303 165 -848 -406 671 -503 -616 379 97 -672 91 58 -626 76 355 -356 -695
5937 -695 -29 78 -440 43 307 -832 198 715 -467 -949 507 186 -654 -112 73 -189 252 567 -384
5956 -384 -717 728 213 -449 -157 280 -219 59 611 -693 -371 415 -2 -850 131 582 170 -364 242
5975 242 -390 -542 825 -52 -912 223 430 -309 -342 410 24 -249 987 -6 -563 671 709 -500 -657
$$ packed form
5839b88k25P07l26n53J054M56j131j28R86p75l26R24j82p56J239r1j444N94R81
5858G16n49m84L97K19p61Q31k69o87L28J264j249k25Q04Lq73P23N29j158M36R02
5878H97o59p71J097L8r54L51M37o29L00M49o85m67J502m71q34K67P95p51j15J031
5898H28p07o87J187j98q92O03M54q19P9O03m96m42Q92j87q96O94N06j049l4R49
5918C88l86o34R35j38j013M42J077j174j13R95k82p69P63l3o84P02K79p11l39
5937f95O66J07n18M83K64j139J030N17j182m82J456l21q40N42J85k62M41L15r51
5956c84l33J445n15o62K92M37m99K78N52j304L22P86m17q48R81M51m12n34O06
5975B42o32j52J367q77q60J135K07p39l3P52l86k73J236r93n57J234L8j209j57
$$ plain form
5994 -657 581 111 -13 411 -129 -344 509 515 -129 -306 793 501 -588 243 97 -239 464 484 -368 -344
6014 -344 885 563 -427 189 110 -293 193 495 -316 46 885 183 -686 523 209 -499 14 421 -431 -45
6034 -45 738 -171 -595 268 163 -495 229 373 -121 -126 496 -362 -1156 486 215 -504 -3 217 -324 -60 359
6055 359 -236 -858 178 243 -726 -283 496 -243 -376 138 -127 -734 184 423 -533 -53 314 -176 -710 208
6075 208 -693 -652 500 -112 -758 9 648 -98 -621 234 -169 -368 307 117 -541 -50 717 -60 -610 276
6095 276 131 -250 -35 153 -351 293 747 -527 -735 617 353 -207 185 429 -679 106 506 -421 -408
6114 -408 640 362 -474 487 367 -126 90 516 -38 -228 918 266 -544 234 669 -495 -169 569 -405
6133 -405 -111 830 207 -392 334 694 -283 -155 842 -83 21 714 433 -677 332 409 -218 -52 616 -237
$$ packed form
5994f57J238m70j24M24n40k15Q53Oo44j77J099k92j089Q31j46l36P03K0q52K4
6014c44J229l22r90O16p9m03M86L02q11L62Q39p02q69J209l14p08N13M07q52L86
6034d5P83r09m24Q63j05o58P24J44m94nO22q58p94J642k71p19N01K20n41K64M19
6055C59n95o22J036O5r69M43P79p39j33N14k65o07R18K39r56M80L67m90n34R18
6075B08r01M1J152o12o46P67O39p46n23Q55m03j99O75j90o58M91P67p77n50Q86
6095B76j45l81K15J88n04O44M54j274k08J352k64n60L92K44j108P85M00r27J3
6114d08J048k78q36R61j20m93K16M26n54j90J146o52q10P78M35j164L26P38r74
6133d05K94R41o23n99P26L60r77J28R97r25J04O93k81j110J009P7o27J66O68q53
$$ plain form
6153 -237 -166 590 143 -532 377 739 -297 -270 291 153 -302 400 130 -468 133 421 -464 -265 394 -47
6173 -47 -251 460 307 -615 -43 405 -402 -99 451 -103 -571 29 90 -623 94 264 -643 -297 360 172 -437
6194 -437 240 110 -436 -108 30 -424 -320 229 -358 -883 108 57 -763 -170 186 -406 -194 331 -651 -453
6214 -453 250 215 -673 -306 313 -482 -683 391 -285 -752 542 273 -470 -382 305 -50 -170 311 -75 -611
6234 -611 491 238 -712 189 577 -307 -352 352 59 -226 436 391 -387 102 794 -170 -545 520 500 -190
6254 -190 424 165 -482 264 373 -233 -446 602 320 -217 294 361 -422 165 582 -94 -336 686 329 -488
6274 -488 237 454 -102 32 309 -124 -82 638 46 -422 86 381 -251 -45 585 -172 -297 880 357 -400
6294 -400 203 479 -38 186 169 -135 -162 622 84 -616 130 446 -420 -258 470 -109 -566 264 -213 -614 47
$$ packed form
6153b37P1P56m47o75R09L62j036K7N61j38m55P02k70n98O01K88q85J99O59m41
6173d7k04P11j53r22N72M48q07L03N50n54m68O00O1p13P17J70r07L46O57j88o09
6194d37O77j30n46L28J38m54J04N49n87n25R91n1q20N93L56n92K12N25r82J98
6214d53P03l5q88L67O19p95k01J074o76m67J294k69p43Q8O87l55j20M81l86n36
6234f11J102k53r50R01L88q84m5P04k93k85O62m5p78M89O92r64l75J065k0o90
6254a90O14k59o47P46J09o06k13J048k82n37N11O7p83N87M17o76k42J022l57q17
6274d88P25K17n56J34K77m33M2P20n92m68N08K95o32K06O30p57j25J177n23p57
6294d00O03K76n17K24j7l04k7P84n38p00P46L16q66J62P28n79m57Q30m77m01O61
$$ plain form
6315 47 490 -486 -541 277 -4 -504 333 67 -569 122 345 -660 -461 456 -87 -238 320 250 -652 -36 234
6336 234 -461 -486 709 -166 -353 -87 43 -416 -9 254 -583 -346 480 -174 -518 147 197 -532 174 123 -976
6357 -976 -387 632 152 -335 182 355 -669 -3 171 -357 41 417 -215 -628 403 604 -138 355 315
6376 315 -278 -97 485 -140 -308 587 453 -224 17 386 -1 268 591 -195 -576 479 591 -375 -15 973
6396 973 96 -204 460 49 -412 516 584 -335 -114 962 6 -40 327 49 11 261 213 -610 230 394 -13
6417 -13 -263 333 -193 -173 58 246 -162 -13 601 -335 -491 423 -53 -671 98 58 -282 -184 552 -582 -344
6438 -344 286 105 -654 146 601 -155 -151 186 -392 -465 230 46 -439 -197 397 -294 -190 36 -275 -363 311
6459 311 220 -575 -141 365 -201 -151 63 -69 -160 116 15 -700 -230 164 -489 -254 161 73 -173 380 -135
$$ packed form
6315D7M43r76n5Q18k81n00Q37k66o36O91K23j005J99R17n43j51N58p0r02O16K70
6336B34o95k5J195q75j87K66J30m59M07K63q37K37Q26o54l44O65N0p29P06n1j099
6357i76N89J019m80m87N17J73j024O66J74n28L98L76o32m13J031K01p42M93m0
6376C15n93J81N82o25j68Q95j34o77K41L69l87K69L23p86l81J055J12r66L60R88
6396I73q77l00O64m11m61R28O8r19K21J076r56m6L67k78l8K50m8q23Q40J64m07
6417a3k50N96n26K0K31J88m08J49O14r36j56R14m76o18P69m0l40R8P36j134K38
6438c44O30j81p59Q00M55p56ML37n78p3O95j84m85K42N94o91J04K26l11q8O74
6459C11r1p95M34N06n66N0K14j32r1K76j01p15M70L94o53K35M15q8k46N53n15
$$ plain form
6480 -135 -477 7 438 -351 -207 311 41 -353 250 78 -311 385 372 -205 -212 719 65 -294 469 172 -134
6501 -134 382 243 -413 -307 399 -33 -80 142 491 -404 241 600 -407 55 535 -7 -564 311 366 -215
6521 -215 366 517 -129 138 632 149 -216 338 441 -371 203 335 -163 -113 361 -142 -214 429 686 -383
6541 -383 -47 329 -188 -96 47 145 -395 229 280 -378 11 292 -76 -24 352 -233 -326 279 118 -206 -105 522
6563 522 -360 -552 190 -139 -604 276 269 -518 -55 347 -149 -590 250 -115 -372 159 -146 -792 -48 658 -341
6584 -341 -473 336 166 -439 -150 143 -444 -186 454 -417 -304 341 -73 -358 -188 166 -167 157 372 -206
6604 -206 -180 153 -46 -393 -362 328 -468 -247 514 90 -8 560 -80 -360 63 597 -158 -66 286 -177 -162 438
6626 438 98 -352 334 489 -47 -131 218 319 -115 341 89 -347 161 475 -312 -84 348 73 -33 568
$$ packed form
6480a35l42M84M31p89J44N18k70l94O03j72l89O96j3n77pR31o54l59P63k97l06
6501a34N16j39o56J06P06m32m7K22L49q95O45L59j007M62M80n42n57Q75N5n81
6521b15N81J51o46K67M94m83l65N54J03q12N74J32m98N0M74n03p2O43K57j069
6541c83L36L76n17R2J43R8n40O24N1o58L89K81l68N2L76n85r3O05j61l24J01O27
6563E22q82j92P42l29m65Q80pp87M63M02m96m41Q40l65k57N31l05o46P44P06r99
6584c41j32Q09j70o05K89K93n87K58O40q71J13O45m14k85J70L54l33L24K15n78
6604b06K6L33j99l47L1O90p96K21P61m24r8N68o40k80M23N34p55R2L52m63J5O00
6626D38l40m50O86J55n36q4L49J01m34M56k52m36N08L14p87K28M32k75j06O01
$$ plain form
6646 568 -131 -393 239 481 72 -307 264 33 12 239 599 -254 189 206 -475 -499 410 -198 -392 232 224 -341
6668 -341 223 788 -517 -79 581 -7 -327 118 171 -258 203 437 -402 -162 216 -330 -186 315 77 -543
6688 -543 31 337 -510 -94 287 -376 -385 191 463 -173 -14 259 -78 -104 397 -83 -190 157 -231 -728 -219
6709 -219 427 -315 -412 257 179 -457 172 13 -393 -64 331 -286 -382 250 -65 -256 87 -113 -452 -56 346
6730 346 -348 -150 449 255 -222 53 -227 -462 -16 45 -380 -175 378 138 -470 39 158 -563 -73 122
6750 122 -479 -129 349 -198 -262 431 358 -414 233 514 -103 -197 231 213 -540 267 386 -441 -66 279 45
6771 45 144 446 -186 -217 299 78 -288 -24 222 -14 -235 454 196 16 239 558 -113 -89 536 -135 -361
6792 -361 272 184 -188 -70 466 -131 130 660 -40 -265 204 -84 -201 308 247 -442 46 349 -173 -73 61
$$ packed form
6646E68o99k62O32K42m09l79N71k31k1K27L60q53M43J7o81k4R09o08j94O24qn65
6668c41N64N65j305M38O60n88l20M45N3m29M61K34q39K40L78n46J44N01k38o20
6688e43N74L06q47M16L81o63rN76K72o36J59K73l37k6N01m80j07L47l88m97N09
6709b19O46p42r7O69p8o36O29j59m06L29L95o17r6O32l15j91L43k00l39L96M02
6730C46o94J98N99j94m77K75k80k35M46O1m25K05N53k40o08N09J19p21M90J95
6750A22o01L50M78n47o4O93p3p72O47K81o17r4M28j8p53Q07J19q27L75L45k34
6771D5R9L02o32l1N16k21l66K64K46k36k21O89k58j80K23L19o71K4O25o71k26
6792c61O33q8l72J18N36n97K61N30p00k25M69k88j17N09o1o89M88L03n22J00J34
$$ plain form
6813 61 119 -151 124 295 -284 12 404 -257 -443 198 255 -314 -9 68 -308 -174 439 -325 -187 62 -39
6834 -39 -516 -22 322 -322 -255 221 -46 -327 393 217 -560 -30 529 -314 -38 234 -272 -75 305 11 -504
6855 -504 -390 264 -326 -142 99 -78 -505 50 65 -468 -52 359 -379 -195 581 -105 -451 -109 257 -204
6875 -204 -10 325 -110 -255 575 28 -389 73 350 30 122 372 -216 -8 392 122 -170 -152 168 -230 117
6896 117 389 -77 -369 165 -70 -79 233 470 53 11 364 -14 122 165 239 -104 164 379 -355 -157 305 44
6918 44 -43 403 195 -127 1 264 -242 -97 317 -220 -15 166 -97 -433 225 437 -199 75 598 73 -92
6939 -92 251 60 -113 291 400 -403 -64 141 -20 -328 495 -48 -206 -3 -65 -386 -17 227 -144 -291 81
6960 81 130 -155 36 90 -307 -20 5 -45 -322 26 -36 -333 -34 119 -205 -286 -22 -202 -297 12 19 -799 -179
$$ packed form
6813F1N8k70K75J71n79K96L92o61j86O41N7n69L05P7l76J34O13p64J38K49j01
6834c9m77M94L44o44O7M76k67k81P20j76p77N30N59q43K76K72n06J97L80k94n15
6855e04J14O54n90J84K41j77m27N55J5n33M16M11p38J84P76o86l46L42L66m61
6875b04J94L35m35j45Q30n47m17M62K77l20R2K50n88K08M00k70k92J8L20l98L47
6896A17K72m66k92N34k35rL12K37m17m2L53l78J36M3P4l43K68K15p34J98M62k61
6918D4q7M46k08l22J28K63n06J45M14n37K05J81k63l36O58K12o36K74N23n25j65
6939i2L43j91j73M04J09q03L39K05j61l08Q23n43j58K03o2l21L69K44l71j47L72
6960H1M9k85J91N4l97K87K5n0k77L48o2k97K99J53l24q1K64j80r5L09Pq18O20
$$ plain form
6983 -179 -23 -170 -2 76 -293 -251 -29 209 -142 438 226 -97 -173 301 -310 59 370 -5 -89 111 334
7004 334 -307 -340 153 -172 -53 435 200 -384 -223 348 -32 -230 420 338 -436 -59 168 -59 243 107 -140
7025 -140 -60 320 119 -121 307 271 -194 118 306 -21 -19 551 209 -37 71 -141 -33 -76 208 -68 -138 515
7047 515 89 -467 129 433 -335 34 472 -115 -403 379 108 -499 224 277 -98 -286 314 -444 -148 507
7067 507 1 -328 6 49 -171 289 196 -89 -166 277 -87 -413 117 77 -108 -59 305 -208 -225 233 -6 -514
7089 -514 152 236 -330 -259 209 -290 -355 218 -126 -355 160 389 -305 -78 107 -328 -101 353 348 -352 -143 152
7111 152 -532 -23 -34 -262 -305 162 -138 -153 -232 93 -235 -2 227 62 -278 85 75 -473 259 487 -468 135
7133 135 312 101 -128 114 184 -596 -157 240 -244 -75 217 77 -410 187 498 -318 -9 331 153 -15
$$ packed form
6983a79J56j47J68P8l69M2K22K38l51N80k12l23p6M74o11L69L11l75q4K00K23
7004C34o41l3M93l25J19M88k35n84J61N71l80j98O50q2p74L77K27k27L02j36k47
7025a40Q0L80k01k40M28l6m65L12J88l27KN70l42k46J08k12J08m3K84k76p0O53
7047E15m26n56N96L04p68L69M38n87k88P82k71o07P23N3l75j88O00p58K96O55
7067E07n06l29L34M3k20M60r3k85p7M43l64l26N30m0j85M9L64n13j7M58k39n08
7089e14O66Q4n66P1M68m99o5N73l44k29N15K29o94K27J85m35K27M54np00K09K95
7111A52o84N09j1k28m3M67l00j5p9L25l28K33K29j65l40L63j0n48P32K28r55O03
7133A35J77k11k29K42P0p80M39L97m84J69K92j40m87N97L11q16L09L40j78j68
$$ plain form
7153 -15 432 54 -197 487 411 -69 122 196 27 -99 476 167 173 456 40 -472 76 651 -135 -202 269 -291
7175 -291 -20 503 313 -351 19 363 -67 -147 238 90 -20 256 16 -263 55 550 68 -355 134 -108
7195 -108 -348 142 3 -507 -110 180 -357 282 355 83 -237 152 69 -3 243 267 -306 -302 163 -58 -461 -72
7217 -72 -47 -306 97 253 -613 -151 464 -116 -385 65 -62 -471 -5 190 -84 -164 127 108 -382 89 196
7238 196 -438 -25 99 -94 -353 162 -43 -575 599 247 -232 -154 55 -26 -437 -204 -150 -398 -25 -55 -164
7259 -164 -121 168 -111 -133 368 -26 -193 130 649 -10 -191 340 186 -60 315 -176 -90 14 535 80 -210
7280 -210 473 -86 -22 362 210 -454 241 287 -204 250 518 96 -229 199 277 -30 244 142 107 -148 259
7301 259 128 -110 375 178 11 -74 518 37 237 424 34 -301 272 462 -321 48 409 -222 -69 109
$$ packed form
7153a5M47l78k51O84p6m80J91P4j69j26N75l09OK83m16n12N48N75p86o7M71n60
7175b91K71N23j90o64L70L44m30q0L85j48j10K76k40k79L18M95m82m23M89k42
7195a08k40M90j39n10L97K90n37O39P3k72l20L89q3p2K46K4n73MM65k21m03L89
7217g2K5k59M03J56q66M62O15n80k69M50j27m09M66J95k74q0K91j9m90M71J07
7238A96o34M13J24j93k59N15k05n32J174l52m79P8K09q1m11K33N4k48L73l0j09
7259a64M3K89k79k2N01l94j67L23N19o59j81N31j54k46L75m91Q6J04N21m55k90
7280b10O83n59O4L84j52o64O95M6m91M54K68m22l25M28P8l07K74j02l5k55M07
7301B59j31k38M85j97j67q5N92m81K00J87l90l35N73J90p83L69L61o31J53J78
$$ plain form
7321 109 -59 -247 325 78 -256 123 64 -76 -160 188 -49 -128 315 -227 -323 -168 425 -122 -364 46 -46 -474
7343 -474 -45 -149 -348 92 141 -296 -40 72 -273 -223 108 245 -178 -16 231 107 -196 116 -173 -233 -20
7364 -20 253 -470 -387 166 -184 -122 300 54 -335 42 94 -206 -327 262 -18 -208 -5 5 -160 78 391 -139
7386 -139 -30 388 -193 -274 -30 27 -94 259 308 -176 334 497 44 -262 498 -62 -355 153 456 -98 -2
7407 -2 260 -103 -67 281 217 -304 166 637 -208 -83 278 226 -72 250 192 -138 -32 599 -252 -8 97 -55
7429 -55 -218 88 -81 201 134 146 -452 -66 229 181 -38 186 94 -92 54 37 -386 -120 279 -107 -239 118
7451 118 -124 -359 133 465 35 -127 150 -253 -337 179 -59 -570 99 185 -318 -183 -80 -325 -281 -104 107
7472 107 -269 106 5 -323 -300 -87 -131 -238 214 151 -216 -42 178 -15 -198 122 -8 -324 219 168 -177
$$ packed form
7321A09j68j88N72k47l34L79n9j40q4L48k37p9M43n42r6J55N93n47k42M10r2m28
7343d74M29j04j99M40M9m37K56J12l45N0L31J37m23J62K47j24l03L12k89o0K13
7364b0K73p23Q3N53l50O2M22k46l89L77N2l00j21N89k80j90K03J0j65K38L13n30
7386a39J09M18n81q1K44N7j21L53M9m84N10J63m53l06P60n60k93N08L03n54R6
7407bK62l63L6L48o4n21M70M71q45J25L61n2k98L22n8l30J06O31q51K44J05j52
7429e5j63L06j69K82o7J2n98L86K95m8k19K24r2j86J46j7m23K66L99l86j32L57
7451A18k42k35M92L32m30j62K77m03q4N16k38n11O69Q6n03J35J03k45M4J77K11
7472A07l76L75j01l28K3K13m4j07M52o3l67J74K20j93j83L20j30l16N43n1l45
$$ plain form
7493 -177 99 69 239 160 64 292 -525 204 372 -290 -134 472 -203 -210 321 -164 -111 379 50 -546 169 527
7515 527 3 -301 837 90 -283 34 194 -485 -104 310 -160 -202 135 136 21 44 97 -116 -117 338 79 -267
7537 -267 174 50 -211 238 209 -167 101 238 -236 -152 570 393 -550 117 276 -15 38 177 -216 -207 341 32
7559 32 -636 13 435 -116 -62 -94 -6 -412 346 -96 -17 -70 86 -301 -154 271 68 -317 98 -334 -178 307
7581 307 -14 -79 -204 359 -101 -155 99 151 -296 28 81 -65 -241 291 32 -137 -45 -12 -218 -15 277 -271
7603 -271 -176 -27 166 -432 133 46 -268 -1 122 -240 134 29 -214 -40 304 106 37 -278 -82 -277 -392
7624 -392 10 -346 -221 400 80 -279 -183 164 -260 -364 327 -273 -374 210 280 -276 -35 112 -55 -165 243
7645 243 -36 -703 210 146 -260 -153 449 -19 -1 221 -105 -260 418 117 -135 189 332 -175 -199 266 13
$$ packed form
7493a77K76l0J70p9r6K28q17P29J68o62J56O06o75pN31m85N3M90l29n96P15L58
7515E27n24l04J138p47l73L17J60o79L81M14m70m2L37Jj15K3N3k13jM55k59l46
7537b67M41j24k61M49k9l76K68J37m74Q4P22j77r43O67J59k91N3J39l93RN48l09
7559C2o68O49M22n51N4l2Q8m06P58m42P9n3J56l87J47M25k03l85M15m32J56M85
7581C07l21o5j25N63m60n4K54N2m47L24N3j46j76N32k59j69R2L3k06K03K92n48
7603b71R5J49J93n98N65q7l14K67J23l62L74j05k43J74L44j98o9l15J96j95j15
7624c92M02l56J25O21l20l59R6L47m24j04O91o00j01N84P0n56K41J47j67j10M08
7645B43k79o67R13o4m06J07O02m68J8K22l26j55O78l01k52L24J43n07k4M65k53
$$ plain form
7666 13 155 246 10 -264 -58 305 -184 -195 494 181 -2 249 175 -432 244 286 -74 -60 139 6 -1 224 207
7689 207 -13 163 397 44 -344 334 -70 47 116 321 -198 99 -117 52 36 263 -332 -322 -44 32 -35 -73
7711 -73 161 34 -65 277 256 -211 66 64 -94 -145 -51 31 -355 304 -172 -572 53 -125 -105 -121 290 -176 -277
7734 -277 51 -75 -242 -4 35 -160 137 212 17 -475 374 -20 -209 -300 158 -434 -38 253 99 47 123 -86
7756 -86 65 -18 63 -52 -50 127 135 -20 -138 -52 -95 372 231 -251 166 196 39 -229 157 -152 -187 -13 156 -50
7780 -50 80 302 -314 223 246 332 -203 40 -90 69 150 252 -66 -86 264 278 -419 207 175 -205 35 186
7802 186 238 -11 243 -86 -305 -71 508 -145 -104 161 92 119 320 296 -86 44 304 -12 -140 254 150 -199
7824 -199 124 -164 -158 423 328 -126 -148 191 153 -175 37 253 -249 -78 -69 39 -338 44 -115 106 165 140 -185
$$ packed form
7666A3J42R1k36k74K06L63m89j1O89l13j83K51p4o07O76M2l60J4J99j33pK25j7
7689B07k20J76K34l53l88O78m04J17O9K05n19K97k16J69j6K27n95J0K78P6o7l8
7711g3K34j27r9L42k1m67K77kj58n1R4Q2l86O59m76m00O25j78K0j6M11m66j01
7734b77L28j26j67K38L9j95K97P5j95m92Q49l94j89r1M58n92L96K91j54n2P6k09
7756h6J51q3Q1j15KJ77Qj55j18Q6m3M67j41m82M17L0j57k68L86l09l5J74J69k06
7780e0J30K22o16N37K3Q6n35K43j30J59Q1J02l18k0L50J4o97O26l2l80K40J51
7802A86N2k49K54l29k19K34N79o53M1K65o9K7K01k4l82J30K60l16j28L94j04l49
7824a99L23k88ON81r5m54k2L39l8l28K12K16n02J71RJ08l77L82j59K21N9k5l25
$$ plain form
7847 -185 -77 262 -381 -55 277 16 -303 161 -23 -172 -99 235 -198 -373 102 176 -226 148 238 -192 106
7868 106 122 -167 -15 211 -40 -282 81 -26 -219 -237 -1 -135 -199 400 -33 -234 -37 -165 -105 222 48
7889 48 -27 -357 364 50 -312 -35 110 -75 30 -35 -177 -159 92 237 -123 340 34 414 78 213 -82
7910 -82 -20 363 242 -268 259 101 -183 262 626 -133 149 120 -80 -61 -310 -149 -322 231 314 324 24 200
7932 200 54 18 46 355 132 71 463 -105 -190 108 37 -291 536 380 -17 -28 406 87 36 442 121 -277
7954 -277 -171 -38 15 -153 38 173 -126 102 -56 -177 -44 96 -113 -131 495 129 -183 -49 -73 -291 83
7975 83 194 -381 -20 405 138 -118 408 -78 -323 62 293 -232 -402 201 200 -412 152 -286 -308 -88 185
7996 185 -92 -422 121 133 -313 -148 -111 -21 237 221 64 -333 359 1 -238 177 295 -516 139 349 -78
$$ packed form
7847a85J08L39o43L26L32k61l19M64j84j49P3L34m33j75M75P4m02L74R0m30K98
7868A06J6k89J52K26k51k42L63j07j93j8K36j34o4N99m33k01J97j28O0L27j74
7889D8p5l30P21l14l62K77J45j85J05o5j42J8K51J45l60M63l06L80l36J35k95
7910h2O2L83j21n10N27j58k84M45L64p59K82k9k00J9k49J61j73N53Q3J0l00J76
7932B00j46l6K8L09k23o1L92n68q5K98p1l28Q27j56l97j1M34l19n1M06l21l98
7954b77J06J33N3j68J91J35k99K28j58j21J33J40k09j8O26l66l12J34k4k18L74
7975H3J11n75L61M25k67k56N26m86k45L85K31n25j70O03jo12N64m38k2K20K73
7996A85k77l30N43J2m46J65L7R0K58j6j57l97O92l58k39M15J18q11O55K10m27
$$ plain form
8017 -78 -116 229 228 -414 37 123 -151 -77 -362 -26 -120 121 226 -86 204 138 41 275 200 -84 -160 171 -218 -150
8041 -150 105 198 -432 -117 339 -4 8 65 79 -9 455 -8 -35 91 255 226 -63 -24 60 -189 133 357 -84
8064 -84 -141 160 114 -42 285 -146 -224 22 111 76 -102 133 -289 -155 68 -152 -189 -199 157 -187 -106 101 16
8087 16 152 327 205 166 29 11 -234 -260 295 6 -204 309 63 -74 221 253 -487 215 96 -77 174 278
8109 278 -4 -198 95 -49 -259 -36 164 -46 -158 71 -176 -267 -36 -220 -32 -344 327 -37 -377 -364 -270
8130 -270 -45 -92 262 -360 -52 38 -321 94 8 136 81 9 68 -145 -138 122 -238 -391 315 -246 -147 -63 -101 -162
8154 -162 311 58 381 -218 343 -107 -110 -7 -38 242 143 283 -32 -190 79 -142 -232 219 591 -87 72 81
8176 81 -195 -48 -346 -7 -249 6 69 250 -207 219 9 -120 -63 358 -459
$$ packed form
8017g8l8L45jo42M51Q6k74P4k85L36r4K41J05l12K90o6r7K34p5k84p6L31l89O8
8041a50K55R3o30L15M56l43J2N7J4q8M64m63k7J26J64k9k89L9Q4k49L22K24m41
8064h4n7L01m6j56L27m31p8K46Q9l5j78K35m22J34K23k20l7j0L56l44Q1K07q5
8087A6J36J75j22l9j37j8k45k6N55k89k10N13k46j37K95L2p40P02j19j73K51J04
8109B78k82j94K93j44k10K23K00k10j12K29k47r1K31j84J88l12O71l64l40J3R4
8130b70K25m7L54o22L08R0l59M15q6J28n5p2N9k13PK60l60j53P06n61R9Q4l8o1
8154a62M73k53L23n99N61m50lJ03l1K80r9J40l15j58K69k21r0M51L72o78J59R
8176H1k76J47k98L39k42K55O3J81m57M26k10j29N7M21q17
8191d59
$$ Imaginary data points
##PAGE= N=2
##DATA TABLE= (X++(I..I)), XYDATA
$$ plain form
0 0 0 0 0 -8 8 -8 8 -16 16 -24 32 -32 41 -55 65 -80 96 -112 135 -153 185 -212 247 -281 328 -373 424 -481
28 -481 549 -616 696 -781 876 -978 1093 -1217 1353 -1501 1669 -1847 2044 -2263 2509 -2775
44 -2775 3077 -3415 3795 -4228 4730 -5310 5996 -6824 7845 -9136 10833 -13176 16631
57 16631 -22253 33000 -61028 287201 655274 134633 -32779 146666 418220 363350 171913
68 171913 58089 221692 350849 226492 29172 128707 316680 295250 99031 9261 101318
79 101318 276641 255968 3144 -119683 122389 331047 188772 -43433 -34625 109892 180002
90 180002 113144 13226 36766 149551 104229 -71026 -56994 162420 257957 125942 -46285
101 -46285 -82144 67343 246422 185542 -41732 -64567 133829 203956 72333 -20221 35920
$$ packed form
0@%%%qJ6j6J6k4L2m0N6o4P3r6J20j45J76k08K47k88L38l97M59n28O09p01P97r05
28d81J030j165J312j477J657j854K071k310K570k854L170l516L891m307M772n284
44b775N852o492P210q023Q958j0040J1306j2820J4669j6981J9969k4009K9807
57A6631l8884N5253r4028L48229L68073n20641j67412J79445K71554n4870j91437
68A71913j13824J63603J29157j24357j97320R9535J87973k1430j96219q9770R2057
79A01318J75323k0673k52824j22827K42072K08658j42275k32205Q808J44517P0110
90A80002o6858r9918K3540J12785m5322j75255J4032K19414R5537j32015j72227
101d6285l5859J49487J79079o0880k27274k2835J98396P0127j31623r2554N6141
$$ plain form
112 35920 149470 184017 79160 -12484 79622 188262 87685 -52164 6869 147743 176403
123 176403 94264 -25558 -62481 71831 199631 111901 -37755 -23913 50221 33857 -10442
134 -10442 -3388 46220 92012 36976 -98015 -96186 66551 115058 -18159 -100827 -55188 5351
146 5351 30919 -986 -86386 -86492 29080 64505 -25980 -60339 -15424 -14267 -47354 -46709 -12757
159 -12757 47568 63758 -48405 -141090 -29606 125904 94915 -24486 -59792 -31590 14371
170 14371 52071 22502 -18956 27626 67562 -172 -44240 22504 77313 52360 2661 -37142
182 -37142 -19012 63426 64764 -54460 -87621 26857 90094 35270 -19807 -44771 -54156 -22432
194 -22432 1654 -21844 -14992 10366 -48855 -118403 -67344 20416 26247 -18938 -76661 -116055
$$ packed form
112C5920J13550L4547j04857r1644R2106J08640j00577j39849N9033J40874K8660
123A76403q2139j19822l6923J34312J27800q7730j49656J3842P4134j6364m4299
134a0442P054M9608M5792n5036j34991J829J62737M8507j33217q2668M5639O0539
146E351K5568l1905q5400j06J15572L5425r0485l4359M4915J157l3087O45L3952
159a2757O0325J6190j12163r2685J11484J55510l0989j19401l5306K8202M5961
170A4371L7700k9569m1458M6582L9936o7734m4068O6744N4809k4953m9699l9803
182c7142J8130Q2438J338j19224l3161J14478O3237n4824n5077k4964r385L1724
194b2432K4086k3498O852K5358n9221o9548N1059Q7760N831m5185n7723l9394
$$ plain form
206 -116055 -65584 8758 -31811 -103723 -62586 -8732 -50708 -86565 -52895 -19324 -12207 -33607
218 -33607 -88107 -85281 1450 16524 -80535 -115658 -39456 26001 37840 6148 -71186 -98678
230 -98678 -18174 38083 2101 -10947 7949 -34661 -76158 -29551 33491 49258 33887 -18961
242 -18961 -62306 -12445 50591 12799 -38221 -15223 -821 -17460 438 16339 -9197 -13006
254 -13006 -419 -22156 -14079 37688 10918 -82009 -91229 -16434 34842 38481 -9051 -85452 -84401
267 -84401 -1538 24601 -13092 -14449 -19323 -76749 -88601 -27464 6089 -2583 -14619 -48557 -63276
280 -63276 -7258 24950 -33463 -70769 -35178 -10691 -10969 -8110 -31086 -49599 -10409 12167 -21162
293 -21162 -9151 42122 10328 -64798 -59151 189 42655 55269 5228 -70229 -45835 49290
$$ packed form
206a16055N0471P4342m0569p1912M1137N3854m1976l5857L3670L3571P117k1400
218c3607n4500K826Q6731J5074r7059l5123P6202O5457J1839l1692p7334k7492
230i8678Q0504N6257l5982j3048J8896m2610m1497M6607O3042J5767j5371n2848
242a8961m3345M9861O3036l7792n1020K2998J4402j6639J7898J5901k5536l809
254a3006J2587k1737Q077N1767k6770r2927r220P4795N1276L639m7532p6401J051
267h4401Q2863K6139l7693j357m874n7426j1852O1137L3553q672j2036l3938j4719
280f3276N6018L2208n8413l7306L5591K4487k78K859k2976j8513L9190K2576l3329
293b1162J2011N1273l1794p5126N647N9340M2466J2614n0041p5457K4394R5125
$$ plain form
305 49290 62539 10014 1025 14422 6988 3297 -8253 -19269 31780 79850 15846 -53263 2587
318 2587 77025 48845 -12645 -28955 676 59988 70037 -15077 -65294 7251 68018 33751
330 33751 3828 19911 23532 13026 -5176 -30801 3113 85008 64167 -55773 -79900 18250
342 18250 80988 56611 2347 -36858 -13726 42586 23314 -41051 -15608 54498 35840 -24342
354 -24342 -24414 11435 38451 34500 -26235 -63204 18866 100357 28185 -86184 -75504 17421 76323
367 76323 59265 -19882 -65305 -4385 49871 -2842 -44371 10323 46305 -513 -46894 -44394
379 -44394 2961 68292 55640 -48990 -82109 10848 64174 6190 -47809 -37537 5204 41462
391 41462 19202 -46305 -38305 36806 32031 -36228 -25533 36452 33248 -24032 -67410 -54260 34401
$$ packed form
305D9290J3249n2525q989J3397p434l691j1550j1016N1049M8070o4004o9109N5850
318B587P4438k8180o1490j6310K9631N9312J0049q5114n0217P2545O0767l4267
330C3751k9923J6083L621j0506j8202k5625L3914Q1895k0841j19940k4127R8150
342A8250O2738k4377n4264l9205K3132N6312j9272o4365K5443P0106j8658o0182
354b4342p2L5849K7016l951o0735l6969Q2070Q1491p2172j14369J0680R2925N8902
367G6323j7058p9147m5423O0920N4256n2713m1529N4694L5982m6818m6381K500
379d4394M7355O5331j2652j04630l3119R2957N3326n7984n3999J0272M2741L6258
391D1462k2260o5507Q000P5111m775o8259J0695O1985l204n7280m3378J3150Q8661
$$ plain form
404 34401 103173 29982 -84741 -61749 36479 51370 -22 -29012 -18873 16321 23559 -35008
416 -35008 -56984 31349 84067 313 -74572 -28128 45544 51255 -6725 -72830 -54475 47961
428 47961 74621 -22691 -76051 -15541 35695 23347 848 -12740 -10055 3358 -24580 -66086
440 -66086 -13448 76424 47467 -55554 -76032 -12036 45532 50455 -7988 -65473 -28731 38519
452 38519 11901 -45133 -19736 27033 16836 -8610 -13580 53 33042 29287 -41599 -62368
464 -62368 28274 82184 13076 -59781 -46494 16026 70963 60088 -17246 -45906 13910 36239
476 36239 -13916 -19436 31882 41203 4685 -26278 -31158 14060 69798 35850 -48804 -41995 31001
489 31001 38295 -10711 -37720 -32183 2730 39219 10340 -44472 -23786 20912 -7337 -46163
$$ packed form
404C4401O8772p3191j14723K2992R8228J4891n1392k8990J0139L5194P238n8567
416c5008k1976Q8333N2718q3754p4885M6444P3672N711n7980o6105J8355J02436
428D7961K6660r7312n3360O0510N1236j2348k2499j3588K685J3413k7938m1506
440f6086N2638Q9872k8957j03021k0478O3996N7568M923n8443n7485L6742O7250
452C8519k6618n7034K5397M6769j0197k5446m970J3633L2989l755p0886k0769
464f2368R0642N3910o9108p2857J3287O2520N4937j0875p7334k8660N9816K2329
476C6239n0155n520N1318R321l6518l0963m880M5218N5738l3948q4654O809P2996
489C1001P294m9006k7009N537L4913L6489k8879n4812K0686M4698k8249l8826
$$ plain form
501 -46163 -20773 11935 2988 -27940 -64655 -59745 15080 55348 -14487 -79062 -45888 1156
513 1156 -533 -17959 -33238 -32317 -1330 -1808 -56043 -56570 20073 43302 -17802 -54092 -29160 9928
527 9928 27353 -8201 -66005 -41313 45288 52155 -19352 -43352 -9523 13029 18786 10165 -12204
540 -12204 -1756 24665 -7271 -48555 -5238 57653 40133 -14446 -38309 -24786 21946 51613
552 51613 4454 -49852 -19682 23412 1837 -21995 -5404 4731 2043 -56 -20213 -26586 9398
565 9398 12135 -43060 -52963 3998 31049 4317 -29640 -52831 -36158 21493 34002 -21499 -43072
578 -43072 -12714 -11367 -28174 -10405 7882 2571 -1105 -15527 -35678 -7554 36047 14496 -30783
591 -30783 -24285 -765 6659 15292 7272 -19561 -7748 29800 20991 -4044 4983 4616 -16797 -3817
$$ packed form
501d6163K5390L2708q947l0928l6715M910P4825M0268o9835o4575L3174M7044
513A156j689j7426j5279R21L0987m78n4235n27P6643K3229o1104l6290K4932L9088
527I928J7425l5554n7804K4692Q6601O867p1507k4000L3829K2552N757q621k2369
540a2204J0448K6421l1936m1284M3317O2891j7520n4579k3863J3523M6732K9667
552E1613m7159n4306L0170M3094k1575k3832J6591J0135k688k099k0157o373L5984
565I398K737n5195r903N6961K7051k6732l3957k3191J6673N7651J2509n5501k1573
578d3072L0358J347j6807J7769J8287n311l676j4422k0151K8124M3601k1551m5279
591c0783O498K3520P424Q633q020k6833J1813L7548q809k5035R027l67k1413J2980
$$ plain form
605 -3817 23505 18008 6679 3850 -16038 -18852 19224 35167 9271 -3579 -9349 -30011 -19197
618 -19197 19227 14825 -14784 -16365 -14889 -20014 2008 15046 -17985 -37750 -16224 -9968 -19834
631 -19834 -12981 -17415 -35934 -22966 -1640 -10228 -11811 -1494 -26358 -50068 -17796 14473 1476
644 1476 -15131 -24512 -39353 -19623 25369 24323 -7174 -6696 -92 -10364 -2005 15564 8376 6646
658 6646 16198 -705 -7438 33438 52046 11051 -10423 15138 34959 39101 29717 -4072 -14574
671 -14574 30591 57354 26179 8537 23884 22725 15358 21805 20524 21281 34723 14331 -28886
684 -28886 -10201 46836 45976 5892 -6421 -1419 7551 22810 12802 -16709 -6478 21549 5045
697 5045 -19163 -3010 11706 4461 1856 -5236 -11733 15352 32968 -11178 -46431 -8329 33539
$$ packed form
605c817K7322n497j1329k829j9888k814L8076J5943k5896j2850n770k0662J0814
618a9197L8424m402k9609j581J476n125K2022J3038l3031j9765K1526O256r866
631a9834O853m434j8519J2968K1326q588j583J0317k4864k3710L2272L2269j2997
644A476j6607r381j4841J9730M4992j046l1497M78O604j0272Q359J7569p188j730
658F646R552j6903o733M0876J8608m0995k1474K5561J9821M142r384l3789j0502
671a4574M5165K6763l1175j7642J5347j159p367O447j281P57J3442k0392m3217
684b8886J8685N7037q60m0084j2313N002Q970J5259j0008k9511J0231K8027j6504
697E045k4208J6153J4716p245k605p092o497K7085J7616m4146l5253L8102M1868
$$ plain form
710 33539 25348 3678 -10099 -11324 16587 35917 10071 -3688 26666 30738 -3279 -6024 25226
723 25226 41997 43190 26345 -5184 7253 61123 61739 10261 3723 39379 48104 35067 26111
736 26111 19571 31913 53079 36328 11595 38857 63694 28744 -5207 11322 37592 50127
748 50127 46381 8709 -19884 16100 55432 31395 -1556 6252 14589 7989 6133 -616 -171 23206
762 23206 19637 -23762 -26897 19551 29274 -6627 -25654 -20311 -4234 19623 10383 -35066 -37556
775 -37556 10225 21458 -9332 -16559 -3210 -1052 -5120 -17352 -24369 7764 37771 -1534 -49177
788 -49177 -20313 31087 30281 2784 -16361 -19766 6895 31678 4313 -24993 1904 29508 7875
801 7875 -10886 2370 18218 24290 11282 -22107 -18350 34964 43635 -16675 -41444 63 32769
$$ packed form
710C3539q191k1670j3777j225K7911J9330k5846j3759L0354M072l4017k745L1250
723B5226J6771J193j6845l1529J2437N3870O16n1478o538L5656Q725j3037q956
736B6111o540J2342K1166j6751k4733K7262K4837l4950l3951J6529K6270J2535
748E0127l746l7672k8593L5984L9332k4037l2951P808Q337o600j856o749M45K3377
762B3206l569m3399l135M6448R723l5901j9027N343J6077K3857r240m5449k490
775c7556M7781J1233l0790p227J3349K158m068j2232p017L2133L0007l9305m7643
788d9177K8864N1400q06k7497j9145l405K6661K4783k7365k9306K6897K7604k1633
801G875j8761J3256J5848O072j3008l3389L757N3314Q671o0310k4769M1507L2706
$$ plain form
814 32769 28092 5898 -20246 -16761 17554 17287 -20021 -16951 19090 13083 -21415 -28709 -10405
827 -10405 17732 30999 -7617 -53239 -22312 35630 18508 -35712 -38474 -7078 10226 7807
839 7807 -13908 -28603 -2051 19522 -11097 -32779 -1745 18989 -3557 -26618 -29503 -10109
851 -10109 27923 31777 -23380 -48472 295 34366 7914 -17649 -13265 -3554 5398 -335 -20658
864 -20658 -9815 25753 16341 -25757 -23078 11235 18050 1316 -18518 -33230 -10343 29793 13751
877 13751 -36424 -32535 7914 12275 -6871 -13528 -13546 -7299 -1968 -22182 -33086 1986 22594 -15745
891 -15745 -43532 -21030 4435 9119 1689 -24007 -38566 -8229 13891 -13571 -30417 -6966
903 -6966 3586 -9879 -14193 -10188 -3272 9171 -2947 -33997 -20125 23073 15930 -23143 -25527
$$ packed form
814C2769m677k2194k6144L485L4315k67l7308L070L6041o007l4498p294J8304
827a0405K8137J3267l8616m5622L0927N7942j7122n4220k762L1396J7304k419
839G807k1715j4695K6552K1573l0619k1682L1034K0734k2546k3061k885J9394
851a0109L8032L854n5157k5092M8767L4071k6452k5563M384R711Q952n733k0323
864b0658J0843L5568r412m2098K679L4313O815j6734j9834j4712K2887M0136j6042
877A3751n0175L889M0449M361j9146o657j8O247N331k0214j0904L5072K0608l8339
891a5745k7787K2502K5465M684p430k5696j4559L0337K2120k7462j6846K3451
903f966J0552j3465m314M005O916J2443j2118l1050J3872M3198p143l9073k384
$$ plain form
916 -25527 -4641 6104 14075 7846 -16016 -13478 10937 4473 -13546 1201 15238 -163 -12394
929 -12394 -8143 113 18941 24468 -9713 -30012 4230 27821 3620 -12232 -1925 901 3439
942 3439 10990 1075 -5970 10143 9278 -14317 -8555 17572 15498 -3457 -11576 -13111 2461 29875
956 29875 18165 -22235 -17819 17135 14850 -5778 -2407 4403 2202 3879 -2327 -8471 13551 27502
970 27502 -3713 -25326 350 22708 13265 -14 -12187 -13391 14834 30352 -1078 -19202
982 -19202 8192 19428 -2227 -6689 7404 10839 8567 -2183 -18088 -2028 32830 22534 -16010
995 -16010 -15238 9484 13915 10450 4153 -11977 -7559 17333 11543 -12477 -302 20512 6545
1008 6545 -9577 -2130 6207 12323 12920 -11120 -24110 6444 28404 4420 -14118 -2660 3985
$$ packed form
916b5527K0886J0745P971o229k3862K538K4415o464j8019J4747J4037j5401j2231
929a2394M251Q256J8828N527l4181k0299L4242K3591k4201j5852J0307K826K538
942C439P551r915p045J6113q65k3595N762K6127k074j8955q119j535J5572K7414
956B9875j1710m0400M416L4954k285k0628L371O810k201J677o206o144K2022J3951
970B7502l1215k1613K5676K2358r443j3279j2173j204K8225J5518l1430j8124
982a9202K7394J1236k1655m462J4093L435k272j0750j5905J6060L4858j0296l8544
995a6010P72K4722M431l465o297j6130M418K4892n790k4020J2175K0814j3967
1008F545j6122P447Q337O116N97k4040j2990L0554K1960k3984j8538J1458O645
$$ plain form
1021 3985 4596 11224 1761 -11915 1225 9019 -11305 -13118 12830 13999 -5604 -10289 -6508 1314
1035 1314 16271 8712 -21174 -18398 9994 7457 -10711 -4522 1573 -6741 -1588 4055 -5623 -2658
1049 -2658 8427 -6948 -22666 -4153 11479 218 -7263 -8252 -11626 1925 16929 -1035 -17069
1062 -17069 313 6584 -11291 -8742 8565 3803 -6066 -4024 -5682 -110 18606 10676 -17046
1075 -17046 -11595 12837 9559 -1927 22 -2101 -1981 11100 6891 -6867 7773 21771 -2695
1088 -2695 -17838 6013 21108 8140 -3120 -8903 -6225 15635 23237 -3153 -12956 9002 12873
1101 12873 -2453 -673 6554 1281 3022 2265 -11493 -3235 23655 13415 -18663 -14947 9439
1114 9439 13178 5511 -5543 -17678 -5659 17568 5603 -17358 -4639 12883 409 -10451
$$ packed form
1021C985O11O628r463j3676J3140P794k0324j813K5948J169j9603m685L781P822
1035A314J4957p559k9886K776K8392k537j8168O189O095q314N153N643r678K965
1049b658J1085j5375j5718J8513J5632j1261p481r89l374J3551J5004j7964j6034
1062a7069J7382O271j7875K549J7307m762r869K042j658N572J8716p930k7722
1075a7046N451K4432l278j1486J949k123J20J3081m209j3758J4640J3998k4466
1088b695j5143K3851J5095j2968j1260n783K678K1860P602k6390r803K1958L871
1101A2873j5326J780P227n273J741p57j3758Q258K6890j0240l2078L716K4386
1114I439L739p667j1054j2135J2019K3227j1965k2961J2719J7522j2474j0860
$$ plain form
1126 -10451 -4012 -918 5332 8941 -13070 -26385 4067 26500 267 -22943 -11781 4314 10763
1139 10763 5926 -14185 -19190 8292 14864 -14461 -18308 9131 12165 -6318 -13074 -10400 17
1152 17 17359 6033 -26827 -21053 14197 15249 -9229 -13967 -6892 290 8639 -1794 -20230 -6349
1166 -6349 15988 -3003 -25596 -7803 12552 5032 -7933 -16259 -16662 4881 18897 -8728 -31205
$$ packed form
1126a0451O439L094O250L609k2011j3315L0452K2433k6233k3210J1162J6095O449
1139A0763m837k0111n005K7482O572k9325l847K7439L034j8483o756K674J0417
1152A7J7342j1326l2860N774L5250J052k4478m738P075P182Q349j0433j8436J3881
1166f349K2337j8991k2593J7793K0355p520j2965q326m03K1543J4016k7625k2477
$$ [...]
8191a14
##END NTUPLES=NMR FID
##END=
