##TITLE=1H_TG-2268-b12
 CDCl3, 8 sc, 
 10.1.2020
##JCAMPDX= 6.0         $$ Bruker NMR JCAMP-DX V2.0
##DATA TYPE= NMR FID
##DATA CLASS= NTUPLES
##ORIGIN= UXNMR, Bruker Analytische Messtechnik GmbH
##OWNER= root
$$ XWIN-NMR		Version 3.5
$$ Fri Jan 10 14:36:25 2020 Russian Standard Time (UT+4h)  she@DPX200
##.OBSERVE FREQUENCY= 200.1315
##.OBSERVE NUCLEUS= ^1H
##.DELAY= (6, 6)
##.ACQUISITION MODE= SIMULTANEOUS
##.ACQUISITION SCHEME= undefined
##.AVERAGES= 8
##.DIGITISER RES= 18
##SPECTROMETER/DATA SYSTEM= spect
##.PULSE SEQUENCE= zg30
##.SOLVENT NAME= CDCl3
##.SHIFT REFERENCE= (INTERNAL, CDCl3, 0, 15.7039)
##AUDIT TRAIL= $$ (NUMBER, WHEN, WHO, WHERE, WHAT)
$$ ##TITLE= Audit trail, XWIN-NMR		Version 3.5
$$ ##JCAMPDX= 5.01
$$ ##ORIGIN= Bruker BioSpin GmbH
$$ ##OWNER= she
$$ F:/spectra/data/she/nmr/H-F/1/audita.txt
$$ ##AUDIT TRAIL=  $$ (NUMBER, WHEN, WHO, WHERE, WHAT)
(   1,<2020-01-10 14:35:17.12 +0400>,<she>,<DPX200>,
      <created by zg, POWCHK disabled, PULCHK disabled
       configuration hash MD5:
       00 E9 B6 7A A2 85 ED C7 34 08 36 98 17 FE 4E 26
       data hash MD5: 16K
       59 E0 78 D1 B7 B5 65 F2 94 93 C2 99 87 C3 F4 41>)
$$ ##END=
$$ 
$$ hash MD5
$$ B4 87 2B 66 BE 66 F3 AF A7 56 B6 A7 4C 39 30 02
##$RELAX= 
##$RELAX= 
##$RELAX= 
##$RELAX= 
##$RELAX= 
##$RELAX= 
$$ Bruker specific parameters
$$ --------------------------
##$DU= <F:/spectra>
##$EXPNO= 1
##$NAME= <H-F>
##$PROCNO= 1
##$TYPE= <nmr>
##$USER= <she>
##$AMP= (0..31)
100 100 100 100 100 100 100 100 100 100 100 100 100 100 100 100 100 100 
100 100 100 100 100 100 100 100 100 100 100 100 100 100 
##$AQSEQ= 0
##$AQ_mod= 1
##$AUNM= <au_zg>
##$AUTOPOS= <>
##$BF1= 200.13
##$BF2= 200.13
##$BF3= 200.13
##$BF4= 200.13
##$BF5= 200.13
##$BF6= 200.13
##$BF7= 200.13
##$BF8= 200.13
##$BYTORDA= 1
##$CFDGTYP= 0
##$CFRGTYP= 5
##$CHEMSTR= <none>
##$CNST= (0..31)
1 1 145 1 1 1 1 1 1 1 1 1 1 1 1 1 1 1 1 1 1 1 1 1 1 1 1 1 1 1 1 1 
##$CPDPRG= <>
##$CPDPRG1= <>
##$CPDPRG2= <>
##$CPDPRG3= <>
##$CPDPRG4= <mlev>
##$CPDPRG5= <mlev>
##$CPDPRG6= <mlev>
##$CPDPRG7= <mlev>
##$CPDPRG8= <mlev>
##$CPDPRGB= <>
##$CPDPRGT= <>
##$D= (0..31)
0 1.2 0 0 0 0 0 0 0 0.06 0 0.03 0 0 0 0 0.0002 0 0 0 0 0 0 0 0 0 0 0 0 
0 0 0 
##$DATE= 1578652516
##$DBL= (0..7)
120 120 120 120 120 120 120 120 
##$DBP= (0..7)
150 150 150 150 150 150 150 150 
##$DBP07= 0
##$DBPNAM0= <>
##$DBPNAM1= <>
##$DBPNAM2= <>
##$DBPNAM3= <>
##$DBPNAM4= <>
##$DBPNAM5= <>
##$DBPNAM6= <>
##$DBPNAM7= <>
##$DBPOAL= (0..7)
0.5 0.5 0.5 0.5 0.5 0.5 0.5 0.5 
##$DBPOFFS= (0..7)
0 0 0 0 0 0 0 0 
##$DE= 6
##$DECBNUC= <off>
##$DECIM= 24
##$DECNUC= <off>
##$DECSTAT= 4
##$DIGMOD= 1
##$DIGTYP= 9
##$DL= (0..7)
0 120 120 120 120 120 120 120 
##$DP= (0..7)
150 150 150 150 150 150 150 150 
##$DP07= 0
##$DPNAME0= <>
##$DPNAME1= <>
##$DPNAME2= <>
##$DPNAME3= <>
##$DPNAME4= <>
##$DPNAME5= <>
##$DPNAME6= <>
##$DPNAME7= <>
##$DPOAL= (0..7)
0.5 0.5 0.5 0.5 0.5 0.5 0.5 0.5 
##$DPOFFS= (0..7)
0 0 0 0 0 0 0 0 
##$DQDMODE= 0
##$DR= 18
##$DS= 0
##$DSLIST= <SSSSSSSSSSSSSSS>
$$ [...]
##$SUBNAM2= <"">
##$SUBNAM3= <"">
##$SUBNAM4= <"">
##$SUBNAM5= <"">
##$SUBNAM6= <"">
##$SUBNAM7= <"">
##$SUBNAM8= <"">
##$SUBNAM9= <"">
##$SW= 24.9337058887773
##$SWIBOX= (0..15)
0 0 2 0 0 0 0 0 0 0 0 0 0 0 0 0 
##$SW_h= 4990.01996007984
##$TD= 16384
##$TD0= 1
##$TE= 0
##$TE2= 300
##$TE3= 300
##$TEG= 300
##$TL= (0..7)
0 120 120 120 120 120 120 120 
##$TP= (0..7)
150 150 150 150 150 150 150 150 
##$TP07= 0
##$TPNAME0= <>
##$TPNAME1= <>
##$TPNAME2= <>
##$TPNAME3= <>
##$TPNAME4= <>
##$TPNAME5= <>
##$TPNAME6= <>
##$TPNAME7= <>
##$TPOAL= (0..7)
0.5 0.5 0.5 0.5 0.5 0.5 0.5 0.5 
##$TPOFFS= (0..7)
0 0 0 0 0 0 0 0 
##$TUNHIN= 0
##$TUNHOUT= 0
##$TUNXOUT= 0
##$USERA1= <user>
##$USERA2= <user>
##$USERA3= <user>
##$USERA4= <user>
##$USERA5= <user>
##$V9= 5
##$VALIST= <valist>
##$VCLIST= <CCCCCCCCCCCCCCC>
##$VD= 0
##$VDLIST= <DDDDDDDDDDDDDDD>
##$VPLIST= <PPPPPPPPPPPPPPP>
##$VTLIST= <TTTTTTTTTTTTTTT>
##$WBST= 1024
##$WBSW= 4
##$XGAIN= (0..3)
0 0 0 0 
##$XL= 0
##$YL= 0
##$YMAX_a= 320668
##$YMIN_a= -172707
##$ZGOPTNS= <>
##$ZL1= 120
##$ZL2= 120
##$ZL3= 120
##$ZL4= 120
##$ABSF1= 10
##$ABSF2= 0
##$ABSG= 5
##$ABSL= 3
##$ALPHA= 0
##$AQORDER= 0
##$ASSFAC= 0
##$ASSFACI= 0
##$ASSFACX= 0
##$ASSWID= 0
##$AUNMP= <proc_1d>
##$AZFE= 0.1
##$AZFW= 0.1
##$BCFW= 1
##$BC_mod= 2
##$BYTORDP= 1
##$COROFFS= 0
##$CY= 11.3945322036743
##$DATMOD= 1
##$DC= 2
##$DFILT= <>
##$DTYPP= 0
##$F1P= 16.9975609425685
##$F2P= -3.02152046262296
##$FCOR= 0.5
##$FTSIZE= 0
##$FT_mod= 4
##$GAMMA= 1
##$GB= 0.15
##$INTBC= 1
##$INTSCL= 1
##$ISEN= 128
##$LB= 0.24
##$LEV0= 0
##$LPBIN= 0
##$MAXI= 10000
##$MC2= 0
##$MEAN= 0
##$ME_mod= 0
##$MI= 1.114404
##$NCOEF= 0
##$NC_proc= 0
##$NLEV= 6
##$NOISF1= 3.799351
##$NOISF2= 2.8
##$NSP= 1
##$NTH_PI= 0
##$NZP= 0
##$OFFSET= 15.70392
##$PC= 1
##$PHC0= -10145.78
##$PHC1= 12.4008
##$PH_mod= 1
##$PKNL= yes
##$PPARMOD= 0
##$PSCAL= 0
##$PSIGN= 0
##$REVERSE= no
##$SF= 200.130013532006
##$SI= 16384
##$SIGF1= 3
##$SIGF2= 2
##$SINO= 400
##$SIOLD= 16384
##$SREGLST= <1H.CDCl3>
##$SSB= 0
##$STSI= 0
##$STSR= 0
##$SW_p= 3612.71676300578
##$SYMM= 0
##$S_DEV= 0
##$TDeff= 0
##$TDoff= 0
##$TI= <>
##$TILT= no
##$TM1= 0
##$TM2= 0
##$TOPLEV= 0
##$USERP1= <user>
##$USERP2= <user>
##$USERP3= <user>
##$USERP4= <user>
##$USERP5= <user>
##$WDW= 1
##$XDIM= 8192
##$YMAX_p= 0
##$YMIN_p= 0
$$ End of Bruker specific parameters
$$ ---------------------------------
##NTUPLES= NMR FID
##VAR_NAME=  TIME,          FID/REAL,        FID/IMAG
##SYMBOL=    X,             R,               I
##VAR_TYPE=  INDEPENDENT,   DEPENDENT,       DEPENDENT
##VAR_FORM=  AFFN,          ASDF,            ASDF
##VAR_DIM=   8192,          8192,            8192
##UNITS=     SECONDS,       ARBITRARY UNITS, ARBITRARY UNITS
##FACTOR=    0.0002004,     1,               1
##FIRST=     0,             0,               0
##LAST=      1.6414764,     0,               0
##MIN=       0,             -172707,         0
##MAX=       1.6414764,     320668,          0
$$ Real data points
##PAGE= N=1
##DATA TABLE= (X++(R..R)), XYDATA
0@%%%%%%%Qj6J6j6J9k7L2m0M9n7P1q6J01j17J36j57J82k10K43k79L15l57M05m57
31b42N15n81O50p24Q08q99J000j112J234j368J513j673J853k054K276k525K807
48A478l129L503l937M448n066N833o808Q099r906J2625j7248K7201q7329J00133
62B9897J18615j80783j23495J70J04383N6952m4702q1038P5572J06531o4159j42717
74a44774K0783J13502M5828m3642o2721o695R8172M4754j27759j10155J07930
85f4777J61865J2379j04425j07412k9461R8401J09267k2921o5438J2032K693n2033
97d9830l209N3764L3707J8353j1946p4642l4934P1884M8036m3336k7819K1489
109A517K1127K6868p242r0988n2618R5798J08173j0275p1866o9895l4162N8140
$$ y = [0, 0, 0, 0, 0, 0, 0, 0, 8, -8, 8, -8, 11, -16, 16, -24, 25, -32, 39, -47, 54, -63, 73, -84, 98, -112, 131, -148, 167, -190, 215, -242, 273, -308, 342, -382, 426, -473, 527, -585, 649, -719, 794, -879, 974, -1080, 1196, -1329, 1478, -1651, 1852, -2085, 2363, -2703, 3130, -3678, 4421, -5485, 7140, -10108, 17093, -70236, 29897, 148512, -32271, -155766, -155596, -51213, 5739, -38963, -120001, -44429, 62102, -2057, -144774, -123991, -10489, 35339, -8303, -71024, -77719, 20453, 65207, -62552, -172707, -64777, 97088, 109467, 5042, -102370, -131831, -33430, 75837, 52916, -12522, -490, 2203, -49830, -53039, 725, 34432, 52785, 40839, -33803, -68737, 3147, 51183, 7847, -19972, 1517, 22644, 49512, 42270, -48718, -101336, -5538, 102635, 92360, 20494, -49401, -83563, -25423]
121b5423Q8499q078m6984J5404M9o5131k1444N7320N6850K2863l5088r3263k2559
134g6985J01330N1105q1148n5945N0565O6057J4497n6837j00380q746J24672P6248
146A04433o2902o5006j943l476j253K5496J8316K3944K7444n5183j04094J2243
158h1981J11531M7862l9446n1357l4827J9598O5905k137p6429o100P5201L2173
170E9993k8406m1660m6679K500P9089M4024m0981k5784J0604k6863l0739K7562
182a7340M7072L8221J3326o9908j01515K5343J24384M2391o4101n7778l092M7088
194B4091M7495m2038q2748L2715J11219R792q4874m2606J9835L7106K3123k2320
206C0790k0932N5792M1303r4048j01768N8524J36736M5273p4066j13975l2897
$$ y = [-25423, 63076, 54998, 8014, 23418, 23467, -41664, -63108, -5788, 51062, 73925, 38837, -54426, -76985, 24345, 75450, -5698, -61643, -11078, 54979, 69476, 12639, -87741, -96487, 28185, 104433, 41531, -23475, -25418, -28894, -30147, -4651, 13665, 37609, 65053, 9870, -94224, -81981, 29550, 77412, 37966, -13391, -48218, -28620, 37285, 35148, -41281, -47381, 27820, 59993, 31587, -10073, -56752, -54252, 24837, 68861, 27880, 2096, 12700, -14163, -44902, -17340, 29732, 67953, 81279, 11371, -90144, -64801, 59583, 101974, 37873, -19905, -22997, 24091, 71586, 29548, -53200, -20485, 90734, 100526, 15652, -26954, -7119, 29987, 53110, 30790, 9858, 65650, 106953, 12905, -88863, -30339, 106397, 151670, 77604, -36371, -69268]
217f9268J02249R2612n7159q5559L5681O9674j5944n7578k7393K6562O7935J9655
229A01467p1713l6895O4105K9441o8388m0612M9352P2149K7278n7994j09669j6748
241e8227J13178P6530m3385n7730j2867O41J6354J7492j3441J600L8764q292n8130
254A2487p561L7609Q954m723K431j2904L192L1143j7898o5256j485O6598M3542
267I6129l423m4738p3392j4437Q1988N8965l1371l7659o001q258J004J2504m705
280B6606J1810L9825j4388p0131q076N6932K1012k5427k2015k591L3848M0140
292H7545m3180q9484J0861R9870M4575m0947n8836l6826J8786N9432J2897l6014
304B8679O949K8676l3598m9573J4829M5492L0821K002m8309m9701L4549O1307
$$ y = [-69268, 32981, 125593, 68434, -17125, 18556, 88230, 72286, 14708, -12685, 13877, 81812, 101467, 29754, -7141, 56964, 86405, 18017, -22595, 26757, 98906, 126184, 68190, -41479, -58227, 54951, 131481, 88096, 30366, 17499, 18140, 34494, 51986, 38545, 40145, 78909, 70617, 12487, 4926, 42535, 51489, 46766, 49197, 36293, 39485, 70628, 52730, -12526, -14011, 52587, 96129, 92706, 47968, -25424, -39861, 42127, 101092, 69721, 32062, 26061, 17803, 18807, 31311, 26606, 38416, 78241, 63853, -6278, -14354, 42578, 63590, 38163, 16148, 13557, 47405, 87545, 44365, -45119, -34258, 65612, 110187, 69240, 10404, -26422, -7636, 51796, 64693, 28679, 35628, 64304, 30706, -18867, -4038, 41454, 72275, 74277, 25968, -23733, 10816, 72123]
316G2123k0011n2344O596L8962K4577l103n1834n3442L5741P9524Q712m3149k1983
329B0369j0436l374K0893J1474l954K6162J4914n7706n3683L4718O3588J8964
341H1929k3892m9198k4217N0243M8403m6321n9674L1241O5355J0382m0866n4242
353a0857j4723N8223N1748l4749m0860K9258K0710m2913l5517K2559N7931M4320
365A05130l4652j01231k7041R4161O6226m6276o0176K551L9322K7975k5977o2065
377b2053N065P9927K4892o2712l5284K4980J8996o764j3581m261L5430L9440m6558
390C7517q6692Q524Q6451M2205k7178n0766l6570J9026N2760P01m1666N623L3827
403D3762r794k6544n199R19J2512K5489p985k8881J0918K0239k6594k5684J8676
$$ y = [72123, 52112, -232, 6364, 45326, 69903, 66800, 14966, -38476, -2735, 76789, 85501, 42352, 20369, 9933, 6559, 27452, 38926, 34972, 61134, 76048, 18342, -35341, -623, 62965, 81929, 58037, 8839, -15378, 34865, 83268, 36947, -22727, 8514, 73869, 84251, 43385, -10857, -25580, 32643, 84391, 49642, 8782, 38040, 58750, 15837, -19680, 2879, 60810, 105130, 70478, -30753, -57794, 36367, 102593, 56317, -3859, -1308, 38014, 65989, 40012, -22053, -16988, 62939, 87831, 25119, -10165, 14815, 33811, 27047, 13466, 9205, 44635, 84075, 37517, -49175, -40651, 45800, 88005, 60827, 10061, -26509, -7483, 45277, 45978, 4312, 9935, 43762, 33968, 7424, 2225, 3144, 15656, 41145, 33160, 4279, 15197, 35436, 8842, -16842, 1834]
416A834K7338J9072N087m3927n6134J9684O5674K0616k3130k7059k4494M253L4807
429B3621L617k8215R433L1083j4289l1805k467J0866J5466J5691j7675k7039K5226
442A3513L0909l5371m6635J7886N0350K9352j3475o0178m4188M1532O6784o551
454D3928m0509l520R166m123l437q207K566L6360J7139m8756l6397L0966L3474
467B8650q991j8928q793R851L4409K759n9379l2484M9067N2483m087l0432l3716
480a9591j3312L1010L1296j7500j5422K3589L176l4257j5592J5727K4027K4662
492C7813q207n0834j5146M8109K3874l5388k5596J4829K9573K1443k1983n9910
504d1423r117O4358L6481l1934l1808N41P472O390m341j4140K1450M1939k1724
$$ y = [1834, 29172, 48244, 53331, 9404, -46730, -27046, 38628, 59244, 36114, 9055, -15439, -11186, 23621, 27238, -977, 8456, 39539, 25250, -6555, -9022, 1844, 17310, 33001, 15326, -11713, 13513, 44422, 9051, -37584, -19698, 30652, 60004, 46529, -13649, -57837, -16305, 50479, 43928, 3419, -101, 9065, 4942, 1505, -6702, -4136, 32224, 49363, 607, -35790, -4824, 28650, 19659, 731, -8062, 1789, 36198, 38957, -20422, -52906, -3839, 48644, 44557, 14125, -19591, -32903, -1893, 29403, 11903, -3519, 20070, 23246, -11011, -26603, -10876, 13151, 37813, 29606, -21228, -36374, 11735, 35609, 221, -25375, -10546, 19027, 40470, 18487, -41423, -50540, 13818, 50299, 18365, -13443, -12902, -5430, 960, -3381, -17521, 3929, 45868, 24144]
517B4144o8633q160N5820L6530j2703l8915k6663K6917M7082j9447n8760N189
529c7599N7207J8757k9126l4595j3778K5339L6050j2469l2084J7905K9116k6803
541b080l9913O506L6281L2621J20n0768m2211L3507N1757q849l2741k432J2022
554f180J0342K207k4160k0131K9648L3411j7133k5598L880L587k973N304j310
567i106o15K3884O543m2676k8421K7507L5626J0672j0124l3102k3887K7694L3708
580A7703j5501k3450J1645J3676l107p216j6268p242K9630K3056k5688k2763J7745
593g780J2375j4698j1465K143J6890L0186m673n5485k5512M4313M2097p671k5562
606d842j9407L88K5433Q548k8832o826L6350J2416l0950k0017P425J6060J6734
$$ y = [24144, -44489, -52649, 3171, 39701, 26998, -11917, -38580, -11663, 35419, 15972, -42788, -37599, 19608, 38365, 9239, -25356, -39134, -13795, 22255, 9786, -22298, -4393, 24723, -2080, -41993, -35487, 794, 33415, 33535, -17233, -59444, -25937, 25820, 16971, -15770, -18202, -6180, 4162, 6369, -17791, -37922, -8274, 25137, 8004, -17594, -13714, -10127, -13100, -7796, -9106, -9721, 14163, 20706, -21970, -50391, -22884, 12742, 23414, 13290, -19812, -43699, -16005, 17703, 2202, -21248, -9603, 4073, 966, -6250, -22518, -29760, -130, 22926, -2762, -25525, -7780, 4595, -10103, -21568, -19425, -2535, 27651, 22978, -32507, -58019, -13706, 28391, 20720, -4842, -24249, -23861, 1572, 10120, -18712, -25538, 10812, 23228, -7722, -27739, -20314, -4254, 12480]
619A2480n500k8466K345L6710j765m2725j1575K9588K9504P657k5702m3314J219
632c9544M7116J6376k7653j1450J1774K318m268p772j0751J6733L2901j2128m1953
645b8301j655K9906R332j0338j3110o601K1175K6538k3708m7233P968M6196J6875
658B7044j7007k4779j6916J4716K9230q291k5869J4600K6917j4418l0765l748
670b9286J7725K6415J0161l2353l1559K5319L6036j6223l1730K586K3658J9462
682B0211l720l6174k4347L2797L7379j4514k6227L630R813j278m718j0327M324
695a3151L1661R123m0510k6752K5370K8379R70j3295j7750j707K6957R066l1542
708a3181j5721K7950K0670p847j3818j3706k962K2089J2734j9268o935K1268J745
$$ y = [12480, 6980, -21486, -19141, 17569, 15804, -26921, -38496, -8908, 20596, 28253, 2551, -40763, -39544, 7572, 23948, -3705, -15155, -3381, -1063, -5331, -13103, -23854, -7121, 25780, 13652, -28301, -29956, -50, 9282, -1056, -14166, -20767, 408, 26946, 3238, -43995, -36027, 10169, 27044, 10037, -14742, -31658, -16942, 12288, 3997, -21872, -7272, 19645, 5227, -25538, -29286, -11561, 14854, 25015, -7338, -38897, -13578, 22458, 6235, -25495, -22909, 749, 20211, 16491, -19683, -44030, -11233, 26146, 11632, -14595, -10965, -1152, -2430, -7148, -17475, -13151, 18510, 27633, -12877, -39629, -14259, 14120, 15090, 1795, -15955, -17662, 9295, 18361, -13181, -28902, -952, 19718, 11871, -1947, -15653, -18615, 3474, 16208, -3060, -9995, 11273, 13018]
721A3018k1956q306Q447J4939J9446n500l7033j0797L1861J7176j4171j0180j038
734d094N164J4030k468k7860l661L2906J2566k0152j2409J052M651J0568o64j7233
748g604O089K8112n812l5669p205K3207K0440O308j7396k9734M663L4428K642
761B2469k7847l387J9464P709n344j4442j4905J4529L0066o762l0145K023K1172
774A4600k88j2590p938J452K1113J9168k4513l6964J1023L5175O777j5061j3307
787a353n162J3031J5880j5861k1647J8165K6967j0674k3134m693P697J5834Q935
800B3985j8752j7915K1535K1112j9884k4567O971K0367J5199k306k8904j8717
812b1876K5822K6645j5070k0024P461J1764J134o580j5915n56K8860J4088k9445
$$ y = [13018, -8938, -17244, -8797, 6142, 25588, 20088, -16945, -27742, 4119, 21295, 7124, -3056, -4094, 1070, 15100, 12632, -15228, -18889, 14017, 26583, 6431, -5978, -4926, -275, 10293, 9629, -7604, -1515, 26597, 20785, -14884, -22089, 1118, 21558, 27866, 10470, -19264, -14601, 19827, 22469, -5378, -8765, 10699, 18408, 13064, -1378, -16283, -1754, 28312, 21550, -8595, -6572, 14600, 14312, 1722, -6216, -4764, 16349, 35517, 11004, -25960, -14937, 20238, 27015, 11954, -1353, -6515, 6516, 22396, 6535, -15112, 3053, 30020, 19346, -3788, -8481, -784, 15050, 23985, 5233, -12682, 8853, 29965, 10081, -14486, -7515, 12852, 28051, 25745, -3159, -21876, 3946, 30591, 15521, -4503, 2958, 14722, 15856, 9276, -6639, -7195, 21665, 35753, 6308]
825F308k0726J7035J7534j914r971j1056M521K5541L367l4552j4545K7792K1742
838C1076p081j4976j2133K567K1195L657k4133l392K6193O955k1207j2373L300
851c52J3538J7633n944k8089k072K8004M996k1587p121R790J1890Q887j1835k5650
865g912L268L0665N019k1164o267Q214M392J973o633j3167J1271K5275q330k8777
879b173j892J8339R086n59r873j3977R930K1673r838k5277N158K1830M791q234
893A8984j2089j0272J2533K1279j0025k2123Q173J8680m646j2904n929J819J6922
906B0402J4301j9678k5185J2839K3228m402j3725l324L313J1615O807j9751j7178
919a0738J9837K2537j0974j7804j027O020R883L804j6594r727K1002J4891j9437
$$ y = [6308, -14418, 2617, 20151, 18237, 8266, -2790, 1731, 27272, 30639, -3913, -18458, 9334, 31076, 23995, 9019, -3114, -547, 20648, 24305, 172, -3220, 22973, 29928, 8721, -3652, -352, 13186, 30819, 24875, -3214, -5286, 22718, 27714, 6127, -994, 8796, 20686, 29573, 17738, -7912, -4644, 26021, 31040, 9876, 3609, 11823, 16215, 18188, 11555, -1612, 9659, 34934, 26604, -2173, -4065, 14274, 23360, 22801, 12928, -1049, 8881, 30554, 20716, -4561, 597, 22427, 27218, 18984, 6895, -3377, 9156, 30435, 20410, -1713, 6460, 25140, 20494, 7590, 1661, 3480, 20402, 34703, 15025, -10160, 2679, 25907, 21505, 7780, 4456, 7769, 19384, 26191, 6440, -10738, 9099, 31636, 20662, 2858, 1831, 7851, 17734, 21538, 4944, -4783, 16219, 31110, 11673]
932A1673j8328P794J3882Q309k692j8756q548K1565J3140j9838j3292J3326J2476
945B0711j151q411j4549l53K4052R379k2765j2552J5514R900n310p903o729N017
959D850K0233M07k7015p780K2199J1630j0210q661l784M874J5401l093k3702k48
973d899K5346O013j7111r941J242Q559J3814n136k1880J999K3754J26j9949m521
987b584R216Q925N921r728j9884O992K4111k543k1271j240J2530N572l61j0830
1001D826j3495J1503K3002o960k3931R56J3902L817k374p936q122J1391J5781
1014B2360j2778k0725P907J8055K7q618p836m411J2748J3174j4030j8782J1267
1027a642J8374m936j2340n379L89J2387J0926j5371j6460J2898J5411q583j1688
$$ y = [11673, -6655, 1139, 15021, 23330, 20638, 1882, -6666, 14899, 28039, 8201, -5091, 8235, 20711, 19560, 11149, -3400, -3753, 20299, 29678, 6913, -5639, 9875, 19775, 14465, 6562, -167, 4850, 25083, 25490, -1525, -9305, 12894, 24524, 14314, 5653, 1869, 6743, 22144, 19051, -4651, -4899, 20447, 26460, 9349, -592, 650, 9209, 23023, 17887, -3993, -1994, 21760, 21886, 1937, -2584, 6632, 15557, 21478, 11750, -8134, -1142, 22969, 20426, -845, -2085, 10445, 16017, 15656, 4826, -8669, 2834, 25836, 18876, -5055, -4099, 9803, 13620, 11246, 3310, -4812, 6579, 22360, 9582, -11143, -3236, 14819, 14846, 6228, -1608, -6019, 6729, 19903, 5873, -12909, -1642, 16732, 11796, -544, -5923, -5534, 6853, 17779, 2408, -14052, -1154, 14257, 5674, -6014]
1040f014R67M793Q991K587j7006j1993J9195J5945j3675j4744L244Q338P284J04
1054H016j6852q317K0279J3272j6647j3752O702R155L563k118j2846l473J8773
1067E755O942k0324r838J5321J0147l335p785j1470K950K1082L883k3364q649
1080a8685J7481R511n595q085p069M438J7009J68k1302l401J8814N057j1770n735
1094i164P47O899J0857o280k0256L297K2697J986j6991o677M205Q386R685p115
1108B276j9080L425K1291l38j6143k326O273M644L616p464j2631Q844J8010p360
1122C037j9396K497J3093M797k571j0724j0106J2427J8822r482k1019K756J4459
1135a410L164l567p960p654J0524J3494j1613j5971J0051J4180n170r800m254
$$ y = [-6014, -5047, -254, 8737, 11324, -5682, -17675, 1520, 17465, 3790, -10954, -7710, 628, 7912, 8016, -8836, -17153, 3126, 16398, -249, -14001, -7299, 1856, 5419, 3301, -9545, -13018, 5755, 12697, -7627, -17465, -2144, 8003, 4668, -3117, -14587, -11637, 9445, 13328, -10036, -18685, -1204, 8307, 2712, -5373, -12442, -8004, 9005, 9173, -12129, -15530, 3284, 8341, -3429, -9164, -8417, -1518, 9339, 3059, -17197, -13900, 8797, 10783, -6208, -12885, -8680, -294, 9391, 2276, -16804, -13379, 7912, 7574, -8569, -10895, -4622, 22, 3638, -3826, -16457, -7613, 10397, 3037, -16359, -13862, -769, 4028, 1457, -9267, -19373, -6946, 11876, 2394, -18625, -15869, -1410, 1754, -1813, -9773, -17427, -6903, 6591, -5022, -20993, -10942, 3238, -1932, -11732, -15986]
1148a5986J372J3084P858j7749j5568J4942J6769p473j2213l470L292J1551O097
1161B506j6212j2397J4775J2430r970r078L020L669M421j53j2540l706J8587P171
1175B523j7650j0464Q657R174L640l043j4090m254J8075Q137j5636q576Q458N835
1189i214J038j540r554k644J4263M046j5662k803J3099L217n912n308m808N279
1203a6503J6590j103k1467m670J6974P464n449o084o548L591J4658q10j7975r79
1217b2311J6294K928j0086l237J014M284Q285o503j4907P644J9253l506j8136
1230a8984l552Q157R766P128j0275j7529O228J9406k522j4128L98P106K467R58
1244e376o734q172R174J3988r800j4258P197J0676j303m606p068l369J3506J2677
$$ y = [-15986, -14614, -1530, 6328, -11421, -26989, -12047, 4722, -2751, -14964, -18434, -15142, -3591, 2506, -13706, -26103, -11328, 1102, -8868, -17946, -14926, -11257, -6836, -6989, -19529, -23235, -4648, 2523, -15127, -25591, -16934, -7760, -4120, -7163, -21253, -25507, -7432, 705, -14931, -23507, -15049, -9214, -8176, -9716, -19270, -21914, -7651, -3605, -19267, -22070, -8971, -5754, -11666, -16974, -21782, -16503, 87, -1016, -22483, -27153, -10179, -2715, -8164, -14248, -20796, -17205, -2547, -3357, -21332, -22311, -6017, -3089, -13175, -16412, -15398, -11114, -2829, -9332, -24239, -16595, 2658, -848, -18984, -22536, -14379, -4613, 2515, -7760, -25289, -19061, 345, -2177, -16305, -15907, -8801, -6334, -5376, -12110, -20282, -11108, 2880, -6920, -21178, -13981, -3305, -4608, -9214, -16282, -19651, -6145, 6532]
1258F532j3297j7660O510J3290J767k403o112o809P180R902q442r561R503Q647
1272i53o622n886j277N22Q633N915j3664j0048J4281J1226r396r944r43N001J1641
1287a514M640j6926j2324J3377J2101o546o318J690J348L308m03j0617j098J7837
1301a445M885j7538q592R733Q559J213n073j2309J734J8985L188j9809p160J2045
1315a1584Q050Q17m185r469p20J2538N79j3119K708J3087r17j0283l703k3P627
1330h597J2098n496j7740J298J5817J464q070k887j432M558J0944l847j5499O79
1344a6710J3033J504n028P15j359j272M506k449q183P890J3855o467j4284j307
1358a5556O750P773O552q490j4255N370J6560l112j2715j61O450N173K986p331
$$ y = [6532, -6765, -24425, -17915, -4625, -2858, -5261, -11373, -18182, -11002, -1100, -9542, -19103, -9600, -953, -7575, -13461, -14738, -14216, -5583, 332, -13332, -23380, -9099, 2127, -7269, -17213, -18156, -13155, -1514, 3126, -13800, -26124, -12747, -646, -7192, -13510, -11820, -10472, -7164, -7567, -18184, -19282, -1445, 3440, -14098, -22690, -12957, -4398, -3185, -8258, -20567, -18833, 152, 3340, -16469, -23629, -11584, -3534, -2717, -6902, -16371, -17091, -4553, -3974, -17093, -14385, -1298, -2215, -12498, -16201, -16224, -8597, 3501, -1995, -19735, -18437, -2620, -1156, -9226, -12113, -13545, -8987, 1957, -1890, -17389, -16710, -3677, -2173, -7201, -6486, -7845, -9117, -4611, -7060, -15243, -7353, 6502, 35, -14249, -15556, -8806, -1033, 5519, -2971, -17226, -11856, 4704, 1592, -11123, -11284, -4834, 339, 3325, -4006]
1372d006j1426P377J3990o837j0802O827R004l012o504p051M30J6621J0683j7118
1386a824j7701Q962J5061J124n971o258j936J0443O149j3203q906J3075R420p660
1400G75n826O89K013N396l90j1141j010J7718N011j6609r253M886Q378Q688J41
1415I466j4689p078J2508O815q131j847M680k87L55M22p912l68J2061K071j1672
1430c606j343Q169N09k239k964o046M240J5519L80j8648o123R693P513K834k172
1445E716r668k322J1036P86j1402K363J1417j0q098l880j100O355R761o127j4121
1460i294N384J5509k756j2304m365M068R734R144q834j6438L606J3225j113n764
1474a98L079K265k517j57n295l163J1490R973j0973j1288N007O765P40k11m807
$$ y = [-4006, -15432, -8055, 5935, -902, -11704, -4877, 4127, 1115, -5389, -12440, -12010, 4611, 15294, -1824, -19525, -10563, 4498, 5622, -349, -6607, -8543, 1900, 8049, -5154, -14060, -985, 8435, 775, -5051, -4362, -2349, 3047, 2657, -8484, -9494, 8224, 13235, -3374, -12627, -7741, 637, 9325, 9466, -5223, -12301, 207, 7022, -1109, -2956, 1724, 1437, 1792, 2214, -5698, -6066, 5995, 8066, -3606, -4949, 3220, 3729, 1490, -1474, -7520, -3280, 12239, 12619, -6029, -12152, -2459, 5054, 7888, 5716, -3952, -6274, 4762, 5548, -5854, -3491, 7926, 7916, -182, -4062, -5162, 1193, 10954, 4827, -9294, -3910, 11599, 8843, -3461, -7826, -3758, 5976, 15120, 6286, -10152, -6546, 6679, 5566, -198, 2881, 5146, 2629, 2472, -2823, -5986, 5504, 15477, 4504, -6784, -1777, 4988, 5728, 5517, 710]
1489G10m707R197Q758r779j0213M457N672K214M134l220r688J150P110k873j637
1504A285P309J487o518k026j915j416R841Q641j0385j1031N581P903n92j920m961
1519A283k607J0522Q540j2359j2873P844R783K03k186l278k823N150J477j0248
1533a572j035J7162N693j5120j1077L246R253J0242k559j5686k946J5742M668
1546A6011j3510n521P574O215K198m358j0232N53J2400q11j0937L269J1228j863
1560A2216q955n659p82J0241J3319o363j7731j049J1658K350j666p41l635N12
1574C715O690l595r452M147Q795k211l357J468k398j109M033k568o030P776R982
1589A5886o679j0545k349K649Q252R653o018j5005Q55J0631m97l602J542N22R92
$$ y = [710, -3997, 5200, 13958, 4179, -6034, -1577, 4095, 6309, 10443, 7223, -2465, -1315, 5795, 2922, 1285, 8594, 10081, 3563, 1537, -378, -1794, 8047, 16688, 6303, -4728, 853, 8756, 8164, 6244, 1283, -1324, 9198, 17738, 5379, -7494, 350, 10133, 10336, 8150, 4872, 2049, 7199, 8676, -1572, -2607, 14555, 20248, 5128, -5949, -2703, 6550, 16792, 14233, -1453, -4399, 11343, 16011, 2501, -3020, 4554, 10769, 12967, 8609, -1623, -1070, 11330, 10519, -418, 2851, 14079, 12216, 3261, -2398, -3180, 7061, 20380, 14017, -3714, -4763, 6895, 9245, 7579, 6838, 3203, 3715, 10405, 6810, -2642, 1505, 10300, 8089, 4732, 6200, 3802, 2693, 6726, 4158, -1872, 5904, 15886, 9207, -1338, -3687, -1038, 7214, 16867, 10849, -4156, -3301, 7330, 6833, 3231, 4773, 5295, 6287]
1604F287K347n922p498Q061J0324o669p941L832N012m57l053p038j039J4711R412
1619B0369j4665j3797M976R355L646M28m935n548N080K860q342j540J2124L216
1633A3227q169m689J68J705O225Q77r186q27J0907J526j0032l644K153K967P368
1648A0576L298j0588p199M963L311j47M324N81o527m22J658m508K80R773J587
1663A0960p803k975L57N80N639J745r167k229J1841L326j1049o836K552O374Q416
1678A1731q1j3554n280J0539K835p083J005P307N72m728p090n413R177J5154m517
1693A0574j7273p71J2187K408n486n747j025Q949R425r338j4825M246J2144l80
1707E088m926K36Q47Q59r38p656k800J4647R959j2020j3036J485P270N514J432
$$ y = [6287, 8634, 2712, -4786, 3275, 13599, 6930, -1011, 2821, 7833, 7376, 4323, -2715, -3754, 10957, 20369, 5704, -8093, -3117, 6238, 9884, 10312, 5377, -171, 4909, 7769, -573, -2113, 10011, 13227, 5058, 369, 537, 2242, 8467, 9344, 158, -669, 10238, 11764, 1732, -1912, 241, 3208, 10576, 13874, 3286, -3913, 1050, 4361, 4214, 8538, 9119, 2592, 2170, 3828, -680, -400, 9373, 10960, 3157, 182, 539, 1119, 6758, 8503, -664, -2893, 8948, 12274, 1225, -5611, -3059, 3315, 11731, 11650, -1904, -7184, 3355, 6190, -893, 112, 7419, 7991, 3263, -3827, -9240, -63, 15091, 10574, -6699, -7470, 4717, 7125, 1639, -4108, -5133, 3816, 13241, 3903, -10922, -6676, 5468, 5088, 162, 398, 1245, 2104, 1166, -6490, -9290, 5357, 15316, 3296, -9740, -8255, -985, 4529, 5961]
1722E961o804n434O903N226q103m878O157L529m78Q45l550m836L304L561m658
1737c255J104P470m30p139k531j597Q06J0413N696j0014q569K587L740K394L095
1752C770l484m758M715L973p629m474O668M284j735m32k755k908M291J307p025
1767f192O06J1630K057j0702p034O60O373R960O61j2353m899P688J881m996J269
1782c391M129q7j07k780o373K456R397k168o844K449M960k755l288j899k050N976
1798b375R387l646j1454j369L321J642M716L511o628m550L534q74k241M129L567
1813F70l342l66l39n404J31Q164J39o310Q51M725j269k541l458l422O821J2372
1829G422l739j5094k993P955M751P32j681m007K146M033o905p684R112J2036m436
$$ y = [5961, -843, -6277, 626, 5852, -2251, -7129, -972, 2557, 2079, 2924, -626, -5462, -2158, 1403, -3255, -2151, 5319, 4889, -2250, -4781, -6378, -5572, 4841, 10537, 523, -8046, -5459, -1719, 675, 3770, 286, -4472, 243, 4216, -3413, -7887, -1219, 3065, 1330, 898, -1857, -4765, -474, 833, -6192, -5586, 6044, 8101, -2601, -9635, -8975, -2602, 7358, 8019, -4334, -9233, -1545, 336, -4660, -3391, 738, 651, 544, -2236, -8609, -6153, 3244, 1076, -5768, -3319, 1641, -1114, -4402, -6301, -8351, -2375, 7012, 3366, -8088, -9457, -6136, -4494, 222, 3733, -2895, -7445, -3911, -4785, -7026, -2897, 670, -2672, -3038, -3377, -8781, -8650, -486, -347, -6657, -5806, -1081, -2350, -4891, -8349, -11771, -4950, 7422, 3683, -11411, -14404, -6449, -1698, -966, -2647, -6654, -4508, -475, -7380, -15064, -5952, 6084, 1648]
1844A648j0624k365L665O851K075r557m937J1831Q974j0231j2167K480Q812N744
1858B199J74q591m427P141K909r152m61J1097M654p563q131l010N645J1313J43
1873C940j1825k461R014J591o517j707J694L612N098j714r197j228O527P01k691
1888e163M096J898l815k302j745k766N383R188k404q278k125P19J457N570K151
1903A864o196j841M531n83m359P28J963P72M352K78q491k098O293J22k622L291
1919a996L242k584k559l922l227O918J0979l397j1320j909M621J748J822m72l479
1934e535K329M600n162p002M428O218j247j183M8k143j08J844l915j323Q454M906
1950E209p222o177m08J383M825O296l241o964M55J916j716J616L610j698q65K264
$$ y = [1648, -8976, -11341, -7676, -825, 1250, -8307, -13244, -1413, 7561, -2670, -14837, -12357, -3545, 2199, 2373, -6218, -10645, -3504, -595, -9747, -10208, 889, 5543, -2020, -10151, -13161, -7516, 3797, 3940, -7885, -10346, -1332, 259, -6258, -7965, -6271, -2659, 2439, 725, -8472, -9700, -3173, -2472, -5163, -1067, 831, -2984, -5286, -7031, -9797, -4414, 4774, 2370, -5908, -8033, -7314, -5857, -287, 1864, -4332, -6173, -1642, -2225, -6584, -5856, -3893, -3121, 1231, 1509, -6982, -9080, -2787, -2665, -5287, -1996, 1246, -1338, -3897, -7819, -11046, -4128, 6851, 3454, -7866, -9775, -5154, -3406, -1584, -2056, -5535, -3206, 1394, -3768, -10770, -6342, -124, -1371, -2554, -2506, -4649, -4757, -2913, -6828, -8151, 303, 5209, -2013, -8190, -8598, -7215, -2390, 3906, 665, -6299, -5844, -3928, -5644, -4028, -418, -2116, -2981, -717]
1966g17k953m710L653M557j436m40J244k897q10K919l592k830Q075O837o022q476
1982g598j522K646P287N431o263p370M294M390n149l079N115M924K47l734p047
1997g428o26J0064L496r249l312Q689M114n983o303k250O120J1596m98j3246m215
2012i031Q216K847l600M04K727J628M05o777o610O755J1963k398r369j090M275
2027C45J334l84k897k597O374P084o401q950K250M631J178J512K92l280m48R84
2043A027m052p30P939L715n067l978o90j222L862N152k178l888J630P00l221R61
2059d0J626j569J935M750k876o370M0K863Q02L185J520m050j938K051l146k099
2075c316O870N127l852m739k174p77M576N954m044m805L643K727m124l087K308
$$ y = [-717, -3670, -8380, -4727, -170, -1606, -2046, -802, -3699, -4509, -1590, -5182, -8012, 63, 6900, 878, -7598, -9120, -6474, 813, 6244, -19, -7389, -3095, 1295, -3854, -6933, -1818, 3106, 3353, -381, -7428, -8054, 2010, 5506, -3743, -7055, 1634, 5748, -235, -6538, -8788, -2668, 8928, 8430, -4816, -9031, -815, 2032, -1568, -1164, 1563, 3191, 3596, -3181, -9791, -3036, 8927, 6529, -2840, -3930, 345, 1679, 1295, -1602, -4199, 2175, 9259, 2858, -6092, -3842, 789, 1967, 3479, 3771, 491, 43, 1027, -3025, -3755, 4184, 7899, 2832, -1146, -1836, -3058, 804, 5956, 3778, -110, 1520, 2220, -1001, -40, 1586, 17, 1952, 6702, 3826, -2544, -2504, 359, 1161, 4346, 5866, 1816, -122, 1929, -1217, -3316, 3554, 8681, 4829, 90, -2084, -2861, 1715, 7669, 3625, -1180, 2463, 5190, 1066, -2021, 287]
2090B87J794L031K051n189m830L668K603l139R32M984j038k908k190k966Q67Q571
2106F528L216o440l842N48k36J896L514j281k756L063Q07n181j164L612J525Q74
2122D683J849l742l702K765K056l638O91O020L92l425l744l476J901R463L344
2137A1437q601m488L468J932r83j8m73J878M786k651r385M72Q973J912m639j748
2153A872J470J715Q67m650n370O802J0805l253j0788k675M351M343K524k874l951
2168A188L446L660o319n888O507P201j161m185l879o55N061K829n441k943P070
2183F491M038o340n251J97L161N279K229n781l628L279L80l695J944N259k42k352
2199D968k041l642L70O657J784m434m71J615k178j039K098m78l81L848N98n188
$$ y = [287, 2081, 5112, 7163, 1974, -2856, 812, 3415, 276, 1208, 6192, 5154, 2246, 56, -2910, -2043, 6528, 9744, 3304, -538, 10, -226, 1670, 5184, 3903, 1147, 4210, 5017, -164, -1328, 2284, 3809, 4683, 6532, 2790, -912, 1853, 3909, 271, 962, 6982, 7374, 3949, 205, -3271, -1370, 8093, 11437, 2836, -1652, 1816, 3748, 2765, 2747, 2274, 4152, 8938, 6287, -3098, -2626, 6347, 8259, 3620, 1872, 3342, 5057, 5924, 1274, -4096, 2706, 13511, 10258, -530, -3205, 1146, 5489, 8013, 5139, 1188, 4634, 8294, 1975, -3913, 2594, 9795, 8634, 4449, 570, -85, 4976, 7805, 2364, -579, 6491, 10529, 4189, -1062, -865, 2296, 7575, 9804, 4023, 395, 3674, 4054, 359, 2303, 7562, 7320, 4968, 2927, -715, -345, 6312, 8096, 3662, 3191, 4806, 2628, 1589, 3687, 3209, 2828, 6676, 7274, 2086]
2215B086j477R52q5K680M066k540m144M51K35j917K263M183j097j560o22m005
2231e31j202O144L292l785j856J327j086l67R03k037K94N748P05o770k317K791
2247A253J261R93K305k020k166J465j299m051K905O295q7l566k376k126K77N637
2263D700J096l973j36K881j645l377J164M42J146M209o46o108j033L738j43q88
2279A427K255Q62j565j29k593l902L732P756q47n742j776J20J392K937o70l820
2295e63K624M691m108o111J889M073J796N03k677l938K740L511m508l076N865
2310B711M872l097n024l386P32O668M806o147m835M052J873l373j915K577K263
2325B777K240j343o656j734O672K643m833l27K994L36j935j830l260K489P329
$$ y = [2086, 609, 1561, 1476, 4156, 8222, 5682, 1538, 1989, 2224, 307, 2570, 6753, 5656, 4096, 3474, -531, -1733, 4411, 7703, 3918, 2062, 3389, 2303, 1936, 2839, 802, 1096, 6844, 7549, 779, -1538, 1253, 2514, 3507, 5812, 3792, 1626, 3091, 1792, -2259, 646, 6941, 6854, 3288, 912, -1214, -937, 4700, 5796, 1823, 1687, 4568, 2923, -454, 710, 1152, 2298, 6507, 5861, -247, -1280, 2458, 2315, 1427, 3682, 4544, 2979, 2850, 257, -3645, 87, 7843, 6996, 1254, -522, -402, 990, 3927, 3257, -563, 2061, 6752, 2644, -3467, -1578, 2495, 4291, 4794, 2117, -1821, 919, 4430, -78, -3154, 2711, 7583, 4486, -538, -3924, -3192, 3476, 8282, 2135, -2700, 1352, 3225, -148, -2063, 514, 2777, 5017, 3674, -2982, -4716, 1956, 4599, -234, -561, 2433, 2769, 834, -996, -4256, -1767, 5562]
2340E562K68p092j738K277j69Q41J833o42k97J451k759m501K699N676j110j807
2356D92j12j695j059J706M49j607K211K819k769k644J16o03P42M542J154m370
2372f28j529M67j297J140L435n40j829J286r63m265J335M730L07j464K52k668
2388b231j222K857O13k997J813M048j739m092m55l80K007M742n26m605n52K203
2404e16j658j367K655K003o27K27l303l690L201N220j169k841R18j71j004N92
2420a530q22j090L350L999l971m849J024J652R00J944p4k903J085J407l903j990
2436e771M902L612j803k212k747j589L783L840l345k499L398J572m085j768O72
2451d040J389M077J233n821k953L831J812k869J43K795O14m50k281m581Q41P494
$$ y = [5562, 5830, -1262, -3000, -723, -892, -51, 1782, 1140, 843, 2294, -465, -4966, -2267, 3409, 2299, 492, 380, -1315, -2374, -668, -219, -1826, 385, 3204, 435, -2209, -2093, -2696, -1954, 2588, 3742, -628, -2157, -1690, -2987, -1847, 1588, 1048, -781, 505, -458, -4723, -3388, 1342, 1649, 185, 437, -2231, -3453, -596, 17, -2980, -1167, 2881, 1142, -2950, -3405, -3785, -1778, 2964, 2438, -2167, -2719, -516, -2174, -3541, -886, 1117, 490, 717, -2586, -6276, -3075, 2145, 976, -1865, -947, -1118, -2122, -1530, -2352, -3442, -92, 3907, -64, -4913, -3889, -2237, -1337, 607, 533, -2370, -1285, 122, -3781, -5771, -869, 2743, 940, -1272, -4019, -5608, -1825, 2015, -1330, -3829, -431, 1141, -2944, -4712, -4040, -2651, 1426, 2659, -3162, -6115, -2284, -472, -3341, -3198, -403, 211, -239, -2520, -7101, -6260, 1234]
2467A234J937n828j939J556R8J72M74j761J648M209k157o461M30M890P35o75l61
2484a799j673P4J984k509l199M303M829k113l819r58n43J828L225l73l117J711
2500b149J226l775j221L259J274m9R04j999l215J686K669j801P8K838q11k552
2516c638K47m92j311L410K796k433k080M85j439j44L088J667k662N39N47k778
2532d198p52K507R98l89J872r51m361J152K936r80n96K412k60j807p0p28k031
2549e246L556M214k725l234N29K46j01J936K23j691J476J599m316j948L318K803
2565F39q01Q8j538k365J824K283k771q89M345R59l739j425m55L77L462K240m033
2582a799j803K762J09k846O53K530N04L62n53m616r04N701J277l146j81J009q26
$$ y = [1234, 3171, -2657, -4596, -3040, -2942, -2770, -2296, -4057, -2409, 1800, -357, -6818, -6388, -1498, -763, -1438, -1799, -3472, -3398, -1414, -3923, -7122, -2819, 2010, -103, -3922, -4880, -5423, -3595, -370, -743, -3860, -2149, -923, -4698, -5919, -2660, -1386, -1435, -531, -2530, -5745, -4059, -1390, -3191, -3113, -275, -1086, -3638, -3391, -3883, -5194, -1784, 1012, -1421, -3501, -3016, -4455, -4599, -1511, 156, -2506, -1967, -1420, -4198, -4950, -2443, -1445, -1834, 38, -913, -5274, -4122, -1186, -2166, -2762, -350, -610, -2417, -2487, -3215, -5246, -1690, 2524, -201, -3435, -2906, -2660, -2761, -825, -602, -2293, -817, 782, -3534, -5482, -2164, 639, -162, -74, -1612, -3977, -2153, 130, -2641, -3530, 815, 1774, -1965, -3390, -3845, -3468, -6, 2234, -1799, -3602, -840, -731, -3577, -2924, -394, 110, 472, -81, -4697, -5601, 100, 1377, -1769, -1950, -941, -1767]
2599a767Rk42j862J360N091j252n094n02K462K81N07P73j527K48K074k187m049
2616e677K465N010p79k159r62j423J153K871j172k833K652K958l232k631R28J021
2632a810J639K374k482l438J825K457k345j051K949Q96j308R7k444j732L733L404
2648B764k719j515J328l14j460J370P3r01K710J187m054j871K921P98l14J232
2664A235j47k239N39R87k311N79L691k48j886K56j026j398K318K494j947j095
2680a98J991j125k110J558O61n38K028Q77l462j760K679P39r97J834l68j957O50
2697E02J133k693N1L805P58k361o28m20j158K331J798k393r05K747n76k633M10
2714b32J275L22J489K81l603r44L487K08k459J642J124r52n07k30k290J118M649
$$ y = [-1767, -1758, -2000, -3862, -2502, 2589, 1337, -3757, -4259, -1797, -1516, -1009, -236, -1763, -1515, 559, -1628, -5677, -3212, 1798, 1019, -1140, -2102, -3525, -2372, 499, -673, -3506, -854, 2104, -1128, -3759, -2831, -1810, -171, 2203, -279, -3717, -1892, 565, -1780, -2831, 118, 1014, -294, -197, -2641, -4373, -640, 2764, 45, -1470, -142, -456, -1916, -546, -473, -1374, 1336, 2523, -1531, -3402, -481, 317, 3, 1235, 1088, -1151, -612, 375, -1936, -1357, 2334, 2086, 200, 456, -570, -1968, 350, 2844, 897, -198, 1793, 668, -1442, 116, 777, 239, 2267, 3144, -318, -2078, 601, 1340, 343, 2177, 1809, -148, 502, 1635, -1058, -1007, 2798, 3556, 1195, 567, 147, -1011, 1320, 3118, 725, -180, 2567, 1991, -642, -232, 1043, 1365, 2854, 3135, -468, -1412, 2075, 2283, -176, 1466, 2590, 1638, 1131, 901, -1389, -271, 4378]
2731D378o04l718%J457q51N73N53r13Q83K149k001l927J590L316k05p98J16j330
2749F68k13K167j510j868L046K504k260k402K43M6Q36K814j627k846K490J592
2765C680k880j525K455J456o5L20k316k319L035K220k325p43K006k70j319L01
2781A711m53m81K931J724l912j703K482J57j117J343M4j243J843K26l464k49L675
2798C514P34k041N03p00j171J286J085j793N34K495j331k460P44Q40m45K043O68
2815D505k417r93J872p34j121J796R14j561P30L37k534l28L319M2j719P91j39
2832B760j555Q84J142j697M29K602j046k585M08R60o27J534J100k838m36K289
2848C324p35j788J439J401q96k2r8k100J31L340k73k246P05J137j509j45R42j355
$$ y = [4378, 3774, 56, 56, 1513, 662, 1235, 1788, 875, 1758, 3907, 1906, -2021, -431, 2885, 2680, 1882, 1998, 668, 455, 2622, 1112, -756, 2290, 4794, 2534, 132, 375, 421, 1257, 4071, 2444, -402, 2088, 3680, 800, -725, 1730, 3186, 3121, 3441, 1125, -1194, 1841, 4061, 1736, 993, 2999, 2729, 1410, 1711, 1258, 777, 3708, 5432, 1520, -183, 2299, 2456, 1339, 2682, 2726, 1483, 3326, 3552, 88, -161, 3514, 4248, 2207, 2710, 2010, 839, 2125, 3210, 1417, 1951, 4446, 3115, 655, 1399, 2239, 1794, 3837, 4505, 2088, 1095, 2967, 2233, 1112, 2908, 3822, 2261, 2991, 3328, 794, 466, 3785, 3827, 2108, 2899, 2760, 1205, 2089, 3231, 1534, 1963, 4565, 3519, 934, 1342, 2302, 1675, 3209, 4309, 1471, 1035, 3324, 2589, 801, 2240, 3641, 2745, 2723, 2625, 525, 656, 3996, 3723, 1477, 2182, 3319, 1810, 1665, 2607, 1252]
2866A252J077K889j750l649J140K178p19k54J008j329n0J891j893j877K288K399
2882D601j853j513O65p91O7K351j405j701K182J360k811j343K165J91O19Q74j938
2899A720j932J730J723k026o48K544m56r82L08j354j080L524Q96k634j090J974
2915B217l56j142J018m09l90K036N76l605p33K973J47r42P36p57j027J490M51
2932B283k587R26K889j042k098K10j15N7J696L27k610L02K405j133k368J238J478
2949A858l54O88m16k810N72K972j164j490J420O18j481m1P08j435Q98K500j716
2966A327k330J379R06j512N39R67q98J1J521j480j808J937J202j357K35O40j787
2983e08Q8K006j013j602K217M24k150J18P06j018Q38K243j376k444J167J048j382
$$ y = [1252, 2329, 5218, 3468, -181, 959, 3137, 2418, 2164, 3172, 1843, 1793, 3684, 1791, -86, 2202, 4601, 2748, 1235, 1900, 1109, 1176, 3527, 2122, 421, 2603, 3963, 1152, -191, 1974, 2165, 2784, 3658, 1720, -212, 1518, 3241, 1215, 567, 3111, 2655, 1673, 1981, 627, -453, 3071, 3967, 1333, 243, 2217, 1861, 719, 1737, 1328, 938, 2974, 3550, -55, -788, 2185, 2332, 1390, 2126, 1369, 342, 1832, 2283, -304, 622, 3511, 2469, 371, 581, 466, 523, 2219, 2546, -64, 238, 2643, 1510, -858, 380, 1858, 1504, 2192, 1776, -1034, -462, 2510, 1346, -144, 1276, 1894, 413, 372, 1080, -355, 543, 3043, 1327, -1003, 376, 1282, -230, 309, 1276, 378, 389, 1910, 430, -1378, 559, 1761, 404, 639, 1279, -508, -420, 1586, 573, -1029, 1188, 1612, -538, -420, 286, -732, 106, 2349, 973, -1471, -304, 744, -638]
3000f38L44J071j281M86J438j742k087K126J441j262j92K72n95k36J705j604j177
3017a931K721P57k483p84J419o38Q88Q20j478j273J921R18k848K64K243q17j99
3034e00M02j185q74J959P65k348K80K045p05j671J061j79o12K038K9k499j54K303
3052A55o74q27R78k41r07R62J69j949P03K159j205j383J379j43j405J703M34k074
3070b166M92J993j209j544R82M33m94J460k05k023j23K463r43j482J462L95j011
3087a520O96j11j785J044K116r45k530J626Q02j179J37P01j337R87J590j787j870
3104c365J671J338j360q1P69j090J21J609j862j081K550O89k387J43J032p10K88
3121a726J326j822k47J569L5j939O33J241j111J49J267j540p59J161O78j342L90
$$ y = [-638, -294, 777, -504, -18, 1420, -322, -2409, -283, 1158, -104, -296, -24, -619, -855, 850, -754, -1931, 790, 1547, -936, -1720, -301, -939, -51, 769, -709, -1982, -61, 857, -1991, -1727, 516, -301, -500, -98, -1283, -2157, -198, 567, -1781, -1501, 544, -161, -1832, -771, -950, -1562, 476, 505, -1994, -2148, 155, -519, -1346, -368, -609, -1516, -554, -385, -2334, -1631, 528, -677, -2060, -681, -824, -2229, -526, -92, -2166, -1674, 319, -890, -2434, -1452, -1019, -1513, -53, -258, -2281, -2404, 59, -884, -2366, -904, -509, -1520, -824, -935, -2720, -1676, 440, -505, -3035, -1409, -607, -1786, -1649, -948, -2285, -1298, 292, -1495, -3365, -1694, -356, -1716, -1797, -1028, -2118, -1997, -388, -2250, -3331, -781, -92, -2479, -2336, -1304, -2014, -1726, -400, -2222, -2469, -900, -865, -2804, -2171, -930, -2041, -1892, -625, -2165, -2924, -1763, -1085, -2427, -2037]
3138b037J207j313j84J531r57j251J718N61j624K70M85o52J72J606j336j115J743
3155a176R48j992k41J126l69J99P65j454q66K234N62k510K62J951o55m22K31r52
3173b359Q2K400k04k803N6K924p99j423P38m12Q7J280k81k175J068K420j481j455
3191b337J312K50k97N04k78j626J076J562j501j512K145N7j046P25K2j102R44
3208a102J372j712m82J556q8j618J542K94j595N49J143j008j200J790L62j654
3224a851J113K12j365N78J923j360j421J256L68q46N32J33j600P98K070j795j074
3241b329J930O34j910K82N09p29P84J261k255r46K299P47k019l3P82j55N35K40
3259c73j799R1K227P9k135J89J658r47n22R70r02n9J871o32k171J082J775j231
$$ y = [-2037, -830, -2143, -2327, -796, -1753, -3004, -1286, -725, -2349, -2079, -1594, -2246, -2074, -468, -1804, -2919, -1176, -228, -2220, -2461, -1335, -1704, -1505, -740, -2194, -3060, -826, -264, -2774, -2512, -561, -1216, -1638, -1407, -2359, -2277, 123, -81, -2884, -2828, 96, -703, -2126, -1388, -1800, -1713, -433, -714, -2889, -1821, 599, -882, -2337, -1025, -775, -1072, -568, -846, -2472, -1396, 166, -1335, -2847, -702, -645, -1691, -966, -944, -2046, -1102, 270, -1442, -1924, -368, -456, -2074, -532, -238, -1833, -1284, -141, -1149, -2349, -559, -197, -1851, -738, -526, -1891, -1313, 610, -750, -2171, -915, -547, -1393, -861, -728, -2328, -1530, 540, -1255, -2329, -399, 235, -1675, -1393, -884, -1613, -829, 432, -1823, -2769, -470, 277, -1742, -1775, -993, -1148, -613, -373, -2172, -2081, 146, 225, -1910, -1721, -63, -1010, -1532, -562, -1464, -1523, 348, -284, -2455, -1373, 402, -829]
3277h29n60R38m02l41Q39j63j144J273J003j720m76J590n06r53J411j94r13N49
3295e98J065j438Q0J603r27j276J548M77j958N78P85q5N5O27j275p64K258M51
3313A206k461N16J710n90q72O03l30j46J950n56k447J011K031j207j201O43P02
3330E62k23P35j086j748J641K253j734j326J488N66j032J22J09p19J524P40k122
3347b50r34K188L92j873P39M91m68L88N36j671j70J977k58j498Q87Q08j388j30
3365b34J284o01m45J378o76j607J372P23j179J17J357q56j288J185K48q93R65
3382H50L1j206N28J268j557n22J565L17r78N2J54o14N16J195j376q34K079m0k101
3401f73M26J371j44N0p8j257j29K194m74k156Q19J882q75o84L94n25j74J832m36
$$ y = [-829, -1389, -451, -853, -1194, -355, -518, -1662, -389, 614, -1106, -1582, 8, -498, -1451, -40, -234, -1147, -598, 467, -971, -891, 712, -215, -1491, 57, 534, -1424, -846, -61, -146, -91, 536, -739, -1503, 755, 1206, -1255, -739, 971, 381, -491, 112, -218, -364, 1586, 1030, -1417, -406, 1625, 418, -783, -140, 562, 339, 1074, -12, -1760, -119, 2134, 400, -926, 562, 1128, 96, 218, 327, -392, 1132, 1872, -250, -1184, 1004, 1396, -477, 262, 753, 285, 673, 1209, -462, -632, 1345, 1087, -411, 476, 1284, -104, -234, 1050, 449, 4, 1382, 706, -901, 471, 1194, 15, 132, 1489, 633, -655, 530, 778, -115, 850, 881, -325, 203, 1471, -86, -608, 957, 1274, 296, 348, 502, -112, 404, 1599, 223, -611, 1468, 1428, -673, -247, 1124, 980, 1030, 952, -305, -434, 1760, 1286, -870, -51, 1831, 956, 272, 666, 141, -33, 1799, 1363]
3420A363k113J639J212j835p22J362K11l39P16r46j132J687L48j291k21J699k54
3437A384j502M74M76o65Q24Q78j356k16J263j141q51J419Q14q70j06L33q09l29
3455B0J488j157k03J476k4j907m1K027n72l64O58o59j21Q21n20j720J573K095
3473B870j615j324O73O85n15J50l61r27J970Q36k567j321K734M79j006J30j75
3490G16k89Q40M8j455P0K435l39k276n8J203j28L18j1r67L07J399r94j696J008
3509A31K194j234l02m8p21m0J463m72j215J528N17j641m44J311q7l68P10m44p97
3528D1N96K42j248L89K151j491o80O09J6r69O53P46n63O15K38j652o58J933L82
3547A350j320J84R29o91o61O15p69N56J445j046j403O39J032r78l82J426l30k29
$$ y = [1363, -750, 889, 2101, 266, -456, 906, 1117, 778, 1494, 548, -584, 1103, 1451, 160, -61, 1638, 1384, -118, 356, 832, 167, 991, 1869, 513, 297, 1560, 419, -432, 987, 1801, 931, 825, 1158, 349, 20, 1508, 351, 148, 1624, 1600, -307, -348, 1679, 1107, 743, 1401, 742, 621, 1442, 922, -798, 775, 2870, 1255, -69, 604, 1289, 774, 924, 563, -364, 1606, 2442, -125, -1446, 1288, 1767, 761, 891, 716, 427, 1267, 1315, -140, -70, 2365, 2026, -250, -308, 895, 767, 1085, 1074, 107, 414, 1813, 819, -877, 131, 2325, 1091, 789, 741, 20, -20, 1443, 971, -244, 1284, 1801, 160, -284, 1027, 940, 572, 1282, 838, 41, 637, 879, -369, 20, 2171, 680, 0, 609, 625, -344, 309, 1055, 492, 1107, 1345, -307, -965, 968, 1350, 30, 214, 1143, 452, -209, 406, -363, 193, 1638, 592, -811, -172, 860, -118, -500, 926, 596, 367]
3565C67O50j113j227J421J662j576o88J045n26n86O18j11k60J176M73k243J58
3582g60J499l41r20R83O8j126P89k13r84R85J432r36j499J237J59j302K11J284
3600E66m21r8N20j394o29K178q7j340K42J560j104r94N38l42O06J124l99j763
3618a237R81J051j442p48J631N95o63l32j023n92J766J241j751m95J849l06j799
3635a274Q8Q26M22O80k51k104j45K511l73j828P06J474o15m38o12o20Q85J881
3653A213r69j838R69J206j215r54J119MN91L12j869p50J660J156j118r63J717
3670B71n48q96J35j80p3J524L0j820J51J318r83n09J289K50n89J53m39p46N34
3689a128J376q09o40R90k57j480K65J195m24K00M29o63o59R79l41p27J311N96
$$ y = [367, 1017, -96, -1323, 98, 1760, 184, -504, 541, 15, -571, 47, -64, -324, 852, 1325, -918, -760, 739, 398, -522, 461, 529, -597, 192, -21, -1005, -20, 1412, 476, -1023, 214, 373, -929, -718, 566, 145, 47, 567, -827, -1456, 722, 635, -705, -463, 1097, -7, -1001, -463, -805, -199, 925, 526, -1237, -256, 795, -647, -1395, 236, 831, 168, -164, -1187, -1779, -13, 1228, -523, -1018, 831, 525, -1274, -1186, -360, 62, 742, 491, -1613, -1758, 753, 380, -1448, -742, 732, 117, -321, -933, -1553, -668, 1213, 244, -1594, -625, 581, -634, -1588, -469, -465, 126, 438, -1431, -2181, -521, 635, -483, -1446, 271, -277, -1173, -1038, -1218, -1291, 233, 263, -1557, -1406, -88, -1071, -1580, -291, -41, -630, -477, -916, -1662, -1128, 248, -561, -1201, -211, -468, -1948, -1683, -488, -912, -712, -283, -946, -1605, -626, -967, -1694, -383, 213]
3707B13j166m57J80k87J36J103n17o78P68N28j956n1J551N77n73l6o47q26J310
3726h28J76j009L80J761j241j524Q35N41l35P48L3j008K96P15j089n97J525N91
3744c0m99r37L90p36K78R60l50l52Q93l5k086O93J211k58n8L59l59q35Q66l71
3764a256r50J431J003j532p52N71N12m45L57J57j01N81k56j630j85K284K57j238
3782a192l32L96o1k67K05p38R48J690j145k028M59J636l20j43k2j03K31L60j218
3801a644j275K066J530j620r97N39L07j61O79q59R2J497j62j839n04J717N13n40
3819f61J84q15l57Q29k76r59J103J619p46j864M27M73k31O42M25p50K49O16j558
3838a650k99J618J48m93J44K4r01M07L17p38M26J471n63j752N60P72n68N13P22
$$ y = [213, -953, -1410, -1230, -1517, -1381, -278, -795, -1473, -705, -177, -2133, -2184, -633, -56, -629, -665, -1312, -2138, -828, -652, -1661, -1281, 480, -761, -2285, -1450, -909, -1244, -496, -463, -1471, -1175, -460, -1549, -2146, -621, -30, -529, -1466, -1076, -1812, -1534, -574, -924, -1276, -383, -418, -2504, -1811, -600, -858, -916, -557, -916, -1751, -885, -1256, -2206, -775, 228, -1304, -2056, -1485, -973, -1418, -1061, -904, -1005, -424, -680, -2310, -2495, -211, 46, -1192, -1524, -1128, -1189, -1456, -1251, -1989, -1041, 649, -496, -2524, -2065, -429, -749, -892, -914, -1017, -786, -426, -1644, -2919, -853, 677, -943, -1940, -1401, -1094, -1255, -576, -1435, -1343, 154, -8, -1847, -2351, -634, -121, -661, -477, -1292, -1649, -820, -1096, -2055, -952, 667, -79, -1943, -1516, -1043, -1274, -632, -207, -957, -708, -92, -1650, -1949, -331, -183, -676, -532, -508, -1409, -1002, -685, -1423, -997, 474, -89, -1841, -1281, -509, -1077, -564, 158]
3857A58l36n77N80q37q68J300J291j031l37L95n53l37Q73J99o51J200m44j615
3875a590K00J271j42m40Q49J40r45j37K92n04Q38P84p85o77O23k21q35P70R62
3894D53p25jJ63p34p20J572M02p66K90N82j345k57Q10J54L25K45p58o72O21L54
3914gr53L74J447Kj168k99p7k79J007N96r59j03J229q16j318Q31J003L23l60n54
3934h1q99M10J238p45r18J454R47j545p73K63N90P61N17j312p54J269N56j771
3952g93k9J530K51k62l04j213J62J411L35j322K65J508o59j331k9N13N46J006
3970A585p10j349N02J321r93m86J402L99n55m82n56m40J245J100j170n97R49k48
3988I17j216Q05M90j58O53j27j247k91J195J39o86N45M81q64k54K36k95J41J692
$$ y = [158, -178, -755, -175, -1012, -1880, -580, 711, -320, -657, -262, -815, -1152, -279, -80, -731, 469, 25, -1590, -1390, -119, -261, -701, 148, 288, -657, -794, -502, -1006, -168, 616, -169, -846, -223, -444, -1279, -509, 453, -272, -273, -110, -844, -1564, 8, 410, -356, -66, 516, -829, -1086, -276, -122, 203, 448, -310, -982, -361, -7, -960, -586, 861, 863, -305, -604, -681, -960, 47, 643, -316, -419, 810, -6, -1324, -493, 510, 833, 473, -81, -980, -570, 668, -77, -995, 459, 1406, -139, -912, -649, -59, 702, 1219, -93, -847, 422, 978, -793, -822, 708, 959, 697, 393, -820, -658, 753, 1088, -234, 31, 1539, 880, -451, -480, 33, 579, 1585, 875, -474, 28, 1349, 356, -130, 1272, 1671, 1116, 634, 78, -362, 883, 1983, 813, 216, 1165, 917, -299, 506, 996, 838, 1491, 1364, 117, -174, 1021, 1160, 474, 1019, 1500, 636, 382, 618, 323, 464, 2156]
4007B156m56j351L58L88q56j05J026J88m50M02n39r23J141M21m41j09Q30r31j080
4026c31O88N82k50O77L52j162j37O17n25n40J523J41r02k1M9o88M05J168m42o99
4046E05Q69n51j219Q02J091p15j26Q91o67q09O35J25R1M44N15j125n51Q12m57
4065E60m90J298K63p24J07k94q50M14J888p92p75O44j39q73j30J128j53N94K44
4084A920j189j098J022J049q24K40L23j03p55N47r27L40J511L00j644j86O64j82
4102A008n40N84L11J56M15o22j554N14K002p77p80Q63m52m46J15k4k54J417M09
4121B345j089j216N92M38k82N51m1J01rP0j497J18J880k7r54k3K4n91K57O49o07
4142F89L76R52p65j400O23P48l99J93K97n91j80N98o13m76R80Q68p24m97R8l16
$$ y = [2156, 1700, 349, 707, 1095, 239, 134, 1160, 1348, 898, 1300, 761, -162, 979, 1400, 959, 850, 1680, 749, -331, 357, 939, 689, 1366, 1718, 556, 419, 1036, 511, -29, 1494, 1635, 733, 712, 761, 73, 478, 1646, 1204, 505, 1374, 823, -396, 406, 1497, 782, 656, 1547, 880, 71, 706, 831, 922, 1366, 1881, 756, 205, 1017, 560, 70, 1368, 1631, 907, 1014, 720, -130, 284, 2172, 1380, 605, 1249, 1110, 237, 107, 1235, 1082, 1676, 1920, 731, -367, 655, 1704, 880, 1120, 1443, 1340, 585, 1132, 205, 545, 2056, 2356, 712, 526, 1190, 1008, 468, 1052, 1363, 1519, 1934, 1312, -242, 272, 2274, 1497, 717, 1580, 1128, 682, 797, 773, 519, 1936, 2345, 1256, 40, 632, 1070, 788, 1339, 1298, 1399, 1390, 1460, -37, 81, 1961, 1934, 980, 957, 981, 390, 647, 1296, 689, 1065, 2017, 1252, -148, 475, 1223, 824, 1017, 1314, 723, 543, 1141, 528, 52, 1032, 1900, 1176, 679, 777, 461]
4162D61o1P07m9k29M43O2j408k33J239M47o63K96M6r00M77Q0n52N88J020p15j083
4183b7N96k15k61N32N97o58p0J82p39k04J181N58p06k4J68r15J28Q76k98m48R29
4204A182L8j359K70M95k89K79R59m77j106L00K57o37O22O52l33q2l44n19l36J314
4224H86O01j081qN99j092K55N64m91L05R22j59j825L89Q65l52J48L50m36l30O51
4244G61k20j134R50J039m36j009J98m16K19O99k34p39R43M93j684l51J407M75
4262I61m03j46n5r06N93L84n27l03J427Q2j231k94n6O1N73O48j200J59J002p37
4282C2j251R05O08k3L4j55j098M09J153n08n88P45O27j167n31L76r9L73J102q24
4302A20q07M07K11m20j01J357k84o37M46r57n15J065M57q46J56Q08j129n42Q19
$$ y = [461, 400, 1107, 1058, 829, 1272, 1334, -74, -307, 932, 1379, 716, 1012, 1058, 158, 635, 715, 163, 751, 1771, 1056, -27, 569, 354, 93, 625, 1222, 564, 494, 676, -63, -267, 914, 1472, 766, 742, 910, -5, 123, 999, 701, 253, 1182, 1220, -139, 131, 626, 337, 616, 1575, 1098, -8, 292, 549, -88, 534, 1186, 853, 771, 427, -92, -428, 886, 1487, 406, 398, 997, -95, 160, 724, 233, 538, 1460, 1301, -524, -135, 730, 378, 526, 876, 440, 110, 761, 541, -593, 357, 1396, 960, -49, 149, -267, -48, 651, 417, -322, 621, 1114, -570, -921, 486, 961, 558, 412, 357, -549, 44, 428, -99, -402, 1025, 1107, -124, -418, -474, -413, 160, 808, -392, -233, 769, 32, -1219, -314, 294, 271, 305, 150, -948, -539, 614, 106, -482, 263, 890, -277, -808, -432, -531, -158, 944, 120, -687, -280, -69, -489, -590, 767, 483, -154, 292, -665, -1180, -115, 342, -504, -348, 460, -669, -1211, -392]
4321c92N66k10N09l09j105O0J051o18p1O68M22p14k65J17p00O53J123p62r41P56
4341a62J35q14N56M75P2r7M4o33p30J168J83m59L65O96j238l22M10j01k23J399
4361G24l16r28q8P19q71K86P54m02k76P21n28r07L43J075k80n86P55r20k9M14
4381c40L10o84M94Q36j103n06M38Q3K76O59m08r76M13J31n83j71J077K07k92m6
4401a85p17l36Q05L95m17k52P24j11j018K78M77N2J99J35j161j38J346m97l03
4420g24L20N57o68l36L42o47K05J524o66r40O94J41j029N73K76R7K5N73p88j115
4440a586J029O28n24j37Q67q83l22N58m58P0Q68M59j230k49O65o24L6Q12j05m95
4460f21O00j68j142N06J175n27k87L54K17j272O24O26o69O95L80p98o24M62L62
$$ y = [-392, 174, -36, 473, 164, -941, -881, 170, -448, -519, 149, 571, -143, -408, -291, -991, -338, 785, 23, -918, -162, -27, -841, -285, 190, 262, 165, 209, -424, -1154, 14, 197, -262, 103, 799, -439, -761, -351, -452, -675, 724, 408, -520, -608, 111, -760, -474, 280, -122, -398, 323, -205, -1112, -769, 306, 26, -560, 195, -725, -754, -340, -30, -714, -220, 616, -487, -993, -555, -472, -196, 463, 55, -921, -508, -377, -960, -1131, -54, 153, -139, -185, -902, -1238, -433, -38, -455, -707, 17, -94, -1112, -834, -357, -305, -106, 29, -1132, -1270, 76, -421, -724, -404, 153, -515, -851, -509, -1156, -951, 573, -93, -1033, -339, -198, -1227, -654, -378, -281, -256, 317, -471, -1586, -557, 71, -453, -590, 277, -606, -928, -370, -828, -758, 110, 569, -661, -910, -245, -869, -833, -21, -126, -621, -21, -189, -1331, -825, 350, -177, -464, -110, 107, -1165, -541, 85, -584, 111, 491, -307, -931, -469, -107]
4479a07m24M60N96r60r8M06q46P0J160J46r08K09J57l61p3Q69m74r5O14j59j209
4500a027M64N99j88J16K48m48j26L23j96n99P93N53o14l46K28k14j91R44n21j83
4520c85O31j07o18k16O64K95m79L91o37n56N87O18o50J49O86k77q50L54k57j05
4540g62J007o4p11m9N56m48q76J234L80l77k9J50j293N02J254n23m82J86K97o35
4560f83J48K92m03O57O82r23m31K17M35l25K61P1J4l45L99o36k66Q00N78n00j05
4581f3p5m64J65L67m7j2L46L03j381J79J035m56kN08k56m51K37J70q84P10R46
4602H75p32l79L32K2k44N16L58q86K17M07o52l25N38M42J8o0j39p93K06P90o93
4623a82k0M05L17p67P6K40o0J13N96m70n38Q26n6r19N03P12m57l85O78m80o07
$$ y = [-107, -531, -71, 525, -435, -533, -127, -973, -903, 257, 403, -505, -296, -139, -500, -573, 296, -178, -273, 341, 182, -1027, -563, 36, -152, -36, 212, -236, -362, -39, -235, -834, -41, 512, -102, -448, -220, -434, -625, 319, -202, -385, 246, 139, -479, -695, -31, 264, -215, 176, -461, -1017, -430, 188, -462, -313, 373, 96, -754, -400, -657, -762, 245, 181, -530, -579, -23, -471, -1347, -113, 267, -110, -139, 11, -1282, -780, 474, -49, -531, -345, -48, -683, -535, -243, -646, 11, 693, -230, -661, -444, -9, -334, -73, -2, 12, -333, 66, -570, -836, -36, 542, 42, -63, -138, -602, -437, -70, -117, -129, 217, 520, -861, -682, 353, -103, -105, 403, 147, -304, -67, 103, -781, -71, 875, 143, -236, 96, 118, -126, 390, 748, -138, 79, 486, -166, -491, 47, 489, 507, 447, 308, -485, -279, 511, -182, -202, 203, 520, -247, -171, 69, 9, 122, 718, 248, -290, 536, 480, -439, 64, 776, 319, -66, 612, 132, -475]
4644d75R44l48k22N64M17q84l90P36p6p4O67m12n86M10K67o04Q6N16R2n14J81
4665B95k24n02O03M84n33RK69j43n12M04L08m09N22j04q32NJ158j42o56M99j40
4686C59l51J77o5o58K73R85k51q18M13j15j46J75K88l4k34K22L0p95M79N92l70
4707A56J63R6l01m02N28j92n39J275N8p73m30N05k55M86L26m80m97M43K73j231
4727g91N14Q79L6l00M4j78o38P00J49m58L10N29o50L1K09m82J36R08j02r05n9
4748a18M63l22l91R87k1j98O6l84m38O87P08p09l91N92o0n62Q7J90r4M84j3m92
4770G1j51K63J07o09Q19R6n26m25P30m10q9Q36l8o68Q7K66n09k07J125l26j43
4791B99K09n16o31Q33J55j54j91O18j25p08L99p8m52P52O5p62J2O04n04r0K65
$$ y = [-475, 469, 121, -101, 463, 880, -4, -394, 342, 266, 192, 859, 447, -139, 271, 538, -66, 20, 536, 628, 114, 295, 71, -431, 172, 656, 123, 132, 401, 258, -254, 150, 458, 49, 571, 467, -365, -360, 798, 656, 0, 499, 359, 8, 185, 120, -538, -265, 720, 469, -349, 64, -51, -197, -22, 266, 232, -2, 220, 250, -545, -66, 526, 156, 319, 415, 114, -288, 240, 48, -491, 784, 842, 69, -361, 144, -111, 375, 701, 221, -276, 167, 440, -791, -277, 602, 638, 338, 382, 204, -434, 266, 415, -43, 267, 796, 146, 177, 386, -96, 40, 948, 846, -59, -118, 345, 23, -368, 619, 598, 400, 466, 82, -356, 331, 1039, 330, -61, 531, 471, -91, -4, 186, 92, 576, 563, 71, -80, 183, 290, -319, 500, 596, 70, -355, 375, -35, -124, 712, 674, 6, 93, 359, -150, -357, 768, 442, 299, 508, -8, -639, 194, 349, 195, 4, 622, 497, -211, 188, 110, -342, 410, 475, -287, -275, 329, -175, -265, 0]
4812@P7k40O05n77l66L17N43j92l09M51j50n21K22J21K0l7N86n24m02N97r4k72
4834a45L19K09p80K70L22o08l39J147K59q70K61J8l66j9N86j24o79R56j75n29
4854b87n5O22n1k42N53n69k22J80L83j45q9K63l04j78R8j19j75L71L68p30M22
4875I4l72K13j70L94q4m16M64L18j021K8J029q59M06K61o0m51L11j06p30N58M18
4896B25L5r09N22j62l1m1L65k15R1K76m95l35Q34k46k14J22K96p97L32J84L9r2
4918b16P62p38m64J36L97k49k0M78m94P8J15j98l30O47L37n64m6K45j24m59N07
4939b00j81l38P35J95r35N6K65mN5J83J90m29j81K65j49J87L67j54l35K76j66
4960b98j07K26l62k60L13Q40r63j49N92J05n10L72mj42j84L57l70j80N12K87n57
$$ y = [0, 77, -163, 442, -135, -501, -184, 359, 167, -142, 309, 159, -362, -140, -19, 1, -36, 550, 26, -376, 221, 127, -145, 174, 383, -397, -127, 195, -413, -752, 395, 654, -216, 45, 63, -303, -322, 264, 140, -539, 417, 242, -287, -342, 280, 229, -13, 540, -29, -251, -71, 312, 167, 78, 341, 37, -141, -43, -162, -337, 34, 402, -328, 94, -278, -65, -235, 159, 75, -341, 123, 441, -580, -552, 477, -382, 24, 285, 225, -226, 85, -21, -751, -193, 225, 260, -649, -127, -289, -320, -361, 4, -211, -120, 156, -339, -674, 160, -86, -300, -178, 118, -679, -347, -163, -124, -216, 546, -192, -656, -520, -123, -372, -392, 86, -408, -330, -215, -413, -743, -96, 241, -323, -369, -124, -248, -707, -200, -381, -719, 16, 211, -724, -668, -403, -407, -352, -169, 21, -408, -589, -324, -473, -286, 81, -73, -408, -132, -298, -405, -179, -541, -801, -488, 352, -611, -760, -168, -63, -573, -201, -205, -347, -531, -174, -544, -724, -212, 75, -482]
4981d82l09N93q2j8J11k01j08J31J13n35N15L94k42l25K46K20l88L38l14l37O34
5002d6j72k04J1J81N9k90N54l8p32L19K67l91L57jj20j92L77l09k86q0O61k23
5024b98k36K51m99J17O28j64o49K92M49k26j23l04L85K8N20m85o20O04M49l16
5044a97m49L78K91l14l6L6m45L53O98o13m32K68M37p06K03K98k15j66L39m16j11
5065g99Q86l40m36L07L33k58j47M04n90K47K71j52m68L24Q3l61K59O71k72n00
5085e38J91l6k21L64Q4m92N2Q17m91m9J00r5j56L80N6k68l6J48k51J09J73o4J90
5108c3l22J58l20K15O19n39o83P24N5k25m42P25L4m12N04m54J48N17k36l80R7
5129b50N96l88k35k6k77L56M30k17o97Q26j55k21o7L1L37rO0k74r6L35K29n74
$$ y = [-482, -791, -198, -280, -298, -187, -388, -496, -365, -252, -787, -272, 122, -120, -445, -199, 21, -367, -29, -343, -680, -46, -218, -422, -411, -230, -171, -461, 93, 55, -677, -358, -91, -482, -125, -126, -246, -438, -61, -370, -656, -736, -75, -298, -534, -283, -782, -665, -37, -201, -850, -558, -109, -335, -458, -762, -377, -349, 171, -314, -934, -330, 119, -197, -646, -268, 23, -291, -327, -291, -736, -383, 315, -298, -730, -462, -25, -731, -528, -230, -445, -611, -272, -688, -799, 87, -253, -689, -382, -49, -307, -454, -50, -640, -393, -122, -274, -742, -418, -335, -696, -437, 234, -38, -538, -347, -383, -604, -240, -156, -648, -596, 221, -270, -319, -219, -314, -470, -90, -34, -302, -338, -190, -441, -332, -159, -223, -33, -355, -197, -517, -302, 317, -222, -905, -181, -126, -351, -793, -68, -34, -446, 58, -396, -248, 269, 33, -347, -250, 346, -42, -277, -303, -580, -224, 206, -11, -708, 118, -37, -258, -325, -294, 43, 34, 94, -180, -276, 59, 288, -286]
5151b86k39P48k18j45j67L22j6l92N24o77K18M25j02p08Q87R2k96K7J52j31j48
5172a30M22o47P9M24k06j66k19N45m27mN91m54K9P7M9m36L10K49j69k41J08M74
5194B58n33J10K70o85O27k0j21k20L78R3q4j39J63m30P10l30l11L67M45l32o86
5215d70N14j03J35j79J82m72K95L43k30n58Q44K92n99q3K68m89M30mj38r6N6M04
5237C42m51K19L62k90j65J72K33k57l8Q7m30M01L59l18m60R17j98n78L31rj2P2
5259B89K60p63m1Q22P5o69L1L93J1P8k63j27r4N21k18m76M29Q8J35n79K55J93
5281C50K2M20q04J3N38M35q25m85N91J65m56K47k3j00N3O97o06K0L55k86o2j31
5303A28K80r5K4J96m72j16O16p2n54M82o0j13j48K25k47j23L67j16n4L32Q6o50
$$ y = [-286, -525, 223, 5, -140, -307, 15, -1, -393, 131, -546, -328, 97, -5, -713, 174, 266, -30, -3, 149, 18, -130, 292, -355, -276, 148, -58, -224, -443, 102, -325, -329, 262, -192, -163, -86, -37, -473, -163, 86, -83, -324, -216, 258, -275, -165, 105, -580, 47, 27, -94, -314, 64, 157, 73, -66, 97, -333, 377, 47, -264, 103, 548, 216, -470, 44, -59, 76, -103, 79, -393, -98, 245, 15, -543, 301, 593, -6, -89, 179, -310, 120, 116, -22, -118, -62, 342, -109, 110, 472, 182, 17, 189, 422, 165, 127, 214, -216, 185, 544, 226, -234, 683, 485, -93, 238, 229, 217, 289, 549, -214, -255, 567, 642, -27, 4, 397, 408, 486, 223, 96, 2, 523, 305, -171, 258, 346, 481, -98, 157, 350, 372, 792, -12, 1, 539, 974, 149, -336, 255, 420, -36, 211, 188, 88, 141, 838, 232, 252, 607, 321, 259, 128, 408, 313, 337, 533, 61, -55, 561, 489, -65, 417, 357, 244, 96, 321, 74, -49, 318, 202, 148, 480, 566, -84]
5325h4L61M64o17P2L40k84O6q1K55l22q3P53o43m02P40L3p0l69J11o9L5L41m37
5348A10k93R44j06j032M10O47l80K59l86O5K2L01j61o48K24M94J79l33j26J7K36
5369D43J44m01k45L67L19m91K9L37m82J03M03m32L8L80m24k9K80K83k19j36j15
5390A52L91m24K0M37o06K74K16j98l12L76L18n71J38N5r8M14k58ln2P4K50k77
5412C16l26O42p30J76L33k62K69L28l83l83L22K81k70k26L01k44kL31k78l10O07
5433D92J44m51n33N49K32l38J67n2L3J03M4n52J29Q89k82r25M95L42J30l90J57
5454C83m03N06K87m60l77K81J44m2n6K91l31m9J47L2n89M18J08m15K92J57j53
5475A71j78L1M17k64J11M21r13J31N27l90K6K40M8q3L1K69q70P33j11j50j06J82
$$ y = [-84, 277, 741, 124, 196, 536, 252, 318, 237, 492, 170, 87, 840, 197, -205, 535, 568, 498, 129, 240, 171, 206, 547, 110, -183, 761, 655, -377, 33, 680, 300, 559, 173, 238, 260, 561, 400, -248, -24, 470, 649, 316, 190, 207, 443, 587, 186, -59, 308, 627, 136, 165, 502, 20, 123, 526, 94, 132, 512, 88, 59, 339, 622, 403, 267, 152, 543, 119, 139, 576, -30, 244, 460, 262, -50, 326, 644, 73, 211, 266, 168, 582, 324, 321, 269, 343, 593, 316, -10, 632, -98, 78, 411, 149, 418, 746, 363, -20, 302, 583, 313, 87, 388, 144, 142, 473, 195, -115, 492, 636, 185, -348, 201, 433, 95, 262, 210, 243, 346, 390, -162, -33, 856, 574, -351, 144, 486, 616, 226, 383, -20, 486, 773, 313, -64, 217, 361, 319, 263, 554, 223, 174, 321, 353, -236, 182, 290, -125, 167, 324, 171, -7, 24, 441, 177, 288, 709, -204, -73, 454, 64, 90, 330, 378, 295, 326, 595, -275, 458, 347, 197, 91, 273]
5497B73m1m12J00K83K23j2j95j05pL49k84j17n2O06m12j23r8j1J20M70l24o98
5519d67P16ok62j02M03J75m43L57l14j42M74j28l33K01J64Kk87q3K43j78N2J28
5541A70m60J25N20k48JM1j71J94Nk5l98K15N66n90J48J29J04l20O4K30j47j42
5563A1J5J38k32L19q1o47R50Oo03m96P60P2j28J19k73j52L67k8l73k20N46L44
5585D14o82L45k95J36K94j67k81R0O44m61k85qK43p7R0k2m10K16M72k86l66L60
5607c6k9j11j0k1K23o2n7j03k05M29K40n78J72K50O3j84j0l67r7M29K11n21K06
5630a68J17o5j83K30J4o8M95m71j34R7K96k02j98P07l05l32L56j00r9Kk08P7R1
5653e1J73m04j82K71K28o4l55L66m03K60M08q9l12K60J19m82p8L02PM5k03L6l22
$$ y = [273, 232, -180, -80, 203, 426, 414, 219, 114, 107, 456, 172, 55, 3, 609, 197, 74, -24, -35, 85, 555, 231, -467, 249, 243, -19, -121, 282, 457, 14, 371, 57, -85, 389, 261, -72, 129, 293, 295, 8, -75, 168, -10, 42, 170, -290, -165, 355, 107, 108, 149, -22, 172, 177, 152, -246, -31, 535, -55, 93, 222, 326, 6, 70, 300, 153, 11, 26, 164, -68, 251, 170, -477, 473, 479, -124, -620, 140, 212, 84, 203, -70, -222, 145, 117, -256, -476, 70, 414, -268, 77, -218, -82, 212, 45, -236, -146, 498, 37, -248, -256, -13, -90, 0, -22, -432, -216, 256, -30, -396, -36, -65, -176, -186, -207, 16, -46, -103, -206, -411, 18, 258, -320, -148, 102, 165, -19, -29, -396, -493, -64, 147, -374, -168, -51, -116, -299, -69, -55, -123, 372, -99, -233, -136, 160, -42, -240, 467, 162, -170, 186, 86, -13, -11, -219, -142, -51, 122, -282, -464, -193, 35, -29, -384, -18, -421, -161, 247, 158, -154, 106, 225, -257, -335, -33, -26, 19, -184, -148, -470]
5676d70N90k47m01J38M13j16J26k72k12p4M08k16j03N97L66o06l48L98P9k46N4
5697a42M0oj07Q5k20j54N11j61K4K49j77m83L13K43j39J04P6j55j67J90j0l99
5719d85n8Q77m32k9j51j20K14o2L45m55j04M40j05j57O4R3OQ6q1j91M4N00j78
5742F1m89K87M27j47m02K33j77J79M15p84j85N28K0k06K99j7J75j00M2k05m82
5763e28O63n7n92J32J30J46J14K7q5J52K2J09m90K18L36m88J52m9j28PK36o8k74
5786c15L14N1m86N43l12J33R8m7m9k73L45J67j92m31N22p3o4K52J45r47K29N17
5808A27l14N2N02l27k49K20j37q1O2L22O8m17j10L59j48K08k24j14J31J84k94
5829a80k60K82j69J65k0J93j92K00J29k62K25O7j36j78K18j53R0J05Q1n01k08
$$ y = [-470, 120, -127, -528, -390, 23, -93, 33, -239, -451, -525, -117, -333, -436, 161, 527, -79, -427, -29, 50, -196, -142, -102, -108, -215, -130, -350, -504, 7, -154, -130, 119, -58, -541, -228, 15, -124, -20, 56, -99, -266, -76, -86, -485, -543, 334, -98, -127, -278, -398, -184, -246, 99, -356, -460, -20, -125, -282, -218, -125, -119, -33, -114, -305, -261, 239, 61, -428, -141, 286, 139, -263, -30, -207, -28, 387, -397, -582, -54, -34, -240, 59, 42, 217, 117, 159, -46, -528, 135, 78, -514, -382, -252, -106, 8, 35, -50, 102, 124, 233, -257, -39, 297, -191, -39, -88, -216, -209, 27, -41, -315, -1, 50, -436, 107, -205, -72, 26, -21, -70, -343, 2, 169, -23, -454, 68, -5, -69, 183, 328, -619, -390, 127, -187, -135, 367, 40, -209, 11, -126, -207, -145, 177, 245, -172, -282, 77, -71, 137, -87, -201, -70, 114, -180, -440, -158, -327, -162, -182, 11, -181, 19, 148, -114, 111, 178, 42, -136, 82, -71, 19, 124, 205, -296, -504]
5850e04O82l25k02K93K2K21m78L81k87j38J57K41j81K29J03m90k9L59j68J70k60
5871b04K42L7k81K80k52J25O00m36n05L05P4J11K57j19m67J87O1j89O0L16P7m61
5893a82J44L30l09K83k80j61j54Q17j99n19L06k69L66N6j99J29l98O63j83o18
5913c77L68O5k5N4l4j19k4L74k42k01L99K57o27Q4J55k67M81k14l5Ml10L85j46
5936Ej61L62R9l06PL44l57L1J67l46L26r4j43k26L29O1k8J0l84J57J91n1M2k0
5960A5J72k2k83P4L23l03M8J71k7j32J53k88j24K50m2j82J0M32n4l12K04J67l29
5983g9K83J88k20k38j42K45Q8J02q1j09K07m6n38K24L12L54q30M4L55n75L99N49
6005D92l94l13M71P6n42R4J31l1j31J91k04j86M21m9mJ1K23k03j22m9J35J42m2
$$ y = [-504, 178, -147, -349, -56, -34, 187, -291, 90, -197, -335, -178, 63, -118, 111, 214, -276, -305, 54, -114, 56, -204, 38, 75, -206, 74, -178, -53, 547, 111, -394, -89, -15, 96, 353, 234, -233, -46, 15, -174, -114, 202, 279, -182, -38, 292, -17, 266, -14, -175, -329, 488, 289, -230, 76, -193, 173, 229, 30, 159, -239, 424, 241, -377, -9, 56, 31, 85, 51, -68, -92, 282, 40, -161, 238, 495, -132, -48, 107, -160, 321, 107, 72, 76, -234, 151, 5, -156, 206, 305, -1, 6, 350, -7, 24, 191, -155, 171, 77, -66, -292, 37, 98, 70, 80, -304, -147, 44, -7, 35, 15, 187, 165, -118, -44, 279, -24, 24, 195, 168, 36, 189, -99, -223, 27, -15, -197, -187, 245, 191, -121, 83, 250, -79, 204, 392, 172, -66, -208, 37, 125, 227, 146, 37, 244, 198, -340, -116, 196, 550, -280, -236, 119, -456, -57, 492, 98, -215, 256, 332, -210, -116, 15, -16, -147, 44, -160, -346, 75, 26, 22, 33, 256, 53, -69, -118, 17, 159, 117]
6028A17M67p30K10k10N4lL55q1k91K75j56k44K5L84n8j16J29P7j20J93L1p92P10
6051B26P0n1j95l0k77K95N49l06n21J96j7L6j00K86p1J06R7j4m97R7N85l30j24
6074A0K30j64M1k87Q0J87J47K2m91k45L34K83n4L10n91K22M10n7m32j19M21l84
6096a27K32j52J89n47L80j54M39k36K19l68j19J32O8p9L07r3j8L5J21j55j08q
6118d2J57J17P9k92j95k27N62o5J29j10K7l0O7k85L57j38L58m05k61j07K08jM30
6141C33j64l39j6p5L76l00Q8M50l10Q8M2l65j82N00J40n28L00M05o11j97M27k25
6163a63J77J61k04J47n16N40j20mJ09j29q8M7o0qJ76K10k06J70ml28r1L19m1l64
6187b70K02k23L00J98m40k07K29M22R1m48k02M15k2l38O72n80J81J02K7n97R21
$$ y = [117, 584, -146, 64, -146, -92, -95, 260, 179, -112, 163, 7, -237, -212, 172, 114, -2, 127, 204, 84, 277, 308, -484, 226, 296, 245, 50, 20, -257, 38, 587, 281, -240, -44, -61, -25, -125, 161, 90, 196, 293, 279, -218, -121, 464, 134, 10, 240, 76, 117, -170, -90, 97, 244, 266, -225, -470, -136, 147, 93, 403, -188, 34, 444, 387, -45, -164, 257, -127, 105, -47, 142, -405, -25, -179, 260, 24, 243, -125, -244, -112, -44, -123, 184, 91, 73, 108, 229, 74, -34, -42, 115, 232, 311, 19, -176, -403, 159, 94, 223, 113, 140, 110, 177, -108, 249, 111, 469, 64, -197, -304, -96, -97, 333, 169, -170, -186, -261, 115, -185, -97, 353, 43, 131, 173, -192, -374, 126, 266, -262, 38, 443, -168, -365, 62, -163, 14, 175, -29, 118, -398, 142, 22, 18, 127, -2, -90, -43, -103, -111, 65, 275, 69, 239, 235, -93, -184, 135, 94, -270, -68, -291, 9, 207, -233, -440, -211, 211, 302, -146, -348, 67, 45, -293, 379, -201, -20, 82, 109, -488, 433]
6208D33k40k72o76M53M10k61N9j1ML03J40k32m23L2L34Lj56K38n79M22K67m41
6230a93P8M21k75q9r2M17n83M53O6j73k68K90j47j11O0j43K36j93J42l14J49L04
6252C5m1j33J47k42j19K07J31J77l21J10K56k67L5N0l21K32N6K09m56J52L42j51
6274H8k28R1k10M72k26j98j85L46L15n44J33J11j90J76J02m34L76K49l49m1Q4
6295f2J14k07J83O2j03k31N86j24m73J68M3q0o8K98p3j58j27N3J65R1K57j06j72
6318C6j99J15K58R0l05j52q5K09j19J54J19m02K09K9l1k05L33j86K11k09k3J40
6340a3j72J13j83J35L3L43n41LNM65l01K62j93r0Q9K58m25k93N42J13l29n9k41
6363d79qM57P3l93J05O44l08m38J4N08l53L08l4l90R3J07K1j83J85j00NJ00j14
$$ y = [433, 193, -79, -755, -302, 108, -153, -94, -105, -101, 202, 342, 110, -313, -281, 53, 56, -100, 138, -441, -19, 248, -193, -115, 306, 31, -58, -150, 267, -316, 137, 203, 30, -238, 52, -95, -206, -146, -289, -53, -246, -104, -418, -269, 35, -6, -139, 8, -234, -353, -146, -15, 162, -159, -49, 207, -60, -25, 25, -296, -64, -8, 201, -255, -103, 239, 88, -140, -49, -259, 213, -13, -211, -396, -50, 265, -279, -146, -35, -225, -49, 53, -381, -5, 244, -105, -146, -62, 52, -155, 28, 90, -13, -244, 342, 218, -255, -87, -44, -124, -192, 106, 33, -125, -252, -199, -34, 57, 314, 208, 36, -163, -48, 210, 300, -5, -157, -242, -33, -152, 2, 121, -281, -72, -43, -74, -279, 54, -132, 79, -130, -153, -13, -185, -72, -255, -120, -87, 256, -285, -282, -277, 188, -113, 149, -44, -134, -45, 213, -212, -505, 37, 150, -179, -238, -479, -487, -30, 43, -350, -245, 399, 91, -347, -333, 175, -178, 130, 96, -294, -201, -94, -73, -256, -71, -171, -166, -66, -180]
6386a80J38N9J70l75LJ48Q5qk72K94J45j03J5J39l86j33M31p2j5k53J76k07J52
6409d9M6k13K29J01P6l81J58j73O7J41J38l36O7J25M6k73j6j54N15L26l58l45
6431b63L83p3j40M08l38J26j89K07j56N5j44J38q3K61n8k70J49K7l29M41n8l16
6453b22L35k89K18K73m48J41k1j55K07O1j19LR0k24K31M7j76j03K78K55l81p1
6475g0L36p5n48P10l89j72L24R0n22J37M75n8j77J48q4j42K0L3k7j65L20n60R7
6498b99J23P2J77nK32o97K70J80o4j55R9K24j25J05m9k48m9L40J64l04KJ3L24
6521C30k12J73m35K04J66l54m2j27M61k3j9K65k14j26j01P0p3K99J44l30P0q5
6543D1l1P4Q3j81j67Q9K24k76L31L8j61k14J68m16M22j21J74j88K40J36k6l53
$$ y = [-180, -42, 17, 187, -188, -185, -37, 48, 40, -232, 62, 207, 104, 119, 258, -128, -261, 170, 98, 83, -170, 6, -201, -49, -3, -216, 13, 114, 190, -191, -33, -206, -139, 2, 140, -196, -129, -4, 42, -231, -247, -401, 114, 440, 82, -263, 120, 47, -93, 315, -23, 103, -86, 121, -35, 20, -124, 14, -69, 192, 134, -136, 13, 40, -289, 152, 94, -222, 113, -176, 42, 315, -133, 8, -13, -168, 39, 100, -19, -16, 74, -150, 81, 128, -48, -151, 127, 382, 1, -70, 266, 191, -357, 353, -36, -208, 116, 206, -316, -179, 296, 238, 61, 209, 125, -17, 3, 36, 9, -156, 164, -396, -299, -176, -104, 73, 68, 300, -397, -127, 53, -11, -166, -67, 157, 32, 137, 88, -160, -209, 131, 295, -9, -7, 6, 330, 118, 291, -144, 60, 226, -128, -170, -297, 164, 141, 122, 387, 173, 47, -54, 16, -57, 242, 386, 56, 126, 41, 10, 84, 167, -14, -181, -92, 132, -144, 187, 225, 64, -150, 18, -398, 24, -97, 77, -111, 129, 265, 239, -114]
6565a14M02l96n4L26j80L0K68J52k66l36M07K41k46n8J99m75OJ82J75q2R6l84
6587a07j4P7K20j35n2r3J80N6r5n5j95J32K97l13j43P8M12k90K88j09j03K02q4
6610A54N9m14K84J88k91L85l44k00N43j57j45J30j1K45o1m78J65k1K28l32m9j95
6632c17N76j52k09K14j01rk7K39j79m6n0M55j71j5J1l05K2L87k74l5J22l00J30
6655c4o3L69m04J86M0j57K47Q8L4n27K43Q3L8j39J79k38p4K54o6j53M12j13j02
6678A03j2M3k10K39qk00k1j42L99o6K82j92Oj05k7l02J60K11j47o1J28M53m07
6701A24k16K26o0J44MJ55k70JP2j5k95L08j46r4j6J91r6K67j31l50N01Lm17K20
6725A10K66o02K03L52j77N2k92J62n7Jj34L01N2k06J07%l4L7k79K75O0j11j84
$$ y = [-114, 288, -108, -162, 164, -16, 14, 282, 434, 168, -168, 239, 480, 234, 176, 375, -100, -94, 88, 263, 181, 277, -107, -121, -44, 176, 41, -11, -104, 76, 132, 37, -18, -213, -81, 216, -97, -240, -162, 250, -40, 248, 139, 36, 238, 154, 213, -201, 83, 271, -20, 365, 21, -179, 364, 207, 62, 192, 181, 426, 365, -113, 52, 31, 259, -73, -122, -317, 259, 107, -102, 112, 11, 2, -25, 214, 35, -11, -61, 394, 223, 208, 219, -86, -64, 323, 49, 14, 136, -164, -34, -97, 272, -132, 54, 94, -63, 184, 272, 306, -221, 22, 105, 143, 4, 183, -55, -129, 125, 59, -94, 318, 205, 103, 91, 134, -76, 163, 155, -45, -66, -208, 191, 125, 407, 215, 221, 116, 89, -213, -53, 158, 11, -50, 78, 531, 124, -92, 134, 74, 218, 222, 377, 107, 108, 180, 165, -130, 178, 32, -62, -78, 113, 17, 284, 153, -197, 304, 307, -110, 110, 376, -226, -23, 329, 152, 204, -88, 74, 17, 18, -116, 185, 237, 31, 138, 138, 104, 141, -138, 137, 197, 86, -98]
6748i8j04L90k02L07k84r1j45N29J73m76O1K72r2l8j84K45m85L25M7l29L20J04
6770B45k42k00L98j53K9j66K53k78J05r4j65P1M79j86%j07n7K23p3J16l12j46
6792b60J41J66q6k8J63l87K01K11l59K36K4J99k90j28j4K60k52K18M0j71J53J02
6814A39n1N5j62K4K89j91k62j74N36J27n37J50k0o2J01K42q3m1R7K01l97q4m8
6837a51oL11j31J04k20J30k01K95k88J16k25J94L0j39P6L60m3K5l66J48N7m12
6859c36M33k18K21o0j02K5mK42j54k67L62j57j77J40J44J0L1k87K13j09Q7K32
6881B69m27K92p4n3K47l90O5j10K08j56N6J66k88q6N43j52k40pJ30j40J82oR6
6904A25j31l18M56k50K03k38J65n2K6j90j09J58O3K1l9o4K35j5k59k04L64J22
$$ y = [-98, -202, 188, -14, 293, 9, -82, -227, 302, 475, -1, 60, 332, 240, 202, 18, 263, -222, 103, 150, -179, 141, 245, 3, -197, 201, 48, 77, -89, 164, -114, -9, -103, -268, -197, 282, 96, 96, -11, -68, 155, 82, 198, -114, -260, -119, 47, -39, -67, 96, -291, -90, 121, -238, -2, 22, 221, -69, -197, -211, 49, -203, 15, 55, -116, 37, 139, 88, 143, -19, 5, 294, 103, -159, -333, 203, 330, -207, -57, -77, -139, -38, 204, 121, 80, 177, 378, -19, -103, -151, -157, 154, 23, 127, -93, 37, -164, 131, -157, -41, -266, -72, -42, -181, -105, 255, 212, 237, -129, 19, 76, -336, 97, -121, 100, 40, -62, -37, -41, 201, 47, -220, 142, -15, -192, -52, 92, 102, 133, -154, 59, -50, 37, 269, -158, 134, 60, 7, 254, -136, -71, -181, 27, -129, -73, 93, -195, -281, 262, 110, -130, -137, -7, -147, 35, 29, 125, -6, -324, 132, -118, 85, -153, 12, -40, -14, -204, -313, -155, -92, -71, -110, -174, 61, 46, -213, -417, -53, 69]
6926F9K37l67l49L49P2p1k4K99k37p7J20O2k13K67J07k47j24K39j85k87J91J63
6948fr0J50l13L01j61m08L65L57l23J22j01k9K54j03J44j87K0O3Q3l32L10K28
6970C44k71j75r7l6K86J6Q7l87l1J75J11j26R0q2J98l37J48L7K16k56J38j36j07
6993a95K23qn6p3J91l23M90j07m47K0M62l06k06L01K85o18M15o6R6m9K03k76j13
7016a57L24r9k07p4K12l1N3n1R2M4o5J04k39K0J41k41O5M6r4K7J31p8j84Q1J48
7041c2K6m0j42J04Q3j32J25J84J8l45j1K88n4O7n6n2K01j7j13l73L22P4J93k24
7065I4k56j2M0L84m71p5K52L69j72M7k64p7P7j04o1Q6K98Rk14k10K89N2Mk47K77
7090A15j02m09K37K20q6J2K71J0p55L92J0K06m17M28k91M11k22j88k39M13K63
$$ y = [69, 306, -61, -410, -61, 11, -60, -84, 215, -22, -99, 21, 83, -130, 137, 244, -3, -127, 112, -73, -360, -169, -6, -96, 54, -259, 42, -119, -527, -162, 195, -128, -6, -107, -136, 118, 15, 159, -28, -8, 55, 138, -194, 116, 344, 73, -102, -199, -235, 51, 67, 154, -233, -264, -89, 22, -104, -14, -96, 102, -235, -87, -50, 166, -90, 48, -88, -195, 28, 20, -36, -109, 82, -241, 249, 142, -305, -285, 177, -129, -335, -34, 251, -367, 48, -18, 78, 29, 232, -44, -157, 167, 68, -139, -213, -1, -32, 21, -30, 62, 106, 41, 145, -94, -74, 67, -174, -109, -63, -157, -130, 1, -77, -261, -180, -32, -6, -46, -188, -84, -1, -133, -8, 176, 194, -151, -162, 126, 72, 139, 83, 31, 232, 215, 102, -271, 51, 125, 318, 94, -162, -174, -134, 250, -221, -296, -44, 325, 153, 200, -64, -141, -64, -168, -229, -143, 155, 164, -50, -260, 29, 81, 85, -162, 115, 13, -396, -159, 61, -25, -13, 258, 268, -487, -95, -85, 121, -296, 132, -159, 252, 30, -158, -397, 16, 279]
7111B79j49r7j01N5Q1j82o4J68k6q8K14l18L11k5k66M07j63l53K46J76j2m4l87
7134c38O51m21L20m06M4J80j32K92k33P4j7K0N1k45j31J88J84j79J28j36J51Q3
7156A28j82l6M7j17j20J6j1J73L33l55M36l68j73J54j13K65l12J21q8L99k35J32
7178I4k71K36m5p3r6O7K18J86j45p3j23j30K44k21K95j94J00P4j81J5p1N8O1J50
7202A75j37J46k12K8k18Q0L7K02J13k87RJ13J07m82J07J63J21j37J70k7k87L80
7224A64o7p8K56j04k97K53j69L15k23MRk12J48J37n1p2j13K25r0J18J99l08l98
7247c54K72L25j71j11N3J40J10j74k24K28K15m45o6K06j38K95m4l93L06J2nP8
7269A15j71j31J38j25K27j62OL6L44l44k42N95k18k10J49q3L0K19j70k6O6j17
$$ y = [279, 130, 33, -68, -13, 68, -114, -178, -10, -36, -124, 90, -228, 83, 58, -208, 199, 36, -317, -71, 105, 93, 49, -338, 313, -108, 212, -194, -150, 30, -102, 190, -43, 31, 14, 34, 85, -160, -291, -103, 81, -98, 30, -106, 45, 128, -54, -90, -43, -160, -280, -264, -275, -102, 231, -124, 312, -56, -229, -75, -188, 77, -235, -114, -202, 197, -38, 94, -177, 59, 14, -59, -155, -88, 130, 316, 171, 98, -25, -155, 89, -132, 163, -31, 69, 143, -38, -23, -94, -36, 25, 175, 38, 184, -28, 0, -218, -138, -101, 101, 214, -73, -64, 49, 156, -326, -219, -56, 65, -72, 98, 71, -216, 164, 97, 19, 275, 171, -126, 127, -42, 273, 50, 54, 63, -149, -1, 136, 85, 13, -100, 125, 35, 153, 352, 44, -354, -82, 243, 72, -39, 14, 154, 264, 90, -134, 94, 309, -136, -202, 4, -134, 161, 117, -276, 30, 42, 37, 115, -56, -187, -49, -174, 53, -109, -103, -67, 277, -67, -309, 286, 68, -142, 7, -76, -46, 173, 3, -23, 43, -74]
7291g4J39l1L2J9k90J74J38k00k10M96K1j43k10J33J16K37m29j2J44O0k54n6n1
7314b51N17k05j13J71j51m4K46m42n9L65N09m71p0J20r8K2L8k82J84n5n11P81
7336B01k86j48K25j62J47Q5k8m3qO3j31K8RJ79j0j07J04n35O92k52j12K08k60
7359a41J38r0j18P1K69k37K0J37k12r8P0K08j57P2L70l75M07k26j03%j66Rj19
7382b71m8N50m45L5L09j38k47L12P2l34J03K05j87L29n59K31K08m8O0k68K18m6
7404D1r0r0n6%q3J04M91l37j37N6K12j02J46l35K85k09J85p8NK4M0o7j56L6K95
7429A80l41j00L42k24J88q3Q1j16j18M41l09K27j56L4J46r7n1j05J02k11K04K13
7451B47l28o3m2l0R7K26k63Q0J48j32M56j13j01Q8j16o5j70n3L44j77J29l45P3
$$ y = [-74, 65, 34, 66, 85, -205, -31, 107, -93, -303, 193, 214, 71, -139, -6, 110, 347, -82, -94, 50, 110, -144, -200, -251, 266, 61, -52, 119, -32, -76, 170, -272, -331, 34, 543, 72, 2, 122, 24, 46, 84, -198, -14, -69, -580, 201, -85, -233, -8, -170, -23, 62, 34, -9, -17, 46, -85, -57, -48, 131, 121, 14, 118, -417, 275, 23, -89, 119, -141, -3, -93, -211, -140, 129, -108, -88, 49, -163, -261, -191, 17, -140, -68, 302, -73, 334, 108, 5, 5, -161, -152, -271, -319, 231, -214, -179, 130, -8, -255, 57, 129, -205, -102, 103, -84, 245, -314, -83, 125, 77, 137, -131, 87, 41, -49, -139, -195, -195, -278, -174, 317, -20, -157, -101, 111, 9, 155, -180, 105, -104, 81, 3, 8, 32, 72, 5, -151, -115, 180, -161, -261, 81, -143, 45, -38, 43, -73, -191, 250, -59, 168, 12, 46, 192, 95, 44, -61, 41, -170, 34, 247, -81, -144, -186, -216, -119, 107, -156, -76, 72, -60, 396, 283, 182, 270, 154, 89, -81, -134, 210, 33, 162, -183, -110]
7474a10K18L4l32k6K82j45J32o0l20J49J81j82k2L17k2k79N1K77o4j40q6L40m56
7497b63r7J58K34O5n7J43k75Q6J13J54l22k17L61l8K40k96N4J57l93K6K69j11
7519ik04L95j81qk02K18l8J61j16j62J80r0K79l82k8M81l01l84L92K17K4k67K34
7542B09J53k65j35j16J71K2N9j74P8m32L87O9K9m0k78j27K08J77k49L51l4N4l58
7565b41j74L45J60j00O5N6j89K12k4q3J33j45Q8r5l18L07rK09k95K5q4J4j40L74
7589I1n4k27L04j14j63K47j19Q8j51J82l09J51J57j08Rj67L19m10J4K73j56n4
7611a97L43l3l43M14j96j33j13J56K38m85O35k70Q8j57J64k19J32q4J89m3O7l69
7633b16L16q6j07J75k03L8j31M01k53J14l5J85l07K09J48m22p2J92L6n9K55J73
$$ y = [-110, 108, 142, -190, -216, 66, -79, 53, -7, -327, -178, 3, -179, -201, 116, 94, -185, -134, 143, 79, -61, -147, 193, -263, -360, -202, 32, 97, 40, 183, -92, -6, 107, 261, -61, -278, 83, 45, 285, -11, 43, 200, -193, -167, 102, -9, -213, 182, 1, -7, -209, 9, -29, 132, 16, -146, 34, -56, 223, -159, -187, 294, -7, -391, 1, 218, 242, -25, 209, 362, 97, -38, -154, 17, 39, 98, -76, 2, -430, -43, 26, 55, 15, -263, -390, -182, -5, -254, 97, 63, 117, -241, -415, -70, 90, -10, 55, 111, -78, 134, 110, 27, 160, 15, 103, 8, -310, -3, -12, 197, -98, -73, -157, -143, -283, 91, 37, -190, 114, 0, -163, 84, -35, 53, -98, 84, -225, -74, 83, -25, -16, -183, 136, -274, -260, 13, -143, -197, 146, 113, -230, 184, -12, -145, -258, -102, 136, -349, 286, 16, 104, -53, 111, -108, 24, -60, 129, 86, 153, -216, 100, 14, -93, 82, -121, -83, -214, 187, -66, 48, 13, 198, -109, 100, 248, -174, -246, -54, -18, -77, 178, 351]
7655C51p73O33j23n8P4r9L09k81j26o7J00J13j7l81L66j00L4Q0l66J22R2K34l34
7678b17Q6K76J3j59n38M38K01mk54P3k03O10k94J90l66L19k08l6%K11K56l59J03
7701A38J8k29J94j78p7J28R0k94L43L9o2j10P0n5j84K51J4l0j73L73m01J66j71
7724a40J34O0J06P3k86L51k49r4L57j24n3k31l2J9m9K51J9K5j63m6J8J46k74K93
7748A11k99k9L00l00K97m55q0L58K65p8k70J77Q3k40J29j01K09k46O8M8K60j67
7770D0qq1m89R86n55K37j56J80J21l58J73l19M34m72K79J27k00K79l61L7K67k42
7792h1J59p2J83N3m9q0nq4J13j34o4P6k44J33L64o5o29N04k32j28K81QK04m62
7816b51J43P7P2L57k73m64K61k14K07L3nJ41p1j02J08L0J8L21n04J82lmj06L11
$$ y = [351, -422, 211, 88, 30, 104, 5, 314, 33, -93, -160, -60, 53, 36, -345, 21, -79, -45, 35, -331, -209, -117, 117, -217, -131, 145, 158, -1, -539, -101, 100, 96, -158, -85, -288, 322, 28, 218, -148, 171, -37, -73, -73, 138, 394, 35, 138, 156, -73, 121, -57, -134, -6, 84, -210, 133, 172, 110, 0, 70, 15, -169, 82, 96, 66, -107, 266, -135, 31, -140, -6, 54, 160, 233, -53, 298, 49, -45, 312, 188, 135, -96, -128, -109, -158, 93, 112, 137, -26, -72, -54, 92, -182, 111, -188, -217, 83, -217, 80, -375, -455, -97, 168, 90, -180, -3, 80, -160, -31, -132, 77, -169, -101, -53, 207, 40, 32, -49, -538, 448, -107, 130, -26, 154, 275, -83, 90, -229, 205, -267, 12, 139, -61, 218, -143, -106, 161, -81, 78, 6, 189, 242, 193, 113, 108, 24, 137, 3, -61, 15, -229, -96, 268, 203, -426, 78, -154, -282, -1, 7, 211, -251, -108, -31, 41, 398, 125, -339, -78, -292, -85, -52, -57, 84, 13, -89, 19, 49, 67, 388, -116, 66, 63, 59, -47, 264]
7840B64o6j98N1j08O0p3k9L56m79L02j19K00k91J94J4J72k29r7j67L40L6q9k3
7863B1k84L21J30k71J91p2j16K56k77J33j88L71m18Q3P2k29L2P2M59k88kr6P5
7886b5Q6K05k60o0o5r4P6K59N7j77j70J91J69j69K38p4j43K00l74J37Om7K1J50
7910A37k36L14k10J42k9K7j32L0J00l2Q0k22j22L37j26K3l00N44m85R8n5J6K31
7933A30L9J08l21N3r3P9j60J80jk50K87K96n92J66K94m1j84J52j05j9J03k4k36
7956a39Q1n1K8no2N9J04k37K74j9J80l00NJ3K12k45J87j17NL28k90J01l1k00J93
7981G4l32J54J67j16M09j63k62J03KJ30r7n9k54K44O4M0j27j16K08j34Q0J58j41
8004C2N6j12j21K77rlj31M1l7K52o0k46j69L03J71k31l24L90p4K33j58o0K10J35
$$ y = [264, 198, 0, 51, -57, 3, -70, -99, 257, -222, 80, -39, 161, -130, 64, 78, 250, 21, -76, -243, 97, 133, 44, 21, -263, 58, 188, -83, 108, 36, -80, 176, -101, 32, -156, 215, -203, -120, -48, -277, -245, -173, 286, -2, -4, -100, -25, 61, 266, 6, -54, -119, -213, -137, 122, 179, 2, -168, 23, 192, 23, 261, 187, 44, 244, -130, 7, 13, -34, -13, 137, -99, 215, 5, 147, 118, 145, 13, 43, 143, 111, 191, -31, -153, 184, 58, 81, -219, 325, -160, -62, -117, -101, 130, 169, 277, -44, 9, -84, -5, -165, 15, 14, -236, 51, 347, -245, -79, 215, 174, -10, 142, 37, 18, 121, 97, -139, -58, -109, -81, -86, -148, -89, 15, -222, 52, 33, 213, -87, -82, -69, 143, -102, 85, -32, -27, 301, 11, 112, 81, -119, 74, -258, -104, 63, -53, 356, 193, -69, 34, 36, 166, 69, 10, -244, 0, 64, 104, -23, -139, 69, -65, 15, 173, 32, 88, -24, -145, 132, 123, 120, -11, 30, -7, 245, 185, -61, -230, 73, 244, 13, -311, 79, 5, 238, 80, 20, 230, 365]
8028C65m92J94N8J5R0l58q5j29L23L6j93J71J62Q6m03K79J10j82k51K86K07j90
8050I9k69K23q3j2K91n65M12l76L09k01K04j28k1J60k49O3K41oo0p5J90k82k8
8073a63L99L9k87K7n8J86k4Nj41j54K7K48j26l72L80k11L19oJ36m08q0N62j70
8096A28j15lO7J65K7k36j86K90lp6K03k56J41l32J69K2k4j54j35L38lJ3j28J14
8120B6N5j70J21J34J22n15k5J99J30j47K26J16j69J51l44l8K89j61mL16m60L04
8142A56j35p8K42l74J73j42k26L98k01K80j76j6J00p0L83l91j05lj52M44n6k19
8164a68Q8J3j22L81k70P0M22p07K37O1R5j02K4k16K52R7On20K44K85k2J33j49
8187A32j7k27J88p8
$$ y = [365, -127, 67, 125, 140, 230, -128, -213, -342, -19, 17, -176, -5, 157, 243, -160, 119, 229, 47, -204, 82, 289, 99, -170, 53, -30, -42, 249, -316, 96, -280, 29, -172, 32, -96, -117, 43, -206, -143, 98, 92, 32, -43, 147, -135, -163, 236, 275, -12, 15, -43, 143, 119, 124, -17, -171, -144, 104, -22, -394, -14, -225, 94, 88, 224, -184, -264, 298, 128, 13, 10, 77, 242, 269, 33, -153, 137, 134, 58, 261, 5, 146, -186, -17, 5, -19, -173, -308, 30, 27, 40, -88, 26, 81, -89, 32, 166, 288, -227, -252, -53, 77, -70, 156, 272, 103, 254, -90, -128, 161, 0, -4, 312, -148, 156, 21, -57, 185, -189, -16, -158, -384, 14, -187, 93, -83, -99, 1, -69, 314, -77, -182, -185, -337, 107, 51, -168, -80, -67, -189, 192, -78, -8, 414, -293, -56, 5, 100, -2, 22, -194, 58, 155, 161, -359, -115, 170, 148, 281, 132, 115, -112, 76, -2]
8191b
$$ Imaginary data points
##PAGE= N=2
##DATA TABLE= (X++(I..I)), XYDATA
0@%%%%%%Qj6J6j6K4l2M0m8N6p2Q8j04J21j42J68j96K27k62L03l48L96m51N14n80
30c06O51p33Q21r19J028j146J275j418J576j746J933k141K371k624K906l223L579
47A884l983M446m983N614o368P289q437R923j1934J4816j9337K7495m6804J73366
61A42987J77681k71587j01294O3394J38064K7691n5906p9415O3972Q3352p0333
72A18606j34924N2623J32498J9244q2490n4804J1184P9306K1240j13596p6436
83b7549J31474J42247n4189j50648p0594L7760J17944Q2812o0079r9816N848K7570
95H2780l1856M840O2793K0179k3520l1390n4238j3671P8867M6668n7784l9467
107D4201L2214K0985l181j9803o2232j8077J04947Q6600o1534j04781l9506J9397
$$ y = [0, 0, 0, 0, 0, 0, 0, 8, -8, 8, -8, 16, -16, 24, -24, 32, -40, 48, -56, 65, -77, 91, -105, 122, -140, 163, -185, 211, -240, 274, -306, 345, -388, 433, -486, 542, -604, 671, -747, 829, -917, 1016, -1125, 1246, -1378, 1528, -1695, 1884, -2099, 2347, -2636, 2978, -3390, 3899, -4538, 5385, -6549, 8267, -11070, 16425, -30379, 142987, 320668, 49081, -52213, 11181, 149245, 176936, 121030, 41615, 105587, 188939, 118606, -16318, 36305, 168803, 188047, 105557, 50753, 61937, 141243, 162483, 48887, -27549, 103925, 246172, 191983, 41335, -29259, 8501, 126445, 209257, 149178, 49362, 55210, 82780, 50924, 55764, 118557, 138736, 115216, 83826, 29588, 15917, 94784, 141452, 83668, 44201, 76415, 97400, 94219, 74416, 12184, -5893, 99054, 185654, 124120, 19339, -20167, -770]
119g70P4612P3325l1317p7135Q65J6438m2174l886P1820M2922k2616n5345o5180
132a8441N551J03612M1260r2298n4164O8275O0089k4357o7614n9572L0122J24819
144A17282M8711j01422q2549K3977L1767Q440K5721J4740n473l539m8022o8301
156c8668M2200J20496K2261q1016n6948j809L6196N5453p257p1666J91P9715J8097
169A17245n7994m2204r410K8087P2681K5927o5215m3786K0148j937j5199L7827
181F6170M5717K418k5899o3883o0878N5731J25360J1885j00776n6618K6924N2663
193G8814K7700m2950o5326M0454J00642j5100j05809l0695N2974M4234P865k6610
205F6193k5027L3282K3863q0109o9173Q7593J28299j0032j17766q9745J8620J16137
$$ y = [-770, 73842, 147167, 115850, 38715, 39580, 56018, 13844, 9958, 81778, 124700, 102084, 46739, -18441, -12890, 90722, 131982, 39684, -14480, 53795, 113884, 89527, 21913, -37659, -7537, 117282, 165993, 64571, -17978, 5999, 37766, 46206, 71927, 86667, 81194, 77655, 29633, -38668, 3532, 124028, 146289, 65273, 8325, 6516, 42712, 98165, 90908, 19242, 19433, 99148, 117245, 59251, 17047, 7637, 35724, 108405, 134332, 69117, 25331, 45479, 43542, 28343, 66170, 111887, 114305, 88406, 24523, -36355, 19376, 144736, 156621, 55845, -773, 26151, 78814, 106514, 63564, -1762, 38692, 139334, 124234, 18425, -12270, 40704, 84938, 92803, 66193, 41166, 74448, 98311, 18202, -50971, 36622, 164921, 154889, 37123, -52622, -34002, 82135]
217H2135P2091p9603r4741M2531P5814k9676o4862m005M4666N0405l286p4320
229A7149l4231O5465L2687o6332l1233O5097N6416j8450p4898p4933K4649J22929
241H4315N3452q2964p7459P653K7314J9263J4395j2411j0019K2687r564n3310
253a6648L70N1903J0524k0575l245o540l387J9454j2577m8961J3501P3088K3077
266G9984m2316n2963l9889J8867Q8266M3096n9783n6423O148J3203N886J6576
278B0652J698j144J9298j8114n9105L858O8001J7097m1892k0988J0902K5888J8365
291D4516m1215o5837L2694J02991J7744p8011n9854j341M1965N6775K866m9626
303C667q272K7231k3923l8093L0189N3079Q889k5461m5362k9438M3227N9603k5865
$$ y = [82135, 154226, 74623, -20118, 22413, 98227, 68551, 3689, -316, 44350, 94755, 91469, 17149, -17082, 48383, 81070, 14738, -16495, 48602, 105018, 86568, 11670, -63263, -38614, 84315, 137767, 54803, -22656, -15003, 12311, 31574, 45969, 33558, 23539, 46226, 36662, -16648, -16278, 35625, 46149, 25574, 22329, 15789, 12402, 31856, 19279, -29682, -16181, 56907, 79984, 37668, -15295, -55184, -36317, 51949, 95045, 35262, -21161, -15013, -1810, 4076, 20652, 22350, 21206, 40504, 22390, -36715, -32857, 35144, 52241, 10349, -10639, 263, 26151, 44516, 3301, -62536, -29842, 73149, 90893, 12882, -46972, -48313, -6348, 50427, 53293, 3667, -4605, 22626, -1297, -39390, -9201, 43878, 52767, 27306, -18056, -47494, -4267, 55336, 29471]
316B9471n7552J4449M6394O995k5494m1782k5363N0050P3969j3986o7946k1874
328c2669J3501J1034K1773J2914j2066K874L959m7098l4870N2652O5663q077m8638
341I52l9308k788N1189L8944m8582n4549M1479O4252j4428n7979l5149J3431O1734
354A9198L8637m7284n1694K7078K8079l6414k4687L9330M9199P565n4052p9112
366h4157M536J05354N2234p2172o7924K1871M8674J2889l2632m4868J7194P4498
378C5497R924p6254l4245M2939K8048j2681j2537J645K2988J7420m6346o5152
390h8754L2731R5386J8917o2219n3311r176L7037N0272n283m7905L63L6065r739
403e616l2225L155J5947J0939J4443j1242k9968O826K3636j8927k0964K7253K9173
$$ y = [29471, -28081, -13632, 32762, 39757, 14263, -27519, -52882, -2832, 71137, 57151, -10795, -32669, -19168, -8134, 13639, 26553, 14487, 17361, 21320, -25778, -60648, -7996, 57667, 49590, 952, -38356, -41144, 10045, 48989, 407, -54142, -12663, 51589, 37161, -20818, -55967, -42536, 19198, 57835, 10551, -41143, -14065, 14014, -22400, -47087, -7757, 41442, 49007, -5045, -84157, -79621, 25733, 77967, 5795, -62129, -40258, 8416, 21305, -11327, -56195, -39001, 35497, 45421, -30833, -65078, -22139, 5909, -6772, -19309, -17664, 5324, 22744, -23602, -88754, -56023, 39363, 58280, -3939, -57250, -66426, -29389, 20883, 15600, -32305, -31942, 4123, -5616, -37841, -34686, -18739, -7800, 6643, -4599, -34567, -27741, -4105, -23032, -43996, -16743, 12430]
416A2430j230j6291l6760l1978L7143O8749K464m9109k9161l890J6463L3876L476
429F182l1470K146K8138j4727l3271O995K4359J0426L743j7060k3125J9683K7819
442I838l1311l8075L1708N2504L926l6756n0061j6546N6060O2655k2947n7118
454c6123l028K2428j68l578J546M868K1981N062m5914k8994M1969L8304j9522
467a169k6151L21J3773K0410n718m8683j6347N9683M5973k8465m6783j9068P969
480d4255L6957K7753k3615k5523J8214O006l1259p174K9622K1903M292j8780m1571
493d7430m421N2050K1510m2180k4319K6505K7693J244k8798m2666Q300O8087K5732
506D1307n0983l8363J3920J9284N419k012q398J2916K5810k5546n8544Q914O8849
$$ y = [12430, 11200, -5091, -41851, -73829, -36686, 32063, 34527, -14582, -43743, -47633, -31170, 2706, 6182, -25288, -23142, 4996, -9731, -43002, -36007, -11648, -1222, 2521, -14539, -37664, -17981, 9838, -21473, -59548, -27840, 24664, 28590, -8166, -58227, -74773, -18713, 43942, 20995, -36123, -39151, -16723, -16891, -20469, -18923, -14055, 7926, 12988, -32926, -61920, -19951, 18353, -1169, -27320, -26999, -13226, 7184, 1466, -47217, -63564, -3881, 42092, 13627, -33156, -52224, -44255, -7298, 20455, -3160, -28683, -10469, -4463, -35722, -42896, -13274, 8629, 12921, -5859, -47430, -51851, 199, 21709, -20471, -44790, -18285, 9408, 10652, -18146, -60812, -52512, 15575, 41307, -9676, -48039, -34119, -14835, -9416, -11428, -19826, -6910, 18900, -6646, -65190, -56276, 12573]
519A2573K4955l6521m0384r103L3135L8410k2472n3507J3951O0915O204m6532
531a8376k9186P536L2288K9252j6966l6066J2759K8822k3878l4147K1036M1816
543A4890J3823k1515m6255k3534M5596N1687j9695m3609J761K1755N613n023j6707
556b1213j0077K9054K8796k4422l2335Q785J5186k348L539L251k856J1248N10
569G118l5428j6900L9708L6220q289k6210k5699q279L3504L2338k0554k9362J3373
582h460J7727q991j0363o432J617K5068J6616k9439k5413K1419J7792j6484r364
595a4707J0779J4864J2688j3796m6651r464N5074L7632k6685l7450q682J2446
607a3952K3905O696k6261p897L3401Q264l6034j7201K1018J9568O222j0717k4030
$$ y = [12573, 37528, 1007, -39377, -48480, -15345, 23065, 593, -52914, -38963, 21952, 28156, -18376, -47562, -40026, -7738, 21514, 4548, -31518, -18759, 10063, -13815, -47962, -26926, 14890, 28713, 7198, -39057, -62591, -16995, 34692, 14997, -28612, -26851, -5096, 517, -4506, -21213, -31290, -2236, 26560, 2138, -30197, -21412, -6226, -8574, -5035, -1784, -4640, 6608, 7118, -28310, -45210, -5502, 30718, 22429, -3781, -29480, -37759, -4255, 28083, 7529, -21833, -8460, 9267, 276, -10087, -16519, -14902, 10166, 26782, -2657, -28070, -6651, 11141, -5343, -14707, -3928, 10936, 23624, 9828, -36823, -46287, 8787, 46419, 19734, -17716, -26398, -13952, 9953, 16649, -9612, -17509, 15892, 24156, -11878, -29079, -8061, 11507, 17729, 7012, -17018]
620a7018L261L2758l184m0797k875L9923K1613j3067l0736k8349J4668M9912J0221
633C6330l8500j6104J8196N543p319l143j760J3204K2495j6537l9924N170L8003
646A5654O495j9906j0847J558J6881J5796k3926l8277J8418N0934N140l4619k3819
659b0518j396K1432K6001r552k8024J0725K5496j7068k9458P859K6868J6147m207
672B4305l1357k2761K9418L5690k0569l4031J0738K9117P247j4855k9933j0212
684b7203L7508L4061k3449l4151P481J7306k143n722k811N682K1128J222l9458
697a0549j8740L6136L0010j1677k1972j0486M970K2467O064k9342j2343L1742
709A6280J9382j9202j9518m086N983K0271R358k0815j0741J9057L163k2720l651
$$ y = [-17018, -13757, 19001, 15817, -24980, -27855, 12068, 33681, 20614, -10122, -38471, -23803, 26109, 36330, -2170, -18274, -78, 5465, -1854, -4997, -6757, 6447, 28942, 12405, -27519, -22349, 15654, 22149, 2243, -8604, -7046, 9835, 25631, 1705, -36572, -18154, 32780, 37920, 3301, -20518, -21914, -482, 25519, 15967, -12057, -1332, 24164, 7096, -22362, -14503, 12365, 28512, 24305, -7052, -29813, -395, 35295, 14726, -19305, -8567, 20550, 27797, 12942, -16991, -27203, 10305, 44366, 20917, -13234, -5753, 11553, 9410, 3688, 877, 6559, 27687, 28909, -10549, -29289, 6847, 36857, 25180, 3208, -7278, -2308, 20159, 26223, -3119, -15462, 16280, 35662, 16460, -3058, -7144, -1161, 19110, 28468, 7653, -3088, 15969, 19132, -3588, -7239]
722g239J7933J2937M709j2100l0609l239L6708J6339k2909j4966N969O935P600
735A8068l543k1819L60L2533Q276k8304j4580J0410Q927N661p48j3951K938K2309
749B6537p958l3523p5L2714J5404r593k1042j9979J1201L4038j07l1559k812K3336
763A6582M532j3226j1620m552J5803K4063j0748l2410L637K5664r53j7158k580
776b966Q024J4813P575k5099k9119J8918L9119j403k6455j1676M252J3089J1582
789B0654j3530j8895J7524K4822j5867k6439K997J6321J1111J765j8000j4574
801a2111K0197J9747k1734k3449J5522K4112L801j2627k4455q782K9122K5029
813C4372k0879k4204J0900J5179l778q949p639L551K3404P432l1766j8399K3770
$$ y = [-7239, 10694, 23631, 28340, 16240, -14369, -17608, 19100, 35439, 12530, -2436, 3533, 10468, 18068, 14525, -7294, -6934, 25599, 33875, 5571, -9009, 1401, 10328, 15989, 15241, 1290, 4228, 26537, 18579, -14944, -15019, 17695, 33099, 23506, 2464, -17515, -6314, 27724, 27617, -3942, -6754, 16582, 21114, 7888, -3732, -8284, 7519, 31582, 20834, -11576, -7939, 17725, 16772, -386, -2966, 5058, 19871, 27446, 2347, -26772, -7854, 31265, 29862, 3407, -8269, -4017, 9072, 20654, 7124, -11771, 5753, 30575, 14708, -11731, -8734, 7587, 18698, 20463, 2463, -12111, 8086, 27833, 6099, -17350, -1828, 22284, 26085, 13458, -10997, -19779, 9343, 34372, 13493, -10711, 189, 15368, 11590, 2641, -4998, -1447, 21957, 29389, -2377, -20776, 2994]
826B994K0742r630j3860m676P009J8704j568l1381r086L3330J9702j8556j9580
839e856l717Q417J7576J400k2665l938K5658M561k5760r905J3635J4105P444j0324
853A0631k4499J149K8675M216k5511o031J6641R701j650j3013j8205Q320K9945
866B0369J135k7216o444J4599M217k932m854p470R410J8998j0814k9247L523K5410
880H684N916r558j0655p587R721J8178j0425k3843P806K5039j081j5542r944j818
894a5109J3541J7028j1281k2975R044K0267p362j6424M3Q701J1594N716j9684
907f901k0909J6628K5684q662j8946K30Q418P096J458j6037j2444K1121K0827
920A7563j6109k1754M427J2359N797n58j2970p212J8526J2569k1469j7571J5200
$$ y = [2994, 23736, 14106, 246, -4430, 2579, 21283, 19715, -11666, -20752, 12578, 32280, 13724, -5856, -9573, -1156, 16420, 17820, -4845, -8783, 16875, 21436, -4324, -14229, -594, 13511, 20955, 10631, -13868, -12719, 15956, 20172, -5339, -11370, 5271, 14972, 13322, 309, -17896, -9576, 20369, 21504, -5712, -12156, 2443, 6660, 3728, -1126, -8596, 814, 19812, 8998, -20249, -16726, 8684, 14600, 5042, -5613, -13200, -3479, 14699, 4274, -19569, -11763, 13276, 12195, -3347, -13291, -15109, -1568, 15460, 4179, -18796, -9752, 10515, 3153, -13271, -13228, -4527, 7067, 12783, -6901, -27810, -11182, 14502, 5840, -13106, -12876, -4458, 2638, 4096, -11941, -24385, -3264, 17563, 1454, -20300, -15873, -3514, 2283, 1725, -11245, -18457, 69, 12638, -8831, -26402, -11202]
933a1202J7026m55q238j4390l586K0311J1862k0756j3853J7213J2659p700j1003
946a2112p297M530K0095N690k4890j1743J9669J1682j1049q951j17O805J3240
959E552k448k5193m515K6090J0379j6386j0922K279O927R833m067j9852J234K5654
973D565K972k2781q770R673J0026O260o636j8643L121K2783q22k2589k563J5456
987g948P106k001j0441j3778Q557K3058m837k3409M08J6873L255o892q510o516
1001b5075J2062J8673j0224k4410L630J9555J746q580n793l181R249J2474j2510
1014a2384j9284J0844K0691m290j4193m307K094J0283R580j4066j6486J3489J9335
1027A306q972j5961p25P086R626N838j4946j4707J4241J7106j0938j3600M981
$$ y = [-11202, 5824, 5369, -2869, -17259, -20845, -534, 11328, -9428, -23281, -6068, 6591, -1109, -12112, -19409, -14879, 5216, 10906, -13984, -25727, -6058, 5624, -5425, -14376, -14493, -7688, 5552, 3104, -22089, -26604, -514, 9865, -6521, -17443, -15164, -8237, 1596, -2471, -22323, -21089, 4565, 7537, -15244, -24014, -14341, -4315, 1945, -4691, -23334, -20213, 2570, 1748, -20841, -23404, -7948, -842, -2843, -13284, -27062, -18505, 4553, -284, -23693, -23285, -6412, -3157, -10049, -18559, -25075, -13013, 5660, -4564, -28974, -25344, -5789, -4043, -12623, -18416, -21597, -12348, 126, -12384, -31668, -20824, -133, -4423, -18616, -22923, -20829, -10546, -966, -15032, -31518, -18029, 1306, -7666, -23627, -24352, -17266, -7640, -1802, -16748, -31455, -17214, -108, -11046, -24646, -19665]
1040a9665Q343L917r83j3809p556J9460J4222j6517j6173Q641J1837K656m175
1053i802j2755m121J9556J1531j9616j4202J2535J2102j450n492q968p08J6425
1066d965N515k0311q198J8875R954r558r841l842N747J7046Q95k3507o484K1379
1080g295R839j2397r044n64O147J2608j522j9991k046K0726M043j5796m911O558
1094a3645N980N191o628j6536M824K3505r41k0997n426J1295Q250L421q143j5478
1108b5328N079K1159j937j9357j050J1733L352j463n746q851Q034J6183q613j9475
1122b6280N012J7153J153q588q490l678J2294J5149j1668k0946O840J8599j17
1135c567r461n796j958R288J1176j1129j5336J1075J5492q077j2326R59N929R167
$$ y = [-19665, -11322, -7405, -8388, -22197, -29753, -10293, 3929, -12588, -28761, -20120, -8283, -5627, -9802, -22557, -26678, -7122, 4409, -15207, -29409, -16874, -4772, -6222, -11714, -20682, -21390, -4965, 550, -19761, -27959, -9084, 870, -8688, -18529, -22371, -16624, 422, 1317, -22190, -28674, -7295, 2544, -9853, -18897, -19461, -13314, -706, -2228, -22219, -24265, -3539, 504, -15292, -20203, -13645, -7665, -2474, -9102, -25638, -20814, 2691, 1750, -19247, -24673, -13378, -5128, -1707, -9850, -25328, -20249, 910, -1027, -20384, -21434, -9701, -6349, -7812, -13558, -22409, -14375, 1808, -6805, -26280, -21268, -4115, -2962, -11550, -20040, -23718, -11424, 3725, -7943, -28889, -22049, -3450, -3567, -13028, -18824, -20782, -11494, -318, -11447, -26783, -15708, -216, -8293, -20619, -19660, -13731, -4564]
1149d564K884j5751j2417J7536J7346j1752j5385K419P788Q257J774j4769r482
1162b6116J6219J3283j2252j1257P295O301L84j279q358j605J6104N673j9048
1175a4656q868J3846J0793k500n933r454n97J7185P214j7819q882J3105P568l675
1189b673l174n634l84J2546L317j4870l300J5200K583r735m212J261N909J1270
1203H104l643j9892j822K0480P004j1319p245n53N000J0772j888j6415N07J7531
1217F621J629j3375l135N913L851L520n055j1744P294J8012o288j9534J36J3924
1231A769P546p47j0556j3148Q527J9467m103j7279J417J0965O85l348m269m581
1245g655Q427J1305r967j4484Q536J2756l938q277k677J148J0757Q108j4666j5825
$$ y = [-4564, -1680, -17431, -29848, -12312, 5034, -6718, -22103, -19684, -11896, -3639, -1865, -16634, -26116, -9897, 3386, -8866, -20123, -12828, -6527, -6143, -7422, -15780, -17385, -1281, 4392, -14656, -23524, -9678, 1115, -1385, -7318, -16772, -17369, -184, 7030, -10789, -19671, -6566, 1002, -2673, -5847, -11481, -11865, 681, 3998, -10872, -14172, 1028, 3611, -6124, -10336, -9075, -3166, 8104, 4461, -15431, -17253, 3227, 10231, -1088, -8333, -8886, -3886, 6886, 4998, -11417, -10910, 6621, 8250, -5125, -8260, -2347, 1504, 5024, -31, -11775, -4481, 13531, 7243, -12291, -12155, 1769, 9315, 8568, -1988, -15136, -6609, 12858, 8755, -8524, -7107, 3858, 4543, 1195, -3074, -7655, 772, 12077, 2110, -12374, -3838, 8918, 4980, -3297, -5974, -4826, 5931, 14039, -627, -16452]
1259a6452J0742J6624k322q354m207k866O584R787q253r829R616R301r167p240
1273f036L277L582N101K786j2269p503J4569J0714j2213j1222M969P828P222m24
1287A0381j5150r233J5896J3296j0024r306M290L412O11k38p075J47J4716K909
1301A4632j8445p126J4289Q995l688o758o923L377J6381M14j9889n546J6823Q759
1315A5295n510o477o122J742J1851J273j2774J150J3635k525j2045j348N965O443
1329A0553O334o832j6040L497J7632Q70j2442k586L839M043O319m044j4000K066
1343g91J5819L42r209n32J619j291L083r3n942N817J1310q560j5094L392J1347
1358A1217N056K64q725j1534P265J6165m014j5063J647R762K882k272o391p592
$$ y = [-16452, -5710, 10914, 8592, 238, -3969, -6835, -251, 9536, 1283, -8546, 1070, 10371, 1204, -6036, -2759, 823, 5924, 8710, -3559, -11062, 3507, 14221, 2008, -9214, -4245, 3583, 10805, 10381, -4769, -14002, 1894, 15190, 5166, -4140, 150, 3562, 4173, 3935, -3140, -2993, 11723, 14632, -3813, -10939, 3350, 12345, 8657, 1899, -5024, -1647, 14734, 15148, -4741, -10287, 6536, 15295, 9785, 3308, -2814, -1072, 10779, 12052, -722, 428, 14063, 11538, -507, -1855, 4110, 10553, 16887, 10055, -5985, -2488, 15144, 16014, 3572, 986, 4825, 8868, 15187, 11143, -2857, -791, 15028, 15370, 6161, 5629, 7248, 5957, 9040, 8947, 3005, 8822, 20132, 11572, -3522, -130, 11217, 16273, 16537, 7812, -3722, 3543, 19708, 15694, 631, 2278, 12040, 14922, 12650, 6259, -1333]
1372a333Q116J2770o848j2259P043R207n878p879j073M304J2302M712j8208j4882
1386i906J3596J7434l924j0682l579J008Q905M118j2739p334J3818R271j0609
1399I377p871M139L440K454n15q504K01J4438K146j8081p482J1597R927K351m760
1414A2857j3388m090J4086P660j0062l877O116J30k563o8l486j77J0220J399j2065
1429B692k275R899R03n584j385j559M105J1166k840j8782l532J5267Q339l368
1443A3046n230p749l57J0615K171j0806R88J1889j967j0558j761L273N679N901
1457A5134o136j2964O115J5158m479j4903l36R082Q154K159j0327j3896O102J6250
1471A5113k013r237K121L018l289j284j143j072R336O715j2166j1667Q267R773
$$ y = [-1333, 6783, 19553, 12705, 446, 7489, 16696, 10818, 2939, 1866, 6170, 18472, 23184, 4976, -9906, 3690, 21124, 17200, 6518, 2939, 3947, 12852, 16970, 4231, -3103, 10715, 19986, 9377, 1506, 5645, 9085, 11539, 11024, 2520, 2721, 17159, 19305, 1224, -6258, 5339, 15266, 17617, 12857, -531, -4621, 9465, 17125, 7063, 3186, 9302, 9432, 6869, 6801, 3315, 3138, 13358, 14757, 2692, 417, 10316, 11219, 5635, 4250, 2691, 6796, 17962, 15122, -3660, -7192, 8075, 16414, 13046, 7816, 67, -290, 10325, 12496, 1690, 2678, 14567, 12600, 2042, 281, 3554, 9233, 15134, 8998, -3966, 2149, 17307, 12828, -2075, -2411, 6671, 14825, 16984, 6657, -7239, -1137, 15113, 13100, 3863, 5984, 9002, 5713, 4429, 3286, 2214, 11550, 18265, 6099, -5568, 2699, 12472]
1485A2472k312l324k438k803P090O630r601r971O885Q789l5j044l555q368K345
1500G60R308j331m428N089R20p435k265K651J132O383N233j1168j1049Q257R788
1515A1845k734m819k532j77P859N179j2227j0937J0430J1982l436o802j790j313
1529E28L665L012p472q92J4065K485j7568q700R379J1268L994o164j3775j074
1543g249J5787L839j4635m808J0786O141k601o345p218K682J1944k61j1823K008
1557a753J0914l378j0971j709N121Q777P339r636j7346K682J5537K746o303j723
1571B97j610l19N756k488p860L889R682l384o222J250K98j502L615m53m928N797
1587A818P467q422j0764K430Q161N638L395p836j3851L222J3683L45p186J082
$$ y = [12472, 10160, 6836, 4398, 1595, 8685, 15315, 5714, -4257, 2628, 11417, 11382, 10338, 6783, -1585, 760, 10068, 8737, 4309, 9398, 10318, 2883, 618, 3269, 4401, 10784, 16017, 4849, -6200, 2057, 11845, 9111, 4292, 1760, 1583, 9442, 14621, 2394, -8543, 1887, 13869, 10433, 3631, 1841, 528, 4193, 7205, -267, -1159, 12906, 15391, -2177, -10877, -1498, 9770, 13764, 7600, -6175, -7249, 8538, 12377, -2258, -7066, 3720, 9861, 7260, 915, -6303, -3621, 8323, 8062, -3761, -1753, 9161, 5783, -5188, -6897, -1776, 7001, 14340, 4704, -12642, -9960, 5577, 8323, 2020, 297, -1313, -1632, 4124, 1636, -6224, -2335, 7347, 3963, -2259, -1009, -711, -2213, 1402, 949, -3979, 1818, 9285, 863, -9901, -7471, 690, 6328, 9723, 1887, -11964, -8742, 4941, 5286, -1900, -818]
1601h18J495n06R71m047m901P834R174p368r626M915O771l083l834k737K006J0804
$$ y = [-818, 677, 171, 1142, -2905, -7806, 28, 9202, 1834, -7792, -2877, 3894, 811, -3023, -5760, -3754, 7050]
$$ [...]
8191a26
##END NTUPLES=NMR FID
##END=
