##TITLE=1H_TG-2268-b1
 CDCl3, 8 sc, 
 9.1.2020
##JCAMPDX= 6.0         $$ Bruker NMR JCAMP-DX V2.0
##DATA TYPE= NMR FID
##DATA CLASS= NTUPLES
##ORIGIN= UXNMR, Bruker Analytische Messtechnik GmbH
##OWNER= root
$$ XWIN-NMR		Version 3.5
$$ Thu Jan  9 13:56:21 2020 Russian Standard Time (UT+4h)  she@DPX200
##.OBSERVE FREQUENCY= 200.1315
##.OBSERVE NUCLEUS= ^1H
##.DELAY= (6, 6)
##.ACQUISITION MODE= SIMULTANEOUS
##.ACQUISITION SCHEME= undefined
##.AVERAGES= 8
##.DIGITISER RES= 18
##SPECTROMETER/DATA SYSTEM= spect
##.PULSE SEQUENCE= zg30
##.SOLVENT NAME= CDCl3
##.SHIFT REFERENCE= (INTERNAL, CDCl3, 0, 15.7039)
##AUDIT TRAIL= $$ (NUMBER, WHEN, WHO, WHERE, WHAT)
$$ ##TITLE= Audit trail, XWIN-NMR		Version 3.5
$$ ##JCAMPDX= 5.01
$$ ##ORIGIN= Bruker BioSpin GmbH
$$ ##OWNER= she
$$ F:/spectra/data/she/nmr/H-F/1/audita.txt
$$ ##AUDIT TRAIL=  $$ (NUMBER, WHEN, WHO, WHERE, WHAT)
(   1,<2020-01-09 13:54:42.57 +0400>,<she>,<DPX200>,
      <created by zg, POWCHK disabled, PULCHK disabled
       configuration hash MD5:
       00 E9 B6 7A A2 85 ED C7 34 08 36 98 17 FE 4E 26
       data hash MD5: 16K
       48 80 DE A3 E5 E3 B0 D8 C0 F6 57 A4 EF 6B 46 7A>)
$$ ##END=
$$ 
$$ hash MD5
$$ 67 34 8A BF FF 12 6E 56 F8 0E D0 B1 68 39 33 30
##$RELAX= 
##$RELAX= 
##$RELAX= 
##$RELAX= 
##$RELAX= 
##$RELAX= 
$$ Bruker specific parameters
$$ --------------------------
##$DU= <F:/spectra>
##$EXPNO= 1
##$NAME= <H-F>
##$PROCNO= 1
##$TYPE= <nmr>
##$USER= <she>
##$AMP= (0..31)
100 100 100 100 100 100 100 100 100 100 100 100 100 100 100 100 100 100 
100 100 100 100 100 100 100 100 100 100 100 100 100 100 
##$AQSEQ= 0
##$AQ_mod= 1
##$AUNM= <au_zg>
##$AUTOPOS= <>
##$BF1= 200.13
##$BF2= 200.13
##$BF3= 200.13
##$BF4= 200.13
##$BF5= 200.13
##$BF6= 200.13
##$BF7= 200.13
##$BF8= 200.13
##$BYTORDA= 1
##$CFDGTYP= 0
##$CFRGTYP= 5
##$CHEMSTR= <none>
##$CNST= (0..31)
1 1 145 1 1 1 1 1 1 1 1 1 1 1 1 1 1 1 1 1 1 1 1 1 1 1 1 1 1 1 1 1 
##$CPDPRG= <>
##$CPDPRG1= <>
##$CPDPRG2= <>
##$CPDPRG3= <>
##$CPDPRG4= <mlev>
##$CPDPRG5= <mlev>
##$CPDPRG6= <mlev>
##$CPDPRG7= <mlev>
##$CPDPRG8= <mlev>
##$CPDPRGB= <>
##$CPDPRGT= <>
##$D= (0..31)
0 1.2 0 0 0 0 0 0 0 0.06 0 0.03 0 0 0 0 0.0002 0 0 0 0 0 0 0 0 0 0 0 0 
0 0 0 
##$DATE= 1578563682
##$DBL= (0..7)
120 120 120 120 120 120 120 120 
##$DBP= (0..7)
150 150 150 150 150 150 150 150 
##$DBP07= 0
##$DBPNAM0= <>
##$DBPNAM1= <>
##$DBPNAM2= <>
##$DBPNAM3= <>
##$DBPNAM4= <>
##$DBPNAM5= <>
##$DBPNAM6= <>
##$DBPNAM7= <>
##$DBPOAL= (0..7)
0.5 0.5 0.5 0.5 0.5 0.5 0.5 0.5 
##$DBPOFFS= (0..7)
0 0 0 0 0 0 0 0 
##$DE= 6
##$DECBNUC= <off>
##$DECIM= 24
##$DECNUC= <off>
##$DECSTAT= 4
##$DIGMOD= 1
##$DIGTYP= 9
##$DL= (0..7)
0 120 120 120 120 120 120 120 
##$DP= (0..7)
150 150 150 150 150 150 150 150 
##$DP07= 0
##$DPNAME0= <>
##$DPNAME1= <>
##$DPNAME2= <>
##$DPNAME3= <>
##$DPNAME4= <>
##$DPNAME5= <>
##$DPNAME6= <>
##$DPNAME7= <>
##$DPOAL= (0..7)
0.5 0.5 0.5 0.5 0.5 0.5 0.5 0.5 
##$DPOFFS= (0..7)
0 0 0 0 0 0 0 0 
##$DQDMODE= 0
##$DR= 18
##$DS= 0
##$DSLIST= <SSSSSSSSSSSSSSS>
$$ [...]
##$SUBNAM2= <"">
##$SUBNAM3= <"">
##$SUBNAM4= <"">
##$SUBNAM5= <"">
##$SUBNAM6= <"">
##$SUBNAM7= <"">
##$SUBNAM8= <"">
##$SUBNAM9= <"">
##$SW= 24.9337058887773
##$SWIBOX= (0..15)
0 0 2 0 0 0 0 0 0 0 0 0 0 0 0 0 
##$SW_h= 4990.01996007984
##$TD= 16384
##$TD0= 1
##$TE= 0
##$TE2= 300
##$TE3= 300
##$TEG= 300
##$TL= (0..7)
0 120 120 120 120 120 120 120 
##$TP= (0..7)
150 150 150 150 150 150 150 150 
##$TP07= 0
##$TPNAME0= <>
##$TPNAME1= <>
##$TPNAME2= <>
##$TPNAME3= <>
##$TPNAME4= <>
##$TPNAME5= <>
##$TPNAME6= <>
##$TPNAME7= <>
##$TPOAL= (0..7)
0.5 0.5 0.5 0.5 0.5 0.5 0.5 0.5 
##$TPOFFS= (0..7)
0 0 0 0 0 0 0 0 
##$TUNHIN= 0
##$TUNHOUT= 0
##$TUNXOUT= 0
##$USERA1= <user>
##$USERA2= <user>
##$USERA3= <user>
##$USERA4= <user>
##$USERA5= <user>
##$V9= 5
##$VALIST= <valist>
##$VCLIST= <CCCCCCCCCCCCCCC>
##$VD= 0
##$VDLIST= <DDDDDDDDDDDDDDD>
##$VPLIST= <PPPPPPPPPPPPPPP>
##$VTLIST= <TTTTTTTTTTTTTTT>
##$WBST= 1024
##$WBSW= 4
##$XGAIN= (0..3)
0 0 0 0 
##$XL= 0
##$YL= 0
##$YMAX_a= 725175
##$YMIN_a= -428575
##$ZGOPTNS= <>
##$ZL1= 120
##$ZL2= 120
##$ZL3= 120
##$ZL4= 120
##$ABSF1= 10
##$ABSF2= 0
##$ABSG= 5
##$ABSL= 3
##$ALPHA= 0
##$AQORDER= 0
##$ASSFAC= 0
##$ASSFACI= 0
##$ASSFACX= 0
##$ASSWID= 0
##$AUNMP= <proc_1d>
##$AZFE= 0.1
##$AZFW= 0.1
##$BCFW= 1
##$BC_mod= 2
##$BYTORDP= 1
##$COROFFS= 0
##$CY= 11.3945322036743
##$DATMOD= 1
##$DC= 2
##$DFILT= <>
##$DTYPP= 0
##$F1P= 16.9975609425685
##$F2P= -3.02152046262296
##$FCOR= 0.5
##$FTSIZE= 0
##$FT_mod= 4
##$GAMMA= 1
##$GB= 0.15
##$INTBC= 1
##$INTSCL= 1
##$ISEN= 128
##$LB= 0.24
##$LEV0= 0
##$LPBIN= 0
##$MAXI= 10000
##$MC2= 0
##$MEAN= 0
##$ME_mod= 0
##$MI= 1.114404
##$NCOEF= 0
##$NC_proc= 0
##$NLEV= 6
##$NOISF1= 3.799351
##$NOISF2= 2.8
##$NSP= 1
##$NTH_PI= 0
##$NZP= 0
##$OFFSET= 15.70392
##$PC= 1
##$PHC0= -10145.19
##$PHC1= 14.4008
##$PH_mod= 1
##$PKNL= yes
##$PPARMOD= 0
##$PSCAL= 0
##$PSIGN= 0
##$REVERSE= no
##$SF= 200.130013532006
##$SI= 16384
##$SIGF1= 3
##$SIGF2= 2
##$SINO= 400
##$SIOLD= 16384
##$SREGLST= <1H.CDCl3>
##$SSB= 0
##$STSI= 0
##$STSR= 0
##$SW_p= 3612.71676300578
##$SYMM= 0
##$S_DEV= 0
##$TDeff= 0
##$TDoff= 0
##$TI= <>
##$TILT= no
##$TM1= 0
##$TM2= 0
##$TOPLEV= 0
##$USERP1= <user>
##$USERP2= <user>
##$USERP3= <user>
##$USERP4= <user>
##$USERP5= <user>
##$WDW= 1
##$XDIM= 8192
##$YMAX_p= 0
##$YMIN_p= 0
$$ End of Bruker specific parameters
$$ ---------------------------------
##NTUPLES= NMR FID
##VAR_NAME=  TIME,          FID/REAL,        FID/IMAG
##SYMBOL=    X,             R,               I
##VAR_TYPE=  INDEPENDENT,   DEPENDENT,       DEPENDENT
##VAR_FORM=  AFFN,          ASDF,            ASDF
##VAR_DIM=   8192,          8192,            8192
##UNITS=     SECONDS,       ARBITRARY UNITS, ARBITRARY UNITS
##FACTOR=    0.0002004,     1,               1
##FIRST=     0,             0,               0
##LAST=      1.6414764,     0,               0
##MIN=       0,             -428575,         0
##MAX=       1.6414764,     725175,          0
$$ Real data points
##PAGE= N=1
##DATA TABLE= (X++(R..R)), XYDATA
$$ [...]
2940A285k770K752K085k057m17O74J88J551J20m057q75N122J674m066j568J563
2956A204J092N71j043l020J003N223l66m949r79M113J572p17k047l053J474N488
2972E566p72n358L39N028P82k453k421j292L255M167k127n600J682M703j056l218
2988A225q4J293K387J198l588l692L370M219l031l623R21K469R69j103l230j280
3004a580N364L193n148m416L327L843j189l053k144J359N307j33o357j411O619
3019C581K904m312l533M83K881K897j711n732R99P082J358o548k954K906M410
3034D711J705l561n606K400P094j218o945l96N453K367k011l395k452M048N203
3049G397l222o175J557M634m31k482j283j1K912K380l516l921L285L860k030l466
$$ plain form
2940 1285 -1485 1267 3352 1295 878 1552 1740 3291 3411 -646 -1521 3601 5275 1209 -359 1204
2956 1204 2296 2867 1824 -1196 -193 5030 4664 -285 -1264 2849 4421 3704 1657 -1396 78 5566
2972 5566 4794 -564 -225 4803 5585 3132 711 -581 2674 6841 4714 -886 796 5499 4443 1225
2988 1225 1141 2434 4821 6019 2431 -1261 2109 6328 3297 -326 595 3064 4033 2930 -300 -1580
3004 -1580 3784 6977 1829 -2587 740 4583 3394 341 -1803 -444 4863 4730 -1627 -3038 3581
3019 3581 6485 2173 -1360 -877 2004 4901 3190 -2542 -1543 5539 6897 349 -2605 301 4711
3034 4711 6416 2855 -2751 -351 6743 5525 -1420 -1816 3637 6004 3993 598 -1854 2194 7397
3049 7397 4175 -2000 -443 4191 3760 1278 -5 -16 2896 5276 1760 -2161 1124 4984 2954 -512
3065e12O12J642J654n43m113q99N560K624m882l742L150L005j51j764k667N06
3081e20M973O93n811j585M419K585j210k438j992J914M344r42o688M9N867J660
3097E318l795l061N57L396L133k622n906J124N907j45m940j102K591J683J020
3112C158k929l647K653M638j364m982N44K804N42n69k766j297K911L677l299m067
3128c993L045L200j403k183j00R12J407k10l568n72M637J678l965j883K339J556
3144H97O91j489l626M42N102N84n001j730L578J830n41k063j867J051M604j277
3160A185n356O07M600M07k852j489J99J385K833j084m078J057L372q05j802k06
3176b027j82R22K116j266l035J500L746j533k835J350R41k82O16j489j255K288
$$ plain form
3065 -512 100 1742 3396 2853 -1260 -2159 3401 6025 1143 -2599 551 3556 3405 1641 -1026 -520
3081 -520 4453 5146 -665 -2250 2169 4754 3544 1106 -886 1028 5372 4430 -2258 -2209 3658 5318
3097 5318 1523 -1538 -981 2415 5548 2926 -2980 -1856 4051 3906 -1034 -2136 455 2138 3158
3112 3158 229 -3418 -765 3873 2509 -2473 -1929 875 1417 848 -1918 -3215 -304 3373 74 -3993
3128 -3993 -948 2252 849 -1334 -1434 -522 885 675 -2893 -3465 1172 2850 -1115 -2998 -659 897
3144 897 1588 99 -3527 -3085 2017 2601 -2400 -4130 -552 1278 737 -1326 -3193 -2142 2462 1185
3160 1185 -4171 -3564 1036 1443 -1409 -2898 -2699 -1314 1519 435 -3643 -2586 786 -19 -1821 -2027
3176 -2027 -2209 -1287 829 -437 -3472 -1972 1774 241 -2594 -1244 -303 -585 31 -1458 -2713 -425
3192d25J772k857o39K337L72j643L69O23j086J116Q70k793l86L271L77k818p27
3209b267J111P91J761n87l943j08M793N59m475j660K484J921L08j188l111J105
3225b506M499q83m165l33K927N79r02q19j483Q87L840j274l907Q12L500o12j509
3242a349o20m69J448J342k176k001L047J838k408j560K085P47r42l31q87j58J937
3259d57Q14l421p76L306M85k042j99R6O43J872q26m096P30M212l11l518o12K150
3277a950J775P49k128l155J752L851j096l119O48J554L09L72p68k227N97L480
3293F44k30k279M63Q17n2L69j13j836N53K484n68k314J482R87j679O23Q92j071
3311h28l56J193r33n05J673L32k228J86J761m30o11M72o98p70K143L90k941l23
$$ plain form
3192 -425 1347 -1510 -2149 188 560 -1083 -714 -91 -1177 -61 809 -1984 -2370 901 1278 -1540 -2267
3209 -2267 -1156 -365 1396 809 -3134 -3242 1551 2110 -2365 -4025 -1541 380 688 -500 -3611 -2506
3225 -2506 1993 1110 -3055 -3388 -461 118 -784 -1603 -3086 -2199 1641 367 -3540 -2728 772 160 -1349
3242 -1349 -1969 -2438 -990 352 -1824 -3825 -778 1060 -1348 -2908 -823 -76 -1018 -1349 -2236 -2394 -457
3259 -457 357 -3064 -3840 -534 -49 -2091 -2290 -2194 -1551 321 -505 -4601 -3871 341 30 -3488 -4100 -1950
3277 -1950 -175 574 -1554 -4709 -2957 894 -202 -3321 -2673 -1119 -810 -438 -1206 -3433 -2836 644
3293 644 414 -1865 -1402 -585 -637 -268 -381 -2217 -1664 820 252 -2062 -580 407 -1272 -649 243 -828
3311 -828 -1184 9 -924 -1429 244 576 -1652 -1466 295 -135 -746 -274 -972 -1742 401 791 -2150 -2473
3329b473K618N15j005k98j499N61L069m15m271J010M137n40k227j155N66P90K735
3346B118j181l389O44M036q44k652K41J01J197J188j523l100J895L817j205k799
3362a456M75J204n17j40k78q90J565J172k288j033K905m92k554M98K508l00o75
3379b96o29j573Q77K991n10l762P67L021p7j129o34p14J088K748j886l510J983
3396a245L589q28k369J29P35Q99J331j983j638K396K340k309j954J032Q5K22J468
3413A900l62j693J052J256k357j96J338j96l56R43n47j313O54P34j363P0J890
3430A454o40j944J290J006j303k62L81o92N51J513j540j546J543J788r54o78j62
3447a95j426J396K972j032l023N40J877%o10l86j054J874L061k439l742J481K554
$$ plain form
3329 -2473 145 660 -345 -643 -2142 -1581 1488 1073 -3198 -2188 1949 1409 -818 -1973 -1407 -617 2118
3346 2118 937 -2452 -1808 2228 1384 -1268 -1027 -926 271 1459 -64 -3164 -1269 2548 1343 -1456
3362 -1456 -981 223 -294 -434 -712 -1602 -37 1135 -1153 -2186 719 227 -2327 -1829 679 379 -296
3379 -296 -925 -2498 -1621 1370 860 -2902 -2135 886 809 -320 -954 -1668 -580 2168 282 -3228 -1245
3396 -1245 2344 1516 -853 -724 11 910 2241 258 -1380 1016 3356 1047 -907 125 210 432 1900
3413 1900 1538 -155 897 2153 -204 -400 938 742 386 1329 782 -531 123 857 -506 -436 1454
3430 1454 814 -1130 160 1166 -137 -399 -18 -710 -159 1354 -186 -1732 -189 1599 645 -33 -195
3447 -195 -1621 -225 2747 1715 -1308 -768 1109 1109 499 113 -941 933 3994 1555 -2187 -706 1848
3464A848l06j029j29k38J002J611k523k756K726K800j489j542k72K81O02J581
3480B167k323j452K764J571l297j122K363J405r86r93j178P48K578n72l141R56
3496e12L709m40l259m33J062J763R03j326k338K359L179k438l990J131L672J450
3512D492j295l083j640M018L544l697m117J949L447n34k171j012Q8L242J543m380
3528C94k467K847K372j685j153L19O9J188k41k796r17L892J101k146r93P55n14
3545B5m37L70n84M59K255l04l525N95K470k08j203K02l26N09J626j036k851J430
3563e33K514o25j627K78q8J174J823j566l002J424K595j305k602R08J772J578
3579B718q9l184k754K606L753j391k903P18J767j13m60k543r94L561L017k765
$$ plain form
3464 1848 1542 513 384 146 1148 2759 236 -2520 206 3006 1517 -25 -297 -16 586 2167
3480 2167 -156 -1608 1156 2727 -570 -1692 671 2076 1090 97 -1081 -333 2245 1673 -1468 -512
3496 -512 3197 2757 -502 -935 127 1890 2793 1467 -871 1488 4667 2229 -1761 -630 3042 4492
3512 4492 3197 114 -1526 2492 6036 2339 -1778 171 3618 3084 913 -99 -11 3231 4774 394
3528 394 -2073 774 3146 1461 308 627 696 1884 1643 -1153 -2070 1822 2923 777 -216 539 25
3545 25 -412 -42 -626 -167 2088 1784 -1741 -1146 1324 1116 -87 115 -211 298 1924 888 -1963 -533
3563 -533 1981 1356 -271 7 -81 1093 2916 1350 -1652 -228 2367 1062 -1540 -632 1140 2718
3579 2718 2629 -555 -3309 -703 3050 1659 -1244 -526 1241 1128 668 -1875 -2869 692 3709 944
3595I44k775R72K073m29r95j032l41L567J028m229j437L218J955k223r56L71O10
3612C21J463q02k157J001L140n87l872j27K715J362k6j001k399J533K748k250
3628A062l252J497L996l71j934j623l69J916J838k389k142K579K524k547k330
3643a545L47J167J788j65k564j288K709J746k388j249J526N76o76k37j345l72
3659a970K953O78k446j062J596J56p72K94RJ18J691m25l162k85K613J08q21O25
3677a02O86o89m5l99j826Q21K437j88k769M97Q39M7J037r52j632M08L084j377
3695a23k243M63J524K32j99j514j520J555K832j158k021J049J353j186j069o78
3711b703K92K651J819k595k286J392J427j190p11Q97O30J416m00k868q78K769
$$ plain form
3595 944 -1831 -859 1214 785 -210 -1242 -1583 1984 3012 -1217 -2654 564 2519 296 -660 -289 321
3612 321 1784 982 -1175 -174 2966 2379 -1493 -1620 1095 2457 2431 1430 -969 564 3312 1062
3628 1062 -2190 -693 3303 2932 998 -625 -994 922 2760 371 -1771 808 3332 785 -1545
3643 -1545 -1198 -31 1757 1592 -972 -2260 449 2195 -193 -1442 84 660 -16 -253 -1598 -1970
3659 -1970 983 1661 -785 -1847 -251 -95 -867 -573 -564 -446 1245 820 -2342 -2627 -14 94 -727 -102
3677 -102 584 -105 -150 -549 -2375 -1554 883 695 -2074 -1577 -738 -691 346 -606 -2238 -1830 1254 -123
3695 -123 -2366 -1903 -379 -147 -346 -1860 -3380 -1825 1007 -151 -2172 -1123 230 -956 -2025 -2703
3711 -2703 -2411 240 2059 -536 -2822 -1430 -3 -1193 -1904 -1007 -377 1039 639 -2229 -3107 -338
3727c38J236j945p68J658R55n87q52j602Q82K989m42l747O9L144O64j710j062
3744a456J12R88J134j468k471K497L499j742l721k20J317J675K95j580j619K766
3760FK420l220l541J382K911J067o96k043j185K352J358k976j669K421K587j247
3776g3j657r31L58K029Q54k862j036K399Q69j517l47N17L90O91l54k479j89L109
3794b29N96k330k85Q94N29o55l18j386J426L337p67l851J63J531N28o31N7m60
3812a851J253J574j962l009J690K970k87k103j030O34J871J719k406k869K910
3827h96K896k190l021K88K359K182l75l131j883K386K444k713j742K408K167m38
3843G41j539k800k25L612J634k858j629K303J392j757j459R1J361K045n39l053
$$ plain form
3727 -338 898 -1047 -1815 -157 798 211 -641 -2243 -1361 1628 1186 -2561 -2492 652 1316 -394 -1456
3744 -1456 -1344 -356 778 -690 -3161 -664 2835 1093 -2628 -2848 -1531 144 439 -1141 -2760 6
3760 6 2426 -794 -4335 -2953 -42 1025 329 -1714 -2899 -547 811 -2165 -3834 -1413 1174 -73
3776 -73 -1730 -2661 -2303 -274 580 -2282 -3318 -919 -50 -1567 -1914 -1397 -1007 -316 -670 -3149 -3338 -229
3794 -229 367 -1963 -2248 -1354 -825 -1480 -1798 -3184 -1758 1579 812 -3039 -2876 -1345 -817 -1448 -1391 -1851
3812 -1851 -598 976 -986 -3995 -2305 665 378 -1725 -2755 -2121 -250 1469 -937 -3806 -896
3827 -896 2000 -190 -3211 -2923 -564 1618 1243 -1888 -3771 -1385 1059 -1654 -3396 -988 1179 741
3843 741 -798 -3598 -3823 -211 1423 -1435 -3064 -761 631 -1126 -2585 -2494 -1133 912 373 -2680
3859b680L8L549l42k829l13J916M63L09j132j699J803L118j594l500OK435L69
3876h3k18n51k57J216P91k701k266K652L355o32k232o33N08L98L89k026o71L513
3894E52J670k716k048M47J146M8N31r79o25K002P78k406j128J602J105K7n32j153
3912a679J1K421L86k322n64J757l97q64M98N98K79J280q61k263J54J975m59n48
3930e98J018M67o46J76m37j579J016K134n3j333J87J90j339N59L2k40J211J077
3948A842k609p57K163Q34j924j84P17Nj72K77j115L75K100j58k477m04J085N01
3966I9O47O6j027k64K102p36k841M18K749Q91n47q32q56J41J390j88j516J130
3984H26J509j522q63Q73l2j16Q07p41p39J012Q93j123p69J624oj316m4j57p75
$$ plain form
3859 -2680 -2642 907 565 -2264 -2577 -661 -198 111 -1021 -2720 -917 2201 607 -2893 -2887 -452 -83
3876 -83 -301 -852 -1109 107 898 -1803 -4069 -1417 1938 1306 -926 -1559 -1051 -653 -264 -2290 -2961 552
3894 552 2222 -494 -2542 -2095 -949 -901 -370 -1349 -1974 28 806 -1600 -2728 -1126 -21 6 -526 -1679
3912 -1679 -1668 753 1139 -1183 -1747 10 -387 -1251 -753 -155 124 1404 543 -1720 -1566 409 -50 -598
3930 -598 420 887 241 417 -20 -1599 -583 1551 1498 165 352 542 -797 -238 -206 -446 765 1842
3948 1842 -767 -1524 639 1473 -451 -635 82 87 -85 192 -923 -548 1552 1394 -1083 -1487 -402 99
3966 99 746 812 -215 -479 1623 887 -1954 -1536 1213 2104 1557 725 -131 10 1400 1212 -304 826
3984 826 2335 813 -50 823 791 675 1482 741 2 1014 1907 784 15 1639 1633 317 273 116 -659
4003f59J611O84j537k16J702j014k161L91J815J172M1j013k248O41K099j100k005
4020a797J942K450m60j707p43q64J141K693j397k017J279J995o77j444l26K0J704
4037A792J140j624j987J990J767p87j261n0O5k8J099n06l22J434K63k251p52J163
4055A145J01j13J291n59m63N86l61k074K54J845N61m41j72q30o01R18j81j364
4073d58J356K438j261k267O94O84L71O04p99j403R33J806q16j693J024R53l74
4090A792n4p64j465J723K883j242k667M01J758r42l67m22j28K355J137k587k521
4107a110J636J452l28l76j1m74N30R72j829j061J934J183j355j106K31L06O62
4124A256L15j503m67K125R5k314j39K332Q91p21r68j418K53J857n00j060J123
$$ plain form
4003 -659 952 1636 99 -117 1585 571 -1590 -1199 616 1788 1829 816 -1432 -791 1308 208 -1797
4020 -1797 145 2595 2135 428 -315 -1179 -38 2655 1258 -759 520 2515 1838 394 68 88 1792
4037 1792 2932 1308 -679 1311 3078 2291 1030 980 1045 1017 2116 1610 1288 2722 2985 734 -18 1145
4055 1145 1246 1133 2424 1865 1402 1988 1627 -447 -193 1652 2213 1772 1600 770 169 1087 906 -458
4073 -458 898 3336 2075 -192 502 1186 1557 2161 1362 -41 892 2698 1882 189 1213 2166 1792
4090 1792 1738 974 -491 1232 4115 2873 206 607 2365 1423 1056 634 506 2861 3998 1411 -1110
4107 -1110 526 1978 1650 1274 1263 789 1319 2291 462 -599 1335 2518 1163 57 288 594 1256
4124 1256 1571 68 -399 1726 1821 -493 -632 1700 2591 1870 902 -516 -263 1594 1094 34 1157
4141A157J689r78j531k03j9R83J929m75k501P76J816j177j294J57J024P09P63
4158B825j601j948J524K080j399j835R50O98J82M07q79j263J710J158j713k114
4174a218P88J497M56Q10j384j961J030J569j980p28K013J458m23j130q36j169
4190a208J427J306j254m34K131P1j831q69L86O19J573J19j759n64K003J12k325
4207d97P5J534O23l9r81j714J526K371j009l123L80K252K26j057l81J03J280P79
4225B348k469k334J575K670j07j755L35p9J32L15j980o41K350K786k131k529P71
4242g43N81N45L4j332k49K578N02k944j193K565R84j197p31j095J029J546m9k051
4260a220K49K311l28k233n22J112J215J068q76k441L03K206n56k154N49K141N76
$$ plain form
4141 1157 2846 1868 337 134 115 1098 3027 2552 51 827 2643 1466 172 329 1353 2062 2825
4158 2825 1224 -724 800 2880 1481 -354 596 1294 1476 1883 1004 -259 1451 2609 896 -1218
4174 -1218 -430 1067 1523 2333 949 -1012 18 1587 -393 -1121 892 2350 1927 797 -39 -1208
4190 -1208 219 1525 271 -163 1968 2039 208 -661 -275 344 1917 2036 277 -287 1716 1828 -497
4207 -497 -422 1112 1735 1696 715 -999 527 2898 1889 -1234 -854 1398 1624 567 186 289 1569 2348
4225 2348 -121 -2455 -880 1790 1683 -72 263 184 316 631 -1349 -1990 360 3146 1015 -1514 -743
4242 -743 -162 383 417 -915 -1164 1414 1916 -1028 -2221 344 1328 131 -600 -1695 -666 880 831 -1220
4260 -1220 -971 1340 1012 -1221 -1743 -631 584 1652 776 -1665 -1362 844 288 -1866 -1317 824 1400
4277A400p91j409j632J379K554r95j900Q75J128m15q95m37n2J072J274k023j187
4294b054J500J735j285r37M52L2J88j06j178m38L132P73k764j326Q12P55J72K79
4312b58q42P31J597p47l114m53K916P29m56p27k72K73J500j264k565P60L438J00
4330A346k363p74O13J238P58j476k247J931L037j565k098L08J635R10j076k021
4346a844p87K422K426j578k056Q93J170q89j077k30O94K384M48k561j773K063
4362b95Q16j674k87J524R69k95j197k051N29K769K04k551K07J638M5r58o41o30
4380a878J251K235j708k652J143K643l7j699n62k24R72J313j614j471J932K349
4396A993j096k821J14P77P39J106j258j026J561J108k116j465R86J438O51j67
$$ plain form
4277 1400 609 -800 -2432 -1053 1501 506 -1394 -519 609 194 -701 -1138 -1190 -118 1156 -867 -2054
4294 -2054 -554 1181 -104 -1041 -589 -557 -369 -475 -1653 -2091 1041 1814 -950 -2276 -1464 -709 -537 -258
4312 -258 -1100 -369 1228 481 -2633 -3086 -170 559 103 -624 -896 -623 877 -387 -2952 -2192 1246 1346
4330 1346 -1017 -1791 -1178 60 818 -658 -2905 -974 2063 498 -1600 -1292 343 1253 177 -1844
4346 -1844 -2631 -209 2217 639 -1417 -524 646 -243 -1320 -1550 -856 1528 1976 -585 -2358 -295
4362 -295 521 -1153 -1440 84 1053 758 -439 -2490 -1961 808 1012 -1539 -1332 306 351 -607 -1248 -1878
4380 -1878 -627 1608 -100 -2752 -1609 1034 997 -702 -1264 -1488 -516 797 -817 -2288 -356 1993
4396 1993 897 -1924 -1810 -1033 -294 812 -446 -1472 89 1197 -919 -2384 -1398 40 691 524
4412E24j816o90J488J082j507r51J299O94o43n35m48k75J820N55k151o67J699
4429e22q3q75N49O54K1Km93j525N43K446J81j845M16N22k40k29n38l45J520J926
4449B085j475k261P54J467m30r1o54L3J298J013j513k057J550J608r45r93L04
4466c07k20R94P91j376j172J464R11j723o94P66J004L05K56j776j092J272P26
4483A29j128O6J478j09o06k71q30m59J719O72j167K36Q50j069j024J022M68j60
4501a83R38k81j578Q86J016r71r55J197O91o86J78j74n04P86J067j095j445P01
4519d12R65m23K84j33m24J64O92j541j096K099J021o30k58l06j473K57J447q60
4537f27o49J526M12j467k88q5N0Q08R46q61j315J465M30j245K08M33L7J90M34
$$ plain form
4412 524 -1292 -1982 -494 588 -919 -1870 -571 123 -520 -1055 -1503 -1778 42 597 -1554 -2221 -522
4429 -522 -605 -1480 -931 -277 -256 -254 -747 -2272 -1729 717 898 -947 -531 -9 -249 -478 -1016 -1361 159 2085
4449 2085 610 -1651 -897 570 140 49 -605 -572 726 1739 226 -1831 -281 1327 382 -611 -307
4466 -307 -527 467 1258 -118 -1290 174 1085 -638 -1332 -566 438 743 999 -777 -1869 -597 129
4483 129 -999 -933 545 436 -170 -441 -1271 -1730 -11 661 -506 -270 580 -489 -1513 -491 -23 -183
4501 -183 755 474 -1104 -218 798 -173 -1128 69 760 74 252 78 -426 360 1427 332 -1113 -412
4519 -412 553 130 414 281 -143 21 713 -828 -1924 175 1196 566 308 2 -1471 -1214 233 -627
4537 -627 -1276 250 662 -805 -1093 -1178 -1128 -320 626 -235 -1550 -85 345 -900 -692 -259 -222 -32 402
4556D02j083k25J291P54j391p1O41q95L78R46l97j38P05P3j441K45M85O7R9M82
4576I27k71n39L54p47q04R34J762j262n30K45L08m72J17k52m08J113P38j718o72
4595a177J334L98n78ql4q34P65J037j149k79J589k3j528o2K37p2J438O32j426
4614B60l31J239l86j444M51J625k58M03l75j298M4J081J06q52R19O04j074o8Q5
4633G31p66K51J360q22j179R42N04n71j90P44p43n0J8k98o53J733O08j401r26
4652g08O77j56m72N78J66j00Q70J56j978k93J386kl39O24k80n35J119k94j714
4671a295M11K113K15j490l14N61r7P27k43j428P88J285m94j656Q17J034m30K38
4689G42q84n73L73J521o58j189Q48R10j146n02K5j97R49J243j444j300J402M32
$$ plain form
4556 402 -681 -906 385 1139 -252 -323 318 -577 -199 747 350 212 917 990 -451 -206 279 346 445 927
4576 927 656 117 471 -276 -1080 -146 1616 354 -176 69 377 -95 22 -230 -638 475 1213 -505 -1177
4595 -1177 157 555 -23 -31 -65 -899 -134 903 -246 -525 1064 1041 -487 -549 -312 -384 1054 1686 260
4614 260 -71 1168 782 -662 -211 1414 1156 1559 1184 -114 -70 1011 1117 265 1184 1788 714 646 731
4633 731 -35 216 1576 754 -425 517 1021 450 260 1004 261 211 229 -69 -722 1011 1619 218 -708
4652 -708 -31 -187 -659 -81 85 -15 855 1011 -967 -1260 126 124 -215 409 129 -406 713 419 -1295
4671 -1295 -884 1229 1444 -46 -360 201 104 831 588 -840 -52 1233 739 -917 -100 934 504 742
4689 742 -142 -715 -342 1179 521 -668 180 1090 -56 -558 -533 -730 219 1462 18 -1282 120 552
4707E52j165n05J253O30j87q2j759n2K050K45j904K02J623J1r82No80Q32J402
4726A489n16k503O05K215k99q32l83K58K69R52q59j784J340K382p56k126N16N05
4744D73J97J00q60p19K012J065k096j703J032J385k80J08j143n03J382R62j626
4761b14j304J934Q02r21o87l47O57R41m3j647l74J613L48k310Q08Q24L45J7n06
4780f4j559M93K045j60k031M77J492j02r12q25l77J322J800r75k313Q38J151k43
4798E7j022q6K44J488M93k082j418J888J328j499j208Q30O09q7L33j020m36J546
4816d2N97j495j337J054J305j76l07q73m33J696L01j850o03K140Q73j035j055
4833a240k05L23J251Nj607N36J673m73j714m55J194L24P77m53j446L74J848l62
$$ plain form
4707 552 -613 -1118 135 765 578 496 -1263 -1315 735 980 -924 -722 901 912 -70 -65 -745 87 1489
4726 1489 973 -1530 -925 1290 991 159 -224 34 303 1255 396 -1388 -48 2334 1578 -548 -32 473
4744 473 670 770 -90 -809 1203 2268 172 -1531 -499 886 606 714 -429 -932 450 1412 -214
4761 -214 -1518 416 1218 297 -390 -737 -80 861 818 -829 -1203 410 758 -1552 -744 80 425 442 -64
4780 -64 -1623 -1130 915 755 -1276 -799 693 591 -321 -1146 -1523 -201 1599 624 -1689 -851 300 57
4798 57 -965 -1051 -807 681 1174 -908 -2326 -438 890 -609 -1817 -987 -378 -465 -132 -1152 -1588 -42
4816 -42 555 -940 -2277 -1223 82 -94 -401 -1274 -1707 -11 290 -1560 -2163 -23 850 -185 -1240
4833 -1240 -1445 -1122 129 134 -1473 -937 736 263 -1451 -1906 -712 -388 389 -64 -1510 -1136 712 350
4851C50j907M42J409P4n42p95o87J641J548j131k228J179J177l31r39P8p0R12
4869A80N53j726r33J741J095q37p39K53j94O51J9j462l94K313R57k509p64J280
4887e16Q98j96m50q75J09J939m57k362L98J815K71j142l29p8mJ390m00j317N30
4906g76J128j39j328k09L52P64R90r31j654J002J510r48j425N91R96J60M6o38
4924e09j315J173J379j045q49N55P91n35J54n88o69J176Q92j316j200J297M97
4941a12l54k63j66p4Q14N2j307k36J289P63j499n25N88M06L73K08r16r1J344j45
4961A49j797R4R71P40l79m8j044K09J832l40k026L85J721R2q81m14m19O00J579
4980A024j098j163Q20J123o85q79L01K61K96N13j084r68J050J598j084q06J16
$$ plain form
4851 350 -1557 -1115 294 368 -174 -969 -1656 -15 1533 402 -1826 -647 530 199 -740 -662 -732 180
4869 180 733 -993 -1926 -185 910 73 -666 -413 -607 44 63 -1399 -1793 520 1477 -1032 -1796 -516
4887 -516 382 186 -264 -1139 -1030 909 452 -1910 -1512 303 574 -568 -897 -975 -979 411 11 -1306 -776
4906 -776 352 213 -1115 -1324 -972 -208 782 -149 -1803 -801 709 -239 -1664 -1073 -77 83 129 -509
4924 -509 -1824 -651 728 -317 -1166 -611 180 -355 -201 -789 -1458 -282 610 -706 -1906 -609 -112
4941 -112 -466 -729 -895 -969 -155 -103 -1410 -1646 -357 406 -1093 -1618 -1030 -624 -251 -43 -959 -1050 294 149
4961 149 -1648 -1554 -583 157 -222 -270 -1314 -1105 727 387 -1639 -1254 467 559 -322 -736 -1155 -555 1024
4980 1024 -74 -1237 -417 706 21 -858 -557 -296 0 513 -571 -1539 -489 1109 25 -781 -665
4997f65Q32j30J78o05r02J474Q23j239p31R87M43q62J06K55l0M97K67j417K12
5016e07R19J39j069L13M72l92K40K59o87K84J137m14j314K60J132m2j63m83o75
5035e91L46J558p35j318Q29P31j51m01q4n15L57J120m00j073O83K67n13l91K79
5054bk87K79J266j154j002J062P18p59n48O20Ok71O99o64m72J188N8j215K1Q82
5074D25j65l11J58p6k23R72j39j471N44J570l51j104K74K05K1P78l58j141R13
5093E21R89l69j618K17J577k60m32m50m34R08J283j224j287Q67J316j145n9j2
5111C88l04O00L92p64n62J064M02j207k97R09J77M8J77j163J62J131j74r94k60
5130b75J360K3j005K9j36M70R60l97q27L96J090o68p92M61R3O93pp29j011J142
$$ plain form
4997 -665 167 37 215 -390 -1292 182 1005 -234 -965 22 465 -397 -291 -36 -66 431 698 -719 -507
5016 -507 412 551 -518 -205 267 -125 115 374 -313 -29 1108 694 -620 -360 772 730 567 84 -591
5035 -591 -245 1313 578 -740 89 820 669 268 184 -331 26 1146 746 -327 356 623 110 -281 -2
5054 -2 -289 -10 1256 102 -900 162 880 121 -427 193 199 -72 627 -37 -509 679 737 -478 -457 425
5074 425 260 -51 107 31 -192 780 641 -830 -286 1284 933 -171 103 308 329 1107 749 -392 521
5093 521 1510 1141 -477 -260 1317 1057 625 175 -259 649 1932 708 -579 288 1604 459 400 388
5111 388 84 684 1076 312 -250 814 1216 9 -288 621 798 846 1023 -140 22 1153 979 -15 -275
5130 -275 1085 1108 103 132 -4 466 1426 1029 202 598 1688 1020 228 689 782 1475 1468 739 -272 870
5150H70J221q78q19L55L72J6m6n85l72R89Q20j202q68Q69P58n27j38l75m65J038
5170A033Q90j297q34P91N90k96J8m81m95R85Q07j355o95J235N48q52o38N09o7
5189C96Q26k03j039k74J269P58j994J82Q90L19j07k18j287M14J803o63j711R01
5207B62R26N2q03k32l3N65R97j059j335J014J197q77p20p2M33O35J8o98r70J347
5227F47R25j793l91Q96N14q8k9j056j41R76N46j324m98J544J60n77O2k28p8O62
5247G29L26j563N22J214k21o54l7P7j14M81m0q45M70J063n67r25O40K94j97j7
5267F36qp94O03J283j033j000Q03K26m74J50J54n39K98P91o13p81K97P26o47m0
5287C8J81q5OL41k27j096Q92P32p95n3L47k68K16N34q14n64J075L25j035j06P19
$$ plain form
5150 870 2091 1213 394 749 1121 1137 1091 506 134 1123 1943 741 -127 742 1500 973 835 460 -5 1033
5170 1033 1923 626 -208 583 1173 877 895 414 -81 904 1711 356 -339 896 1444 592 -46 463 396
5189 396 1222 1019 -20 -294 975 1733 -261 -79 811 1130 1023 805 -482 -68 1735 1072 -639 262
5207 262 1188 1240 437 205 172 737 1734 675 -660 354 1551 674 -46 -118 315 950 968 270 -700 647
5227 647 1572 -221 -612 284 798 710 681 -375 -516 460 1006 -318 -816 728 888 311 373 145 67 729
5247 729 1055 -508 14 1228 1007 353 316 393 279 760 720 -125 345 1408 841 -84 556 850 653 636
5267 636 628 -166 437 1720 687 -313 490 716 242 392 546 7 305 1096 483 -298 -1 725 78 38
5287 38 219 134 140 481 254 -842 50 782 -13 -66 281 13 229 763 -51 -615 460 785 -250 -356 363
5308C63J70m29J35j30k84R74J31j516J44J335n34r66M34L37m76R51l31r28N83
5327c7P34n81j027R32K86m89K16l52j17O89O02j153j200J161Q98n88l34l8k04
5346f02Q38K36j257l7J507m16j113J10N57J1n9R8q23M37J247n27j062L83O81l69
5366a60j0kl0j55J169q07p94O56N91p73l08N26j20M29L45p70p34P83Q32o40m78
5387d50M59K65o8M0l53n57N45M10r12J74P27k42j62L19l38p64R30O76r14o39Q55
5408AK52n37J45n41p2J019J43j009l12J238k39o78k99O02k46R72j42j382J74J536
5428F25j82j812J62Q77M46K47q00q24O60J190n09j710N72J539l16n66m70j29J077
5447G7O75j480j214J473J165r67j016J67M16O53N6j245j82J146R29j408m99R88
$$ plain form
5308 363 533 104 239 109 -175 799 930 -586 -442 893 359 -607 -173 164 -312 639 308 -620 -37
5327 -37 697 116 -911 21 307 -182 34 -318 -435 254 856 -297 -1497 -336 562 -26 -360 -398 -602
5346 -602 236 472 -785 -822 685 269 -844 -734 -177 -166 -225 -127 -950 -513 734 207 -855 -472 209 -160
5366 -160 -170 -172 -202 -357 812 5 -789 -133 458 -315 -623 -97 -217 212 557 -213 -947 -164 668 28 -450
5387 -450 9 274 206 246 -107 -664 -119 291 -621 -447 280 38 -124 195 -143 -907 23 699 -215 -854 1
5408 1 253 -284 -139 -680 -752 267 410 -599 -911 327 88 -590 -889 -287 -533 439 297 -1085 -911 625
5428 625 443 -1369 -1207 -330 116 363 -437 -1261 -601 589 80 -1630 -1058 481 165 -401 -871 -1000 77
5447 77 752 -728 -1942 -469 696 -271 -1287 -1120 -704 -51 5 -1240 -1422 -276 653 -755 -1254 -266
5465b66M06k46p14m43O8J871k26k058K7J417M33p39m29j63N40M62r9j371L57J191
5485A8j28n72K66K54m3K7p7r59N89J195p30o53J69P64k57R4k90j005Q13R93m58
5506A0p59N26N53l30k68K96r83M29R90l65j036L59P37m70l86j47k00J067Q18j244
5526d03r43R52J040p55l31m86N91R15M9j292n44J641K72j217m87O41N80p5j47
5545Aj203L01J875j03j870l91J312Q58o36j008k13O17J479q51j731J050J546p65
5563B68j135l3N57J78Q17r20p28Q84J064j121j094Q13N28J04k15p27k26J141N96
5582G51j342n57R07N33n53l20K89J82P4K7r53r4J578l84j014M55O34n23J85R9
5602b6q45K69J310o19p42L06M54m70j88K23j74J76Q32o8j203L82K83o4J6M57o95
$$ plain form
5465 -266 140 -106 -820 -1263 -1195 676 450 -1608 -1581 -164 269 -470 -899 -1062 -522 -60 -159 -1530 -1173 18
5485 18 -110 -682 -416 -162 -205 -178 -255 -1214 -625 570 -160 -813 -644 120 -137 -43 -333 -1338 -525 468 10
5506 10 -749 -223 330 0 -268 28 -955 -526 464 99 -937 -578 159 -311 -697 -844 -1044 23 841 -403
5526 -403 -1346 -394 646 -109 -440 -926 -335 580 629 -663 -1207 434 706 -511 -998 -357 223 148 1
5545 1 -1202 -901 974 871 -999 -1390 -78 780 144 -864 -1077 -460 1019 168 -1563 -513 1033 268
5563 268 -867 -900 -343 -165 652 -268 -996 -112 952 -169 -1263 -450 78 182 -33 -760 -986 155 751
5582 751 -591 -1148 -241 292 -261 -581 -292 -110 -36 -9 -962 -1056 522 138 -876 -421 213 -310 -125 -26
5602 -26 -871 -602 708 89 -653 -347 107 -363 -551 -328 -502 -326 506 438 -765 -383 -100 -164 -148 309 -386
5623c86n9O79K43j006J71M28k30M96k11p73l8J230k80q72N17N41o50l23M72j1
5643f2j70O65o49p69J007O92r79k54R32m0j59N4m96p3J070j11p93m03J490m26
5663E26p97n5K13M62L43l41j233P53J327l83j245J7R26j85K20m91l76Q68O61j069
5683A41j160Q57O81k16k26l45K71M79K72j227n40R60Q01p12j82N04j58k76P2m25
5703d29J29J172k56j239K15J031l15p62N1L50M06M09n98j296J215O88r11p56P25
5722a71M80j17Q6k82n11Q63J89r77l55O62P82m49K71l75q99Q43Q11q75n53Q96
5742C19O9k61j26Q5p62M91R48n10o75M30N0j05K66j34o31P52O14o35o28M87M91
5763E35l82L3j72n24O18K51k03p9M85Pj041J90O37j22K65L50r31J79O29j49r67
$$ plain form
5623 -386 -445 234 477 -529 -358 70 -160 336 125 -648 -686 544 264 -608 -91 450 -200 -523 -51 -62
5643 -62 -232 433 -216 -985 22 714 -265 -519 413 373 214 268 -228 -301 769 658 -135 -538 952 526
5663 526 -271 -326 -113 349 692 351 -882 -129 1198 815 -430 -413 513 328 548 57 -319 549 1210 141
5683 141 -1019 -162 519 303 77 -268 3 482 754 -473 -1013 -53 748 36 -146 358 200 -76 -4 -429
5703 -429 -300 872 616 -623 -408 623 308 -454 -403 -53 353 762 164 -1132 83 771 -140 -896 -171
5722 -171 309 192 278 -4 -515 348 537 -440 -795 -133 649 200 471 96 -803 40 851 -24 -577 319
5742 319 388 127 1 86 -676 -185 763 253 -422 8 58 -47 219 85 -546 206 820 185 -443 44 535
5763 535 153 186 14 -510 108 359 156 77 562 569 -472 -282 355 233 498 848 -83 96 725 576 -391
5784c91L7J197K38l74l12o29P22N13k58j470R18J209r37p51K64M31P00k74r21
5803h8o79R07J215j077p27O09M13l05L14j181J59R96M45p95n28O94N9m07J49j28
5823D5j58P31p2r21r0Q54p6o22N30M30o99J82J48m09J15O87m85l28M93J04l15
5844A44l63O76m09%N2j7m64Q86R7l85k46J97q48j32J184k01m37N84R7o82J6K35
5866a6n19L28R18l21q10K81L33n77J50M2K2K81O37r75m41N49P39p35k00M29J88
5887C03k74K05k31l30M85O39j396L83Q00J10n92K03m60Q9Q6K44p37O8J457o07
5907D45m90k86L85rR3Rq90J034J055j437r26P88N28K49m58m11k2O83N86j459l29
5928h62J071M61p71k50O61j85J1M01r26J29O73l45o92J08J215m82k29k61l58L15
$$ plain form
5784 -391 -354 843 1081 707 395 -234 488 1001 743 -727 191 1400 463 -288 -24 407 1107 833 -88
5803 -88 -767 140 1355 278 -449 160 573 268 582 -599 -440 556 1001 206 -322 372 431 24 173 45
5823 45 -113 618 546 -375 -465 389 313 -309 221 651 -48 134 282 -127 -12 675 190 -138 355 459 144
5844 144 -219 457 48 48 100 83 -381 505 602 217 -29 168 -680 -812 372 171 -266 318 415 -267 -251 -16
5866 -16 -535 -207 711 390 -420 -139 194 -383 -233 -191 -169 112 749 -226 -667 -118 621 -114 -314 115 303
5887 303 29 234 3 -327 158 797 -599 -216 584 694 102 305 -155 -66 20 264 -473 -405 1052 445
5907 445 -45 -331 54 45 138 147 -743 291 1346 -91 -1017 -229 299 548 90 -321 -343 340 926 -533 -862
5928 -862 209 670 -101 -351 310 125 136 537 -389 -260 413 68 -624 -516 699 217 -12 -273 -631 -316
5948c16P45K93j303J52J002m38m31j01J80L5L75n4q66L67P01n70l19N94k59l21
5968e34K91j77p00Q68P03n51o04K99j28o8R76k78q75Q15j0n37n86O17J90J56N06
5989C73p88m55L99P64o28m87J005K41m64l1n76j78Q80M51r42l3Q28K84r63j62
6009d82K16r8L96k40m74M46J222p06j136L34N17K15j30m75l14O76R74q54j165
6028a078M70J210o78j77k06L09N61N52j521j107J493J219o21j174P86P6K07j84
6046A37p01j49P36J222j448n62R23q1J33j58J1j72P93j29j184L09P27M2q69K36
6066a84J55r1L43J20p44J91Q90r50o80P08N65j55J2k16m38L56N03p24o19R10Q53
6087H05n50o63l54j1N35P66l74r98Q10L57m70j39J12o47J048L56j187l26J156
$$ plain form
5948 -316 429 722 -581 -429 573 135 -296 -397 -217 -182 193 139 -727 -360 341 -229 -548 46 -213 -534
5968 -534 -243 -420 -1120 -252 451 -100 -704 -405 -533 -601 375 97 -778 37 27 -510 -1096 -479 -289 -133 373
5989 373 -415 -870 -471 293 -335 -822 183 424 -40 -71 -647 -825 55 506 -436 -469 359 643 -320 -482
6009 -482 -266 -364 32 -208 -682 -236 986 280 -856 -522 -5 210 80 -395 -709 -33 941 87 -1078
6028 -1078 -608 602 -76 -253 -459 -150 411 963 -558 -1665 -172 1047 426 -748 38 114 321 137
6046 137 -564 -713 23 1245 -203 -765 158 77 210 52 63 -109 684 555 -629 -320 407 449 -420 -184
6066 -184 -29 -120 223 343 -401 -210 680 -270 -950 -242 323 168 180 -36 -474 -118 385 -339 -958 -48 805
6087 805 255 -408 -762 -773 -238 528 154 -844 -34 323 -147 -286 -174 -821 227 583 -604 -930 226
6106B26K59m57j39L8m16O04K67j023J68R28O0q46J94K56j30K49J04k69k3K30n2
6127B28r77N43M57j03j48L43m61k43N63J78j108N47Q21o65n15P22L50j59m03j02
6147a32j75P32N18j259K3R18M60p83j71o28N7J335L25j313L9Q13R2q36m86J96
6167b75P21N74j23r84l80J138j39p19J54N77O0k29K85p48m8Q59l42p28P37L40
6187G30m60k90M85n40K84J21l17j29M35N13n92k74M14k07%j7j07j53N97L48n38
6208C03n20N17l2k65L08K28m91M35L66j190K24N50K8j24P1n03l11R85o6p23n1
6229b61Q35j68l25j2R2l69N15K92q41l91P79K09l15M95m05k78L50K10q53M5J019
6250F23k34k63k49J10j25M94k00l43K21O36l59p39L22K77J54J06j99m7o6N70n82
$$ plain form
6106 226 485 28 -111 -73 -489 115 382 -641 -473 455 515 -331 -137 119 -11 238 342 73 50 280 228
6127 228 -749 -206 251 148 0 343 -118 -361 202 380 -728 -181 640 -25 -540 182 532 373 -30 -132
6147 -132 -307 425 943 -316 -293 625 1085 302 131 -497 -440 895 1220 -93 -54 759 851 15 -471 -275
6167 -275 446 1020 897 -87 -467 671 532 -187 -33 544 604 375 660 -88 -136 723 381 -347 390 730
6187 730 270 -20 465 -75 209 330 13 -116 319 832 240 -34 380 173 173 156 49 -104 493 841 303
6208 303 -217 300 268 3 311 539 48 483 849 -341 -117 433 461 337 408 -95 -406 579 513 -210 -261
6229 -261 574 406 81 69 161 -208 307 599 -242 -633 146 355 40 535 130 -148 202 412 -441 -396 623
6250 623 389 126 -123 -13 -138 356 156 -187 34 670 311 -428 -106 171 325 431 232 185 119 689 107
6271A07o16J091q9n53k25J46J15L24M85p59k49Q05P5r29M6O67P0o0O2q76K3Q83
6293E43Q6o22J42J077p50m8l25m32M0R12L03j070J00M14J75o85J36p9Q8N67K50
6314H22j117N46P21n89n76L40R6l00O31l7r27N36L97n29r1k45M65j22P20R6q37
6335@l01Q43k45q95N21N79J2j86k95m49L52N78m54k76L54M43n03j81J43m64O88
6356B64M4n68l10R06J52j236M79K90qJ33J3p92L41O62R5j155L66M84J78n60J97
6377b5n07M05P76q06r48K62J093j64k12p7K91m15Q8Q0l56N03P81p63o43N68J8
6398e1J63N9l75m49Q69J86p66j05M19L56o33K17j47k87M69K61n90Q4O30n72k97
6419e59K68L20l08M67M4n18K12L50k79o52Q67Q7l73J8j72j38k5L92k79k49P78
$$ plain form
6271 107 -509 582 493 -60 -285 -139 -24 300 785 26 -223 582 657 -272 -226 441 511 451 513 -363 -340 543
6293 543 629 7 149 1226 476 428 103 -329 -289 623 926 -144 -44 370 545 -140 -4 -83 5 572 822
6314 822 -295 251 972 383 -193 147 243 -57 574 537 -390 146 543 14 -77 -322 143 21 741 837 0
6335 0 -301 542 297 -598 -77 502 514 328 33 -416 -64 514 60 -216 138 581 78 -103 40 -424 264
6356 264 308 -260 -570 336 488 -748 -269 21 13 146 159 -633 -292 370 465 -690 -324 160 338 -222 -25
6377 -25 -532 -127 649 -157 -1105 -843 250 86 -126 -203 88 -327 -239 -159 -515 -12 769 6 -637 -69 -51
6398 -51 112 171 -204 -653 216 402 -364 -469 -50 306 -327 -110 -257 -544 -75 186 -404 -320 310 -262 -559
6419 -559 -291 29 -279 188 232 -286 -74 276 -3 -655 212 299 -74 -56 -228 -366 -391 1 -278 -527 251
6440B51M16r05k18M15k71K48L15o66k47Q74Q4m76k81M53p6m4K15o56j53J283j2
6461E49j025K1L48J15l47K55l95J73R46j64j475M94K66L59k75k79K43k2K08k43
6481b48n84M62M93j22o72J34L94M9K2n14m51O84N07o06p77Q09N90m13k81j07J54
6502d77N32K16j031j67P90O13j157j85k0N38N69j7r84l0J415m57r41j48Q16L26
6522B01J16p50l73L90Q21j06j194j20R33M76n07l67j61N25N40p86o40J00J512
6541F10n10n44oN9J95K24j09o24O79M84n59q65M24M13m4R1l88J18M25k2n43m48
6563i40Q21K02k34j14k25k18J105m69o94M01O48J11n78Nj11L32o9K45q79n3J032
6584C18j86m80k62O45K6L14m25o92pJ033j57k70R5J08k94J65j98m83P59N76k64
$$ plain form
6440 251 667 -238 -456 -41 -312 -64 251 -415 -662 212 296 -180 -461 -8 -84 -128 87 -569 -722 561 549
6461 549 -476 -455 -107 8 -339 -84 -479 -306 640 476 -999 -505 -239 120 -155 -434 -191 -213 -5 -248
6481 -248 -832 -370 123 1 -671 -537 -143 -94 -72 -586 -1037 -353 154 -452 -1229 -420 170 -243 -524 -631 -477
6502 -477 55 271 -760 -927 -137 476 -681 -866 -886 -348 221 204 -780 -810 605 148 -793 -941 -125 201
6522 201 317 -433 -806 -416 405 299 -895 -1015 -82 394 -113 -480 -641 -116 424 -362 -1002 -902 610
6541 610 100 -444 -450 -391 -196 28 -81 -705 -26 458 -101 -966 -542 -129 -173 -82 -470 -352 73 51 -492 -940
6563 -940 -119 83 -151 -265 -490 -708 397 -72 -766 -365 283 394 -184 -179 -290 42 -27 218 -661 -714 318
6584 318 132 -348 -610 35 61 375 -50 -742 -749 284 127 -143 -48 60 -234 -69 -267 -750 9 585 321
6605C21q39Q1L70J6m34K46n07O34M79l23r82P46L62l71m2k2QK94K74l00n36M00
6627a25J16m78K8L15m3J2L82o75K70L16q2q79N14K56K66m25j6j76L08K53k98j02
6649b63J66K27j28q82M79O50k52jL1m23L10K05j64l21J54K53m99L56K6m7K03J83
6671B63m13P1K39j28m13N19J81l17j93J90k02l25M11J42k3K0P99r79l79Q88q2
6692B69j04j50n9j44N19p0m28m26J122k00n73N71L4m90L84O6k38j89O58l29m28
6713b05J95L47l18q0J03l50j20N36j17j10K08L42q43J02N20j35k07p5N04l94K37
6734A40n2o19M20P78j015k59M26N10p45K67rl01N56K09r35K81Q30L29q31j69Q6
6755a03l11L26L23n34J64N98J02p39j85N88n2j45j51L7L55K54m15r23N58P44j08
$$ plain form
6605 321 -518 -437 -67 -51 -485 -239 -746 -112 367 44 -938 -192 170 -201 -243 -265 -257 37 311 11 -525 -125
6627 -125 -9 -487 -459 -144 -187 -175 207 -468 -198 118 36 -843 -329 -73 193 -232 -248 -424 -116 137 -161 -263
6649 -263 -97 130 2 -880 -401 249 -3 -4 27 -396 -86 119 -45 -366 -212 41 -458 -102 -76 -123 80 263
6671 263 -150 -79 160 32 -381 138 319 2 -191 -1 -203 -528 -117 25 2 22 821 -158 -537 351 269
6692 269 165 15 -44 -188 331 261 -167 -593 529 329 -244 327 361 -129 255 321 83 -106 552 223 -205
6713 -205 -10 337 19 -61 42 -308 -428 108 -9 -119 89 431 -412 -310 210 75 -132 -207 297 -97 140
6734 140 88 -531 -111 667 -348 -607 -181 329 -416 -149 -158 -459 97 306 -629 -348 482 811 -20 -189 -103
6755 -103 -414 -88 235 -299 -135 463 565 -174 -359 229 177 32 -119 -82 273 527 112 -811 -253 491 383
6776C83m63P8j29j4L94j20p11Q72j6l05n00R79m12J26K5l19k64O85L7l58j98J71
6798e9R5J47o1j69K4K17R00j068k71R42k62l55O0Q9kL15l37k90L22J97K05l22
6820C17j3j44j86L91J21p34K00M59L96r12M41J5m00L98m3q12M26N80m06j77l6
6841a19L22J85J48n98m46L03O83l65m87L61M51j23k79k71K68M48L14r50m64P74
6861A55M20l05p46L79P68om64m59l92J110K53q50l35N73N44m39j38l85L98O99
6881G80l93p46r4Q57K73m14l71J45L71J82l63r19M25J005o42l90M1J02J95P1k54
6902a39p2N41K42n97l03M34K92n32K30j17K17O3K26o82K48m4K95l15J24j22L3
6923B2J56J51l00%J53K43n22M1L93l7J57j75m88l16L46M45j55j59M20l44M8j97
$$ plain form
6776 383 -80 -2 -131 -145 249 129 -582 290 274 -31 -531 448 36 162 187 -132 -396 289 326 -32 -230 -59
6798 -59 36 183 122 -47 -23 194 1094 26 -245 697 435 80 140 229 227 542 205 -85 237 434 639 317
6820 317 304 160 -26 365 486 -248 -48 411 807 -105 336 351 -49 349 306 -506 -80 500 94 -83 -119
6841 -119 203 388 536 -62 -508 -205 478 113 -374 -13 438 315 36 -235 33 481 795 -155 -619 155
6861 155 575 270 -476 -97 671 665 201 -258 -650 460 713 -137 -472 101 645 206 68 -317 81 780
6881 780 387 -359 -453 404 677 263 -108 37 408 590 227 -692 -267 738 96 -294 -253 -151 44 115 -139
6902 -139 -211 330 572 -25 -328 106 398 -134 96 -21 196 259 485 -197 51 7 302 -13 111 -11 22
6923 22 178 329 29 29 182 425 -97 -56 337 300 457 282 -206 -522 -176 269 114 -45 375 31 79 -118
6945a18N65n58L53M50p57J38j00J18j13N0j77L46K67k42o37J09P27j72k44j96
6965a91k9J68L62o6r99Q33J56n41O2K12J52j05L03m63l40N04M56q97L04M94jN5
6987D29o70K1K30K93k63j30k02N67j76o21J84M03K74k96j88k93N10Pq8p07M03
7008c13Q19l65p5j27k31M74L9l95m65P13L11o83q6M99k31K87j37o72M77K71R9
7029B09o44O0P35l27j33L27k69J31o2J01l63J93K90k16m78K34M18k8r4k23m03
7050e42M35P37o94k43J54K80j66K52r7k94K62o5O7l5J06Oj77L36l81k88K52M19
7072C24k75o20O75L14k31p7m1n45Q06K85m38o27K52N41j83j70J18j95J38L03m87
7093a33l75R40J10n38m0j64K34j16N64j093L34N59K3o30l24O85K72m01M7j87j87
$$ plain form
6945 -118 447 -111 242 692 -65 73 -27 91 -22 28 -149 197 464 222 -415 -306 421 249 5 -191
6965 -191 -220 -52 310 244 -755 78 234 -307 -245 -33 119 14 317 -146 -486 18 474 -423 -119 375 374 429
6987 429 -241 -220 10 303 40 -90 -292 275 99 -522 -338 65 339 43 -145 -438 72 79 -9 -716 -313
7008 -313 506 141 66 -61 -292 182 221 -174 -639 74 385 -298 -384 115 -116 171 34 -638 -161 110 209
7029 209 -435 -375 360 33 -100 227 -42 89 27 128 -235 -42 248 32 -446 -212 206 178 84 -139 -542
7050 -542 -107 630 -64 -307 -153 127 -39 213 116 -178 84 19 86 51 157 163 -14 322 -59 -347 -95 324
7072 324 49 -571 104 418 187 110 69 -476 330 615 177 -450 -198 343 160 -10 108 -87 51 354 -133
7093 -133 -508 432 542 4 -36 -200 34 -82 482 -611 -277 282 305 -325 -649 36 308 -93 -46 -233 -420
7114d20R33n26o37L40O04J84p38k0L9L03M06n63o20M11J267p14o28J0K76K04m9
7135F2J09n75L89L13l37m67O49K63k32l71k9j7R9N28m84J53j65K57l16J86%l09
7157b94K93L03k66m75L25L49l79MJ63l05J51L53j37n50N60L71p29L08j85k8J11
7178e7O59o22o17O52K42l83q5J83Q6J34j13l71J7P04p3q02M3M72M98n28k13Rm0
7201b05Q25n04n41K14O54O4o86L01n8j00K13k95o07Q57M32o32k38J24O08j27k59
7222D0k61K07O25p7o57k99Q85r2n48K82l8K27o8l36k62M55N47k32n81L2L49k52
7244e4k6M26l53P7L91m57p3QM44n98m8J61N33l73Q1l96Q8M90k27n48J46M25j65
7267d8n64L99L09k82L34l7m24M74J45k95m88M90k3J46J7k38m48L71M19l59K2k9
$$ plain form
7114 -420 513 -13 -650 -310 294 478 -260 -280 -241 62 468 -95 -715 -304 963 249 -379 -369 -93 111 62
7135 62 171 -404 -15 298 -39 -506 143 406 174 -197 -226 -243 -144 384 -100 53 -112 145 -171 15 15 -294
7157 -294 -1 302 36 -439 -114 235 -144 -140 23 -282 -131 222 85 -465 95 466 -263 45 -140 -168 -57
7178 -57 602 -20 -637 15 257 -126 -211 -28 58 192 79 -292 -275 429 356 -446 -403 69 567 39 -174 -165 -205
7201 -205 620 116 -425 -211 443 507 -179 122 64 -36 177 -118 -725 132 564 -68 -306 -182 426 299 40
7222 40 -221 -14 611 534 -123 -422 463 371 -177 105 67 294 226 -110 -372 83 630 398 -183 -151 198 -54
7244 -54 -80 346 -7 70 461 4 -69 -61 383 -215 -263 -102 431 58 139 -257 -169 321 94 -454 -308 117 -48
7267 -48 -612 -213 96 -186 148 111 -313 161 306 11 -477 13 -10 136 153 -85 -533 -162 257 -102 -80 -109
7289a09j22K9N0N33n32M05l46J38K45K98k03l65M12k36l06j56L65J98n33m0M92
7310B17k53N97m49n75O21K36q6l68k39M48J03k32j26j18O53M2m34n01M13M81k06
7331B24m44j71K49P40k48p75q0Q65M70n28m33J80K16j32k98l01O17O16k17j064
7351e14Q6R79K64n88m85K90M59M02q93m40M26O62m20k9l37K98K3K9m54L8M80J72
7373D48k35m00K22M93o61J31k11m1M81L17n35l65M99M2l66J56j27r5M37M2l53
7394a21N7J59j95j39L17J59n04P5M43l39NL53J40k78J78o3k67P8J63k09J18R2
7416B22j11j06M4k15j79N08Q8l82J58L13k69p23O6N92K49%k25p49O38K72K0r88
7438g77L14Q68k07m62K32J42p4J83m60l20N54Q23q69m77O24J15r0j66n79K33O58
$$ plain form
7289 -109 -231 -202 -152 381 -151 254 -92 46 291 589 386 21 433 197 -109 -265 100 298 -235 -275 217
7310 217 -36 561 112 -463 158 394 308 -60 -299 149 252 20 -106 -224 429 471 37 -464 -51 430 224
7331 224 -220 -391 -142 598 350 -425 -505 360 830 302 -131 49 265 133 -165 -466 151 767 550 -514
7351 -514 -428 551 815 227 -258 32 491 893 0 -440 -14 648 228 199 -138 160 183 212 -242 -204 276 448
7373 448 213 -187 35 528 -133 -2 -213 -254 227 544 9 -356 143 185 -181 -25 -152 -247 190 232 -121
7394 -121 -64 95 -100 -239 78 237 -267 -192 251 -88 -83 270 410 132 310 247 -20 58 221 12 130 222
7416 222 111 5 49 -166 -345 163 251 -131 27 340 71 -652 -586 6 255 255 30 -719 -81 191 211 -777
7438 -777 -463 405 198 -264 -32 110 36 219 -241 -561 -7 816 -53 -530 94 209 119 -47 -626 -393 265
7459B65K33r44K23L62J60j90r5q0L69O5n73l9L02L99l23m70J35K10n1JJ03k54
7481a92M44M6m58l10O25K58p42j85M38J88J36j07p13kM78L49m36k91K66Q5J00
7502b3J34m70n3N64j21n52M70L38j49m66K61J06J23jl78k86N69L98n27m79P91
7523B49p5q12N87J02j63o7K03l30mL11p8j02J11N8j65L7L99n53l46P00k24o2J70
7546e4R4n43J04K15L6j20L54J09m23J54P4k02N07j33m45j03L98M83l39l74q7L59
7568F4M44J18q81j55O84J24j74n29J57M71K76o99k36J08P37k78j107N15L38j19
7588a42J49m40O7L50L29n24l76K78O60O6r77M38K98N4j87j45m05N90L20o30l93
7609f20L08N28r5k56j60j41N70J63k97l39K16K32k84J89k12l76M68k7k5j9L89
$$ plain form
7459 265 498 -446 -223 139 299 109 14 -66 303 368 -205 -244 58 457 134 -336 -201 9 -42 -41 62 -192
7481 -192 252 298 -160 -470 155 413 -329 -514 -76 112 248 141 -572 -574 -96 253 -183 -474 -208 -123 -23
7502 -23 111 -359 -412 152 31 -521 -51 287 138 -328 -67 39 162 161 -217 -503 66 464 -63 -542 249
7523 249 174 -638 -51 51 -112 -179 24 -306 -310 1 -77 -179 -68 -10 -175 -138 261 -292 -638 62 -162 -224 -54
7546 -54 40 -503 -399 -184 -148 -268 86 195 -228 -74 0 -202 305 172 -273 -376 22 505 166 -208 -295 64
7568 64 508 626 -255 -410 274 398 224 -305 -148 323 599 -100 -336 -228 509 231 -876 -361 -23 -142
7588 -142 7 -433 -366 -16 313 -211 -587 -309 351 417 -560 -122 176 230 43 -102 -507 83 403 -227 -620
7609 -620 -312 216 121 -135 -295 -436 134 297 0 -339 -123 109 -175 14 -198 -574 -106 -133 -158 -177 212
7630B12K09n74K56j64q8N11m22m69J63L30L19k42k17k8j8n9J10j50J98j28N89
7651C38k94k00J46J8k82K22k82J1P53o77j47K14j16M36Q4k85m33K89O40l14o75
7672e54L07L82q7l08k30J26L86M19o84o06P69N40n11n40L05J88M74J31p38n67
7692g98P21N04p55k39p4N94J8l8j59J45K07k5n24J07N78N0n10n4j10L40K76r6
7714A58n36J69M55m42J5J97j8K07p1n28L37j43N58o88k71P16K08n54J1O9j16J29
7736a38K05j6m34Q4L92j55K35k90q8j44M78l67O0j16N57l12R9K58n61L32K79k32
7758A26l79J69RQ3P9j21j54J91M39n06k42L81n7K02n55N54l99K73Rj55j60L54
7780A41j93m34K10L25j12m9l2q5o2L34N9j36j84M27l93k13L69J24j13o1l1l61
$$ plain form
7630 212 421 -153 103 -61 -149 362 -60 -529 -366 -36 283 41 -176 -204 -222 -281 -171 -321 -123 -251 338
7651 338 44 -156 -10 8 -274 -52 -334 -323 430 -247 -394 -180 -296 140 224 -61 -494 -205 435 121 -554
7672 -554 -247 135 48 -260 -490 -364 22 441 -243 -849 -80 460 -51 -591 -286 -98 376 507 -231 -798
7692 -798 -77 427 -328 -567 -641 -47 -29 -67 -226 -81 126 101 -423 -316 262 312 -198 -252 -362 -22 254 158
7714 158 -378 -209 246 -196 -181 16 -2 205 134 -394 -57 -200 358 -330 -601 115 323 -231 -220 -151 -267 -138
7736 -138 67 51 -383 -299 93 -62 173 -117 -205 -349 129 -238 -178 -294 263 -49 50 308 -253 79 358 126
7758 126 -253 -84 -75 8 87 -34 -188 3 442 -64 -306 75 18 220 -335 219 -180 93 102 -53 -213 141
7780 141 -52 -486 -276 49 -63 -112 -144 -229 -291 43 102 -34 -218 209 -184 -397 -28 96 -17 -78 -109 -470
7802d70O86J1l14m49O03J26j60k03kp6M23k2l96K84J55K03n04M5K83j87k45Q4
7824a25p3l6N87j93o77L68N67m98N2k79K35N39l2p17j17N30J25k93P8o6L04J15
7846C94l96l89j21R15P2o10J8M00j13l34J65j00K90L34k04o33J76P62n58m25L60
7867Cj57L64J54r6o95N00N24n06j34l1K6J77J38J31m73L57M8m4l30K82L1o6L81
7890E84k78l71rJ40k02j83P5O01k12j45j35P9K25J42k99k56L65j41J7j87N4J16
7912b0k86O75r29J62M92L91o64l45N25j73J22K38r7k46M84k3n94K23rL71j22j67
7934Hn4L60k0j09n53K45O29k87l43K32j83L02L62m21n93M36K50k37o6m1K17j54
7956b0K65k40l38L14K70m99M21M1m20lR7j59J87J99m2k5m2P6J69p5K64l25l12
$$ plain form
7802 -470 216 227 -87 -536 67 193 33 -170 -172 -248 175 153 -243 41 196 399 -105 -60 223 36 -209 -125
7824 -125 -198 -234 353 160 -517 -149 418 -80 -28 -307 -72 467 435 -282 -399 131 256 -37 41 -25 279 394
7846 394 -2 -391 -512 403 475 -135 -117 283 170 -164 1 -99 191 525 321 -312 -136 626 68 -357 3
7867 3 -154 210 364 268 -427 73 597 91 -43 -74 -48 129 267 398 -75 282 330 286 -44 238 269 203 584
7890 584 306 -65 -74 66 -136 -319 -244 357 145 0 -135 -56 169 311 12 -244 121 -20 -3 -190 -136 -20
7912 -20 -306 369 -560 -398 94 485 -179 -524 1 -172 -50 188 91 -155 329 306 -288 -65 -74 297 175 8
7934 8 -46 314 294 185 -368 -123 506 219 -124 108 -75 227 589 168 -425 11 261 24 -42 -83 134 -20
7956 -20 245 5 -333 -19 251 -248 173 214 -206 -209 -112 -271 -84 115 73 48 6 82 251 176 440 115 -197
7979a97M41K1Q9J9k97J65j93K64J8j71P8L50m33R4oL40n61J22J45l87N58K35n97
8002I7o4qmn0K58l7m4P6J70l21j26L76k77p3p1K50R5j15Kj29j9J41K62n58n1M03
8028A83k69k06L28J62q3j03L92n97L72L18l64m69K61L89m07M62j98k14N1j66J17
8049d1J1J90Q8k19J92l13J86j51jl24j08P42p5l56o9L18k48n8J84L2o3L88o69
8072c64j79M99J27N1k49K19j17K19k63k26P0K93K60n37M5M96k27j36J01o6j11
8093i5J97L10o40M39J48k09l1r4J11j3L92j07j73J08K13k20o21M18J44k93M13
8114C97j81j91L93q8o3n57M13L18n18M12k24j50rP38m77k51p1P3l4m5K04n7K95
8137C27j11n31l46R13J32m52m3M4J29J61J25o03J12K38N08l65m47O6J4J94pn82
$$ plain form
7979 -197 244 265 354 373 76 241 48 312 330 159 237 587 154 248 242 582 21 143 288 -99 459 694 97
8002 97 33 25 21 -29 229 192 148 224 394 73 -53 323 46 -27 -98 152 247 132 134 5 -14 127 389 -169 -220 183
8028 183 -86 -292 36 198 115 12 404 -193 179 497 133 -336 -75 314 -93 369 171 -43 8 -158 -41
8049 -41 -30 160 248 29 221 -92 94 -57 -58 -382 -490 252 177 -179 -248 70 -178 -236 -52 -20 -83 305 -364
8072 -364 -543 -44 83 134 -115 104 -13 206 -57 -283 -213 80 340 -197 -152 344 117 -19 82 16 -95
8093 -95 102 412 -228 211 359 150 119 25 136 123 515 408 235 343 556 336 -285 133 277 -16 397
8114 397 216 25 418 330 267 -290 123 441 -77 335 111 -39 -48 690 213 -38 -109 -36 -70 -115 89 32 327
8137 327 216 -315 -661 252 384 -68 -111 -67 62 223 348 -255 -143 95 603 238 -209 -143 -129 65 58 -524
8159e24RR37q9n61j72L82oK97o41k69Q04J19K09n76j21K54K98q39J5K70K29J88
8181B13k83m60L00M60k10rl44K44rL7
$$ plain form
8159 -524 -515 422 333 -228 -400 -18 -24 273 -368 -637 167 286 495 -81 -202 52 350 -489 -474 -204 25 213
8181 213 -70 -530 -230 230 20 11 -333 -89 -98 -61
8191f1
$$ Imaginary data points
##PAGE= N=2
##DATA TABLE= (X++(I..I)), XYDATA
0@%%%qJ6j6J6k4L2m0N6p2Q8j04J28j54J80k19K63l07L59m20M88n65O51p44Q48
27D52r66J099j243J399j575J766j975K208k463K741l044L379l749M153m597N090
43B675n635O241o922P686q553R552j0706J2057j3675J5651j8123K1321k5647L1860
57A7782m1601N9204j01012L74257M16545o04198k62158J96094L74223l5624k73073
68A20439j61637K37460K40858j08597l20730k7468K32518J47772j24490j87451
78D8674j7995J97555R3450j87554j94978J30503K26663k1114k03415r3056Q9202
89F7935J51064L6773j05058p9368M4103M325p8723K0811J42229M9443r9953j10283
101D3298k0537Q6815J12617j9580j26197k1917J13290M8487q9231j19892l2463
$$ plain form
0 0 0 0 0 -8 8 -8 8 -16 16 -24 32 -40 48 -56 72 -82 98 -121 142 -165 194 -226 262 -303 348 -396 452
27 452 -514 585 -658 741 -834 932 -1043 1165 -1298 1443 -1601 1778 -1971 2182 -2415 2675
43 2675 -2960 3281 -3641 4045 -4508 5044 -5662 6395 -7280 8371 -9752 11569 -14078 17782
57 17782 -23819 35385 -65627 308630 725175 120977 -141181 54913 429136 393512 120439
68 120439 -41198 196262 437120 328523 7793 -19675 212843 360615 236125 48674
78 48674 30679 228234 321684 134130 -60848 69655 296318 275204 71789 -21267 67935
89 67935 218999 255772 150714 71346 115449 119774 41051 61862 204091 253534 153581 43298
101 43298 22761 109576 222193 202613 76416 54499 167789 216276 127045 7153 -25310
112b5310J13448J60376o514j68511p5292Q2021N2163l9794m0337M525N0536M5572
124A52883p6138j47704J9411J95586R2954j33663j86399k6234J67949J67961p3843
135A52763k24726l3104J93605J04098j25879j59357N833J73095J53967o6385j91503
146a7593l3798J28351M0853p7133q831Q5720N8542m1152j10669m8246J11082J34152
158B21278l3505j14040j0156N6732J4410j5665j2816j852K7030J2030m2879p552
170I3015O0935O004p1446q318P2180K1916o5775q8708k7260R5005J27965k5235
182A90278j50083n7001O3565M0298o628O393J1399m355k2058n5966m0229M0896
194A6509N3362p136p748K2221j6986m0338M675P926j7683Q338L1979O602j867
$$ plain form
112 -25310 88138 248514 242000 73489 -1803 80218 132381 92587 52250 56775 107311 152883
124 152883 76745 -70959 -51548 144038 236992 103329 -83070 -109304 58645 226606 152763
135 152763 -71963 -105067 88538 192636 66757 -92600 -86767 86328 240295 173910 -17593
146 -17593 -51391 76960 117813 40680 31849 117569 176111 134959 24290 -23956 87126 221278
158 221278 187773 73733 63577 120309 134719 119054 106238 104386 131416 143446 100567 93015
170 93015 153950 159954 88508 80190 152370 174286 108511 19803 -7457 87548 215513 190278
182 190278 40195 -16806 46759 87057 80429 86822 98221 93866 71808 15842 -24387 16509
194 16509 69871 62735 54987 77208 60222 19884 24559 32485 14802 23140 55119 61721 59854
207E9854j3052o3538k7428R6528R8556m5000j25406n4531P2317J32969K8862j39819
219B0312j11033P7849J11446l7737q9090J0843Q5834N3837n0230j14433l2508
230g4910R0369N3761n8888l6072M6572L1660l2907o1821m5228L6218J10538L8898
242I8190q5744p6397L874J8541J2364K6614O310k1845j1458q368L443L8101J5840
255A9465n4432k6785N7628L0091m6882l4587J4346K8748L1870P595m2736l0465
267d6144J9903J5814P346L8017J8990m7811m6399l571M825K2973M8030J7221k4260
280B4934j7346k3984l2377L0023O7167q367o9027j8370M5203M3723j1802q1239
292e1462n2443R0127J28919l4105j50641n0053Q9390R6120m41r1479o7997N1281
$$ plain form
207 59854 46802 -16736 -44164 52364 150920 105920 -19486 -74017 -1700 131269 160131 20312
219 20312 -90721 -12872 98574 60837 -28253 -17410 68424 122261 72031 -42402 -74910
230 -74910 15459 69220 10332 -25740 20832 52492 19585 -42236 -87464 -51246 59292 98190
242 98190 12446 -63951 -60077 -41536 -29172 -2558 3752 -18093 -29551 -37919 -34476 3625 19465
255 19465 -34967 -61752 -4124 25967 -20915 -55502 -41156 -12408 19462 27057 -15679 -46144
267 -46144 -26241 -10427 -3081 34936 53926 6115 -40284 -43855 -39030 -16057 31973 49194 24934
280 24934 7588 -16396 -48773 -18750 48417 40050 -28977 -47347 -2144 41579 29777 -51462
292 -51462 -103905 -13778 115141 81036 -69605 -119658 -30268 65852 65411 -26068 -94065 -42784
304d2784P9019l4205p1513L9042Q9903M271q1247p4336J0993R5302N8367o7283
316E529p3667M0606O3943k1364n6465j4156L2449O0071K8632m9029n7074L387
328c7138J2690q385K6328M4236r584m4179k4812L580L9027M7884k1376p1659r322
341e2710M7015J4540j6622o682n110K583K1733q992l9236L595M2341J4974j3054
354D375j4898k4336q078K0554j1075l3157L8205Q5871M454q9500p9028K875Q9812
367a3926Q8091l3805j15860k5013Q7051M8260m9569o5492o26P6315O7519m7678
379A5267j05333M500R5368J8454p2420l7091L9976N1516m240o6007l2448P8711
391a3747Q0433n0788j05494j1999O5338M9977L281l8241l3873J5242J7408k9360
$$ plain form
304 -42784 36235 2030 -69483 -30441 59462 63733 -17514 -91850 -80857 14445 72812 5529
316 5529 -68138 -27532 36411 15047 -41418 -55574 -23125 36946 65578 16549 -40525 -37138
328 -37138 -24448 -32833 -6505 37731 28147 -16032 -40844 -37264 1763 49647 28271 -43388 -52710
341 -52710 -5695 8845 -7777 -14459 -19569 -16986 4747 -4245 -43481 -39886 2455 17429 4375
354 4375 -10523 -34859 -42937 -22383 -33458 -66615 -28410 57461 61915 -27585 -106613 -103738 -13926
367 -13926 74165 40360 -75500 -100513 -13462 34798 -14771 -80263 -80889 -4574 62945 15267
379 15267 -90066 -85566 9802 28256 -44164 -81255 -41279 10237 5997 -60010 -92458 -13747
391 -13747 66686 15898 -89596 -101595 -36257 13720 17001 -21240 -55113 -39871 -22463 -51823
403e1823p375O0130L3494m3379m1805Q290K7050N513l3246l6219M1301Q5252p568
416C9615r3796l7126N2012M8374K091k4954k5238R472K1694k4305l5400L4220
428c3341N6686j4169n4411k2893K1349M8132L0006l7586n7749J0117M1579l686
440a5966k2708k213N495J7355L2340l625m6215k5562J1316K6841L8275J3800m5836
453a6703m4784K0221L0157m926j148J6530Q099j40j0775l2326j469N0857K0852
466C4445m4831l3110J9005L1705J6437j2746l6350J035N0807J4404n2230l3092
478d4521K0461K8829K0085K522l4616l3931J0614K0972M307J6685J6354j8743
490I018k5776r933j0186L828L3983J2455k6902q025J7280o34j1511j239m333O714
$$ plain form
403 -51823 -59198 932 34426 -8953 -50758 -42468 -15418 -9905 -43151 -79370 -38069 47183 39615
416 39615 -54181 -91307 -39295 9079 11170 -13784 -39022 -29550 -7856 -32161 -67561 -33341
428 -33341 23345 9176 -45235 -68128 -46779 1353 31359 -6227 -63976 -53859 -12280 -15966
440 -15966 -38674 -40887 -35392 -18037 14303 10678 -35537 -61099 -49783 -22942 15333 29133 -16703
453 -16703 -61487 -41266 -11109 -16035 -17183 -653 7446 7306 -3469 -35795 -37264 13593 34445
466 34445 -10386 -43496 -24491 7214 23651 10905 -25445 -24410 26397 40801 -11429 -44521
478 -44521 -24060 4769 24854 27376 -7240 -41171 -30557 -9585 -5278 11407 27761 9018
490 9018 -16758 -26691 -36877 -33049 934 13389 -13513 -21538 -4258 -4892 -16403 -17642 -21975 -15261
504a5261K9352K967l7244j5973J8359R980N46Q831j211l933N663j1044j4473L3934
518A0493M2744l3024o8604p387N2921M7263l827n1425k8075M8435M7281m7525
530I270o7588K2448P4670K5781m6152o5780r273O4339L4371n8617m5193N9614
542b110P2593k9821q9883m1384N4750Q7884P55r5225m7180P0520O3820l4667n9499
555d9447K425N0817L2450l2054o1929P673P3991J6397o2936l1595M2497M0077
567B8366j1378m0052j3617N2828N8960l3083q6373j0476O7649L8020k0677l0550
579c83l438L0080J8991l6607l9352L8237O3434j1711n9607k1948K9050L7209k327
592D1628n0609k5261N7020N4592l7896o9178k427N2190L9352j4213o2551l5259
$$ plain form
504 -15261 14091 17058 -20186 -36159 -17800 -7820 -7274 1557 346 -3587 2076 -8968 -23441 10493
518 10493 53237 20213 -48391 -55778 -2857 44406 40579 -10846 -38921 9514 56795 9270
530 9270 -58318 -35870 38800 64581 18429 -47351 -56624 7715 42086 -16531 -61724 -2110
542 -2110 70483 40662 -49221 -90605 -35855 52029 52784 -42441 -89621 -19101 44719 10052 -49447
555 -49447 -47022 3795 36245 4191 -57738 -50065 23926 40323 -22613 -54208 -11711 28366
567 28366 16988 -23064 -36681 16147 75107 42024 -44349 -54825 12824 50844 30167 -383
579 -383 -3821 26259 45250 8643 -30709 7528 70962 59251 -356 -22304 6746 43955 41628
592 41628 -8981 -34242 22778 77370 39474 -29704 -32131 20059 59411 45198 -17353 -52612
604e2612M6710N3853k2946m8139Q646M1121J1277l3956m6793P173P0022L3946
616F8302o1231o0535K6396N3350L448l6455k6370K4433N9363Q483o8413m3759
628e2988M0951N0591o148l5467j7153J7902L1709r773m7751M112O2701J4722n9529
641f121m0385K7024M7251J0225m3102m6991K0797N6597m652n4097p975M1856K4100
654B4527j7251m0301k4934K4636M0021j3315l8598J4318L9577q353m4541k2091
666f6305K4929N1885J9516m9263m7618K5385M5102r406l2364q00K2719K3937K913
679A0630k8568j8526K9003K7558j8187k4085O340J3753P853j737j5692j827L3410
692A9925J6006l5235k7424J8963K9122Q049j0626k4604j3303J9053J3612j5006
$$ plain form
604 -52612 -5902 47951 25005 -23134 -14488 26633 37910 3954 -42839 -35666 34356 68302
616 68302 7071 -53464 -27068 26282 29730 -6725 -33095 -8662 50701 59184 -9229 -52988
628 -52988 -12037 38554 32406 -3061 -20214 -2312 29397 19624 -28127 -24015 38686 53408 -6121
641 -6121 -46506 -19482 27769 37994 -5108 -52099 -31302 25295 20643 -33454 -41429 427 24527
654 24527 7276 -33025 -57959 -33323 6698 -6617 -45215 -30897 8680 327 -44214 -66305
666 -66305 -41376 10509 30025 -19238 -66856 -41471 3631 -5775 -38139 -38939 -16220 7717 10630
679 10630 -17938 -36464 -7461 20097 1910 -22175 -15835 -2082 5771 4034 -11658 -13485 19925
692 19925 35931 696 -26728 -7765 21357 29406 18780 -5824 -19127 -74 13538 -1468
704a468k655K0813L753j5950r856o561J065J8575N029k3525o266K3131L164k3900
718a4651j1947P121K0467K2687r434l8069q049K8862Q522j6244l920N021P39L666
732e229j75n527J2268J8591j4462k6157M967J5787m55j223L58l856Q968J2218
746A6073j6627k1099J3689K1489k721m808j548r211n205J991m447L600K1190j148
760A1218k7293m284J9731M581r065k095l372k322N009o584j2770J2144J8370j1115
774g847j5373Q453Q373l461k227n451m523J6040J1241k4317k1714J7261K6622
787C077N718p257j3068o548J3885N757k0446k975K9787R363k5784j3799J1842
800a0448J2147O284n924j4857P280K6793l539l1191r261J7399J3958J721j3563
$$ plain form
704 -1468 -4123 16690 20443 4493 -5363 -11924 -10859 7716 12745 -10780 -17046 6085 9249 -14651
718 -14651 -26598 -19477 990 23677 14243 -23826 -31875 -3013 5509 -10735 -14655 -9634 -8895 -5229
732 -5229 -5404 -10931 1337 19928 5466 -20691 -15724 63 -392 -1615 -1257 -5113 3855 16073
746 16073 -554 -21653 -7964 13525 10804 5996 4448 -4763 -9968 -7977 -12424 -8824 12366 11218
760 11218 -16075 -20359 -628 3953 -5112 -7207 -10579 -12901 -7892 -14476 -27246 -15102 3268 -7847
774 -7847 -23220 -14767 -6394 -9855 -12082 -17533 -22056 -6016 5225 -19092 -40806 -23545 3077
787 3077 8795 1538 -11530 -18078 -4193 1564 -18882 -21857 7930 17293 -8491 -22290 -10448
800 -10448 1699 7983 2059 -12798 -5518 21275 17736 -13455 -22716 -5317 8641 10362 -3201
813c201k0822Q757L2893j018l1068k778K3135K999j9410j5264K542K6559J8759
826B2083k5443l4358J3910L3479k080k0206n452Q548J5209M396k7382k5835K2283
839b0848L6592m809k6670n022J5855J7022m400k8560q114L8653K4554l4669l6941
852c7357J4727L3803R133j6974k2713K102L3433J2782l3292k2543K2302K4001
864A9404q094k3366j4353J3464L2736J978l6908j1087L3994J4739k8017k5208
876c0718P728K8970J7792k3050m1275N285M3450P361l2710j3278K0602J9345j650
889G852k5609k3691J8425L5462p638l6703m148K7909J4838q158k0927q651K4069
902f970K3118k3953l7206J1944L6152M844k1386j6125M071K3032J1567k3917k0488
$$ plain form
813 -3201 -24023 -15266 17627 16609 -14459 -17237 5898 8897 -10513 -25777 -23235 3324 22083
826 22083 -3360 -37718 -23808 9671 7591 -12615 -18067 -9519 5690 10086 -17296 -43131 -20848
839 -20848 15744 10935 -15735 -20757 -4902 12120 7720 -20840 -28954 9699 34253 -416 -37357
852 -37357 -22630 11173 20306 3332 -19381 -17279 16154 28936 -4356 -26899 -4597 19404
864 19404 11310 -12056 -26409 -12945 19791 21769 -15139 -26226 7768 22507 -5510 -30718
876 -30718 -22990 5980 23772 722 -40553 -35268 8182 15543 -17167 -30445 -9843 9502 7852
889 7852 -17757 -41448 -23023 12439 4801 -31902 -36050 -8141 6697 -1461 -22388 -31039 -6970
902 -6970 16148 -7805 -45011 -33067 3085 7929 -13457 -29582 -25511 -2479 9088 -14829 -35317
915c5317K3390K5903j4994k7212l631J3182J7304L948k2236j4015K1978K0319
927H619j5869k0495M759J5886R980o376k5163p507K6358J5930k1109j3557J5274
940a3270J2483m061q999q371K208J7129K080k2470p200J7072J0526l069m162o372
954a6476J258J5759j20k3113m036K3033R112j3209j0373k388N790J4121n63j5298
968a6503K440J8353j679j4487k189J265P18R153K443j4295k292J5751K999r069
982g392j346K141J485N130m288j5019M408J8008k307j4013J099O684P09N090P63
997A152j1858l14J4328j419j4090k695N624N159Q304l481j6893K264K0634n73
1011F142j7015j374J0140L362j578q282j1534Q664K0595l025j8056R87J1214L402
$$ plain form
915 -35317 -11927 13976 -1018 -28230 -31861 -18679 -1375 2573 -19663 -33678 -11700 8619
927 8619 -7250 -27745 -22986 -7100 2880 -3496 -28659 -36166 -9808 6122 -14987 -28544 -13270
940 -13270 -787 -4848 -13847 -22218 -20010 -2881 -801 -23271 -30471 -13399 -2873 -5942 -10104 -16476
954 -16476 -15218 541 421 -22692 -26728 -3695 5417 -7792 -18165 -20553 -14763 -642 -1205 -16503
968 -16503 -14063 4290 2611 -11876 -14065 -12800 -12082 -2929 -486 -14781 -17073 -1322 1677 -7392
982 -7392 -8738 -6597 -5112 18 -4270 -19289 -14881 3127 820 -13193 -12094 -5410 -4701 389 1152
997 1152 -10706 -11020 3308 1889 -12201 -14896 -9272 -4113 4191 710 -16183 -13919 6715 6142
1011 6142 -10873 -12247 -2107 1255 -323 -8605 -20139 -11475 9120 6095 -11961 -10974 240 3642
1025C642j249p867j0770P951J8882q185k1657M758K0088L318r037q392j112J4924
1039E294J1007j8656j9306J5818K2738p727j8619n281Q000J8019P818k0216j6791
1052a7902J8306K0696j2150j9922q47J2353J1951j919k0639p229K6907J5678k2460
1065B823j9221J2138J8565R62j5489k0045N256L0982O557k9487j6112K1450K0198
1078A8577m334j6107j3718Q718K5213j184l1414q612K8813J5591j4330j8778k042
1091a3607J9930K0615j2002l2902K021L4041Q393k5364j7442Q564K1245J2136
1103B5628j5831k3932J0888L0514k866k7608o162J7037J3053l747k0008j2548
1115a5582K3768K7613j6162l3855N394L0514J0372j8221k4817k241K9395J8163
$$ plain form
1025 3642 2393 -5474 -16244 -8293 10589 2404 -19253 -14495 5593 8911 -126 -8518 -9630 5294
1039 5294 16301 -2355 -21661 -5843 16895 9168 -9451 -14732 -6732 11287 19105 -1111 -17902
1052 -17902 404 21100 8950 -10972 -11819 534 12485 10566 -10073 -17302 9605 25283 2823
1065 2823 -16398 -4260 14305 15267 -222 -20267 -15011 15971 22528 -6959 -23071 -1621 18577
1078 18577 14243 -1864 -15582 -6864 18349 17165 -14249 -22861 5952 21543 7213 -11565 -13607
1091 -13607 6323 26938 14936 -17966 -15945 18096 26489 1125 -16317 -7753 13492 25628
1103 25628 9797 -14135 -3247 27267 24401 -3207 -9369 7668 20721 16974 -3034 -15582
1115 -15582 8186 35799 19637 -14218 -8824 21690 32062 13841 -10976 -13217 16178 34341
1127C4341k6174k7155J7592K8361l456k1273r704J1236K2379J061l0470j4622
1139a7884K8656K3634j9148k7456L067K5103K0311j0951l3943m330L6966J7231
1151D1256k9567k4388J3329K3381N794j6380j9445R005L0970K201l1243j1467
1163f554K3319J7539q250j9984j2028J4841K7132n440l1953l621K8185J2920j5168
1176B0938j6574l207J3399J3741j1455k0997P547K2889l846j9978l077J2609J2350
1189B4339P11j8761j5229J6740K2881j2236k5480J482J8997J0712n010j6718p216
1202d788K0351J6897j8240k0145J0291J7558k531j2719p477P251K0885L684k6663
1215D354j3315K3570K1496j0872k0772n682J1257J8441k232k4863o819K5578J4862
$$ plain form
1127 34341 8167 -18988 -1396 26965 23509 2236 -7468 3768 26147 27208 -3262 -17884
1139 -17884 10772 34406 15258 -12198 -9131 15972 36283 25332 -8611 -12941 24025 41256
1151 41256 11689 -12699 630 24011 29805 13425 -6020 2985 33955 36156 4913 -6554
1163 -6554 16765 34304 26054 6070 -5958 8883 36015 30575 -1378 -4999 23186 36106 20938
1176 20938 4364 1157 14556 28297 16842 -4155 3392 26281 22435 2457 -620 11989 24339
1189 24339 25050 6289 -8940 7800 30681 18445 -7035 -5553 13444 24156 19146 2428 -4788
1202 -4788 15563 32460 14220 -5925 4366 21924 19393 6674 -803 6448 27333 31017 4354
1215 4354 -8961 14609 36105 25233 4461 -1221 10036 28477 26245 1382 -5437 20141 35003
1228C5003j6215j4021L398R576O323n570j5972J085J9791R89j9657m470J4065
1241A4325P880k345o687r311M288J3593k693j4630K696R298o311n394O361N089
1255A6159O31M00o342m193J1191N088j5546p884J2615J0436k736n813p625j505
1269D876J4291P241j2261n732J1071J304r266k072K148J909N644j068j0918J415
1283H582J4266o67j2003n51L503q48K610k39r169p95R823J85o054K841k10p105
1299D169K690R308j657m790k146q418j866J3084N722j0854l127Q289J763l130
1313I037k360o488Q18J3395J807j6211l988J1663M634m688m787l530P514J5922
1327B2738n475k4063l967K1475J1340r846j4941q767J1208K2431j209k4094n418
$$ plain form
1228 35003 18788 4767 8165 17741 24064 18494 2522 3607 23398 24387 4730 260 14325
1241 14325 22205 19860 13173 3862 8150 21743 19050 4420 7116 16414 10103 4709 11070 16159
1255 16159 16790 17190 10848 6655 17846 22934 7388 -496 12119 22555 19819 14006 6381 4876
1269 4876 19167 26408 14147 8415 19486 20790 11524 9452 11600 13509 19153 18085 7167 8582
1283 8582 22848 22181 10178 9627 13130 12282 14892 14653 5484 4689 14512 14697 8643 11484 11274 4169
1299 4169 6859 16167 14510 9720 7574 -844 -2710 10374 16096 5242 2115 10404 12167 9037
1313 9037 6677 189 1007 14402 16209 -2 -3990 7673 12307 7619 2832 -698 6816 22738
1327 22738 17263 -6800 -10767 10708 22048 12202 -2739 -11506 -298 22133 20924 -3170 -8588
1340h588J9518O461j2508j0603P11J1115R989j0562j8686P476K0855m777j8927
1353h526l29J4877R163n299j9452j2048J7342K0456j0439j9527M445J4899Q11
1366F373q745p160M275J5125P24k3942j0042K5196J7284j7337k0838M328J9447
1379D688J3176j2787k6521K904L2851R231k6772j9866R658J8226N848j1610j5085
1392a6059R575K4832m493l1555p475K4718J8409p966k2149j2435J5621K4862o348
1405I537k8371k815K3578J0449q482j3977q101Q053J5812l548j8047Q3J3422J574
1419h33o463j959K645O053L673j3824j4825J2728K1165l790j7649n206N461Q418
1433d406L541q778p197J2869J2247j2200j5545M251R104J407l482o071K623J6600
$$ plain form
1340 -8588 10930 17391 4883 -5720 -5009 6106 16095 5533 -13153 -5677 15178 10401 -8526
1353 -8526 -8855 6022 15185 9886 -9566 -21614 -4272 16184 5745 -13782 -9337 5562 6373
1366 6373 -2372 -9532 -5257 9868 10592 -13350 -23392 1804 19088 1751 -19087 -14759 4688
1379 4688 17864 5077 -21444 -18540 14311 23542 -3230 -23096 -13438 4788 10636 -974 -16059
1392 -16059 -6484 18348 13855 -17700 -25175 -457 17952 9986 -12163 -24598 -8977 15885 9537
1405 9537 -18834 -21649 1929 12378 3896 -10081 -18182 -10129 5683 2135 -15912 -15829 -2407 -833
1419 -833 -7296 -9255 -6610 -557 3116 -10708 -25533 -12805 8360 4570 -13079 -18285 -12824 -4406
1433 -4406 -865 -9643 -16840 -3971 8276 -3924 -19469 -15218 -6114 -4707 -8189 -14260 -11637 4963
1447D963K815k4927j3908K1984K2269o064k2520j2365J1527K3956Q35k8364j0021
1460b9820K5480J5862j4856j7216K502J6837J1688j3559k5538K250K8272Q321
1472A0223k1702j2273J1555J6213L741j6044k0343P100K7986N845k0488j1039
1484a9226N541N166K798o3l105L708P248o820r622O750P558o249m617M241Q90
1499e802j92K878l332m285O930N409n371l429K134l424j021P155P04m664J390
1514d920L64q064Q44J1550L941l725l131q027o129R770R908o655p590K850M814
1529d200M734J30j3026q696J5561J6729r994j8149J49J0520O411k789j1769k236
1543a6625J6492P137j7241j1169J3445J4451j654j2902j4022N88J9628J1389j3805
$$ plain form
1447 4963 7778 -17149 -31057 -9073 13196 7132 -15388 -27753 -16226 7730 8565 -19799 -29820
1460 -29820 -4340 11522 -3334 -20550 -18048 -1211 10477 -3082 -28620 -26370 1902 10223
1472 10223 -11479 -23752 -12197 4016 7757 -8287 -28630 -21530 6456 12301 -8187 -19226
1484 -19226 -13685 -8519 -5721 -5784 -8889 -5181 2067 -4753 -14375 -7625 -67 -6316 -10933 -6692 -5802
1499 -5802 -5994 -3116 -6448 -10733 -3803 1606 -3765 -7194 -5060 -8484 -9505 -2350 -1646 -6310 -4920
1514 -4920 -4556 -12620 -11776 -226 3715 -10 -3141 -11168 -17297 -7527 2381 -4274 -11864 -9014 -4200
1529 -4200 534 664 -12362 -21058 -5497 11232 1238 -16911 -16762 -6242 169 -2620 -14389 -16625
1543 -16625 -133 7004 -10237 -21406 -7961 6490 4836 -8066 -22088 -21500 -1872 9517 -4288
1556d288j1836Q049Q439k358n502n667L6J2285O058r868o449L385j855k775R836
1571b510P864n027m856q16k202R05L831k790o11P132j039r955J540R910n92n052
1587d268J044r45q2N435j2p775R29O209k871m196L176k58j575O658N061l770l647
1604h87n736r715N476J8936L260j5319o947P661O710j034r161p154J3817J7636
1618A7543r905k4204J88J9234O092r462j0105J230J5705R622j6566j9447J0433
1631i642K2979J225j7952j3271K745J8366J2448j2727j7065O267J4072l087r060
1644d702R67M404L814P50q681o936P393N708n082N71Q353j099o241j674k618j361
1660f434O858N864m868l932J237k894j054O507K598l265J428p68p718J276J1090
$$ plain form
1556 -4288 -16124 -8075 364 -1994 -7496 -13163 -13127 -842 5216 -4652 -11101 -7716 -9571 -12346 -2510
1571 -2510 5354 327 -4529 -5345 -7547 -6642 -2811 -5601 -6212 920 -119 -10074 -8534 1376 784 -4268
1587 -4268 -3224 -4169 -4251 1184 1172 -6603 -5674 535 -2336 -6532 -3356 -3614 -5189 1469 6530 2760 -887
1604 -887 -6623 -16338 -10862 8074 11334 -3985 -10932 -3271 3439 2405 -6756 -13910 -93 17543
1618 17543 7638 -16566 -16378 2856 8948 -514 -10619 -9389 6316 15938 -628 -20075 -9642
1631 -9642 13337 14562 -3390 -16661 -13916 4450 16898 4171 -12894 -6627 7445 4358 -4702
1644 -4702 -3735 669 4483 5233 -3448 -10384 -2991 2717 -2365 -1794 6559 5460 -781 -2455 -5073 -6434
1660 -6434 424 6288 1420 -2512 -1275 -4169 -5223 1284 3882 617 2045 1277 -6441 -5165 5925
1675E925P15q900l330J990M257O640k539j1367K066J5990L091j4850j2018Q79
1689a1451J3402J4936m373j9544k022J9231L330j7597p113J3905J7303j47k2412
1702b552j7760J5178K7503n001k6107m932K0039J4475o757j9217r089J6563J9373
1715B1716r527k2218N39J6480N065o632o176J108Q520R9j4509l513K0034J1422
1729B2408j6529j6117M331J0666K801n004m410P428J3316o624k0023j107J6884
1742H020N626r564n496L901R875M034j5323j6010J1865K5512R16k0117j1819O433
1756b147J4055N795j1819j3945P042J5185l137j0662J486P466K263k317p179p578
1770e492N843J0898j530p254o68J802R00K272m225q415O364J4553P63j2446r405
$$ plain form
1675 5925 6640 -2260 -5590 -3600 657 7297 4758 -6609 -4543 11447 14538 -312 -12330 -11451
1689 -11451 1951 16887 12514 -7030 -9052 10179 13509 -4088 -11201 2704 20007 19860 -2552
1702 -2552 -20312 -5134 22369 17368 -8739 -13671 6368 20843 14086 -5131 -14220 2343 21716
1715 21716 12189 -10029 -9490 6990 12055 5423 -753 355 8875 8974 -5535 -9048 10986 22408
1729 22408 5879 -10238 -5907 4759 7560 2556 -1854 5574 18890 12266 -7757 -8864 8020
1742 8020 13646 4082 -1414 2487 12362 16396 1073 -14937 -3072 22440 23356 3239 -8580 -2147
1756 -2147 11908 17703 5884 -8061 -1019 14166 11029 367 1853 9319 11582 9265 2086 -5492
1770 -5492 351 11249 9719 2465 1797 3599 4499 6771 2546 -5869 495 15048 15811 3365 -6040
1785f040k005N406J2208L084r139m331M106k98j638L165l58l896K753K938l727
1800B228j296J708k930Q65Q179N87r673k638O332L846m39l409n358L340Q152p140
1816B354j3621P418K0503L675j6808j5219M57J6251J2307j1189j7358O900J6705
1829A2375k037j5598m976P474J1523L693j1512r608Q461Q777q959r467P652R888
1843G686j828q071o535N008J3155K190j4527m832R612J278r149Q59J1122N001
1857A0969o593j2000m550J3831J3324r479j5669P042J6406j520j6173j1606N160
1870a0858J9886J0966j4805j7053P227J3656l963j0990o96Q367Q032l529j4867
1883h627m971J5022R927j0331r923L241O343K666j028o649k867O989J543q020
$$ plain form
1785 -6040 -8045 -2639 9569 12653 3514 -817 3289 2991 1353 4518 4160 264 3017 5955 2228
1800 2228 932 2640 -290 575 8754 9341 -332 -2970 3362 7208 6769 3360 -1998 1342 9494 2354
1816 2354 -11267 -3849 16654 20329 3521 -11698 -11241 5010 17317 6128 -11230 -4330 12375
1829 12375 10338 -5260 -10236 -2762 8761 12454 942 -8666 -205 8572 -387 -9854 -2202 7686
1843 7686 5858 -2213 -8748 -3740 9415 11605 -2922 -7754 1858 3136 -6013 -5154 5968 10969
1857 10969 4376 -7624 -12174 1657 14981 5502 -10167 -3125 13281 11761 -4412 -16018 -10858
1870 -10858 9028 19994 5189 -11864 -4637 9019 5056 -5934 -6630 1737 9769 6240 -8627
1883 -8627 -13598 1424 11351 1020 -8903 -5662 681 3347 2319 -4330 -7197 -208 1335 -6685
1897f685k477N147K233J383L217k673o655n55R19k407M843Q170j732o551l590
1912g413k476N93P989M579n270j797M163j420n023j290n04K721Q303M4j1268j447
1928i516R676K252p101k543L079N251K116j0007j0192J0051J7400l417j8983o341
1942a8275J1145J2254J064j1302q263R358J1079r419j6468L767J6179O275o622
1955G72j0958j911J0022N507j1197p378J2978J1378p913j3947k479P965J0189
1968C028N50j0551l061J0765K798j0463k605Q584L932m012o493l659N860J0294
1982D967k156j0339R61R679q35q773l965K758Q281P180n437j3146p24P795J917
1997a837j491J811Q03R1O51n116p455L824R414K65m918k433r66L043O523k969
$$ plain form
1897 -6685 -9162 -4015 -1782 -399 2818 145 -6510 -7065 -6146 -8553 -3710 4460 2728 -3823 -7413
1912 -7413 -9889 -9296 -1307 3272 -1998 -3795 368 -1052 -6075 -7365 -7869 -5148 3155 3199 -8069 -9516
1928 -9516 160 2412 -4689 -7232 -4153 1098 3214 -6793 -16985 -6934 10466 7049 -11934 -18275
1942 -18275 -7130 5124 6188 -5114 -13377 -4019 7060 -2359 -18827 -15060 1119 7394 772
1955 772 -10186 -12097 -2075 3432 -7765 -15143 -2165 9213 1300 -12647 -15126 -7161 3028
1968 3028 3578 -6973 -10034 731 3529 -6934 -9539 -955 2977 -1035 -7528 -11187 -5327 4967
1982 4967 2811 -7528 -6567 3112 2277 -6496 -10461 -7703 578 7758 2321 -10825 -11549 -3754 -1837
1997 -1837 -3328 -1517 -714 -623 28 -5088 -12543 -8719 695 960 -3958 -6391 -7357 -4314 2209 -760
2013g60j0420J284J1534J812p995o861O84R245Q885o745j5583Q95J4380M710o243
2028a178l528J294K864l45q514n690J1219J3605m401j3023p23O303J829l066m575
2043g929K011J0419L538j2936j0001Q130Q006l430l963L332M807J469p239j0411
2057a4197N215J5919mj7007o103J0104J0367J74q860p414N485J0841m201j2818
2071a2499K132J2780L007p412o962j595N763N910l983n073P368Q062o015j0585
2085i102k240L280O552O139k519p239m03K369j028J466M417j927m113K598J947
2100A97k168j260k56j233L974M305n220n770M063O075j081j857q12k706k7K125
2116a651k116j69P135L015o590m568l17Q85M717N711k728o389RJ821j192J034
$$ plain form
2013 -760 -11180 -9896 1638 3450 -4545 -11406 -10722 -1477 7408 663 -14920 -14025 355 5065 -1178
2028 -1178 -4706 -3412 -548 -893 -9407 -15097 -3878 9727 5326 -7697 -8420 -2117 -288 -3354 -7929
2043 -7929 -5918 4501 8039 -4897 -14898 -6768 1238 -2192 -6155 -2823 1984 3453 -3786 -14197
2057 -14197 -8982 6937 6933 -10074 -16177 -6073 4294 4468 -4392 -11806 -6321 4520 319 -12499
2071 -12499 -10367 2413 5420 -1992 -8954 -10549 -4786 1124 -2859 -7932 -564 7498 1483 -9102
2085 -9102 -11342 -8062 -1510 4629 2110 -5129 -5532 -3163 -4191 -2725 1692 -235 -4348 -1750 197
2100 197 -1971 -3231 -3487 -4720 -746 3559 -1661 -7431 -3368 2707 1626 -231 -1043 -3749 -3776 -1651
2116 -1651 -3767 -3936 3199 6214 -376 -4944 -5261 -4376 341 6052 3324 -3065 -3056 -1235 -2427 -1393
2132a393J765j770J498N146j246o394r57J987J012L473O85n578j721M372Q98k428
2148f51K831K758m082l486M62J210L711L917l526n343N66J089k848K303O626j55
2164E382l486n36j225j005Q64j897k565O784Q513n237j1314j847O374O433J459
2179F697o122n867O229P131p215r234N139J0178L81p670o401L217J2008L497j2554
2194e86r135R388Q830n432p336O05P348P411l544j2466l377J0888N873o013k482
2209b8N122K475m877p251l970Q336J2758j526j2107j487Q064J073n696l621K671
2224f4P086L203p661p159N589Q111l637n931K507M238K3k221m414m4Q612L183
2240A1421r516o935N038O949J743j317l426k275L941Q22p110j692Q407M843l679
$$ plain form
2132 -1393 372 -1398 100 5246 4000 -2394 -3351 -1364 -352 3121 3806 -1772 -3493 879 1777 -651
2148 -651 2180 4938 856 -2630 -2168 -958 2753 6670 3144 -2199 -1633 -544 -3392 -1089 5537 5382
2164 5382 1896 1360 135 -870 -6 -1903 -4468 2316 10829 5592 -5722 -7569 -1195 5238 6697
2179 6697 575 -5292 937 8068 853 -8381 -3242 6936 7317 -353 -6754 -3537 8471 11968 -586
2194 -586 -9721 -333 8497 3065 -4271 -3666 3682 11093 7549 -4917 -8294 2594 8467 2454 -28
2209 -28 5094 7569 2692 -4559 -8529 -193 12565 11039 -1068 -2555 5509 6582 886 -2735 -64
2224 -64 7022 10225 2564 -4595 994 9105 5468 -463 2044 6282 6305 4084 -330 -374 8238 11421
2240 11421 1905 -5030 8 6957 8700 7383 3957 1682 5623 6445 -665 -2357 6050 10893 7214
2255G214m184k767P0M311K240l648J12N688j053n918k574L72J810N479K290o344
2271C098l710M667K210k268j57Q36m54J71q02m151K079O876k1o372n34K506n30
2288C444K2P96k98K572L157n030p037J135N708J062O75L19j970n38R29m515k136
2305a705O914M534n721n081K210L355K17j557k868R71O263p39q369j162P493K727
2321G482m719k806j423J484M198m51l723K985N692m472p846m21N109L918J466
2336F473k859m969K884L305n187m610O577P392k026m914l290m65L872J005n006
2351a818M36Q199J629p483m349L773L565Q68j413m988k73N984L20n016j78L968
2367C224P8k963j549o22L936N833k808q296M79N519j525l558Q06L555L980J508
$$ plain form
2255 7214 3030 263 333 4644 6884 3236 3348 9036 7983 2065 -509 -137 1673 7152 9442 3098
2271 3098 -612 4055 6265 3997 3840 4676 4222 4393 3591 -560 1519 8395 8374 2002 1468 3974 3444
2288 3444 3466 4262 3964 6536 9693 4663 -2374 -1239 4469 5531 6206 6525 4555 4017 4946 431 -1705
2305 -1705 5209 9743 4022 -1059 1151 4506 4723 3166 298 1269 7532 6793 -1576 -2738 4755 7482
2321 7482 2763 -43 -1466 18 4216 3765 42 3027 8719 4247 -3599 -4020 1089 5007 6473
2336 6473 3614 -1355 1529 4834 -353 -4963 1614 9006 6980 2066 -1224 -1689 2183 3188 -1818
2351 -1818 -1382 6817 8446 963 -3386 387 3952 4820 3407 -1581 -1854 4130 4450 -566 -744 3224
2367 3224 3302 339 -1210 -1832 2104 7937 5129 -3167 -2688 2831 1306 -2252 -1446 2109 6089 7597
2383G597o228p408K712P049J177k273J44j502r85K080j391l908M029O842j436
2398F499n678j424J152K546K192l011m624M017N230l744m718J843L768J611r64
2413D695m100m453L899O299k087m324J640J082j188k493j851J780P417K984r013
2428B87o336M709M391k974k894J105L126L684k493p937k38Q660J757o529k481
2443d163L344J950k58k645l338L842P910k753j0725j207Q711N718k031o353m664
2458f662M283P021m363q250L816J0182N30o934n217k55N923M683m496n691L842
2473a588N667l253o647p65L560O609K075o584p330M616P173k788o205L74M005
2488a081K851j876m809j032P257M301p434o146L561N150N46j066l701k91N509
$$ plain form
2383 7597 1369 -6039 -3327 3722 4899 2626 2770 1268 283 2363 972 -2936 1093 7935 6499
2398 6499 821 -603 549 3095 5287 2276 -2348 1669 6899 3155 -1563 280 4048 5659 4695
2413 4695 595 -3858 41 6340 4253 -71 1569 2651 1463 -1030 -2881 -1101 6316 9300 287
2428 287 -6049 -1340 3051 77 -2817 -1712 1414 5098 2605 -5332 -5570 3090 4847 -1682 -4163
2443 -4163 -819 1131 873 -1772 -5110 -1268 6642 3889 -6836 -8043 668 6386 4355 -1998 -6662
2458 -6662 -2379 4642 279 -7971 -4155 6027 6557 -377 -5594 -5849 74 4757 261 -5430 -1588
2473 -1588 4079 826 -5821 -6586 -3026 3583 5658 -926 -8256 -3640 3533 745 -5460 -5086 -1081
2488 -1081 1770 -106 -4915 -5947 1310 5611 -1823 -7969 -4408 742 1288 222 -3479 -3770 1739
2503A739J509q427m009P589P363o06n379m708Q61N637j119o947J415J0345K014
2518G277q823n686K115N952L941m236p137K986Q785j769r357k086O835N072q22
2533C047o564n164N872Q807l859r383M78P283J003m797m058J758Q238L621q848
2548b566q546N588Q428j496n608l79L576K829k259p681j486R481O016n563n836
2563e502J801L143P52k126m796J561Q590J157r060m343O454N066j254m133k867
2578e557K106M796j379o889J368P129l06n650k418J689L024L469j324n391R63
2593d370M436k401n684J106M197K756P55m189m808K673N609k151m307K916K908
2608e54j347k251j456k60L820K827l739k734K804J978k075k71R87o07Q74P29m409
$$ plain form
2503 1739 3248 -5179 -9188 -1599 5764 5158 -221 -4929 -4068 1569 450 -6497 -5082 5263 7277
2518 7277 -1546 -7232 -5117 835 4776 540 -6597 -3611 5174 3405 -5952 -8038 -1203 3869 3047
2533 3047 -3517 -8681 -2809 5998 2139 -7244 -6766 517 1520 -3277 -7335 -5577 2661 6282 -2566
2548 -2566 -11112 -5524 2904 1408 -4200 -4579 -1003 1826 -433 -8114 -9600 -119 5897 334 -5502
2563 -5502 -3701 -558 194 -1932 -6728 -5167 3423 4580 -4480 -8823 -2369 2697 1443 -2690 -5557
2578 -5557 -3451 1345 -34 -6923 -5555 1574 1268 -4382 -6800 -5111 -2087 1382 58 -5333 -4370
2593 -4370 66 -2335 -8019 -6913 -2716 40 795 -3394 -8202 -5529 80 -2071 -6378 -3462 -554
2608 -554 -1901 -4152 -5608 -5868 -2048 779 -2960 -5694 -2890 -912 -2987 -3258 -2271 -2878 -2004 -1275 -5684
2625e684q98N638L315l890k505J016M19N37P9k094J525M668j298o995r80M122
2641c025J560L21Q95j170p42J604j656m010K064M378m98j677J7n89Q2J864p29
2658a311k242K670K857l556k679K998K240j094j11j973j032L164J708l136K68
2673a229M496m56m585j378J297J539J745M44k696J76K971k401l980J814M118R44
2689B819j004k698l362J509M565j400m026K830L695j750k925q98j24L001K068
2704B300l194l934L199K895k320j641K020M34k95O19k579j036L966K602l889j824
2720b677K001l60q83O97J7R60L737q73n614j150M529Q98j577m44P15k22J925j256
2738D23m449K392N276p38m111p0Q45M22J572p18l251J477M123k421l750J404L647
$$ plain form
2625 -5684 -6582 -944 2371 -1519 -4024 -3008 -2589 -2052 -1973 -4067 -2542 2126 828 -6167 -7147 -3025
2641 -3025 -1465 -1144 -249 -1419 -2161 -557 -2213 -6223 -4159 219 -279 -1956 -1939 -2528 -2446 -582 -1311
2658 -1311 -3553 -883 1974 -1582 -4261 -1263 977 -117 -228 -2201 -3233 -69 1639 -1497 -1229
2673 -1229 3267 2811 -1774 -3152 -1855 -316 1429 1873 -823 -647 2324 -77 -4057 -2243 1875 2819
2689 2819 1815 -883 -4245 -2736 1829 429 -3597 -767 2928 1178 -1747 -2645 -2769 232 2300
2704 2300 -894 -4828 -1629 1266 -1054 -2695 -675 -241 -536 83 -2496 -3532 434 3036 -853 -2677
2720 -2677 -676 -1036 -1919 -1222 -1205 -245 3492 2619 -2995 -4145 384 1282 -295 -739 -24 -246 1679 423
2738 423 -4026 -1634 3642 2904 -1207 -1277 -432 -10 1562 844 -2407 -930 3193 772 -2978 -1574 2073
2755B073J095o27k942k896K447M401k150l743K800L041r54k089j630n81M164L633
2771F042l209m065J990K179j615j006Q27J58K534J385m032k721M156K114k597
2786B140j159P91J17M38L70k383l57M303J32m765o45L223O35j89l88k061p64K783
2804B221m20l712J324M423J13k313j187j991M32L323j90l189J682L444k102l396
2820a538Q44J568P41J998j216l238K080K480k433k378K058J622m06K69j307j769
2836f25K836L134k854k975J902J036j102R27j45j216J247K010l148k340L465R65
2852C117o13M24o22j685N33J067k262K3L612P18l227P7L56q13Q40J657j971n39
2870F92K406n61k911J118K410o82p1J074j966l52K411l91j946J431J394k020j201
$$ plain form
2755 2073 3168 2541 -401 -3297 -850 3551 1401 -2342 458 3499 2545 456 -1174 -1755 2409 6042
2771 6042 2833 -1232 758 2937 1322 316 1143 1301 3835 5220 1188 -1533 2623 4737 2140
2786 2140 981 1772 1889 2327 2697 314 -43 4260 4392 -373 -1018 2205 2840 2651 2263 202 -562 2221
2804 2221 1801 -1911 -587 3836 3949 1636 449 -1542 -1110 2213 2023 -1166 516 3960 1858 -1538
2820 -1538 -694 874 1615 3613 2397 -841 1239 3719 1286 -1092 966 2588 2182 2451 1144 -625
2836 -625 2211 5345 2491 -484 1418 2454 1352 2279 2134 918 2165 4175 1027 -1313 2152 3117
2852 3117 2504 2928 2306 621 1154 2221 -41 -18 3594 4312 1085 1162 1518 705 1545 3202 1231 692
2870 692 3098 2537 -374 744 3154 2472 2401 3475 1509 1157 3568 3177 1231 2662 4056 2036 835
2887H35J826J64J79J672j297k096J593J174l093k44L279O40j841l14j009j255
2903B13K954J205l285k62K894l10k620K01J78k84K179kl374J08L824o50k586J091
2921A474J357j119l02n69j495K083L259k309l073J759K299j495m53R43l81J002
2937B980J305l734k163L885K229k187j421J712n3L79L61l046r49M808J757n277
2953E86j579K503J631o30j455j857J025M141p09n506k77M616J320k614k222j210
2969b237J807M389q13n613O38N227p2l815j618L03L212K992k836m967J397N541
2985C535r64l937O42K253J590m43k751l292L985M276l202l935J827L326k74j827
3001H09j835m46M764K021n908l851M643L915k309l502p53K127L919q55o049m25
$$ plain form
2887 835 2661 2825 3004 4676 3379 1283 2876 4050 957 713 3992 4632 2791 2477 1468 213
2903 213 3167 4372 1087 825 3719 3409 789 990 1168 884 3063 3061 -313 -205 3619 2969 383 1474
2921 1474 2831 1712 1410 841 -654 1429 4688 2379 -694 1065 3364 1869 1416 2359 1978 2980
2937 2980 4285 551 -1612 2273 4502 2315 894 2606 2553 2932 3293 247 -702 4106 5863 586
2953 586 -993 1510 3141 2511 1056 -801 224 4365 3656 -1850 -2127 2489 3809 1195 -1027 -2237
2969 -2237 -430 3959 3146 -2467 -1829 3398 3326 -489 -2107 -1804 1408 4400 1564 -3403 -2006 3535
2985 3535 2571 -1366 -724 1529 3119 2676 -75 -3367 618 4894 1692 -2243 -416 2910 2636 809
3001 809 -1026 -1472 3292 5313 -595 -4446 197 4112 1803 -1699 -2452 -325 3594 2739 -3310 -3735
3017c735O335K490o122l403K172L170J493k054m875J481O455m05o893j849M835
3032i05L618k11m385l757L218O344j678p399M61O452J774l849l088k0L759L681
3048D015l927n493K172N685p77l816k54J199K146J294l256m071L540M501k967
3063il888J250K454M67j557k381l16N065J684n582l206M182K849j676j973j736
3079d373J047M071j47n426j174N132K258k794k761j46J869L498j427n694O23O539
3095A095J062n389k362K904K724J928l455m830K086N930o3n684j72L319J541m60
3111A74k566k974K975M584k005n366J075L775L33j803k183KK795K799l561l819
3127e765K994L723k396k780Q68J554M30k43k794o87N276J259n248j397L350J661
$$ plain form
3017 -3735 2600 5090 -1032 -4435 -2263 907 2400 346 -4529 -3048 3407 3002 -3891 -5740 -905
3032 -905 2713 2502 -1883 -5640 -2422 3922 2244 -5155 -4694 1758 3532 -317 -3405 -3425 334 4015
3048 4015 88 -5405 -3233 2452 1675 -2141 -2395 -1196 950 2244 -1012 -5083 -1543 2958 -9
3063 -9 -3897 -2647 -193 274 -1283 -3664 -3980 1085 2769 -2813 -6019 -1837 1012 -664 -2637 -4373
3079 -4373 -3326 745 598 -4828 -6002 -870 1388 -1406 -4167 -4313 -2444 1054 -373 -6067 -5444 1095
3095 1095 2157 -3232 -5594 -2690 34 1962 -1493 -6323 -4237 1693 1630 -4054 -4226 -907 634 174
3111 174 -2392 -5366 -2391 2193 188 -5178 -4103 -328 5 -1798 -3981 -3979 -1184 1615 -1946 -5765
3127 -5765 -2771 952 -1444 -4224 -3356 -1802 -1372 -1615 -4409 -5096 180 1439 -3809 -5206 -1856 -195
3143a95o73j926j764P73M564M92n461r00M425K130k275k125n11J777L320j709
3159e8m527J123M818j09l831m96J129J786J214j443l461J066L747p28l049M99
3175b320Q01M83R10o99k544J496L173j702k569R94J861p73k90m37q91J465K345
3192A303k653j398K546P75k156j86J260o46K20J017j946l38L128O34l344o07K158
3209b33R92J21r96k843N84M356Q5m699j048L457J687q54j530j848J659L218r73
3226A135m764M05L749M47j692j045l20O84K852j323l880J204M016j083k308j23
3242b046N04J086Q82j515j699K566K484l009j984K572J008j332o46J78O9J969
3258A087l01k780K18L115K41k484p0J021J01J048q55k883O43M596k39m300J7L007
$$ plain form
3143 -195 -868 -2794 -4558 -3785 779 1271 -4190 -5090 -665 1465 -810 -2935 -3446 -1669 1651 -58
3159 -58 -4585 -3462 1356 1247 -2584 -3080 -1951 -165 1049 -394 -3855 -2789 958 230 -2819 -2320
3175 -2320 -1519 -1036 -126 -825 -3369 -1873 1300 -402 -2971 -1977 -116 -889 -1179 -1616 -2507 -1042 1303
3192 1303 -1350 -2748 -202 573 -1583 -1769 -509 -1155 -935 82 -1864 -2202 926 1560 -1784 -2391 -233
3209 -233 759 880 -116 -2959 -2375 1981 2066 -2633 -3681 -224 1463 609 -921 -2769 -1110 2108 1135
3226 1135 -3629 -3224 525 972 -720 -1765 -2085 -1401 1451 128 -3752 -2548 1468 385 -1923 -2046
3242 -2046 -1542 -456 426 -1089 -2788 -222 2262 -747 -2731 -159 849 -483 -1129 -951 -882 1087
3258 1087 786 -1994 -1776 1339 1580 -904 -974 47 148 1196 341 -2542 -1899 2697 2458 -1842 -1825 1182
3276A182J218r46j847k265J751L883j293l565Q60K693j43j002m89j354O51L446
3292B780n80l080L79J930m39n01M37j382J67K872m93k265Q29J702j348m37J441
3309B012q23q37J377mj024J285P21k789L77K128m30j250R86o26j001J561P85k940
3327d92l97L025K31j514q07n36O90J884l25l269J68M274o32l489n23J688J178
3344A154J039j362l000J172L455r26l119M08J559O44N22q55k603K007L731j886
3360A940l239J015J816p98K09j10l54P22J005j957j046K371P18l115P34K704n32
3377B083j678n06m95R30K480j115k994O25L166l17k020m66K59R72J860k015l336
3394b567K038M183j119l868P70J293R82N46j374k035K228K405k970k093J807J362
$$ plain form
3276 1182 2400 1454 -393 -2658 -907 2976 1683 -1882 -1022 1671 1528 526 37 -1317 -666 2780
3292 2780 2200 -880 -501 1429 990 489 926 -456 -289 2583 2090 -175 654 2356 1008 571 2012
3309 2012 1189 352 1729 1725 701 1986 2707 -82 295 2423 1993 743 1729 1103 102 1663 2448 -492
3327 -492 -889 2136 2367 853 46 -490 200 2084 1759 -1510 -1342 2932 2300 -1189 -1712 -24 1154
3344 1154 2193 831 -2169 -997 2458 1532 -1587 -1179 380 1024 1546 691 -1912 95 3826 1940
3360 1940 -1299 -284 1532 734 943 833 479 1201 2206 249 -797 1574 2292 -823 -89 2615 2083
3377 2083 405 -101 -596 334 2814 1699 -1295 -670 2496 2179 159 -307 -48 924 2784 769 -2567
3394 -2567 -529 3654 2535 -1333 -563 730 1712 2258 884 -1151 1077 3482 512 -1581 226 1588
3410A588j78P98M0k011O89J193j281p58J848L54j159N05k2j115J69J522j350j83
3428F49J992m55k402R51J336j498p17R26m17L03J180j362j674J904J641j692j404
3445g39r5j78J465K234j416l286O52K854p65q56q3l24J997J067k600k943K270
3462g46L320j103j558L05N71P07O98j881k026K451K815j729k471M43J047P90M98
3479B131j602j503K634J200l130r76K919M57j511j348l35R96J895k77l256J076
3495f30L447j373l684k97K321J325j3j650k326K438K575k339l576J804M201j27
3511B096k020k515n18L682K618l926l804L265L985j463k643m04R90K475O78l626
3527a130k372L873K483k103j877P60N23M39J31k027l40L128J381k965j737J191
$$ plain form
3410 1588 1410 2208 2248 237 926 2119 838 80 1928 2282 1123 1628 1606 491 660 2182 832 649
3428 649 2641 2186 -216 735 2071 573 -144 782 365 668 1848 486 -1188 716 2357 665 -739
3445 -739 -834 -1012 453 2687 1271 -2015 -1363 1491 726 -130 -213 -537 1460 2527 -73 -3016 -746
3462 -746 2574 1471 -87 218 789 1496 2194 313 -1713 738 3553 1824 -647 -204 843 1633 2131
3479 2131 529 -974 1660 2860 -270 -1246 1673 2130 619 -729 -1064 -68 1827 1550 -1706 -630
3495 -630 2817 1444 -2240 -2537 -216 1109 1096 -554 -2880 -442 2133 -206 -3782 -1978 2223 2096
3511 2096 76 -2439 -2957 725 3343 -583 -4387 -1122 2863 1400 -1243 -1647 -657 1818 2496 -1130
3527 -1130 -3502 371 2854 751 -1126 -366 157 596 727 -1300 -1640 1488 2869 -96 -1833 -642
3543f42K02k33M63o05M98J864j196l350P39K852l27j781K12L52K02J107j190k436
3561c269J303L341q67k342M83Q83R11M09j888j908J339K924j294k694J774K062
3577A167M56j169k246j636L262L481k530l117J327K383m72j302j635j98L410K126
3593C307l704l188K155K066r16j400k51P04K045Jl378j292L562J778k898j426
3609b835J156J036L24l61j977K77K939p70l726Q32L182J068j485j734r31J437
3625a568K253j726k714J877L728p97l067q77P51J851J401j886j842K382K392k944
3641g86k692J372J976P91m23j974j298K790J541k648j874K189Q86r08j021L16
3657a763j54K089R26k927j601K710N02j273L25O63k08K31j49k575K16K865N27
$$ plain form
3543 -642 -440 -673 -210 -815 -317 1547 351 -2999 -2260 592 265 -1516 -1304 -952 -750 357 -833 -3269
3561 -3269 -1966 1375 508 -1834 -1351 -468 443 852 -1036 -2944 -1605 1319 25 -2669 -895 1167
3577 1167 1623 454 -1792 -3428 -166 3315 785 -2332 -1005 1378 906 -396 -2031 -2229 1181 3307
3593 3307 -397 -3585 -1430 636 -280 -1680 -1931 -1227 818 819 -2559 -3851 -289 1489 -1409 -2835
3609 -2835 -1679 -643 -319 -680 -2657 -2380 559 -211 -3937 -3105 77 1145 -340 -2074 -3005 -1568
3625 -1568 685 -1041 -3755 -1878 1850 1053 -2014 -2891 -2140 -289 1112 -774 -2616 -234 2158 -786
3641 -786 -3478 -2106 -130 661 238 -1736 -3034 -244 1297 -1351 -3225 -1036 -150 -1058 -2079 -1763
3657 -1763 -1917 172 1098 -1829 -3430 -720 -218 -1491 -1166 -503 -711 -480 -629 -3204 -2988 -123 404
3674D04j877L98O04q91p9J62j018J135K362r12k656O30J719J48p46k27j071J076
3692h39K492j714k410J079K073n65o01p94r50J533K757j406k819J032J819j504
3708h17j113L50O30J993R90k758k732J616K439j386r16J474Q78n44n36k107k95
3725b834K973J227k707p07K089O48j095r41n28M77K629o37l446N29L687Q2k828
3742a382o03P89J164L80j244j574K087L031k741l365K17K932J187k30j725q46
3758a923K204J567k788l065K328L485m70j653j412n87K140J359k392j519K905
3773A79K244k257j824O7P24J819N12k464j023K596R89j728m59P77N25j53k10j836
3791a522J12L321K85k666n84J725J38j003m93k59J566K213j291l479K05K782p1
$$ plain form
3674 404 -1473 -1075 -471 -1362 -1441 -1279 -2297 -1162 1200 288 -2368 -1738 -19 129 -617 -844 -1915 -839
3692 -839 1653 -61 -2471 -1392 681 116 -485 -1279 -2229 -696 2061 655 -2164 -1132 687 -817
3708 -817 -1930 -1580 -950 1043 2033 -725 -3457 -1841 598 -788 -1704 -230 648 104 -432 -2539 -2834
3725 -2834 139 1366 -1341 -2048 41 689 -406 -1347 -1875 -1398 1231 594 -2852 -2323 1364 1446 -1382
3742 -1382 -1985 -1196 -32 348 -896 -2470 -383 2648 -93 -3458 -3241 -309 878 648 -1077 -1923
3758 -1923 281 1848 -940 -4005 -1677 1808 1338 -315 -1727 -2314 -174 1185 -1207 -2726 179
3773 179 2423 166 -1658 -1591 -867 952 1464 -1000 -2023 573 1562 -166 -625 152 677 524 314 -1522
3791 -1522 -1410 1911 2196 -470 -1054 671 809 -194 -687 -946 620 2833 1542 -1937 -1732 1050 979
3808I79n70k22P4M35J224j835k464J763L706j362k891k60J626J720O23k758j648
3825a860K663K865k479l507J891K558N68r14l151o98L198K056k345k442K737K152
3841C292j676j927j496J059L097J157l170k059L027R10k097j485J392J521J087
3856B632j523k425K87L195j39l187J60K180P29j138r46n04J768J737j304l566
3872b044J213L226j66j152m14j23P08R09k400j452L255K920j819k924R2Q17Q39
3889A485K72j265l95L207R04l488k378J895J341M15J07j168p20J929K19k745m65
3906h50K353R15j231k83p43L16J627N77k860q07J869K72j301O02J352m24M13o66
3924A131j766J43K116J7o06M81L15q20k19K36o04P90K170k24k449L37M00l70J22
$$ plain form
3808 979 409 187 261 696 1920 85 -2379 -616 3090 1728 -1163 -1423 203 1923 2546 -212 -1860
3825 -1860 803 3668 1189 -2318 -427 2131 2699 1785 -1366 -2064 1134 3190 845 -1597 1140 3292
3841 3292 1616 -311 -1807 -748 2349 3506 336 -1723 1304 2214 117 -1368 24 1545 2632
3856 2632 1109 -1316 -1029 2166 2027 -1160 -1000 1180 1909 771 -175 -679 1089 2826 1522 -2044
3872 -2044 -831 2395 2229 1077 663 540 1248 2157 -243 -1695 1560 4480 2661 -263 -171 646 1485
3889 1485 1757 492 97 3304 4208 720 -1658 237 1578 1993 2100 932 212 2141 2360 -385 -850
3906 -850 1503 2418 1187 904 161 477 2104 2681 -179 -986 883 1155 -146 456 1808 1384 1797 1131
3924 1131 -635 -492 1624 1641 1035 1516 1831 1011 792 1028 424 1214 3384 3160 711 1048 1448 1078 1200
3943A200Q71q1L73K95j543r96K337Q52j927o65J472j22k48M8p91L34J665n41k403
3962A30l19K094O25j14l44j218O6R92m75k257P05K848P67j637j423k88M38J305
3980A895j82j453R29J790j487j675J215O69l51K36J24o55O80Q68j256n67J064
3997A844N23j590K0O80m7R57N99j740l67Q88m23j996J054K174nm72j703j103R36
4016B29J870o72j925J337K583k225j730o31L45J659J346r72k399J068K113j218
4032G78j627K62J53J655N82j714j727J771K269j484j984P03O65J67Q49j29n86
4049F03Q48P0k122n28J972O70n22Q42k58j389L28Qj249M85K453k1j313p17j02
4068E8n25R48L99j073Q10K189j886k525Q84J684m61j7j52j313J040J508j086j855
$$ plain form
3943 1200 2071 1990 2363 2658 1115 119 2456 3308 1381 716 2188 2066 1818 1866 1075 1409 3074 2533 130
3962 130 -189 1905 2530 2416 2072 854 920 1912 1437 -820 -115 2733 3500 1863 440 152 590 1895
3980 1895 1713 260 1189 2979 1492 -183 1032 1701 1350 1586 1710 1055 1735 2603 1347 780 1844
3997 1844 2367 777 797 1477 1430 2387 2986 1246 879 1767 1344 -652 402 2576 2571 2099 396 -707 229
4016 229 2099 1427 -498 839 3422 1197 -533 -1164 -819 840 2186 1214 -1185 -117 1996 778
4032 778 -849 -587 -434 1221 1803 89 -1638 133 2402 918 -1066 -363 302 469 1318 1189 603
4049 603 1451 1521 -601 -1129 843 1513 991 1833 1575 186 514 522 -727 -242 2211 2190 877 160 58
4068 58 -467 481 880 -193 617 2806 920 -1605 -721 963 502 485 333 -980 60 1568 482 -1373
4086a373J355J058q35l98j79m67J342K404j894k632P93J630m27l81M15J84J381
4103A976M50k789k109K523J919m47j038J62l23J22P22r43r16J592R62j579j072
4120g88Q75J77N64j19j541m23K348k70k284O1K200N13j937o30p67N12J777n12
4138b44j415J003J264j197k122L49J210P48J223r78k254N09J742r97j334Q73J498
4155a22O7K74j713j542J919K048j639k076J405J201m1n34k88j010J222J505j761
4172a085j621J391J607K1m26j547q23P10J662r99j217K352J083j370j910m67K92
4189b347J417J283j268o28J513N6k369l38J737N39M11j33j509o43K290J35k178
4206b032l5K162L73j154o82j93O82K201j034l098O47K718J17j420j66N36P06J30
$$ plain form
4086 -1373 -18 1040 205 -193 -372 -839 503 2907 1013 -1619 -826 804 377 -4 411 595 1976
4103 1976 2426 -363 -2472 51 1970 1523 485 647 324 446 1168 225 -691 901 1863 284 -788
4120 -788 87 264 828 709 -832 -1255 1093 823 -1461 -1400 800 1313 -624 -1254 -2021 -1509 268 -244
4138 -244 -1659 -656 608 -589 -2711 -2362 -1152 -404 819 -159 -2413 -1904 -162 -1159 -2493 -1620 -122
4155 -122 -55 219 -1494 -3036 -1117 931 -708 -2784 -1379 -178 -219 -753 -1041 -2051 -829 676 -1085
4172 -1085 -2706 -1315 292 313 -113 -1660 -2483 -1773 -111 -1110 -2327 25 1108 -262 -2172 -2639 -2347
4189 -2347 -930 353 -915 -1543 -30 26 -2343 -2681 -944 -405 6 -127 -1636 -2279 11 146 -2032
4206 -2032 -2067 95 468 -686 -1368 -1561 -879 1322 288 -2810 -2163 555 672 -748 -914 -378 328 458
4224D58j930j488K202L094j476k466L83O32P5o8j056j24J976J895k714k747J379
4241a975J758J84r83o87P8J589L38k505o14K344J120j863q32K94N59J196l81j916
4259b296J92K202j79k441o7J690R50K90j210k356O80K713o47k222R13K065L2j707
4277a398q36p41J714J964j008k189J321J330j020j006L34J22J027J062j831j296
4293b451J571J567j164j323O65KL11P8j002K17K317N10l201j193J915J248n38
4310d71P3m74K00J525j196k435J18L471Q33j822j202K64N50P44o01k200J377L319
4328B073o55k987j64J094R60J46j372j434J931K274j288k997J126K392j93j256
4344c50j167n8K238J955k174k383J396J254p81o29K03Q72J331l05k410j544K459
$$ plain form
4224 458 -1472 -2960 -758 2336 860 -1606 -1223 -591 -516 -584 -1640 -1764 212 2107 -607 -3354 -1975
4241 -1975 -217 -33 -1016 -1703 -1625 -36 302 -2203 -2817 -473 647 -1216 -2048 -1754 -1195 1 -380 -2296
4259 -2296 -2104 98 -81 -2522 -2589 -899 51 341 -869 -3225 -2545 168 -479 -2701 -1788 277 309 -1398
4277 -1398 -2234 -2975 -1261 703 -305 -2494 -1173 157 -863 -1869 -1535 -1413 -386 676 -1155 -2451
4293 -2451 -880 687 -477 -1800 -1135 -1133 -822 -744 -1746 -1529 788 1298 -1903 -3096 -1181 67 -471
4310 -471 -398 -872 -672 853 -343 -2778 -2660 811 1644 -178 -1380 -1116 -566 178 -423 -2623 -1246 2073
4328 2073 1418 -1569 -1733 -639 321 467 -905 -2339 -408 1866 578 -2419 -1293 1099 906 -350
4344 -350 -1517 -1575 663 2618 444 -1939 -543 711 -70 -699 -496 376 1707 1402 -1008 -2552 -93
4361i3J142j400n03J672K40n06j248j361Q54K812k98k349l7J819l06j511k81K29
4379a125J077J728j584k666J290K687o46j839m82N43Q93Q83j300j467J882K129
4395B003j817k736P96J492Q21O46j210q03J080Q73k124j396K332J366j67r09j119
4412h72k42J581J252j789q98J729P34j053n83j41m4J373N66k067n27J914K52j473
4430b88L84R61p05k66k05r65N86J992O9k351P7J002l80o21L74K4J002J577j927
4449C40k352Q16K024l16q50j01Q38N33K13j192j948J885J935r76j758Q25L95N08
4467H19M69j613q57J759J209k077l85J198N12j73l69j139p30J427J263j255j40
4484h2J131l56j328J43k17o0J327Q48j729l95Q11n72q18P27J405p45O6J31j252
$$ plain form
4361 -93 1049 -351 -854 818 1058 552 -696 -2057 -1203 1609 1311 -1038 -1075 744 438 -1073 -1354 -1125
4379 -1125 -48 1680 96 -2570 -1280 1407 761 -1078 -1560 -1017 -124 759 -541 -2008 -126 2003
4395 2003 186 -2550 -1754 -262 559 1205 -5 -808 272 1145 -979 -2375 -43 1323 1156 247 -872
4412 -872 -1114 467 1719 -70 -968 761 1495 442 -141 -282 -326 1047 1613 -454 -981 933 1185 -288
4430 -288 96 1057 352 86 -119 -1084 -498 1494 1563 -788 -711 291 -89 -710 -336 -312 690 2267 340
4449 340 -2012 -1196 828 512 -338 -439 399 932 1145 -47 -1995 -110 1825 849 -909 -84 311 819
4467 819 1288 -325 -1182 577 1786 -291 -676 522 1034 861 492 -647 -1377 50 1313 58 -82
4484 -82 1049 693 -635 -492 -709 -769 558 1406 -323 -718 93 -479 -1297 -570 835 90 156 287 -965
$$ [...]
8191d16
##END NTUPLES=NMR FID
##END=
