##TITLE=1H_TG-2268-b
 CDCl3, 8 sc, 
 9.1.2020
##JCAMPDX= 6.0         $$ Bruker NMR JCAMP-DX V2.0
##DATA TYPE= NMR FID
##DATA CLASS= NTUPLES
##ORIGIN= UXNMR, Bruker Analytische Messtechnik GmbH
##OWNER= root
$$ XWIN-NMR		Version 3.5
$$ Thu Jan  9 14:02:55 2020 Russian Standard Time (UT+4h)  she@DPX200
##.OBSERVE FREQUENCY= 200.1315
##.OBSERVE NUCLEUS= ^1H
##.DELAY= (6, 6)
##.ACQUISITION MODE= SIMULTANEOUS
##.ACQUISITION SCHEME= undefined
##.AVERAGES= 8
##.DIGITISER RES= 18
##SPECTROMETER/DATA SYSTEM= spect
##.PULSE SEQUENCE= zg30
##.SOLVENT NAME= CDCl3
##.SHIFT REFERENCE= (INTERNAL, CDCl3, 0, 15.7039)
##AUDIT TRAIL= $$ (NUMBER, WHEN, WHO, WHERE, WHAT)
$$ ##TITLE= Audit trail, XWIN-NMR		Version 3.5
$$ ##JCAMPDX= 5.01
$$ ##ORIGIN= Bruker BioSpin GmbH
$$ ##OWNER= she
$$ F:/spectra/data/she/nmr/H-F/1/audita.txt
$$ ##AUDIT TRAIL=  $$ (NUMBER, WHEN, WHO, WHERE, WHAT)
(   1,<2020-01-09 14:01:45.31 +0400>,<she>,<DPX200>,
      <created by zg, POWCHK disabled, PULCHK disabled
       configuration hash MD5:
       00 E9 B6 7A A2 85 ED C7 34 08 36 98 17 FE 4E 26
       data hash MD5: 16K
       9B 59 7E 31 CE 80 CE 5D 81 B7 64 86 78 19 E8 9C>)
$$ ##END=
$$ 
$$ hash MD5
$$ 61 A6 69 3B EC 86 3E 58 8D 8B 4F 11 EE 13 4D CF
##$RELAX= 
##$RELAX= 
##$RELAX= 
##$RELAX= 
##$RELAX= 
##$RELAX= 
$$ Bruker specific parameters
$$ --------------------------
##$DU= <F:/spectra>
##$EXPNO= 1
##$NAME= <H-F>
##$PROCNO= 1
##$TYPE= <nmr>
##$USER= <she>
##$AMP= (0..31)
100 100 100 100 100 100 100 100 100 100 100 100 100 100 100 100 100 100 
100 100 100 100 100 100 100 100 100 100 100 100 100 100 
##$AQSEQ= 0
##$AQ_mod= 1
##$AUNM= <au_zg>
##$AUTOPOS= <>
##$BF1= 200.13
##$BF2= 200.13
##$BF3= 200.13
##$BF4= 200.13
##$BF5= 200.13
##$BF6= 200.13
##$BF7= 200.13
##$BF8= 200.13
##$BYTORDA= 1
##$CFDGTYP= 0
##$CFRGTYP= 5
##$CHEMSTR= <none>
##$CNST= (0..31)
1 1 145 1 1 1 1 1 1 1 1 1 1 1 1 1 1 1 1 1 1 1 1 1 1 1 1 1 1 1 1 1 
##$CPDPRG= <>
##$CPDPRG1= <>
##$CPDPRG2= <>
##$CPDPRG3= <>
##$CPDPRG4= <mlev>
##$CPDPRG5= <mlev>
##$CPDPRG6= <mlev>
##$CPDPRG7= <mlev>
##$CPDPRG8= <mlev>
##$CPDPRGB= <>
##$CPDPRGT= <>
##$D= (0..31)
0 1.2 0 0 0 0 0 0 0 0.06 0 0.03 0 0 0 0 0.0002 0 0 0 0 0 0 0 0 0 0 0 0 
0 0 0 
##$DATE= 1578564104
##$DBL= (0..7)
120 120 120 120 120 120 120 120 
##$DBP= (0..7)
150 150 150 150 150 150 150 150 
##$DBP07= 0
##$DBPNAM0= <>
##$DBPNAM1= <>
##$DBPNAM2= <>
##$DBPNAM3= <>
##$DBPNAM4= <>
##$DBPNAM5= <>
##$DBPNAM6= <>
##$DBPNAM7= <>
##$DBPOAL= (0..7)
0.5 0.5 0.5 0.5 0.5 0.5 0.5 0.5 
##$DBPOFFS= (0..7)
0 0 0 0 0 0 0 0 
##$DE= 6
##$DECBNUC= <off>
##$DECIM= 24
##$DECNUC= <off>
##$DECSTAT= 4
##$DIGMOD= 1
##$DIGTYP= 9
##$DL= (0..7)
0 120 120 120 120 120 120 120 
##$DP= (0..7)
150 150 150 150 150 150 150 150 
##$DP07= 0
##$DPNAME0= <>
##$DPNAME1= <>
##$DPNAME2= <>
##$DPNAME3= <>
##$DPNAME4= <>
##$DPNAME5= <>
##$DPNAME6= <>
##$DPNAME7= <>
##$DPOAL= (0..7)
0.5 0.5 0.5 0.5 0.5 0.5 0.5 0.5 
##$DPOFFS= (0..7)
0 0 0 0 0 0 0 0 
##$DQDMODE= 0
##$DR= 18
##$DS= 0
##$DSLIST= <SSSSSSSSSSSSSSS>
$$ [...]
##$SUBNAM2= <"">
##$SUBNAM3= <"">
##$SUBNAM4= <"">
##$SUBNAM5= <"">
##$SUBNAM6= <"">
##$SUBNAM7= <"">
##$SUBNAM8= <"">
##$SUBNAM9= <"">
##$SW= 24.9337058887773
##$SWIBOX= (0..15)
0 0 2 0 0 0 0 0 0 0 0 0 0 0 0 0 
##$SW_h= 4990.01996007984
##$TD= 16384
##$TD0= 1
##$TE= 0
##$TE2= 300
##$TE3= 300
##$TEG= 300
##$TL= (0..7)
0 120 120 120 120 120 120 120 
##$TP= (0..7)
150 150 150 150 150 150 150 150 
##$TP07= 0
##$TPNAME0= <>
##$TPNAME1= <>
##$TPNAME2= <>
##$TPNAME3= <>
##$TPNAME4= <>
##$TPNAME5= <>
##$TPNAME6= <>
##$TPNAME7= <>
##$TPOAL= (0..7)
0.5 0.5 0.5 0.5 0.5 0.5 0.5 0.5 
##$TPOFFS= (0..7)
0 0 0 0 0 0 0 0 
##$TUNHIN= 0
##$TUNHOUT= 0
##$TUNXOUT= 0
##$USERA1= <user>
##$USERA2= <user>
##$USERA3= <user>
##$USERA4= <user>
##$USERA5= <user>
##$V9= 5
##$VALIST= <valist>
##$VCLIST= <CCCCCCCCCCCCCCC>
##$VD= 0
##$VDLIST= <DDDDDDDDDDDDDDD>
##$VPLIST= <PPPPPPPPPPPPPPP>
##$VTLIST= <TTTTTTTTTTTTTTT>
##$WBST= 1024
##$WBSW= 4
##$XGAIN= (0..3)
0 0 0 0 
##$XL= 0
##$YL= 0
##$YMAX_a= 887859
##$YMIN_a= -690708
##$ZGOPTNS= <>
##$ZL1= 120
##$ZL2= 120
##$ZL3= 120
##$ZL4= 120
##$ABSF1= 10
##$ABSF2= 0
##$ABSG= 5
##$ABSL= 3
##$ALPHA= 0
##$AQORDER= 0
##$ASSFAC= 0
##$ASSFACI= 0
##$ASSFACX= 0
##$ASSWID= 0
##$AUNMP= <proc_1d>
##$AZFE= 0.1
##$AZFW= 0.1
##$BCFW= 1
##$BC_mod= 2
##$BYTORDP= 1
##$COROFFS= 0
##$CY= 11.3945322036743
##$DATMOD= 1
##$DC= 2
##$DFILT= <>
##$DTYPP= 0
##$F1P= 16.9975609425685
##$F2P= -3.02152046262296
##$FCOR= 0.5
##$FTSIZE= 0
##$FT_mod= 4
##$GAMMA= 1
##$GB= 0.15
##$INTBC= 1
##$INTSCL= 1
##$ISEN= 128
##$LB= 0.24
##$LEV0= 0
##$LPBIN= 0
##$MAXI= 10000
##$MC2= 0
##$MEAN= 0
##$ME_mod= 0
##$MI= 1.114404
##$NCOEF= 0
##$NC_proc= 0
##$NLEV= 6
##$NOISF1= 3.799351
##$NOISF2= 2.8
##$NSP= 1
##$NTH_PI= 0
##$NZP= 0
##$OFFSET= 15.70392
##$PC= 1
##$PHC0= -10145.8
##$PHC1= 13.8008
##$PH_mod= 1
##$PKNL= yes
##$PPARMOD= 0
##$PSCAL= 0
##$PSIGN= 0
##$REVERSE= no
##$SF= 200.130013532006
##$SI= 16384
##$SIGF1= 3
##$SIGF2= 2
##$SINO= 400
##$SIOLD= 16384
##$SREGLST= <1H.CDCl3>
##$SSB= 0
##$STSI= 0
##$STSR= 0
##$SW_p= 3612.71676300578
##$SYMM= 0
##$S_DEV= 0
##$TDeff= 0
##$TDoff= 0
##$TI= <>
##$TILT= no
##$TM1= 0
##$TM2= 0
##$TOPLEV= 0
##$USERP1= <user>
##$USERP2= <user>
##$USERP3= <user>
##$USERP4= <user>
##$USERP5= <user>
##$WDW= 1
##$XDIM= 8192
##$YMAX_p= 0
##$YMIN_p= 0
$$ End of Bruker specific parameters
$$ ---------------------------------
##NTUPLES= NMR FID
##VAR_NAME=  TIME,          FID/REAL,        FID/IMAG
##SYMBOL=    X,             R,               I
##VAR_TYPE=  INDEPENDENT,   DEPENDENT,       DEPENDENT
##VAR_FORM=  AFFN,          ASDF,            ASDF
##VAR_DIM=   8192,          8192,            8192
##UNITS=     SECONDS,       ARBITRARY UNITS, ARBITRARY UNITS
##FACTOR=    0.0002004,     1,               1
##FIRST=     0,             0,               0
##LAST=      1.6414764,     0,               0
##MIN=       0,             -690708,         0
##MAX=       1.6414764,     887859,          0
$$ Real data points
##PAGE= N=1
##DATA TABLE= (X++(R..R)), XYDATA
$$ [...]
2906h560R427K798n658o806J909R523L488r463p516O833R497k040q735k225O529
$$ -8560 867 3665 -1993 -8799 -6890 2633 6121 -3342 -10858 -4025 5472 3432 -5303 -7528 -999
2921i99P350j576r763k817J0238N996p138p659L145P587K554n812p091K583R667
$$ -999 6351 4775 -4988 -7805 2433 8429 1291 -6368 -3223 4364 6918 1106 -5985 -3402 6265
2936F265J253r898m493P555O683k629p581l098N824P262l343j0323j64J0056L451
$$ 6265 7518 -2380 -6873 682 7365 4736 -2845 -5943 -119 7143 3800 -6523 -6687 3369 6820
2951F820p028n549J983O559K967o622p486M703R765j014r094k601O129O183j295
$$ 6820 -208 -5757 -3774 2785 5752 -870 -8356 -3653 6112 5098 -3996 -6597 -468 5715 4420
2966D420p627l750P674P655m792r311J741Q636K556n024o116J162Q165L762q227
$$ 4420 -3207 -6957 717 8372 3580 -5731 -3990 4646 7202 2178 -3938 -2776 5389 9151 924
2981I24o831N945Q079j831p412l056M432O913r98q548l416Q459N482n417o832
$$ 924 -5907 38 8117 6286 -1126 -4182 250 7163 6165 -2383 -5799 2660 8142 2725 -4107
2996d107J142N650K712m664p243J626R293J508r085m143O279N522k321o346k992
$$ -4107 -2965 2685 5397 733 -6510 -4884 4409 5917 -3168 -7311 -1032 4490 2169 -4177 -7169
3011g169N393P114k783q992L72Q805K097o016n150K443O927L130o510o335N046
$$ -7169 -1776 5338 2555 -6437 -6065 2740 4837 -1179 -6329 -3886 3041 6171 -339 -6674 -1628
3026a628Q892k387q459j802O359N700j647p158l052Q017O111n751q182K741P654
$$ -1628 7264 4877 -3582 -5384 975 6675 5028 -2130 -5182 2835 8946 3195 -4987 -2246 5408
3041E408J092n247m993J690P354J653p562m484N635N907l147n971p92L790M220
$$ 5408 6500 1253 -3740 -2050 5304 6957 -605 -5089 546 6453 3306 -2665 -3457 333 4553
3056D553j518o203q36O704J682n528l112L268L774j79l423l098K963N418j923
$$ 4553 3035 -3168 -4004 2700 4382 -1146 -4258 -990 2784 2605 -818 -3916 -953 4465 2542
3071B542o389K64O116J390k605k879M53L535K842l992m764K907N987j001m988
$$ 2542 -3847 -3583 2533 3923 1318 -1561 -1108 2427 5269 1277 -3487 -580 5407 4406 -582
3086e82r79K884L724j99m849l143M340N578l237n769J3M261K365j461m607j687
$$ -582 -1561 1323 5047 4848 -1 -3144 1196 6774 3537 -2232 -2219 2042 4407 2946 -1661 -3348
3102c348M547L688l944m816K249L817J17k960k992L43M811J352m825l206M262
$$ -3348 1199 4887 943 -3873 -1624 2193 2310 -650 -3642 -3299 1512 2864 -1961 -5167 -905
3117i05L493k133l054m43J650K581o20m135j46N072J022m471j556L363K376p21
$$ -905 2588 455 -2599 -3042 -1392 1189 569 -3566 -3712 1360 2382 -2089 -3645 -282 2094 1373
3133A373l303k127L359M976k457o279J048O015J409m105l529J111M857K342n008
$$ 1373 -1930 -4057 -698 4278 1821 -4458 -3410 2605 4014 -91 -3620 -2509 2348 4690 -318
3148c18n462M114O412j847o490j538M173M428q24o240l154O414N424m591o368
$$ -318 -5780 -1666 4746 2899 -3591 -5129 -956 3472 2648 -3592 -6746 -332 5092 501 -5867
3163e867R32N293J989k750m426j11O306K531n957l845M463L809j512l960j123
$$ -5867 -4935 358 2347 -403 -4829 -4940 1366 3897 -2060 -5905 -1442 2367 855 -3105 -4228
3178d228L109M018r24n836k60O071J632m608k567K666L116N85k783l362K759N125
$$ -4228 -1119 2899 1975 -3861 -4121 1950 3582 -1026 -3593 -927 2189 2774 -9 -3371 -612 4513
3194D513j952o031J92N599J676k470l694j075M824L592m131o163K236O145J18
$$ 4513 2561 -3470 -3278 2321 3997 1527 -2167 -3242 1582 5174 1043 -5120 -2884 3261 3379
3209C379m117k596M65N031J801m837m716L936N581j773m954j152K690M103M36
$$ 3379 -738 -3334 -2869 2162 3963 -874 -5590 -1654 3927 2154 -2800 -3952 -1262 2841 3277
3224C277n348l558M839N553k619n408j58M047K462p96m357j754N046L371m281
$$ 3277 -2071 -5629 -790 4763 2144 -3264 -3422 625 3087 2291 -2066 -3820 1226 4597 316
3239C16l884K465M064N10l209l379J249N605R6o240k111N595L450l225m050k56
$$ 316 -3568 -1103 2961 3471 262 -3117 -1868 3737 3833 -2407 -4518 1077 4527 1302 -2748 -3004
3255c004L483L158l092n879J337P643L44p263l322M997N079n25o568m185O316
$$ -3004 479 3637 545 -5334 -3997 3646 3990 -3273 -6595 -1598 3481 2956 -3612 -7797 -1481
3270a481P637l656q796m04Q231L783m341p467K66Q182N026p037p797M486R337
$$ -1481 6156 2500 -6296 -6700 1531 5314 973 -6494 -6228 1954 6980 -57 -7854 -3368 5969
3285E969m38p463m237M075P237N34p848m748O861O887l191p382l73N279L471k261
$$ 5969 5531 -1932 -6169 -2094 5143 5677 -2171 -6919 -58 6829 3638 -3744 -4117 1162 4633 2372
3301B372n487n03O366K234o078l608M785L519j526l775j328K605L931j270n979
$$ 2372 -3115 -3618 2748 4982 -1096 -4704 81 3600 2074 -1701 -3029 -424 3507 2237 -3742
3316c742L83O025J021m430k649K181L988L55l681m015L997O456j597o950j205
$$ -3742 -3359 2666 3687 -743 -3392 -1211 2777 3132 -549 -4564 -567 5889 4292 -2658 -3863
3331c863M681M327r92n351l222N761O957k933q575k36N767L884k211n364j899
$$ -3863 818 5145 4153 -1198 -4420 1341 8298 5365 -3210 -3446 2321 6205 3994 -1370 -3269
3346c269N696N472m238p892J257O826K535m434n204j00O119L326n608o552L392
$$ -3269 2427 7899 3661 -4231 -2974 3852 6387 1953 -3251 -3351 2768 6094 486 -6066 -2674
3361b674O478P5m656l150J759L992N60n408k235N481L416m498l840K398L855J09
$$ -2674 3804 3879 -777 -3927 -2168 1824 2384 -3024 -5259 222 3638 -860 -4700 -2302 1553 1662
3377A662l755k828K976O147j219p504j408Q021K985m882n496J990O644L676o634
$$ 1662 -2093 -4921 -1945 4202 2983 -4521 -5929 2092 5077 195 -5301 -3311 3333 7009 375
3392C75p410M298J0089l18r878l888O444P591j140q974m458P626Q704l962j0210
$$ 375 -7035 -2737 7352 7034 -2844 -6732 -288 7303 6163 -2811 -7269 357 9061 5099 -5111
3407e111J21P721L941n040o782L63P825L386o934n686M582O367j316n811j643
$$ -5111 -4990 2731 6672 1632 -5150 -4787 3038 6424 -510 -6196 -1614 4753 3437 -2374 -4017
3422d017L290M061o92n168j183N215K200m277k426L242K521r64k716j282L467
$$ -4017 -727 3334 2642 -2526 -3709 1506 3706 -571 -2997 245 2766 1802 -914 -2196 1271
3437A271L891k731n477J234O033O93m535k601J613M700J590l930n033L381N529
$$ 1271 5162 2431 -3046 -1812 4221 4914 379 -2222 -609 4091 5681 1751 -3282 99 5628
3452E628j328n256j421K861L920K2m897l540L484N757j854n898j405L569L099
$$ 5628 4300 -956 -2377 484 4404 4426 -471 -4011 -527 5230 3376 -2522 -3927 -358 2741
3467B741j56m503m123L670N975j432n223j481L084K826q03l451k552M278M271
$$ 2741 2585 -1918 -6041 -2371 3604 2172 -3051 -4532 -1448 1378 575 -2876 -5428 -1150 3121
3482C121k518m792J235L290R73k149k403J036L862J855m208k373L537K547k640
$$ 3121 603 -4189 -2954 336 1309 -840 -3243 -2207 1655 3510 -698 -3071 466 3013 373
3497C73k218J544L326O19k971l587K415O259j141p312j119O437M138l709o677
$$ 373 -1845 -301 3025 3644 673 -2914 -499 5760 4619 -2693 -3812 2625 6763 3054 -3623
3512c623j292O816N719n318q495K450R356J071q187n977L752Q074K003q384n870
$$ -3623 -4915 1901 7620 2302 -6193 -3743 5613 6684 -1503 -7480 -3728 4346 6349 -2035 -7905
3527g905N757Q746k189r420k550O248O107j474p042k462O468M697m574n293K428
$$ -7905 -2148 6598 4409 -5011 -7561 -1313 4794 3320 -3722 -6184 284 4981 407 -4886 -2458
3542b458M494O46k817k268J777L615l38m428n25N046J034l881j895K643K360p12
$$ -2458 2036 2682 -135 -2403 -626 2989 2651 -1777 -2302 2744 3778 -103 -1998 645 3005 2293
3558B293k689j613L366L436k716n343N99N852J217l897l680L46M960K960m081
$$ 2293 -396 -2009 1357 4793 2077 -3266 -2667 3185 4402 505 -3175 -2829 2131 5091 1010
3573A010o225J702N777J221l588l998K20M163L332l174n541Q58N447J581l307
$$ 1010 -5215 -3513 2264 3485 -103 -4101 -3881 282 3614 440 -5101 -4243 1204 2785 -522
3588e22l284j96L868M074k625o132O90N712K201l028l862o20M581L937k631n622
$$ -522 -3806 -4002 -134 3940 1315 -4817 -4127 1585 3786 758 -3104 -3724 857 4794 2163 -3459
3604c459Q9N507J274l017j847Q69K149J673k498k716K025K587k116k372K170J833
$$ -3459 -3370 2137 3411 394 -1453 -584 1565 3238 740 -1976 49 2636 520 -1852 318 2151
3620B151q64k497r11J554K699j044m869N92O107Q17n871l965L486N327Q10o222
$$ 2151 1287 -1210 -2121 -567 2132 1088 -3781 -3189 2918 3735 -2136 -6101 -2615 2712 3522 -2700
3636b700m791N046Q312j727r673l150P350O880k405p412l067P060O931m243r016
$$ -2700 -7491 -2445 5867 4140 -5533 -8683 -1333 5547 3142 -4270 -7337 -277 6654 2411 -6605
3651f605P92P981L900m909n667P37N904K972n104n333L056O617k05m535j927J500
$$ -6605 -5813 2168 6068 1159 -4508 -3771 2133 5105 1 -5332 -2276 4341 4136 -399 -2326 -826
3667h26K291K37k104j016K437R43k530r99K111M15k339q86J827J832O78k837l251
$$ -826 1465 1702 -402 -1418 1019 1962 -568 -1567 544 959 -1380 -2266 -439 1393 2071 -766 -4017
3684d017K426L837r73m630l10L589K438j153l932k020L777M001k194m903J15M211
$$ -4017 -1591 2246 1273 -3357 -3667 -78 2360 1207 -2725 -4745 -968 3033 839 -4064 -3949 262
3700B62K288j402m080j941L436M714r00m871j259L370K571J73l262l017J906N473
$$ 262 2550 1148 -2932 -4873 -1437 3277 2377 -2494 -3753 -383 2188 2361 -901 -3918 -2012 3461
3716C461k53m514k160K686L238K30k984l086K244M546o00m847j255L401K504q87
$$ 3461 3208 -1306 -3466 -780 2458 2688 -296 -3382 -1138 3408 2808 -2039 -3294 107 2611 1724
3732A724k391j747K171K875j709k621R60K376r64j919N18J647L19j341j827J548
$$ 1724 -667 -2414 -243 2632 923 -1698 -738 1638 674 -1245 -727 920 1239 -102 -1929 -381
3748c81L519l8n233j791N139L030k691m806K51N024L446m106p161J997Q086J735
$$ -381 3138 3100 -2133 -3924 1215 4245 1554 -3252 -3001 2023 5469 1363 -5798 -3801 4285 6020
3764F020o778m779L461O804M80p020n413M840Q918j656q375k390N812M330k331
$$ 6020 -758 -5537 -2076 4728 5208 -1812 -7225 -2385 6533 4877 -3498 -5888 -76 4254 1923
3779A923n648j248N517M407m252n544K324M575n76l659j084K602L217j028m330
$$ 1923 -3725 -4973 544 4951 699 -4845 -2521 2054 1478 -2181 -3265 -663 2554 1526 -2804
3794b804q45M549J217m080j934M054K717j660m070j216M456L552k797o034J412
$$ -2804 -3649 900 2117 -1963 -3897 157 2874 1214 -2856 -4072 384 3936 1139 -4895 -3483
3809c483O978J436n710m595K061N679K407m631n164L179O004l14n705l076L254
$$ -3483 3495 4931 -779 -5374 -3313 2366 4773 142 -5022 -1843 4161 3847 -1858 -4934 -1680
3824a680M432J136m275l620K814M926q44n046j133K791L383R24l043l695J417
$$ -1680 2752 3888 -387 -4007 -1193 3733 2889 -2157 -3290 -499 2884 3808 765 -2930 -1513
3839a513L974K64l407p91J411K732L94j897k888J064L470m22k383J41J870L25
$$ -1513 2461 2725 -682 -1473 -62 2670 3064 1167 -1721 -657 2813 2391 8 149 2019 2344
3855B344p69j647k04J928J304k396j410K381J896k587k333O74K605J024k066l763
$$ 2344 1575 -72 -276 1652 2956 560 -850 1531 3427 840 -1493 -819 1786 2810 744 -3019
3871c019J769N333j97o259l163N065N263j812o357k687N217O931l114q936q38
$$ -3019 -1250 4083 3886 -2373 -5536 -471 4792 2980 -3377 -6064 -847 6084 2970 -5966 -6804
3886f804Q287M288m694o915M06P330M154n653p570K812Q466R73p252m140M487
$$ -6804 1483 5771 1077 -5838 -5432 1898 6052 399 -7171 -4359 4107 5080 -2172 -6312 -1825
3901a825O251N4o464l400M885N376k841n435Q26M927J018k856k871J481L871l89
$$ -1825 4426 4480 -1984 -5384 -499 4877 2036 -3399 -2573 2354 3372 516 -2355 -874 2997 2608
3917B608m703j220N166K654m587l616J381M201J280l754l771K790N553j106o566
$$ 2608 -2095 -3315 1851 4505 -82 -3698 -2317 1884 3164 -590 -4361 -1571 3982 2876 -3690
3932c690j543M951L703j681m770j555M425M078k913o158M44N723K739k546l800
$$ -3690 -5233 -282 3421 1740 -3030 -4585 -160 3918 1005 -5153 -4709 1014 3753 1207 -2593
3947b593p30L180K958j773m540N81M562J699j758k631p49J553L144r52l456L87
$$ -2593 -3323 -143 2815 1042 -3498 -2917 1645 3344 1586 -1045 -1794 -241 2903 1951 -1505 -1118
3963a118L171J398j231k371q78J230K647n51k647J69K239J38j631j228M20M89
$$ -1118 2053 3451 2220 -151 -1029 201 2848 2297 -350 -181 2058 2196 565 -663 -243 246
3979B46J125j068r66J340J116k561j761K116K020q72k176q74J666K462j165m104
$$ 246 1371 303 -663 677 1793 -768 -2529 -413 1607 735 -1441 -2315 -649 1813 648 -3456
3995c456j049N045K779l101l870O08M117K285l883m921J921P295J396o113m080
$$ -3456 -4505 540 3319 218 -3652 -3044 1073 3358 -525 -5446 -3525 3770 5166 -947 -5027
4010e027L459N178N8m827l806M002O211j156o547j888M605L543k222l735l40L647
$$ -5027 -1568 3610 3668 -1159 -4965 -963 5248 4092 -2455 -4343 262 3805 1583 -2152 -2492 1155
4026A155K928k940m505J235L851o9l065p96J563J629n94k110p92J978J356k951
$$ 1155 4083 1143 -3362 -2127 1724 1655 -1410 -2206 -643 986 392 -1718 -2510 -532 824 -2127
4042b127j206K313J746j560j753%K104J599j487l486N09M407P41k802k062J750
$$ -2127 -3333 -1020 726 -834 -2587 -2587 -483 1116 -371 -3857 -3348 1059 1800 -1002 -3064 -1314
4058a314K486J106k912k791J950M301K68l702j286K276K386m01k369j942J744
$$ -1314 1172 2278 -634 -3425 -1475 2826 3094 -608 -1894 382 2768 2367 -2 -1944 -200
4073b00L630J25l637j001J562J807R13k139k016L78L386J8k824j388J215J551
$$ -200 3430 3555 -82 -1083 479 2286 3199 1060 -956 -578 2808 2826 2 -1386 -171 1380
4089A380N16o08k428O20K162n08k623n09J747J267l37j139p56N79R54j035j581
$$ 1380 1896 1288 -1140 -520 1642 1134 -1489 -1998 -251 1016 679 -460 -1216 -637 317 -718 -2299
4106b299J142J921p60j156Q00Q08l22j236j563Q21L631P81l691j750K886L076
$$ -2299 -1157 764 4 -1152 -352 456 134 -1102 -2665 -1844 1787 2568 -1123 -2873 13 3089
4122C089j975k976q33L145L768j517n280q13N471J859l468l388J143M437J767
$$ 3089 1114 -1862 -2695 450 4218 2701 -2579 -3392 2079 3938 470 -2918 -1775 2662 4429
4137D429l527m773J068N341O39m449k602L331L058l41l827k377K880L346j126
$$ 4429 902 -3871 -2803 2538 3177 -1272 -3874 -543 2515 2174 -1653 -4030 -1150 2196 1070
4152A070l434K76K793N00k247j353K66K781O71k661r19K392J728k328k081J141
$$ 1070 -2364 -2088 705 1205 -1042 -2395 -2129 652 1323 -1338 -2257 135 1863 -465 -2546 -1405
4168a405K966K39j763j979J114L444l86m140j114L979K911j565l533j237L278
$$ -1405 1561 1800 37 -1942 -828 2616 2230 -1910 -3024 955 3866 2301 -1232 -2469 809
4183H09L403k190m554l95M916K158k706l081J9K835K496k288m147L03M207J400
$$ 809 4212 2022 -2532 -2927 1989 4147 1441 -1640 -1621 1214 3710 1422 -2725 -2422 1785 3185
4199C185l029k281Q53K482J303k130l331P33L911Q9k334j121J048J646L46j870
$$ 3185 156 -2125 -1272 1210 2513 383 -2948 -2215 1696 1785 -549 -1670 -622 1024 1370 -500
4215e00j768J197K337l33k224O94J672k22p73r65k28K048J028k220j608K261K311
$$ -500 -2268 -1071 1266 933 -1291 -597 1075 853 80 -885 -1113 935 1963 -257 -1865 396 2707
4232B707j836k393N31K057J633j077l193j55L432J561l473k268K223L598k90l041
$$ 2707 871 -1522 -991 1066 2699 1622 -1571 -1726 1706 3267 -206 -2474 -251 3347 3057 16
4248A6l285J867M705j87n100j404M549L053j998m457j005K933L658j913m600Q91
$$ 16 -3269 -1402 3303 3116 -1984 -3388 1161 4214 2216 -2241 -3246 -313 3345 1432 -3168 -2277
4264b277M732Q67l892l031J606L476Q30k995k509K401M207j619m425k96L026K028
$$ -2277 2455 3322 -570 -3601 -1995 1481 2311 -684 -3193 -792 3415 1796 -2629 -2925 101 2129
4280B129j191k159m54K749J243l368k257K761K981r95k523p33J631K601j065l872
$$ 2129 938 -1221 -1675 1074 2317 -1051 -3308 -547 2434 1439 -1084 -1817 -186 2415 1350 -2522
4296b522J2L690J955k991k552J484K179M51j995k136J298L745K31m049j379K824
$$ -2522 -2510 1180 3135 144 -2408 -924 1255 1706 -289 -2425 -1127 2618 2849 -1200 -2579 245
4312B45J524n72j841j164J821K740r79l885j6K581J122j219j048N7J226J052j301
$$ 245 1769 1197 -644 -1808 13 2753 1774 -2111 -2127 454 1576 357 -691 -634 592 1644 343
4329C43k430P16K360p4j276n74N96R11K66j492j366J345K156j230j699M17J087
$$ 343 -2087 -1371 989 915 -361 -935 -339 572 838 -654 -2020 -675 1481 251 -1448 -1031 56
4346E6M45p21j202j57J942J005k080j638K125K156r42j732q32J057K128k28k961
$$ 56 501 -220 -1422 -1579 363 1368 -712 -2350 -225 1931 989 -743 -1575 -518 1610 1382 -1579
4363a579p86L186K024j806k562L50K114R79j101k853K67M029J024l480j865J870
$$ -1579 -2365 821 2845 1039 -1523 -1173 941 1920 819 -2034 -1767 2262 3286 -194 -2059 -189
4379a89K213M4k214j933J282L507q74l116r11K756J379j246j855k35J576J219
$$ -189 2024 2068 -146 -2079 -797 2710 1836 -1280 -2191 565 1944 698 -1157 -1392 184 1403
4395A403j415k210J284K590p11k025k38J425Q91q65k012k3K695J481k240k151
$$ 1403 -12 -2222 -938 1652 941 -1084 -1322 103 994 129 -1883 -1906 789 2270 30 -2121
4411b121J641J931o07j979j188J593K731k1l222j259K976J394j572k329N43K131
$$ -2121 -480 1451 844 -1135 -2323 -730 2001 1980 -1242 -2501 475 1869 297 -2032 -1489 642
4427F42J470r94k811m13L089Q73k560j285J278J473N53j291k314M18K655Lk490
$$ 642 2112 1118 -1693 -2106 983 1856 -704 -1989 -711 762 1315 24 -2290 -1872 783 786 -1704
4444a704l84J286J207o09j338j190J236J670J36k307J70J625O3q54o66K20J295
$$ -1704 -2088 -802 405 -204 -1542 -2732 -1496 174 310 -1997 -1827 -202 -139 -993 -1659 -1439 -144
4461a44J071r83k182J304J501l82j742L88J261J155J36j572j210J988J765j780
$$ -144 927 -56 -2238 -934 567 185 -1557 -1169 92 1247 1383 -189 -1399 589 2354 574
4477E74j861J103K185J047j890j855l3K577J274l097j676K270K648q99k399j429
$$ 574 -1287 -184 2001 3048 1158 -697 -730 1847 3121 24 -1652 618 3266 2367 -32 -1461
4493a461J421K478k06l063j587L221K571k428k423R0K115J406j279l002N75L062
$$ -1461 -40 2438 2232 -831 -2418 803 3374 946 -1477 -1387 728 2134 855 -2147 -1572 1490
4509A490N29k916j503J979J493M11k224j701J909K480o82k880L76K193R89j775
$$ 1490 2019 -897 -2400 -421 1072 1483 -741 -2442 -533 1947 1265 -1615 -1239 954 1943 168
4525A68j363L72J944J301k359k170K170K455p28k486l92J911J673o23k955n17
$$ 168 -1195 -823 1121 2422 63 -2107 63 2518 1790 -696 -1088 823 2496 1873 -1082 -1599
4541a599K882J560k456k594J423K499K61j540k627M80K881Q64k687k322K532K299
$$ -1599 1283 2843 387 -2207 -784 1715 1976 436 -2191 -1711 1170 2034 -653 -2975 -443 1856
4557A856o78l008j116J611K451M3l210n30K680J403j818k155M27J658J796q66
$$ 1856 1178 -1830 -2946 -1335 1116 1159 -2051 -2581 99 1502 -316 -2471 -2044 -386 1410 544
4573E44k473N05K619N88k633r15J491J815L92j807j387J016K825r44k774K81K328
$$ 544 -1929 -1424 1195 1783 -850 -1765 -274 1541 1933 126 -1261 -245 2580 1636 -1138 -857 1471
4590A471J354j430j861M2J474J477j829k022J373K892r84j978j423J269K259j69
$$ 1471 2825 1395 -466 -424 1050 2527 698 -1324 49 2941 1957 -21 -1444 -175 2084 1915
4606A915k363j498K434K288j803l016L97K076J137j050k540N91K764Q94k796k341
$$ 1915 -448 -1946 488 2776 973 -2043 -1646 430 1567 517 -2023 -1432 1332 2226 -570 -2911
4622b911J762K611n5j949j398J395K141J31l518m90L028J749j680j825J92J693
$$ -2911 -1149 1462 1407 -542 -1940 -545 1596 1727 -1791 -2281 747 2496 816 -1009 -817 876
4638H76J413j309k721J028L507k05l193m35J499J297J07j963j278K160J603j438
$$ 876 2289 980 -1741 -713 2794 2589 -604 -1039 460 1757 1864 -99 -1377 783 2386 948
4654I48k736M37K643L90j639j202k35K564R33k687j882J774K311j151j942k96
$$ 948 -1788 -1351 1292 1682 43 -1159 -1394 1170 2103 -584 -2466 -692 1619 468 -1474 -1770
4670a770J330J330p64j976k79K182J586k268j643R64J814K07j254j229M79K156
$$ -1770 -440 890 126 -1850 -2129 53 1639 -629 -2272 -1308 506 713 -541 -1770 -1291 865
4686H65J24k239n57J825J266p81j314j79R65J733q25k382K90K746j2j584o80L47
$$ 865 989 -1250 -1807 18 1284 503 -811 -990 -25 1708 883 -1499 -1209 1537 1525 -59 -739 -392
4704c92J160O46j127j545J247J984m10k355j15J234N01m81j189k32J581J242j420
$$ -392 768 1414 287 -1258 -11 1973 1563 -792 -907 327 828 347 -842 -1074 507 1749 329
4721C29k107R76J832k48j114p67J19J708N31k212j339K231J429q81j471J06R34
$$ 329 -1778 -802 1030 782 -332 -1099 -980 728 1259 -953 -2292 -61 1368 487 -984 -878 56
4738E6J082m20j914j62K360O15j724j159J120J157p3j159j065J273K029j12k582
$$ 56 1138 718 -1196 -1358 1002 1617 -107 -1266 -146 1011 938 -221 -1286 -13 2016 1904 -678
4755f78j76J566Q45j039j526L47J515J170j050k486R82J905k25j678j231J866
$$ -678 -854 712 1557 518 -1008 -661 854 2024 974 -1512 -530 1375 1150 -528 -1759 107
4771A07J049m1j765p49J132J757j460j756M25K112M02r06j928j3K298O79k020
$$ 107 1156 1115 -650 -1399 -267 1490 30 -1726 -1301 811 1213 307 -1621 -1634 664 1343 -677
4788f77j607J655J826l45j726n52O99J720o53j360n14J794J427j904j261M97J437
$$ -677 -2284 -629 1197 852 -874 -1426 -727 993 340 -1020 -1534 260 1687 -217 -1478 -981 456
4805D56Q41r03k111N79K559O4j985n34J393J065l91j082r62Q66J651p72j737P9
$$ 456 1297 394 -1717 -1138 1421 1485 -500 -1034 359 1424 1033 -49 -1011 -145 1506 734 -1003 -924
4823i24K179M6j103r17J88J139N28j158j500Q20J915l29j906n9Q97Q11n0j103
$$ -924 1255 1301 198 -719 -531 608 1136 -22 -1522 -702 1213 884 -1022 -1081 -184 627 577 -526
4841e26j111J309J811j406j457K88J465P07r86j166n51J866J204j643j801J605
$$ -526 -1637 -328 1483 77 -1380 -1092 373 1080 94 -1072 -1623 243 1447 -196 -1997 -392
4857c92J475k43j402j082P41K018L55k263p31J554J800j653j141n0J163J399o66
$$ -392 1083 840 -562 -1644 -903 1115 1470 -793 -1524 30 1830 177 -964 -1014 149 1548 882
4874H82k017L3K061M24j722j028J193J363O8j103j479J268J564m70k328K98J829
$$ 882 -1135 -1102 959 1383 -339 -1367 -174 1189 1257 154 -1325 -57 1507 1037 -1291 -993 836
4891H36P57r85j428k73J729J151j407j954J120J747Pk063o17Q37J615N5j766p66
$$ 836 1593 608 -820 -1093 636 1787 380 -1574 -454 1293 1300 -763 -1380 -543 1072 1127 -639 -1405
4909a405J739J314j467j899K84J785Q00o57j525J1J755R01j891j716J297J595
$$ -1405 334 1648 181 -1718 -1434 351 1151 494 -1031 -1020 735 1636 -255 -1971 -674 921
4925I21j96q16o61L37J143M10k056n59J606Q90l47j058l83R97Q42m39j847P4J900
$$ 921 725 -91 -752 -415 728 1138 -918 -1477 129 1019 672 -386 -769 228 1070 631 -1216 -1142 758
4944G58M42j338p68N02J006J91q44j310P85J317l4j635k74J464N81q40o37o84
$$ 758 1200 -138 -906 -404 602 793 -51 -1361 -576 741 707 -928 -1202 262 843 3 -634 -1318
4962a318R86J864j385j737P10J659J90j271q13M64J570K99j872r82J405J629m46
$$ -1318 -332 1532 147 -1590 -880 779 969 -302 -1115 -651 919 1218 -654 -1636 -231 1398 952
4979I52j921k27J468J039o1j925q19K399J063j550j385O13J470K90j461p40N95
$$ 952 -969 -1196 272 1311 1250 -675 -1494 905 1968 418 -967 -354 1116 1406 -55 -795 -200
4996b00J892J93k240p94J835J199r54j541k57J311J337p42k232O47K099j95j486
$$ -200 1692 1885 -355 -1149 686 1885 931 -610 -867 444 1781 1039 -1193 -546 1553 1358 -128
5013a28j051Q89J634k68j407p54Q29K235q86k363J49J898L07r12j186K54J676
$$ -128 -1179 -290 1344 1076 -331 -1085 -256 1979 1093 -1270 -1121 777 1084 172 -1014 -760 916
5030I16Q61j760j500J236J796n18j498n14J085J567k07j934o89K050J270j258
$$ 916 1777 17 -1483 -247 1549 1031 -467 -981 104 1671 1464 -470 -1159 891 2161 903
5046I03j542L52J346O71o51j249k85J700P67k165q65J148J127l1j147m38M90J402
$$ 903 -639 -287 1059 1730 1079 -170 -455 1245 2012 -153 -1018 130 1257 1226 79 -359 131 1533
5064A533p18j528mJ375N38j294r12O79P69K69o62j305O82J285l38j341M58O59
$$ 1533 815 -713 -717 658 1196 -98 -1010 -331 438 707 45 -1260 -578 707 369 -972 -514 145
5082A45O85l55r91o53Q70J445j090j668N80K041O17j782j103L66J913P21j952
$$ 145 830 475 -516 -1169 -299 1146 56 -1612 -1032 1009 1626 -156 -1259 -893 1020 1741 -211
5099b11j510J270K385k65j971n59J227J229l29j926p11J783J763j277j691J85
$$ -211 -1721 -451 1934 1669 -302 -861 366 1595 1266 -660 -1371 412 2175 898 -793 -608
5115f08J454O62p32j940j6K334K89j878j340J987J113o02j191o82J274J085n57
$$ -608 846 1508 776 -1164 -1180 1154 1443 -435 -1775 212 1325 723 -468 -1150 124 1209 652
5132F52k072M67J967L22j539j343P72J549N77j675j268J542J814q10j997m3J858
$$ 652 -1420 -953 1014 1336 -203 -1546 -774 775 1352 -323 -1591 -49 1765 955 -1042 -1085 773
5149G73P67j218j296J6K202Q81j821j809Q05K361q6j526r84N14J994J49j968j070
$$ 773 1540 322 -974 -958 1244 2125 304 -1505 -700 1661 1575 49 -935 -421 1573 1722 -246 -1316
5167a316J576J483j180j281k54J027J239n51j653j58J817M65j746o51N27O00N74
$$ -1316 260 1743 563 -718 -972 55 1294 743 -910 -1068 749 1214 -532 -1183 -656 -56 518
5184E18q56q78O47Q91j42j366j33J153M96m58n45j88P03P91q97j029K02J212P23
$$ 518 -338 -1216 -569 322 180 -1186 -1319 -166 330 -128 -673 -861 -158 633 -264 -1293 -1091 121 844
5203H44j557m41M80J111J82r85j087J002J031j79j039P0N20R00L3j397o69J374
$$ 844 -713 -1154 -674 437 619 -366 -1453 -451 580 401 -638 -568 -48 852 885 -512 -1181 193
5221A93J178q94j748N98J309M04o13j224m00J509R76j362j600J202J485m87j166
$$ 193 1371 477 -1271 -673 636 1040 427 -797 -1197 312 1288 -74 -1674 -472 1013 526 -640
5238f40p03P22J307k28j413m83J188J328q17j537L9J579N44q40j540O49J628L1
$$ -640 -1343 -621 686 458 -955 -1438 -250 1078 261 -1276 -1237 342 886 46 -1494 -845 783 814
5256H14j332l98J297O53q79q50l75J358J002r72j616O95J798J88j590q88J073
$$ 814 -518 -916 381 1034 155 -695 -1070 288 1290 318 -1298 -603 1195 1383 -207 -1095 -22
5273b2J160k6j472q23J631J298j413j357J77J412M75q90j047l52J824Q16j535
$$ -22 1138 1112 -360 -1183 448 1746 333 -1024 -847 565 1040 150 -897 -1249 575 1391 -144
5290a44r85R03R77o6q53m81l1J091L91j532J27M67O80l70q89L08j01M47L06r27
$$ -144 -1129 -226 751 685 -168 -649 -680 411 802 -730 -603 -136 544 174 -715 -407 -508 -61 245 -682
5310f82j69R62o5k87j09K67K17k42J71k15K01M87l75m91K22N80r0j85m60k46L80
$$ -682 -851 111 46 -241 -350 -83 134 -108 63 -152 49 536 161 -330 -108 472 382 197 -263 -509 -129
5331a29P12q9j486M35Q28K21k29r18j47J131L97o87j580O48J640J56j540k27K24
$$ -129 583 494 -992 -557 271 492 263 -655 -802 329 726 39 -1541 -893 747 903 -637 -864 -640
5350f40J348J22j195j285J088J709m09j707j14O78J230m18j285k53J463R22r63
$$ -640 708 830 -365 -1650 -562 1147 738 -969 -1083 -405 825 407 -878 -1131 332 1254 291
5367B91j327Q24J004Nr27l66M92J008l76j252J18J188N88j603k51K54J172k1q86
$$ 291 -1036 -212 792 797 -130 -496 -4 1004 628 -624 -506 682 1270 -333 -584 -330 842 821 -65
5386f5n38N63J644j010j529n7K052N79j670p58N0J500Q79j896j199J034J620m76
$$ -65 -603 -40 1604 594 -935 -992 1060 1639 -31 -789 -739 761 1640 -256 -1455 -421 1199 723
5404G23j299k34L53J403j51j297q26J330J403r73j468L87J068N32p87p28k68J076
$$ 723 -576 -810 -457 946 795 -502 -1328 2 1405 432 -1036 -649 419 951 164 -564 -832 244
5422B44N22q94n51M57N00q7j58l26M9M77o6n25m74J297J9o19j65J84K82j16o9
$$ 244 766 -128 -679 -222 278 191 33 -293 -244 233 167 -358 -832 465 484 -135 -300 -116 166 50 -19
5443a9l19j45Q04K08r48k88O40L04j14n38l02P04R67k49j548p6J241N49k55j103
$$ -19 -338 -483 321 529 -419 -707 -67 237 123 -415 -717 -13 954 705 -843 -919 322 871 616 -487
5463d87r49J512J444j013j646O6J751N68j069j151k40J674R94j476j519J077J807
$$ -487 -1436 76 1520 507 -1139 -1073 678 1246 177 -974 -1214 460 1454 -22 -1541 -464 1343
5480A343j39j795q36J063J272K43j662p29J610J031j277j436Q19P55P27q64o61
$$ 1343 1204 -591 -1427 -364 908 1151 -511 -1240 370 1401 124 -1312 -493 262 989 125 -536
5497e36P3J482J5j804o6J022J155j104j213N23J334N44j528j307R02J791p0k157
$$ -536 -463 1019 1034 -770 -836 186 1341 237 -976 -453 881 1425 -103 -1410 -508 1283 1213 -944
5515i44n43J446J250l29j885k77K003J252j578j867K97K275L68j621r67m9J848
$$ -944 -1487 -41 1209 880 -1005 -1282 721 1973 395 -1472 -1175 1100 1468 -153 -1120 -1169 679
5532F79N50j290j352Q99J602l19j124n38J100M97K00j395n87J294M36m07r62L95
$$ 679 1229 -61 -1413 -514 1088 769 -355 -893 207 704 904 -491 -1078 216 652 245 -717 -322
5550c22L14L08K9l37p01Q19L50m65m84J004O2n36J82o75O33L64k81q36K5J073
$$ -322 -8 300 329 -8 -709 110 460 -5 -489 515 577 41 223 -452 181 545 264 -572 -547 526
5570E26J06n06o49j02R29M81r78p82J59J401K42j386j50M83P59K85r76j101N67
$$ 526 632 126 -523 -625 304 785 -193 -975 -816 585 827 -559 -709 -226 533 818 -158 -1259 -692
5589f92J312Oj434q3K00J400l29p87j121R79J700p09j175l48J303N72o05q38m35
$$ -692 620 626 -808 -891 -691 709 380 -407 -1528 -549 1151 442 -733 -1081 222 794 189 -649 -1084
5608a084J359N71j086p91P02J165n04r74J18N30O99o71n49l84J649L47j460p86
$$ -1084 275 846 -240 -1031 -329 836 332 -642 -524 6 705 34 -515 -899 750 1097 -363 -1149
5626a149J308Q20o75r58m32J297R56j123j153M03J332O75j335j014L87J371L09
$$ -1149 159 979 304 -654 -1086 211 1167 44 -1109 -706 626 1301 -34 -1048 -661 710 1019
5643A019j268j100Q39J777o39j457k29J242N80J8j557j25R60P02l30j583O55J029
$$ 1019 -249 -1349 -510 1267 628 -829 -1058 184 764 782 -775 -900 60 762 432 -1151 -496 533
5661E33M5o81k91o5O11M46o70k52L26N82m83l70L21KK08k61j16q0N03k85n64N4
$$ 533 578 -103 -394 -459 152 598 -72 -324 2 584 101 -269 52 54 262 1 -115 -195 308 23 -541 -487
5683d87P27N0n04Q2Pj67L80m0q29M06P90k43n09M9k57N97K57n10o00K01Q58j11
$$ -487 240 290 -214 -132 -125 -292 88 48 -781 -375 415 172 -337 -288 -545 52 309 -201 -801 -600 258 147
5705A47p1p00o4N72N07j96p77M1O89M89n14r27J06O76J150j034o89M1J254l4r78
$$ 147 76 -624 -688 -116 391 195 -582 -541 148 637 123 -804 -698 -22 1128 94 -595 -554 700 666 -312
5726c12n81O11P11N09j198m73N46P66l32r78P03J50K69k80p92M23N40Rj027j6
$$ -312 -893 -282 429 938 -260 -733 -187 579 247 -731 -28 122 391 111 -681 -258 282 291 -736 -752
5746g52P83O52o17j079N16L78O68r21m60M00J250p2j629l96J292Q54o90j038j4
$$ -752 31 683 66 -1013 -497 -119 549 -372 -832 -432 818 746 -883 -1279 13 867 177 -861 -875
5765h75J075Q72n20j629J27J537N24j163r28L37J310J96p23j004O45J234o15n78
$$ -875 200 1072 552 -1077 -950 587 1111 -52 -980 -643 667 863 140 -864 -219 1015 400 -178
5783a78l43N51M88j08n84m52Q26N84p64m79L36M41j39p7k86r0L88J72m90j89M19
$$ -178 -521 30 518 410 -174 -626 200 784 20 -459 -123 318 179 102 -184 -274 114 286 -204 -393 26
5804B6L96k85n21J62K65J05k26o95N60N16K13o02p78P82M14k68j82n05M95J003
$$ 26 422 137 -384 -222 43 148 -78 -773 -213 303 516 -86 -864 -82 332 64 -118 -623 -128 875
5824H75m95n99m66N83P94n1p11n12M87R68j52j457n22J167Q38k32j065m52J035
$$ 875 380 -219 -685 -102 692 641 -70 -582 -95 873 721 -736 -1258 -91 747 515 -550 -1002 33
5843C3R85n16j354J16J376J35m13q44j46Q14O71j292n34M96J061K33j359o7O91
$$ 33 1018 502 -852 -736 640 775 362 -482 -628 186 857 -435 -969 -473 588 821 -538 -605 86
5862H6M26k82o69l67J123O09j161n04P99N59l95p47k8P69Q23n45q96j03J231M07
$$ 86 512 230 -439 -806 317 926 -235 -739 60 619 224 -523 -551 218 1041 496 -400 -503 728 1135
5882A135j247p25O85J053J7j045r31P39J474l84j347m61J432R19n17j598k41J358
$$ 1135 -112 -837 -152 901 918 -127 -1058 -319 1155 771 -576 -1037 395 1314 797 -801 -1042 316
5900C16J069n97j749O63Q99p0m66n60J92Q07K79p14r54P11Q37o47j85j15L70J47
$$ 316 1385 788 -961 -298 601 531 65 -495 -303 504 783 69 -885 -174 663 16 -169 -284 86 233
5920B33l0k35j37M10K16o01j19K12Q27n88l09r3K74M95n72k26l37J164j06l69
$$ 233 203 -32 -169 241 457 -144 -263 -51 776 188 -121 -214 60 555 -17 -243 -580 584 478 109
5940A09j76r3M86O15m73q91l41J128J43m70n28J07O29M62m43q69K59P93K20j051
$$ 109 -67 -160 326 941 468 -423 -764 364 507 37 -491 -384 245 707 264 -605 -346 447 667 -384
5960c84p2L17O17M0o34q34P64Q64j20r36j69O74L70n24j56m48L47R60k88q74K06
$$ -384 -456 -139 478 518 -116 -950 -186 678 558 -378 -547 127 497 -27 -183 -631 -284 676 388 -486 -280
5981b80Q86m89l52j73N61M35k99l79m19Q03L73m45r02O30P73R8r78q57O76Q77
$$ -280 606 117 -235 -408 153 588 289 -90 -509 294 667 222 -680 -50 723 821 -157 -1014 -338 539
6001E39K7j121k9J393K08j047n54m6Q06L49j06j220K92J346j90j113n32P15Q41
$$ 539 566 -555 -584 809 1017 -30 -584 -630 176 525 419 -801 -509 837 647 -466 -998 -283 558
6020E58j80n34m53Q33M50n9j150j65R45L54k65p02j36O13N15q84l61L50N46o4
$$ 558 378 -156 -609 224 674 615 -535 -700 245 599 334 -368 -504 109 624 -260 -621 -271 275 211
6040B11m85J78J20L15r0n72K45N23J10o54L2K49K54k02k81l60M87L00q5q68J88
$$ 211 -274 -96 24 339 249 -323 -78 445 555 -99 -67 182 436 234 -47 -407 80 380 295 -573 -385
6061c85M05M03k68m98PJ73O56o35l27j95Q88l8j90j40j43K40N02n86m11J58N17
$$ -385 20 423 155 -343 -336 -163 493 -142 -469 -664 224 186 -4 -144 -287 -47 455 -131 -542 -384 133
6082A33K36n03l61J03O01K18l89o28M06M20q7p49K07N46K12k26l15q6K46N27m28
$$ 133 369 -134 -495 -392 209 427 38 -590 -184 236 149 -600 -393 153 365 139 -176 -262 -16 511 83
6103H3l77N1N63K33q76j14M43J25K38q81j05J009N32o65j038M19L65M18j64p09
$$ 83 -294 -243 320 553 -323 -437 6 131 369 -512 -617 392 924 259 -779 -360 5 423 259 -450
6123d50J87O93j35o93k02N96N96r2p80o11N46J186q15l81k68K82P90m13j98l13
$$ -450 -263 430 295 -398 -600 -4 592 500 -280 -891 -345 841 26 -355 -623 -341 449 36 -162 -475
6143d75N56L72k98j127P67Q07j82m53j78L7M98j67n60J98N85J44l08o01M07K72
$$ -475 81 453 155 -972 -205 602 420 -33 -211 -174 324 157 -403 -205 380 524 216 -385 22 294
6163B94J72l79p4j53N85J60q05k51O51J75l04m30M06p0L61K80p97n1M94L36l10
$$ 294 466 87 13 -140 445 605 -200 -451 200 375 71 -359 47 -23 338 618 -179 -230 264 600 290
6184B90n22j5P95j45k06o57j55R46J56n86j95J65L80M99r22l27O03N22R8q71m05
$$ 290 -232 -247 548 403 197 -460 -615 331 487 -99 -294 -129 251 750 -172 -499 104 626 724 -147 -552
6205e52N45K71J25n21J10j38R21l65r58J79L57M29l30l16j16O44K7k80n68N09
$$ -552 -7 264 389 -132 -22 -160 761 396 -562 -383 -26 403 73 -243 -359 285 312 32 -536 -27
6225b7R2M6j13k69M13N58m35m26p1J58M40l48m28L10L34m6j36l77J03J003k71
$$ -27 65 111 -2 -271 142 700 265 -161 -232 -74 366 18 -410 -100 234 188 52 -325 -222 781 510
6246E10p61p92J039R97r23m91l3N94N83o24n87j34J014M31q34n71N16O28l8m48
$$ 510 -251 -1043 -4 993 70 -421 -454 140 723 99 -488 -622 392 823 -11 -582 -66 562 524 76
6266G6p11O52N95r0r28J09M22J68j53m25K04K46M65m68n15L97M65k6p68j02O47
$$ 76 -635 17 612 522 -406 -297 125 293 140 -285 -81 165 630 162 -353 44 509 483 -285 -387 260
6287B60L40l13k49p9R6M35k59n33K34M33N3m48m94O00K3L18n86kN15R4k47m63
$$ 260 600 287 38 -41 55 490 231 -302 -68 365 418 -30 -524 76 99 417 -169 -171 344 438 191 -272
6309b72n9L75N20K2j084N05L12J32n77p5o5N30j21J36n31k27R75j98l67k05J61
$$ -272 -331 44 564 586 -498 7 319 451 -126 -201 -266 264 143 279 -252 -479 496 298 -69 -274 -113
6330a13M17K23n11j41l57N02L69o44p7J88L70l29k48K0M53L28m92k14M39J01j47
$$ -113 304 527 16 -125 -482 20 389 -255 -332 -144 226 -103 -351 -331 122 450 -42 -256 183 284 137
6351A37m52O8R8O5N20p48R8K88M02l10p14J71J059j42o47m79K86J071m73o04j63
$$ 137 -315 -247 -149 -84 436 -312 -214 74 476 166 -548 -377 682 540 -107 -586 -300 771 298 -306 -469
6372d69M50N61k71q24R0N43M00l86p48j1J081J80o36n34L84M57K83m65m52j38
$$ -469 -19 542 271 -553 -463 80 480 94 -654 -665 416 596 -40 -574 -190 267 550 85 -367 -505
6392e05J289k49j012qM77L43k12l93m52Q72L21m62n78N75M85k89k89k41Q2N14
$$ -505 784 535 -477 -485 -8 335 123 -270 -722 150 471 9 -569 6 491 202 -87 -328 -246 268
6412B68p5j87m16Q51rm35m05J80N62J01k48n87q7P70K52o14n13P07Q4J5j64l04
$$ 268 193 6 -410 441 432 -3 -408 -228 334 435 187 -400 -487 283 535 -79 -592 115 199 214 50 -254
6434b54L39L34l99k77j60M50L59k52j20l64M10L09k71l51o6Q32m18m63k57N54
$$ -254 85 419 20 -257 -417 33 392 140 20 -344 66 375 104 -247 -313 519 101 -362 -619 -65
6454f5J32l3K52n40J37Q74m42n09j16L90J9nk19o4M68J20m84n55M69K29J61o12
$$ -65 67 34 286 -254 -117 757 315 -194 -310 80 99 94 -125 -189 279 399 -85 -640 -171 58 219 -393
6476c93R0K7M17J93o84j02K23O71j42o18JL05N13m48o45L65N33K15m45q01P15
$$ -393 -303 -276 141 334 -350 -452 -229 442 300 -318 -317 -12 501 53 -592 -227 306 521 76 -725 -10
6497a0K41k22j22k63N01M74j80o25j58L94M03k17n90l2N10J68j11q21N68N41k03
$$ -10 231 9 -113 -376 125 599 419 -206 -364 30 433 216 -374 -406 104 272 161 -660 -92 449 246
6518B46k97m69L36M03L65q05k35L65N17k10l44k81O74k97R4l28M6J34N22m4o75
$$ 246 -51 -520 -184 219 584 -221 -456 -91 426 216 -128 -409 265 -32 62 -266 -220 -86 436 392 -283
6539b83L30J65m4J9o95L85O25k25k03l53L89Mm4j85L0O8J95J7l98k36Q80j28j76
$$ -283 47 212 168 187 -508 -123 502 277 74 -279 110 114 70 -115 -85 -17 178 195 -203 -439 441 313 137
6562A37k31j90K45N13m65o1m21M15L49n14K4K65L90o52J96k32K37L1j1m78J85
$$ 137 -94 -284 -39 474 9 -52 -473 -58 291 -223 -199 66 456 -196 0 -232 5 36 25 -453 -268
6583b68J67K85j76k94L54K23J83o38j39K99J86kn13L17l74L72r4j22j90N14O75
$$ -268 -101 184 8 -286 68 291 474 -164 -303 -4 182 180 -333 -16 -390 -18 -112 -234 -424 90 765
6604G65r62K31l62L60Q3j68l84J60N61Jn23l09N48M52j78l37l50K22K13J37n26
$$ 765 -197 34 -328 32 115 -53 -437 -277 284 285 -238 -547 1 453 275 -62 -412 -190 23 160 -366
6625c66j15P04P2m04l86M38K91k46k7l97J55N83P9n35k9L14L6k0n17K48L07J68
$$ -366 -481 223 295 -109 -495 -57 234 -12 -39 -436 -281 302 381 -154 -183 131 167 147 -370 -122 185 353
6647C53l45j86KK50J24j56j83j55N16k93l44l08R53K17l21k36M2M49l20Q3m06
$$ 353 8 -178 -176 74 198 42 -141 -296 220 -73 -417 -725 228 445 124 -112 -70 379 59 142 -264
6668b64m5N82J54l37m17J51M63o2k15j22j38M83N27p14j76L16K48l92j2nl4L06
$$ -264 -309 273 427 90 -327 -176 287 225 10 -112 -250 233 760 46 -130 186 434 42 30 25 -9 297
6690B97j21k56k04L13R7k90K42o2J1L40n14j54L53L31j77m57J55L53R8k81l57
$$ 297 176 -80 -284 29 126 -164 78 16 27 367 -147 -301 52 383 206 -251 -96 257 355 74 -283
6711b83J23J72M79n73m9L28K94l71l43k06J81O01l1l11k20L16J95Rn42P1K78K79
$$ -283 -160 12 491 -82 -131 197 491 120 -223 -429 -248 353 322 11 -209 107 302 311 -231 -160 118 397
6733C97l26l76l8N86ol16n30N05K84K34p31j13K81M75k36l26j33O49K64p82l37
$$ 397 71 -305 -343 243 237 -79 -609 -104 180 414 -317 -430 -149 326 90 -236 -369 280 544 -238 -575
6754e75L55K81L20m84l92L37J84K62m57k40N74O6j1n86K00J25O55o12Pn84N81
$$ -575 -220 61 381 -103 -495 -158 26 288 -169 -409 165 231 220 -366 -166 -41 614 2 9 -575 6
6775FK29m92L11K94N6j24k83k84N29q5l2k55j8J85K42q1n53Q3M17J16p7l50k96
$$ 6 235 -257 54 348 404 280 -3 -287 242 157 125 -130 -148 37 279 198 -355 -272 145 261 184 -166 -462
6798d62Q43j79j46l26j4N86J09k35p15M73M10J92m57m43K23K87j88j53l86N98
$$ -462 381 202 56 -270 -284 302 411 176 -539 -66 344 536 79 -364 -141 146 -42 -195 -581 17
6818A7O5k35L5n9K00K02M8p52L39O30k54l16j21N2L03l27J88Pq7J43q8n13J84
$$ 17 82 -153 -118 -177 23 225 273 -479 -140 490 236 -80 -201 -149 154 -173 15 22 -65 78 -10 -523 -339
6841c39L97K31k34n36L61J46P04p08l15J13L61o0k17J05k77M87j57j36m12M70
$$ -339 58 289 55 -481 -120 26 730 22 -293 -180 181 121 -96 9 -268 219 62 -74 -486 -16
6861a6M67n81j0j93N72n9j20j22l47O22j76k91J5K94j38M14j82k98N36l07J83
$$ -16 451 -130 -140 -333 239 180 60 -62 -409 213 37 -254 -239 55 -83 331 149 -149 387 80 263
6882B63m89j14L57J07l26K43l48L53J85j67l02K95m2L29m14l20L40P3l8l54L31
$$ 263 -226 -340 17 124 -202 41 -307 46 231 64 -238 57 15 344 -70 -390 -50 23 -15 -369 -38
6903c8K48J13m05l84L25oL32j84k39L77K74m80L55o58K73n9K27j75j71N68j77
$$ -38 210 323 -82 -466 -141 -147 185 1 -238 139 413 -67 288 -370 -97 -156 71 -104 -275 293 116
6924A16M2k08j37K99R6m25J62j16L41l82L31k84k84P40r6m26K96N9j35oJ21j64
$$ 116 158 -50 -187 112 208 -217 -55 -171 170 -212 119 -165 -449 291 195 -231 65 124 -11 -17 104 -60
6946f0l28K94K67k47L40j44L9N3l67j55P36m05pn27M84L00j95k4l27K51L29r9
$$ -60 -388 -94 173 -74 266 122 161 214 -153 -308 428 23 16 -511 -27 273 78 54 -273 -22 307 208
6968B08j24j99K51J8k17l90N04M90m88J05l28J50J81K73n35p8j32M65Kl11J37
$$ 208 84 -115 136 154 -63 -453 51 541 53 158 -170 -20 161 434 -101 -179 -311 154 156 -155 -18
6989a8J24j11K4l52K12K18J21j97J05j39J50j95J87k25l36N56p7%l01M26j11K20
$$ -18 106 -5 19 -333 -121 97 218 21 126 -13 137 -58 129 -96 -432 124 47 47 -254 172 61 281
7011B81n67J74K4L10Q2o11K24J99j11j42PQ4R4L8j68j67K36K6K38m65l5L62J74
$$ 281 -286 -112 -88 222 304 -307 -83 116 5 -137 -130 -46 48 86 -82 -249 -13 13 251 -214 -249 113 287
7034B87k37k95K69Q3n1k15l8o8M46m44J78kj35pL54R7n62J58N73l39j60k91P17
$$ 287 50 -245 24 107 56 -159 -197 -265 181 -263 -85 -87 -222 -229 125 222 -340 -182 391 52 -108 -399 318
7057C18k50M4j47n5J61m4jj22k6J64m2j3N5J7J84p2k21n0N28o17K00j44J04k45
$$ 318 68 112 -35 -90 71 27 26 -96 -122 42 0 -13 42 59 243 171 -50 -100 428 -189 11 -133 -29 -274
7081b74L51J67k76j61K37K18m39K40k43N68k78n38J3J22M78k79R9l35N52j60N8
$$ -274 77 244 -32 -193 44 262 -177 63 -180 388 110 -428 -415 -293 185 -94 5 -330 222 62 120
7102A20k45p2J20K69m3l76LM17K83n30k52K34L55k68n0o9k89O35q6j49j78J61
$$ 120 -125 -197 -77 192 149 -227 -224 193 476 -54 -306 -72 283 15 -35 -104 -393 242 156 7 -171 -10
7124a0J6k5j71K25j51L70j89o30L81j28L37l09k3K87L03m24j29J04K20j80j14
$$ -10 6 -19 -190 35 -116 254 65 -565 -184 -312 25 -284 -307 -20 283 -141 -270 -166 54 -126 -240
7145b40K46l01L69k7l75m3kN59j57q2j36K05J58J2l81J5J73J72K41m70K1R8J84
$$ -240 6 -295 74 47 -328 -371 -373 186 29 -53 -189 16 174 186 -195 -180 -7 165 406 -64 -43 55 239
7168B39k31j22J50p2L20k66k31J86L42k60N5l56J19j06N23m23j65L63N2J54m69
$$ 239 8 -114 36 -36 284 18 -213 -27 315 55 110 -246 -127 -233 290 -133 -298 65 117 271 -198
7189a98N7nL57r2j54j74mM92l41p8L37j47L44n32k56M53N6J09m34O2L18j9k29
$$ -198 -141 -146 211 119 -35 -209 -213 279 -62 -140 197 50 394 -138 -394 59 115 224 -210 -148 170 151 -78
7212g8P2j85L03L49k41n62K82M72l20l96J85J2N08j98l71m33M62L39m9k91J66
$$ -78 -6 -191 112 461 220 -342 -60 412 92 -304 -119 -107 401 203 -168 -601 -139 200 151 -140 26
7233B6oj30J55m35J98j99N40k01k75N01K17k05k7m56K08K90j49r8k04J46K62k3
$$ 26 20 -110 45 -390 -192 -391 149 -52 -327 174 391 186 159 -297 -89 201 52 -46 -250 -104 158 135
7255A35p1k08K83j52k38K64m3K9KK1m12O49l70J65Kj38J33q3q0J34L35l64K81
$$ 135 64 -144 139 -13 -251 13 -30 -1 1 22 -390 259 -111 54 56 -82 51 -32 -112 22 357 -7 274
7278B74l49k00L84qN7k86r8K62K09l95R5l07M72p8j85k28M29j43J46M9k20J88
$$ 274 -75 -275 109 101 158 -128 -226 36 245 -150 -55 -362 110 32 -153 -381 48 -95 51 100 -120 68
7300F8k73L93j66m51M91j06R8J1l7j95J19Q6M2J8NJ84m7q0k92J35N4k71K72l22
$$ 68 -205 188 22 -429 62 -44 54 65 28 -167 -48 38 80 98 103 287 240 160 -132 3 57 -214 58 -264
7324b64K93J40j27J51l08J04K00J24l80J31N4k69J32m72P26j1k58l16J0L65K74
$$ -264 29 169 42 193 -115 -11 189 313 -67 64 118 -151 -19 -491 235 224 -34 -350 -340 25 299
7345B99j80l72k4K30L30m6o96L07M94l38m06L11o9M26j62l7m71L03J69l17J45
$$ 299 119 -253 -277 -47 283 237 -459 -152 342 4 -402 -91 -160 266 104 67 -404 -101 68 -249 -104
7366a04k3K41k57K76m90K47K60r2k5L3m8j55j8J9K29j5N9J00m71R4M18N4m86K6
$$ -104 -127 114 -143 133 -357 -110 150 58 33 66 18 -137 -155 -136 93 78 137 237 -234 -140 278 332 -154 -128
7390a28K5J27LK9j82k17O73m70j61K04J39j37K67j86j65J77K19j36n3j67NL69
$$ -128 -103 24 27 56 -126 -343 330 -140 -301 -97 42 -95 172 -14 -179 -2 217 81 28 -139 -134 235
7412B35j84j85MQ9J28J30k51P6j14J34k05L6K69J30Q5l82J40k91J47N0R4l76M3
$$ 235 51 -134 -130 -41 87 217 -34 42 -72 62 -143 -107 162 292 377 -5 135 -156 -9 41 135 -241 -198
7435a98K32n6J10l19L42j2r9PJ48L6m4P6l67P9J18K24k38k08K4L01Nl1l19K07
$$ -198 34 -22 88 -231 111 99 0 7 155 191 147 223 -144 -65 53 277 39 -169 -145 156 161 130 -189 18
7459A8q8p6k8Q7K2K9k0j12J78O5L8jl25R0N00j50l51j97N68Nk69j17P2j0L23k57
$$ 18 -70 -146 -174 -87 -65 -36 -56 -168 10 75 113 112 -213 -123 377 227 -124 -321 247 252 -17 -134 -62 -72 251 -6
7485foj14K00k53L23k48N9J85k41J7K51K0l62J93o5j42K10K77m99K79j77K51n2
$$ -6 -12 -126 74 -179 144 -104 -45 140 -101 -84 167 187 -175 18 -47 -189 21 298 -201 78 -99 152 100
7508A00l14M25m33L20L7j11m2K65l11J18k44J03N58k81k37p3J89j7m2P7n47M98
$$ 100 -214 211 -222 98 135 24 -18 247 -64 54 -190 -87 471 190 -47 -120 69 52 10 87 -460 38
7530C8J45L1l90l38N75J23k62J15j16p2N88k42l23j31J2M40m01J60m07P20Lo38
$$ 38 183 214 -176 -514 61 184 -78 37 -79 -151 437 195 -128 -259 -247 193 -208 -48 -455 265 268 -370
7552c70J84J95J00l88K75Q7j35j7Q4P9k63o4J47K47P8n10L05j69J22L9J2R1P5
$$ -370 -186 9 109 -279 -4 83 -52 -69 15 94 -169 -233 -86 161 239 -271 34 -135 -13 26 38 129 204
7575B04j19j65n1K24j94O8k36K4N36k37l10L39o2%l5J61k98J17K16r5k02K82L55
$$ 204 85 -80 -131 93 -101 -33 -269 -245 291 54 -256 83 21 21 -14 147 -151 -34 182 87 -115 167 522
7598E22m00r5k94R5J28J15J46n41M33N0m10j22L28J03K54k43m1k10K11J65l59
$$ 522 122 27 -267 -172 -44 71 217 -324 109 159 -251 -373 -45 58 312 69 28 -182 29 194 -165
7619a65N0J84M8M6k56j4O8L3j32J00r5J42N8k60k4K62n1j22J03J25rQ2j23j36
$$ -165 -115 69 117 163 -93 -107 -39 -6 -138 -38 -133 9 67 -193 -217 45 -6 -128 -25 100 91 173 50 -86
7643h6p5J80r0P9J18j54l13M99j92L4j01L54k26m1m7K23j89Q6j55J1K49n0J01
$$ -86 -161 19 -71 8 126 -28 -341 158 -34 0 -101 253 27 -14 -61 162 -27 59 -96 -85 164 114 215
7666B15m00M4J06K19l51K30j49K35k82P4j39pM15m5q5o2J43j27p0J36o7J76K5
$$ 215 -185 -141 -35 184 -167 63 -86 149 -133 -59 -198 -205 210 165 80 18 161 34 -36 100 33 209 234
7689B34k59q0j35L33Q6j1m88M27m2K1j26R8k93O5K07J3p0J14P9n0l64K27L98l46
$$ 234 -25 -105 -240 93 179 168 -320 107 65 86 -40 58 -235 -170 37 50 -20 94 173 123 -241 -14 384 38
7713C8rj89j56J54J35J01J2j75L01N7n70J37L10j04mJ04k80K27K41m08q6M1p1
$$ 38 29 -160 -316 -162 -27 74 86 -89 212 269 -301 -164 146 42 38 142 -138 89 330 -78 -164 -123 -194
7736a94N44k99O2q5j08J41k01j13Q6l7L8Q4J8J74j07o3q0J02j87J57J57j76J87
$$ -194 350 51 113 28 -80 61 -140 -253 -167 -204 -166 -82 -64 110 3 -60 -140 -38 -225 -68 89 -87 100
7759A00J09j93P6j92J45K48j60l5J44k05j77M45k55j81KJ52j74k28M82m0j40K29
$$ 100 209 16 92 -100 45 293 133 98 242 37 -140 305 50 -131 -129 23 -151 -379 103 63 -77 152
7781A52k17M1J49Lj55J03l52K44R8L0j35L6j06J51Q6j89k56M00k74J67J33j81
$$ 152 -65 -24 125 128 -27 76 -276 -32 66 96 -39 -3 -109 42 128 -61 -317 83 -191 -24 109 -72
7803g2L02l38o6L76l35R7K52k17PL48j23m18J95N1rn6k3O4j16p9k45P49m22J02
$$ -72 230 -108 -174 202 -133 -36 216 -1 6 354 231 -187 8 59 50 -6 -29 35 -81 -160 -405 344 -78 24
7827B4J3J14L7l16L71N0k89M6K32n59L97j5k28J34J57k74M8J47J03j40l8q1J00
$$ 24 37 151 188 -128 243 293 4 50 282 -277 120 105 -123 11 168 -106 -58 89 192 52 14 -67 33
7850C3k11O68m08J91l86k13O54l03k36K03P5r1J6k4m9M31m93K4J56j27J8K1j3
$$ 33 -178 490 82 273 -113 -326 328 25 -211 -8 67 -24 -8 -32 -81 350 -143 -119 37 -90 -72 -51 -64
7873f4M1K3K80l92Q0J23r1J35j54Q7L3K82m21q9k26N35k92M22j45k94j32K86M
$$ -64 -23 0 280 -112 -32 91 0 135 -19 68 101 383 -38 -127 -353 182 -110 312 167 -127 -259 27 31
7896C1j86J7M1J09j31J73k01K88k18K69l29J37j02K8j58J13R7R2j36K0r1K62j
$$ 31 -155 -138 -97 12 -119 54 -147 141 -77 192 -137 0 -102 -74 -232 -119 -22 70 -66 -46 -137 125 124
7919A24k95K69q6k21K30m2k22K81N1m3j65n1J63J06j6k67L29j30M28n01j28K86
$$ 124 -171 98 12 -209 21 -21 -243 38 89 46 -119 -170 -7 99 83 -184 145 15 443 -58 -186 100
7941A00k09K82r3mn0P4K19j59n88K08N09l71L12l61N1O3J00J79j84K04m18L52
$$ 100 -109 173 80 76 26 100 319 160 -428 -220 289 -82 230 -131 -80 -17 83 262 78 282 -136 216
7963B16j64q4j66J15K49j24l02M60k09J58l84O5K77k57K44r2M4j28k30M75l89
$$ 216 52 -32 -198 -83 166 42 -260 200 -9 149 -235 -170 107 -150 94 2 46 -82 -312 163 -226
7984b26K97k02L64m01P0J51j5J1j43l0J05L1j21K21o5K38k57K6O2j14Q9J21l16
$$ -226 71 -131 233 -168 -98 53 38 49 -94 -124 -19 12 -109 112 47 285 28 54 116 2 91 212 -104
8007a04K8r9K86k80L19o1R8k45R2p8Q1j5mk65K66K4J74k10p1P3k71N04l50R5K74
$$ -104 -76 -175 111 -169 150 89 187 -58 34 -44 37 22 18 -247 19 43 217 7 -64 9 -262 242 -108 -13 261
8032B61j67k15J31k04M9R5k14M94m74R4r0N8M90j07k20J01p9j26K20k10J17J97
$$ 261 94 -121 10 -194 -145 -50 -264 230 -244 -150 -240 -182 308 201 -19 82 3 -123 97 -113 4 201
8054B01n43K33J15K5k74K36J98k25J5n4J62p6l4O4J27m48J13J7L50j65k86L95
$$ 201 -342 -109 6 31 -243 -7 191 -34 -19 -73 89 13 -21 43 170 -278 -165 -148 202 37 -249 146
8076A46l2j81K37k58L38J08j44k0k15J53j10k58J65nL87m66J15j42K01J1R3k51
$$ 146 114 -67 170 -88 250 358 214 194 -21 132 22 -236 -71 -76 311 -155 -40 -182 19 30 123 -128
8098a28L0J19J11p1l8N6J12K39l96M5l4o3J34n7QJ16p8L2l27J38N3j02K38j05
$$ -128 -98 21 132 61 23 79 191 430 34 79 45 -18 116 59 67 183 105 137 -190 -52 1 -101 137 32
8122C2m5J41r8j62o9M26j65j61J25m4n2J40P6n46L73OR6r1J88k28l5K06j82K88
$$ 32 -13 128 30 -132 -201 225 60 -101 24 -20 -72 68 144 -402 -29 -23 73 -18 170 -58 -93 113 -69 219
8146B19l45M75k82j93R4R9K5m0k4k06K59j81K5J81n3j3J00o6j3k18k48M33j93
$$ 219 -126 349 67 -126 -32 67 92 52 28 -178 81 -100 -75 106 53 40 140 74 61 -157 -405 28 -165
8169a65J16o0J02O6mj01J13m8k7p7j73L62Rj23M7k18K81j95J69k74L47r8
$$ -165 -49 -109 -7 59 55 -46 67 19 -8 -85 -258 104 113 -10 37 -181 100 -95 74 -200 147 49
8191D9
$$ Imaginary data points
##PAGE= N=2
##DATA TABLE= (X++(I..I)), XYDATA
0@%%%qJ6j6K4l3M1m8O4q8J04j28J61j93K29k78L31l84M51n29O12p06Q16r37J067
$$ 0 0 0 0 -8 8 -8 16 -17 24 -24 40 -48 56 -72 89 -104 125 -153 178 -206 245 -284 328 -378 438 -499 568
27E68j214J377j556J755j974K214k478K769l089L437l817M238m702N208n762O378
$$ 568 -646 731 -825 930 -1044 1170 -1308 1461 -1628 1809 -2008 2230 -2472 2736 -3026 3352
43C352p065P826q678R639j0728J1979j3428J5127j7153J9628k2729K6740l2165
$$ 3352 -3713 4113 -4565 5074 -5654 6325 -7103 8024 -9129 10499 -12230 14510 -17655
56a7655L9958n2177P4248j26643M69753N00375p97084l34327L28838N68127r3465
$$ -17655 22303 -29874 44374 -82269 387484 887859 90775 -243552 85286 653413 559948
67E59948n31648l03669M09251M74571j15651n38611j45027L18392K65814j50930
$$ 559948 28300 -275369 133882 608453 492802 -45809 -190836 127556 393370 242440
77B42440k92687o7183K45162J70163j47924k28699L8031J43760M818o2446K6630
$$ 242440 -50247 -117430 127732 297895 149971 -78728 -40697 103063 107881 45435 72065
88G2065K9823l6692n5406J9754J08047P1011j30923j68645J06803K71218J1875
$$ 72065 101888 65196 9790 29544 137591 208602 77679 -90966 15837 287055 298930
99B98930k67999j57110J63308K78558N6672k51461k24402J45310L05233n571l01346
$$ 298930 30931 -126179 37129 315687 372359 120898 -103504 41806 347039 341468 40122
110D0122j66651J61389K66588N2093k41807k32185J07739K85819K2965k71404
$$ 40122 -126529 34860 301448 353541 111734 -120451 -12712 273107 296072 24668
120B4668j94180R6256K47927J04734k01954k88646K0940L02279J38024k08865
$$ 24668 -169512 -73256 174671 279405 77451 -211195 -190255 112024 250048 41183
130D1183k59062P971K55695J87618j50114l08540k0823K90970J59344j72476k14441
$$ 41183 -217879 -209908 45787 233405 83291 -225249 -246072 44898 204242 31766 -182675
141a82675K9948K22249J40411j21400k06396L5290K23236N8772j55042q7105Q8535
$$ -182675 -152727 69522 209933 88533 -117863 -82573 140663 199435 44393 -42712 45823
152D5823J15730K4447n7640m2243M6009M8239m8342k4539R9663M9154j18422q3783
$$ 45823 161553 186000 128360 86117 132126 180365 132023 107484 207147 256301 137879 54096
164E4096J05733J38568l6730j93862j13199J61677K53455m9391l20341j12481
$$ 54096 159829 298397 261667 67805 -45394 116283 369738 320347 6 -112475
174a12475K55382K12547j53689l14127o1440K78623K36365j77763l63349j0750
$$ -112475 142907 355454 201765 -112362 -173802 104821 341186 163423 -199926 -210676
184b10676L40526J54776k47050k78898N4525K88648J24217k28260k74042P1277
$$ -210676 129850 284626 37576 -241322 -186797 101851 226068 -2192 -276234 -204957
194b04957K87303P2679j89423j32502P2865J38270L0419j06507r6891N2307J06881
$$ -204957 82346 155025 -34398 -166900 -94035 44235 74654 -31853 -128744 -76437 30444
205C0444J380m0367K5618J2911n6207k0639N6798M4449j6972m7190o870Q6189
$$ 30444 31824 -8543 17075 29986 -26221 -46860 9938 54387 37415 -9775 -16645 69544
217F9544P6886r5519j69539J9280J78276O6084j19152j21670L4461J57516P4209
$$ 69544 146430 50911 -118628 -99348 78928 145012 25860 -95810 -61349 96167 170376
228A70376j54875k00622M0088K08383O9634j33736j42219K819J32708R8933q7234
$$ 170376 15501 -185121 -145033 63350 132984 -752 -142971 -140152 -7444 91489 4255
239D255j67345m288J51810Q3863o8200j18812n1723P7116J27574m440j39167n7416
$$ 4255 -163090 -167378 -15568 68295 95 -118717 -170440 -93324 34250 29810 -109357 -166773
251a66773J09261J17372j1852j20666r7034O9484J80658M0358j63043j12280R3252
$$ -166773 -57512 59860 48008 -72658 -169692 -100208 80450 120808 -42235 -154515 -61263
262f1263J45606J3479j15725j00938N5415J61039M5138j22825q7439N0612O8349
$$ -61263 84343 97822 -17903 -118841 -63426 97613 142751 19926 -67513 -16901 51448
273E1448l52l4419l2447P53M1925K1844j9622o968o897m5837m970P7266K7114
$$ 51448 51096 16677 -15770 -15017 26908 48752 29130 22162 15265 -30572 -35542 41724 68838
286F8838r1899p4754M9465J06571K5589j17490j33184O3757K06160L2371k12778
$$ 68838 -23061 -97815 -48350 58221 83810 -33680 -166864 -103107 103053 135424 -77354
297g7354j41718J31558K11255P805k12437j62075J24747K52450P025k44821j15408
$$ -77354 -219072 -87514 123741 131546 -80891 -242966 -118219 134231 141256 -103565 -218973
308b18973J72448J93275l8065j95698r3552J34756J75613m3885j85582k7791J54498
$$ -218973 -46525 146750 108685 -87013 -180565 -45809 129804 85919 -99663 -127454 27044
319B7044Q7818p5643j03047n527Q5035O7003m0281p3281J6130M9611k2289l3418
$$ 27044 114862 39219 -63828 -69355 15680 82683 42402 -30879 -14749 34862 12573 -20845
331b0845L3114K7148l4803l1780K3707N7426K4783p0970j02303L1391J43652L1999
$$ -20845 12269 39417 4614 -27166 -3459 53967 78750 7780 -94523 -63132 80520 112519
343A12519j30443r0859O7365J18582J4856j17940j04752P4673J68647J1250j61751
$$ 112519 -17924 -108783 -41418 77164 92020 -25920 -130672 -55999 112648 123898 -37853
354c7853r1333Q4819J19754J734j18947r2067Q0643J66612J2849j58581j00862
$$ -37853 -129186 -44367 75387 77121 -41826 -133893 -53250 113362 126211 -32370 -133232
365a33232P0475J22882L0207r1782j05253L4399J41876L8215j21250j00267L8302
$$ -133232 -62757 60125 90332 -1450 -106703 -72304 69572 107787 -13463 -113730 -75428
376g5428J06073N3774n4462r7429L311J07026L2432r7667p2840M4801Q3853K7194
$$ -75428 30645 84419 29957 -67472 -64161 42865 75297 -22370 -95210 -50409 33444 60638
388F0638m8053o5419J3176P4103P645o8113j7352M8155J8687j8137o502K946j121
$$ 60638 12585 -52834 -39658 34445 42090 -26023 -43375 4780 23467 5330 -1172 1774 653
401F53r926k2572J3694P2129K1395r2098o4367P5124R3030l2269j14561m6361
$$ 653 -9273 -31845 -18151 53978 75373 -16725 -81092 -5968 87062 54793 -59768 -106129
413a06129R8775J33250l2648j79159n4961J62027J25052j00390j68346j54J66903
$$ -106129 -7354 125896 93248 -85911 -140872 21155 146207 45817 -122529 -122683 44220
424D4220J09246j16877k00048J4268K14349Q7743j60846j54147O4246J75555N1235
$$ 44220 153466 36589 -163459 -149191 65158 152901 -7945 -162092 -97846 77709 128944
435A28944j41897j43976O1967J73329J7028j47260o6905R4031R4420k3008q6353
$$ 128944 -12953 -156929 -94962 78367 95395 -51865 -118770 -24739 69681 46673 -39680
446c9680k6517P3667O4860n2119p7174L5959P7583j4868o2971L04N1974K8052
$$ -39680 -66197 7470 72330 20211 -56963 -21004 56579 41711 -21260 -20956 31018 59070
458E9070l2233n2149J7189Q3465J0563r8267m5744Q5646P4614m7979r8445k1219
$$ 59070 26837 -25312 -8123 75342 85905 -12362 -58106 27540 102154 54175 -44270 -65489
470f5489R0534R3404m5955j37705k1733J24271P1735q0196j06254r04R5039P0989
$$ -65489 25045 118449 72494 -65211 -86944 37327 109062 28866 -77388 -78292 16747 87736
482H7736n9461j22430m965J17396N5793p4669p9266J3787P9589M8375n7861j03137
$$ 87736 28275 -94155 -99120 18276 74069 -600 -79866 -66079 13510 61885 4024 -99113
494i9113L577J09180N1824o1654o3498J3305O2288M1737l6449p4849M308Q3384
$$ -99113 -95536 13644 65468 3814 -59684 -46379 15909 57646 21197 -53652 -49344 34040
506C4040L5198m7103l4954J6557K6714P792j8698j9834K7683M4456j7929m5525
$$ 34040 69238 22135 -12819 3738 30452 38244 19546 -288 27395 71851 53922 8397
518H397J4185L7925j7648m2804k730L7862L5109j6477o2560j4328P2908L5047
$$ 8397 22582 60507 42859 55 -2675 35187 70296 53819 -8741 -23069 49839 84886
530H4886p9679p0985M8760R1614M815r5388q4591M6641J26141J2214j35415p0978
$$ 84886 5207 -65778 -17018 74596 79411 -15977 -100568 -53927 72214 84428 -50987 -121965
542a21965J05030J16879l5783j33028n7790R4072J22279k9512j38736k3579J30150
$$ -121965 -16935 99944 64161 -68867 -126657 -32585 89694 60182 -78554 -102133 28017
553B8017P7543q0117j04881J2164J08451O6842o4015r8561K7239J10122J3458
$$ 28017 105560 25443 -79438 -67274 41177 108019 44004 -54557 -27318 82804 96262
564I6262r1495m2947N6005O5935J277n1605k4654M7504L9563m8987n5643L7770
$$ 96262 4767 -38180 17825 83760 85037 33432 8778 56282 95845 46858 -8785 28985
576B8985O0354k0615n9651o791M9868L9956l3093p8313m931Q9002L6523q3418
$$ 28985 89339 68724 9073 2282 52150 92106 59013 -19300 -24231 64771 101294 17876
588A7876p2802L9354P8885P578p4893o4811M3582J01783L04j12040n0690Q2033
$$ 17876 -54926 -15572 63313 70891 -4002 -68813 -25231 76552 76856 -35184 -85874 -3841
600c841Q5502k2612r0660m3544O5824R5040j5239j06736l1155Q9752P4629k7875
$$ -3841 81661 59049 -31611 -75155 -9331 85709 70470 -36266 -67421 22331 96960 69085
612F9085p2664k3545N7860P0174j9917q5136j3217P6535M4715l7932m9706J89
$$ 69085 -3579 -27124 30736 100910 80993 -4143 -17360 59175 103890 65958 16252 16441
624A6441M9808M1810l0003o6814J6O0185J2364m7109k8318J7045K9731O463l3014
$$ 16441 66249 108059 78056 11242 11258 71443 83807 36698 8380 25425 55156 61619 28605
637B8605l4488J9459L4049k7925m8128J4663M4502l743m6265l4961J4260M9268
$$ 28605 -5883 13576 47625 19700 -28428 -13765 30737 26994 -19271 -54232 -39972 9296
649I296N949o7530l7740O4686O4733l7893q0326j4729O0235N4931l0022q4073
$$ 9296 15245 -52285 -90025 -25339 39394 1501 -78825 -93554 -33319 21612 -8410 -92483
661i2483m569J01977N4016p8369q5437L1771R6241L4929o7280p8944L2549J10199
$$ -92483 -97052 4925 58941 -19428 -104865 -73094 23147 58076 -9204 -88148 -55599 54600
673E4600K0150j03168o1911O7749Q9092l808p3554m1709N2273P5018k2794r1736
$$ 54600 74750 -28418 -90329 -22580 66512 62704 -10850 -52559 -286 74732 51938 -39798
685c9798j3777Q0043M1430m9040n7246O612N5189K7720m9174n7942L0008O9146
$$ -39798 -53575 26468 67898 18858 -38388 -31776 23413 51133 1959 -55983 -25975 43171
697D3171q845o9723k2989L9434L3509j5346m6287r030N6209L9012n0990o2286
$$ 43171 34326 -35397 -58386 -18952 14557 -789 -47076 -56106 103 39115 -11875 -74161
709g4161K3901O1440N450m6359l2762K6878O3451J1871o9239m6143N2356O6059
$$ -74161 -50260 11180 16630 -29729 -62491 -35613 27838 39709 -29530 -75673 -23317 42742
721D2742j3731n4495j4192M3779N1307j3282p1364k3799O6522M9387l9252n4966
$$ 42742 29011 -25484 -39676 4103 55410 42128 -29236 -53035 13487 62874 23622 -31344
733c1344R019N3578L2330l3666o5454l455O6618K6353n9412m9674K4897M9371
$$ -31344 -22325 31253 63583 29917 -35537 -38992 27626 53979 -5433 -55107 -30210 19161
745A9161Q970m1245m3995J6565N5843l578o7664k5928M6158L4849k4125m4060
$$ 19161 28131 -13114 -57109 -40544 15299 11721 -55943 -81871 -35713 -864 -24989 -69049
757f9049j0796L9185L7022l1854o0981R284O3632J2126m7860k8482K4427M2729
$$ -69049 -79845 -40660 -3638 -35492 -96473 -87189 -23557 -11431 -59291 -87773 -63346 -20617
769b0617O058m7314l4272M3767N8390k1413n8679M720N8417L1300k9849n1754
$$ -20617 -14559 -61873 -96145 -52378 6012 -15401 -74080 -69360 -10943 20357 -9492 -61246
781f1246r83O2720L5004n3452n4103L7160O8800M906n0638l3690K6975N5372l09
$$ -61246 -62229 491 35495 -17957 -72060 -34900 33900 38806 -11832 -45522 -18547 36825 36516
794C6516o8052k9719O0105N2068l2084n6160k621M5081L2100k9432n8087K395
$$ 36516 -31536 -61255 -1150 50918 18834 -37326 -39947 5134 37234 7802 -50285 -47890
806d7890O5420K1733n5192m0185K5591L9160o25l7129k6852K9435N0230j1346
$$ -47890 17530 39263 -15929 -56114 -30523 8637 8012 -29117 -55969 -26534 23696 12350
818A2350n6987o460M8274J8986l1180l1084Q072M0632K2537l5172m1272K5855
$$ 12350 -44637 -51097 -2823 16163 -15017 -46101 -38029 2603 25140 -10032 -51304 -25449
830b5449N2247o310m3993p704L2597K7640r775m1271j5286M4006L7032l1832m3854
$$ -25449 26798 20488 -23505 -31209 1388 29028 19253 -22018 -37304 6702 43734 11902 -31952
843c1952J6292M4659Q771l1476l4253Q821M7351J4342m9852l4365L3672L8767
$$ -31952 -15660 28999 37770 6294 -27959 -19138 28213 42555 -7297 -41662 -7990 30777
855C0777j5101l6436r924K7046L3428r618m8489j3208M1951K0095l3497k9667
$$ 30777 15676 -20760 -30684 -3638 29790 20172 -28317 -41525 426 20521 -12976 -42643
867d2643J4606L3693J4009k4424l4983J0010M3271j77m3586j0166L6337K4399
$$ -42643 -28037 5656 19665 -4759 -39742 -29732 13539 13362 -30224 -40390 -4053 20346
879B0346j3926k8648q829K9581K8584k4002l9419J7394M8757L706l6576j9738
$$ 20346 6420 -22228 -31057 -1476 27108 3106 -36313 -18919 29838 33544 -3032 -22770
891b2770J7683L2833M551m0122k6473L8381M4525k0856m4519L048L8192J9451
$$ -22770 -5087 27746 32297 -7825 -34298 4083 48608 27752 -16767 -13719 24473 43924
903D3924k2899m2602k532M7909K2577m4658l6622L0529M3981m993l8818k4472
$$ 43924 21025 -21577 -24109 23800 46377 1719 -34903 -4374 39607 34614 -4204 -28676
915b8676K0812M1315n118n2900j4303M8174K9298l1663l7633N544L5331K0145
$$ -28676 -7864 33451 28333 -24567 -38870 9304 38602 6939 -30694 -25150 10181 30326
927C0326k8165m1928J4413N3600L876n0319k1334L3026L2021q576l8714j7737
$$ 30326 2161 -39767 -25354 28246 32122 -18197 -39531 -6505 25516 16940 -21774 -39511
939c9511L6766M2576k1651n1340N848M9322J3055l6118l3446R627M3726J8797
$$ -39511 -2745 39831 18180 -33160 -27312 22010 35065 -1053 -34499 -24872 18854 37651
951C7651m1605l6461L3264N0077j2557m9027j3380L2211L3648r342m6547j4548
$$ 37651 -3954 -40415 -7151 42926 30369 -18658 -32038 173 33821 24479 -22068 -36616
963c6616M8425L4601l6844m5088J4600M4193J3515l1206l6220J1326M9354Q266
$$ -36616 11809 46410 9566 -35522 -20922 23271 36786 5580 -30640 -19314 30040 38306
975C8306n3485k7967M0046M0515j4645l9906j2356L2284L6933j7524n3293l166
$$ 38306 -15179 -43146 -3100 37415 22770 -17136 -29492 2792 39725 22201 -31092 -34258
987c4258N3186K0927l9096l5073J3619L9881J5195l4158l9254K2065N3462l311
$$ -34258 18928 39855 759 -34314 -20695 19186 34381 223 -39031 -16966 36496 33185
999C3185n3266j7889L6247L2056j1743m0405j6196L8915M0115k6307n1045P877
$$ 33185 -20081 -37970 -1723 30333 18590 -21815 -38011 904 41019 14712 -36333 -28456
1011b8456M8844J4187l2814l3303P639M1754J6934m2111l7176L1839M8801q620
$$ -28456 20388 34575 1761 -31542 -23903 17851 34785 -7326 -44502 -12663 36138 27518
1023B7518m3680j3875K9505L3539r184m7375j6079M7170L5097l2600m2165J0774
$$ 27518 -16162 -30037 -532 33007 23823 -23552 -39631 7539 42636 10036 -32129 -21355
1035b1355M0075J4495k8008l6982Q390M8668J1146m7967k7983L2700L5707j0882
$$ -21355 18720 33215 5207 -31775 -23385 25283 36429 -11538 -39521 -6821 28886 18004
1047A8004l6991j6437K8651L9105j2213n0072o502M7425K1346l3798l4431P597
$$ 18004 -18987 -35424 -6773 32332 20119 -29953 -36455 10970 32316 -1482 -35913 -28316
1059b8316L6007J8852k9316l7830J8494M9544l74m5909j6788K9572K9739o897
$$ -28316 7691 26543 -2773 -40603 -22109 27435 27061 -18848 -35636 -6064 23675 16778
1071A6778l5826j7491L4752L8909k0604m5445N288M1979J4792k4672k9865L752
$$ 16778 -19048 -36539 -1787 37122 16518 -28927 -23639 18340 33132 8460 -21405 -17653
1083a7653L7647J9090l6064l4334K4815M0843o342l4780j3561K2049L1409k067
$$ -17653 19994 39084 3020 -31314 -6499 34344 28002 -6778 -20339 1710 33119 31052
1095C1052m0298j8295L5939K9695k5236l5314L652K9604J7511j6375l2716NL8817
$$ 31052 -9246 -27541 8398 38093 12857 -22457 -18805 10799 28310 11935 -20781 -20776 18041
1108A8041J3069l7375k5804K1974K7949k882k6178j7591J7247L4640m134m0417
$$ 18041 31110 -6265 -32069 -10095 17854 14972 -11206 -28797 -11550 23090 18956 -21461
1120b1461r099L5529K0588k0494k6112j052K5695K1615j9275l3984R879M0951
$$ -21461 -30560 4969 25557 5063 -21049 -22101 3594 25209 5934 -28050 -18171 22780
1132B2780N068l4209j5761J9941K6986J144l0638k2583K6340L6625j4650m1082
$$ 22780 27848 -6361 -22122 -2181 24805 25949 -4689 -27272 -932 35693 21043 -20039
1144b0039m42L4664J8640j7047l0626m866L3602K1362l2030l6235J8165L8368
$$ -20039 -20481 14183 32823 15776 -14850 -19716 13886 35248 3218 -33017 -14852 23516
1156B3516j034l1970j9337J5830L2975K329m0782k1217L4164L1924k0734l5783
$$ 23516 22482 -9488 -28825 -12995 19980 22309 -18473 -39690 -5526 26398 5664 -30119
1168c0119k009K6696K0239j3811l2955M1L9929J4428l4999k3981K0849K7197k201
$$ -30119 -32128 -5432 14807 996 -31959 -31918 8011 22439 -12560 -36541 -15692 11505 9304
1181I304k5646j6424K0496L3938p188l9179l944L7218J6411k2461k3279M520K7525
$$ 9304 -16342 -32766 -12270 21668 14480 -24699 -28643 8575 24986 2525 -20754 -16234 11291
1194A1291J4445k5443l0463J8311L9510m380l7662j0842K6848K5477p316l5513
$$ 11291 25736 293 -30170 -11859 27651 23271 -14391 -25233 1615 27092 19776 -15737
1206a5737j6151L3039L2177k4196m2062M502L6006J3810k1884k8862J797L5762
$$ -15737 -31888 1151 33328 9132 -32930 -28428 7578 21388 -496 -29358 -27561 8201
1218H201J6640l5866l2438K0620L4773l986l0094j5572J7629L1690J012l6759
$$ 8201 24841 -11025 -43463 -22843 11930 7944 -22150 -37722 -20093 11597 12609 -24150
1230b4150j7222L1976K6129j8333k7463J977K2252J5891j1144k6864L462L3138
$$ -24150 -41372 -9396 16733 -1600 -29063 -27086 -4834 11057 -87 -26951 -23489 9649
1242I649P949k9603j4398K2146K1669m950k2774j2875J9870K8714j2389l7561
$$ 9649 17598 -12005 -26403 -4257 17412 12462 -10312 -23187 -3317 25397 13008 -24553
1254b4553Q72L8303J3826k4889k3659O412K9599J2014l2565l3960K2398M4827
$$ -24553 -23681 14622 28448 3559 -20100 -13688 15911 27925 -4640 -38600 -16202 28625
1266B8625n609m3470j5791K9597L3095p484m4839k1630M0249M1377k4626n0458
$$ 28625 23016 -20454 -36245 -6648 26447 18963 -25876 -47506 -7257 34120 9494 -40964
1278d0964m16M2319K2135k4580l9000J454M7167K2000m0600l8198K3887M2606
$$ -40964 -41380 939 23074 -1506 -40506 -39052 8115 30115 -10485 -48683 -24796 17810
1290A7810k037l6300j9429K2605L7739k628m3079j3660L9163K7202k3637k9012
$$ 17810 15773 -20527 -39956 -17351 20388 17760 -25319 -38979 184 27386 3749 -25263
1302b5263P285K7214R801k3583k6578J5681L9231k426l9449q186L4199K0508k1144
$$ -25263 -17978 9236 19037 -4546 -31124 -15443 23788 21362 -18087 -26273 7926 28434 7290
1315G290l2638k931L5031K5625k8109m0616J4071M4420K311l8946k2615K1994
$$ 7290 -25348 -28279 6752 32377 4268 -36348 -22277 22143 24454 -14492 -37107 -15113
1327a5113L7868M018m2210k8356L2989M2618j7503m6526p168L6970L1586j1549
$$ -15113 22755 26773 -15437 -43793 -10804 31814 14311 -32215 -39383 -2413 29173 17624
1339A7624m1434j3215L8855L1786k4809l8510O241L3912J4179j7809k6431J395
$$ 17624 -23810 -37025 1830 33616 8807 -29703 -23462 10450 24629 6820 -19611 -18216
1351a8216L3046J5811k6952k1958J8307K4648l543j9991j0834R770K2425J766
$$ -18216 14830 30641 3689 -18269 38 24686 21143 1152 -9682 88 22513 24279
1363B4279k3772p918K2273J1542j6072j2618O946J2368L793j2780j6234R891K4312
$$ 24279 507 -7411 14862 26404 10332 -2286 4660 17028 20821 8041 -8193 1698 26010
1376B6010n971l0357l734K6202J5649j2289k5230p757K4970K4572k0958l7924
$$ 26010 20039 -10318 -14052 12150 27799 15510 -9720 -17477 7493 32065 11107 -26817
1388b6817O477L7462J0351k7171k4881P991L4895J3616l4296l4123K2079M3533
$$ -26817 -20340 17122 27473 302 -24579 -16588 18307 31923 -2373 -36496 -14417 29116
1400B9116k899l9949j7730K3445L4586L46l9115k1507L2033L5718j5461l5175
$$ 29116 26217 -13732 -31462 -8017 26569 26915 -12200 -33707 -1674 34044 18583 -16592
1412a6592l53K6127J4778j3916k5831m93L0160J2529k5412j6242K0248J9030j0886
$$ -16592 -16945 9182 23960 10044 -15787 -16280 13880 26409 997 -15245 5003 24033 13147
1425A3147j9390m292J4616J5067q896k2061O182K6357k180k7858n978K3091J5290
$$ 13147 -6243 -10535 4081 19148 10252 -11809 -5627 20730 18550 -9308 -15286 7805 23095
1438B3095j0419k3500n780K6239K1299k3840l4641J0976L7376Q352k5456k2383
$$ 23095 12676 -10824 -16604 9635 30934 7094 -27547 -16571 20805 29157 3701 -18682
1450a8682O417K9303J1243k8435k5005J9987L1911n114k7330j1046J3685K0658
$$ -18682 -12265 17038 28281 -154 -25159 -5172 26739 21625 -5705 -16751 -3066 17592
1462A7592L397k2540j3048K0425K0396j0245k0386m622P274J1810O092j0023j0056
$$ 17592 20989 -1551 -14599 5826 26222 15977 -4409 -9031 -1757 10053 16145 6122 -3934
1475c934Q115J0459m993o842m55k195R36Q825O13q297k22K095l974R86N748l665
$$ -3934 4181 14640 9647 2805 2350 155 1091 9916 10529 2232 2010 4105 131 1117 6865 3200
1491C200m751N815L227m379k356k529n401O035J2140o605j4762K999J2829N082
$$ 3200 -1551 4264 7491 3112 756 -1773 -7174 -1139 11001 4396 -10366 -7367 5462 10544
1505A0544o437j4385o970J8811K2404j3165l1495j990K6373J5978j1596k5687
$$ 10544 4107 -10278 -17248 1563 23967 10802 -20693 -22683 3690 19668 8072 -17615
1517a7615o196K9426K6212k0921l7912M538L4540J1903k2660k4618M798L2885
$$ -17615 -23811 5615 31827 10906 -27006 -22468 12072 23975 1315 -23303 -18505 14380
1529A4380J5760k9079k9810J6969L3895o04k6876j3416J2177K1379J886k1772
$$ 14380 30140 1061 -28749 -11780 22115 21511 -5365 -18781 -6604 14775 16661 -5111
1541e111j1086J8551J3908j4061j0690J0415Q502o103r776k68J2601R541j5385
$$ -5111 -16197 2354 16262 2201 -8489 1926 10428 4325 -5451 -5719 6882 16423 1038
1554A038k0817J2099K9101l921k9285q245K2525K1149q873l1041j1211L2432K9325
$$ 1038 -19779 -7680 21421 17500 -11785 -20030 2495 23644 14771 -16270 -27481 4951 34276
1567C4276k2924m1296L747L8877J7807k3505l4099N35M0564K4255l1510m0117
$$ 34276 11352 -29944 -26197 12680 30487 6982 -27117 -26582 13982 38237 6727 -33390
1579c3390R134L6344J1065k1129k3068L510K8864J5084k3149k5618R269K2638
$$ -33390 -24256 12088 23153 2024 -21044 -17534 11330 26414 3265 -22353 -13084 9554
1591I554L219j2052r415J532J2906Q949j2904j4409O640J2889J484j804l102o136
$$ 9554 12773 721 -8694 -7162 5744 14693 1789 -12620 -5980 6909 8393 6589 3487 -2649
1605b649J249O925j242m897K842J570m183M186Q213m329j0265l052M080J0054
$$ -2649 -1400 5525 4283 -614 2228 3798 -385 3801 12014 7685 -2580 -5632 -1552 8502
1619H502R845j0137k0914L138K2949M847j9514j5437Q125K5032J3510k3575l3033
$$ 8502 18347 8210 -12704 -9566 13383 18230 -1284 -16721 -8596 16436 29946 6371 -26662
1632b6662J0459L8973M899l5935k2786K1715L9183O057m2313l4587K7820N0321
$$ -26662 -16203 22770 27669 -8266 -31052 -9337 29846 35903 -6410 -40997 -13177 37144
1644C7144l481m8977j9252L2993L7117q342m3911j9612L6093L9009j7794m1164
$$ 37144 33663 -15314 -34566 -1573 35544 27202 -16709 -36321 -228 38781 20987 -20177
1656b0177J172L4454J3698k3448k6461O345L2046J0432k9037j9106K1598K1709
$$ -20177 -19005 15449 29147 5699 -20762 -14417 17629 28061 -976 -20082 1516 23225
1668B3225j4200k2382M047K0527P754j7201j7999J2411K6141q580l6381k969L5790
$$ 23225 9025 -13357 -9310 11217 18971 1770 -16229 -3818 22323 13743 -22638 -25607 10183
1681A0183K0085k4185l2101K114L7179K1002l3114m1704J4555M8713P285m0415
$$ 10183 30268 6083 -26018 -23904 13275 34277 1163 -40541 -25986 22727 30012 -10403
1693a0403k7286J9989M0137N999l9006k9435K6951M2002p265m1165j4194K7019
$$ -10403 -37689 -17700 22437 28436 -10570 -40005 -13054 28948 21683 -19482 -33676 -6657
1705f657L0512l204l3564j8600K5099L2015p924k9788o639J7753J6354q36j7796
$$ -6657 23855 20651 -12913 -31513 -6414 25601 17677 -12111 -18750 -997 15357 14521 -3275
1718c275j2423J2422J7850m136j3685j132O815M204O56n368n979N303Q272n501
$$ -3275 -15698 -3276 14574 10438 -3247 -4379 2436 6640 7296 1928 -4051 1252 9524 4023
1732D023p659L463K550m093K73N005J313n04l833p826L643J2694m285j9522j740
$$ 4023 -3636 -173 2377 -1716 -1443 3562 4875 4371 538 -7288 -3645 9049 4764 -14758 -16498
1747a6498K0621J4999q784k3783j1853K0702K8631j0119l7205m810L5583K3797
$$ -16498 4123 19122 10338 -13445 -25298 -4596 24035 13916 -23289 -28099 7484 31281
1759C1281j9458l7577p742L6001L1591k1129m3272M589M5915J6910l3816l7269
$$ 31281 11823 -25754 -33496 2505 34096 12967 -30305 -25716 20199 37109 3293 -33976
1771c3976P993M2168K1002l2032l7370J4764M1989L719l4285j9721J6815K6809
$$ -33976 -25983 16185 37187 5155 -32215 -17451 24538 28257 -6028 -25749 -8934 17875
1783A7875L444k4266j5465J5734J5918j2402j5216R661J4311m489j2085j891J0287
$$ 17875 21319 -2947 -18412 -2678 13240 838 -14378 -4717 9594 5105 -6980 -8871 1416
1796A416O557j2829j7382J0964K7962k501l2022j0289K5715K1718j3322l1503
$$ 1416 7973 -4856 -22238 -11274 16688 14187 -17835 -28124 -2409 19309 5987 -25516
1808b5516o039L6337L0532k5078m7128J587M4640K1123k7207l5464M385M1435
$$ -25516 -31555 4782 35314 10236 -36892 -35305 9335 30458 3251 -32213 -27828 13607
1820A3607K3562l0276m0209Q420L9304J1959k3951k2122O150K5816J1918j9553
$$ 13607 37169 6893 -33316 -24896 14408 26367 2416 -19706 -13556 12260 24178 4625
1832D625k2545P349K2479M801j0761r568k438P385J1116j999j3225n531N929P807
$$ 4625 -17920 -10571 11908 16709 5948 -3620 -6058 1327 12443 10444 -2781 -8312 -2383 5424
1846E424O440k679j4958o791J4607J3709p239j4904o088O546J4232M676j5164
$$ 5424 11864 9185 -5773 -12564 2043 15752 8513 -6391 -12479 -5933 8299 12975 -2189
1859b189j2963R758J5117J51j0021q875j137J2136J2008p649j7206l81J4172J1017
$$ -2189 -15152 -5394 9723 9874 -147 -9022 -10159 1977 13985 6336 -10870 -11251 2921 13938
1873A3938k808j5676j2015J4411K6823k200l0372j3793K0102K6918Q57k8149k2639
$$ 13938 11130 -4546 -16561 -2150 24673 22473 -7899 -21692 -1590 25328 26185 -1964 -24603
1886b4603J9788L7468j960l8447j6574K6283L0508m295l2100j7866K2224K9507
$$ -24603 -4815 32653 30693 -7754 -24328 1955 32463 28168 -3932 -21798 426 29933
1898B9933j0664l3066l607K9318J6692j3980k2344l965J7350J1791j3761j5453
$$ 29933 19269 -13797 -17404 11914 28606 14626 -7718 -11683 5667 17458 3697 -11756
1910a1756R141J5775m451j0629J538M975l628p698l63J2314J2855j0593k3661
$$ -11756 -2615 13160 8709 -1920 -382 4593 965 -6733 -7096 5218 18073 7480 -16181
1923a6181L351K6839N371k5851j7149J6190K9301M705k9228k4120J9503L4794
$$ -16181 -12830 14009 19380 -6471 -23620 -7430 21871 26576 -2652 -26772 -7269 27525
1935B7525m561l6251j0978K8097K6080j0041l3268j2552K8086K9899j2465l2982
$$ 27525 22964 -13287 -24265 3832 29912 19871 -13397 -25949 2137 32036 19571 -13411
1947a3411l406K5200J4303j2099k1969n439J8359J8046p135j7451j599Q940K324
$$ -13411 -16817 8383 22686 10587 -11382 -16821 1538 19584 12449 -5002 -6601 2339 4663
1960D663k513l621l368J968P980R70n097m103l194m24P342N288o985o591O842
$$ 4663 2150 -1471 -4839 -2871 5109 6079 982 -3121 -6315 -6739 603 5891 -1094 -7685 -843
1975h43P191j892o554p026l67J0931R199p199r378J837O660L480Q81n377q987
$$ -843 6348 4456 -2098 -9124 -9491 1440 10639 3440 -5938 -4101 2559 6039 6920 1543 -7444
1990g444K934J3870M690r060j0270k179J1342J5285n141k2236m023K1963J5224
$$ -7444 -4510 9360 14050 4990 -5280 -7459 3883 19168 14027 -8209 -12232 9731 24955
2003B4955j3375k2378k786K2381J9837j4517l2498j44L3939J6059k3797k7440
$$ 24955 11580 -10798 -13584 8797 28634 14117 -18381 -18525 15414 31473 7676 -19764
2015a9764M830K9159J5112k2717l0109P166L2642P078k5586j6517J2273J8876
$$ -19764 -14934 14225 29337 6620 -23489 -16323 16319 23397 -2189 -18706 -6433 12443
2027A2443O71j6731j0358J2190J4596q801j5395M778J2915k208j0143l92R321
$$ 12443 13114 -3617 -13975 -1785 12811 4010 -11385 -6607 6308 4100 -6043 -6435 2886
2040B886N935q139j2570M463J8830J3k2463o805K2112J7139j3057k6139m751K5170
$$ 2886 8821 682 -11888 -7425 11405 11418 -11045 -17850 4262 21401 8344 -17795 -22546 2624
2054B624K2946j4767l2894J760L3737J3746k4798k7505L549K8803J6413j9073
$$ 2624 25570 10803 -22091 -20331 13406 27152 2354 -25151 -21602 7201 23614 4541
2066D541k5888P649K7949L879k3718j5872R317J9829O591j4271j5681O038J6250
$$ 4541 -21347 -13698 14251 18130 -5588 -21460 -12143 7686 14277 6 -15675 -9637 6613
2079F613L31j2784n149M631P421N749k438r442l620M985L749O75J512l892l934
$$ 6613 6944 -5840 -10989 -6358 1063 6812 4374 -5068 -8688 -3703 46 721 2233 -1659 -5593
2094e593N721O225l784o181p92L271N343M886n070r262J163P980J690l505k726
$$ -5593 128 6353 2569 -3612 -4404 -1133 4210 9096 4026 -5236 -4073 3907 5597 2092 -634
2109f34o59N963Q467l475j4986m905J0860J0936j347j1027q731Q787J8518j709
$$ -634 -1293 4670 13137 9662 -5324 -10229 631 11567 10220 -807 -9538 -751 17767 16058
2123A6058k3724j1225J6702K0249j082j9707j3688J2926K1743l527k6417q464
$$ 16058 -7666 -18891 -2189 18060 16978 -2729 -16417 -3491 18252 14725 -11692 -20156
2135b0156K1890J7918q147j9941o002J5981J6112j0765k1733J261K1277O920j3448
$$ -20156 1734 19652 11505 -8436 -14438 1543 17655 6890 -14843 -13582 7695 14615 1167
2148A167j1313M746J0916L421r660o866Q418P765q805r281Q691J0530n879j1992
$$ 1167 -10146 -5400 5516 8937 -723 -7589 829 8594 -211 -9492 -801 9729 3850 -8142
2162h142j48J3084R810j0546j9691K707K4477P627k2046j7165J2308K2973J852
$$ -8142 -8290 4794 14604 4058 -15633 -12926 11551 19178 -2868 -20033 -7725 15248 17100
2175A7100k2830j7002J5818K8565l590l1039j1092K4349K2228r106k6525r447
$$ 17100 -5730 -22732 -6914 21651 18061 -12978 -24070 279 22507 13401 -13124 -22571
2187b2571K1668K2842j0530k7610k575K4145J3715j2224j6964j443J3499R506
$$ -22571 -903 21939 11409 -16201 -18776 5369 19084 6860 -10104 -11547 1952 11458
2199A1458r669j3613N389J4275M65r431l575L374K920p93l788r59O601K707o946
$$ 11458 1789 -11824 -6435 7840 8305 -1126 -4701 -1327 1593 800 -2988 -3947 2654 5361 -1585
2214a585l474O125K411p153l934M749P569L354p458j1550K623J4060K334j3431
$$ -1585 -5059 1066 3477 -3676 -7610 -2861 4708 8062 604 -10946 -8323 5737 8071 -5360
2228e360p724P817J2318L316j1032j5059L652J8483N748j4749j1234O755J3355
$$ -5360 -13084 -5267 7051 10367 -665 -15724 -12072 6411 12159 -2590 -13824 -7069 6286
2241F286M260j3445j5190N319K2818N718j8459j3738Q862J6496K465j6159j5351
$$ 6286 10546 -2899 -18089 -12770 10048 15766 -2693 -16431 -7569 8927 11392 -4767 -20118
2254b0118R231K4055L090k1411j2943J1663J5327j259j3725q776J1266J6313m649
$$ -20118 -10887 13168 16258 -5153 -18096 -6433 8894 7635 -6090 -14866 -3600 12713 8064
2267H064j8805l141J3892O246p935p827L837J1061K973j1852r690Q745J1232o525
$$ 8064 -10741 -13882 10 6256 -1679 -9506 -5669 5392 8365 -3487 -13177 -4432 6800 275
2281B75j1074L662J2596J882j0356j0232N989J6174M06j8427p408J7622J5405
$$ 275 -10799 -7137 5459 7341 -3015 -13247 -7258 8916 9322 -9105 -16513 1109 16514
2294A6514j1036j9663k948J8547J5902j0069k3206l73K4446J0926j8325j8743
$$ 16514 5478 -14185 -17133 1414 17316 7247 -15959 -16332 8114 19040 715 -18028
2306a8028O219K0459P320j6054j8426P242K2856K754k0710j0422J1937J5376q57
$$ -18028 -11809 8650 15970 -84 -18510 -11268 11588 14342 -6368 -16790 -4853 10523 9666
2319I666j4498j0760Q509J4694j848j4504k727R258N944l238n577k543M007N246
$$ 9666 -4832 -15592 -7083 7611 5763 -8741 -11468 -2210 3734 496 -5081 -7624 -3617 1629
2333A629m090n686L062N877k833l707J122K693J084j209l596r45O504L003o551
$$ 1629 -2461 -8147 -5085 792 -2041 -5748 -4626 -1933 -849 -2058 -5654 -6599 -95 2908 -3643
2348c643l302N659M882k562n448m224M329R909J657j0796n405R440Q953m007j0809
$$ -3643 -6945 -1286 3596 1034 -4414 -8638 -4309 5600 7257 -3539 -8944 496 9449 5442 -5367
2363e367o612P445J5058J142j5773q654J2365J2288m725j4080n098J0534J4939
$$ -5367 -11979 -4534 10524 11666 -4107 -12761 -396 11892 7167 -6913 -12011 -1477 13462
2376A3462k830j8864o313J5615J1508q346j4278p65J3573J0855p501j7873q58
$$ 13462 10632 -8232 -14545 1070 12578 4232 -10046 -10811 2762 13617 6116 -11757 -12615
2389a2615J6605P281j0694r283M912Q947K407q304p971N096J0914j460q812Q41
$$ -12615 3990 11271 577 -8706 -3794 5153 7560 -744 -8715 -3619 7295 5835 -2977 -2136
2403b136Q249k66p671m067M287P882J478q172m058R970O540j0017j1180M635J1831
$$ -2136 6113 5847 -1824 -5891 -1604 6278 7756 -416 -4474 5496 12036 2019 -9161 -4526 7305
2418G305L664q573r976M132J4390J132j7157q869J2982J4280l109j3851p610Q356
$$ 7305 10969 2396 -7580 -3448 10942 12074 -5083 -13952 -970 13310 10201 -3650 -11260 -2904
2432b904J3417l212j6056m300J4206R741p228j0638j683P788P555l969j1107O17
$$ -2904 10513 7301 -8755 -13055 1151 10892 3664 -6974 -8657 -869 6686 2717 -8390 -7773
2446g773J1153L241p678n778K199N365L538k729n509J319O819p83n509o45L919
$$ -7773 3380 6621 -1057 -6835 -4636 729 4267 1538 -3971 -2652 4167 3384 -2125 -2770 1149
2461A149P32q84J26o93K150J775l982l623M467M981k806m094j98K142L505l50
$$ 1149 1881 997 1123 430 2580 4355 373 -3250 1217 6198 3392 -702 -900 1242 4747 4397
2477D397o307l407P144N873n369p049J558N925K918l745q499q01R873M971r200
$$ 4397 -1910 -5317 1827 7700 2331 -4718 -3160 2765 5683 1938 -6561 -7362 2511 7482 -1718
2492a718p890N258Q796J411p066q575K800J1079J830j1118n391Q981P989l469
$$ -1718 -9608 -4350 4446 5857 -1209 -9784 -6984 4095 5925 -5193 -10584 -1603 6386 2917
2506B917q163k897O498P295l130r899J383J1244K112r719n668M811P418J073o772
$$ 2917 -5246 -8143 -1645 5650 2520 -7379 -5996 5248 7360 -2359 -8027 -3216 4202 5275 -1497
2521a497n025P339Q644o030j1037K122R835J934o532o355L336R648J094j1714
$$ -1497 -6522 817 9461 3431 -7606 -5484 4351 6285 -247 -6602 -3266 6382 7476 -4238
2535d238p330J0565J1109n203j1996j656Q856P103n081j2160o85J4778O628j1272
$$ -4238 -11568 -1003 10106 4903 -7093 -8749 107 7210 2129 -10031 -10716 4062 10690 -582
2549e82j0678M480J1127J192q718q039O363J3325J1j4341n744R662Q124l080q050
$$ -582 -11260 -6780 4347 5539 -3179 -11218 -4855 8470 8481 -5860 -11604 -1942 6182 3102 -4948
2564d948j318P657Q171n152j1352J08J0052K318o746l513M722O202M08p672o325
$$ -4948 -6266 1391 9562 4410 -6942 -6834 3218 5536 -1210 -4723 -1 6201 6609 -1063 -7388
2579g388O161Q293l749q857J453P590K160n082o709l33Q384M758q468p535N861
$$ -7388 -1227 7066 3317 -5540 -4087 3503 5663 581 -6128 -6461 1923 6681 -1787 -9322 -3461
2594c461Q348k018q500m273N494Q908j13j1577n621R915Q915n785r588j28Q498
$$ -3461 4887 2869 -5631 -9904 -4410 4498 4385 -7192 -12813 -2898 6017 232 -9356 -9484 -986
2609i86P042m541j1662j653J2250O410r501p599M833R793K701p827r291L162J2254
$$ -986 6056 1515 -10147 -11800 450 6860 -2641 -10240 -5407 4386 7087 -740 -10031 -6869 5385
2624E385J219j1446m769Q830Q148k585q458l706O473Q596l860j0969J370J0750
$$ 5385 6604 -4842 -9611 -781 7367 4782 -3676 -7382 -909 7687 3827 -7142 -5772 4978
2638D978K516q168n140L013P318J732q464o780P428J0666m429j0533n48R028M517
$$ 4978 7494 -674 -5814 -2801 4517 6249 -2215 -8995 -1567 9099 4670 -5863 -6411 2617 7134
2653G134n349q967o54J1746O397r601r603N983J1100j044r303n866N840J0795
$$ 7134 1785 -7182 -7836 3910 10307 706 -8897 -2914 8186 7142 -2161 -8027 -2187 8608
2667H608L62j2578n367J0720Q791n328r997Q6Q286O489m804j0903p4J1270L744
$$ 8608 8970 -3608 -8975 1745 10536 5208 -4789 -4703 3583 10072 5268 -5635 -5709 5561 9305
2682I305q958o151N291P162N56p477o034M233Q769j517r500j474Q075K869m867
$$ 9305 347 -5804 -513 6649 7205 -272 -6306 -2073 6696 5179 -4321 -5795 2280 5149 282
2697B82n900o60O273N107n042p757L275Q116j263q038k471M498N986P00p065m084
$$ 282 -5618 -6278 -5 5102 60 -7697 -4422 3694 2431 -5607 -8078 -3580 2406 3106 -3959 -8043
2713h043O077O623m794q379J865P183M009l317o489j300P441M638p456o180N071
$$ -8043 -1966 4657 -137 -8516 -6651 532 4541 1224 -5265 -6565 876 5514 -1942 -8122 -3051
2728c051Q424J95n401n105J510P522J398q421m246P677O644l906o193j187M088
$$ -3051 5373 5568 167 -4938 -3428 4094 5492 -2929 -7175 502 7146 3240 -2953 -4140 -52
2743e2N210j798p547q45Q144L097p183m876L058N284J484l991n573K755P762j180
$$ -52 5158 3360 -4187 -5032 3112 6209 -974 -5850 -2792 2492 3976 -15 -5588 -2833 4929 3749
2759C749q213j650O855L913k656n106j179M837M965m791p065K839R054M85o539
$$ 3749 -4464 -6114 741 4654 1998 -3108 -4287 550 5515 724 -6341 -3502 5552 6037 -502
2774e02l126K834N386N66o904m701P082P806m059p937O20O053L069l639p027o14
$$ -502 -3628 -794 4592 5158 -1746 -6447 635 8441 4382 -3555 -2935 3118 6187 2548 -4479 -5093
2790e093Q075M385p696o328M342O973p40o026m476L070O995L51q691l159P380
$$ -5093 2982 7367 -329 -6657 -2315 4658 3918 -2108 -6584 -3514 3481 3832 -4859 -8018 -638
2805f38N105m790o074l39M896M785k978p462R27Q671J704p903l749M427M919M70
$$ -638 4467 -323 -6397 -6736 -1840 2945 -33 -7495 -6568 2103 3807 -4096 -7845 -3418 1501 1971
2821A971m742m099M486P349k037q398j95P442L249l768m943m48O087M746n323
$$ 1971 -2771 -6870 -2384 4965 2928 -5470 -5665 1777 5026 1258 -3685 -4133 1954 6700 1377
2836A377p102L362Q472l20o500l241K831N438R07p096m087O789P094m396p799
$$ 1377 -5725 -2363 6109 5789 -711 -3952 -1121 4317 5224 -1872 -5959 830 7924 3528 -4271
2851d271o0N336L721k392o775j061Q239M221p551o971L371P125N37m732m646K862
$$ -4271 -4331 1005 4726 2334 -4441 -5502 2737 6958 -593 -7564 -4193 2932 3469 -1263 -5909 -3047
2867c047Q140M56j0001l844P558O701l758o241p99N881N756l826q891O28J0228
$$ -3047 5093 5549 -4452 -8296 -738 5963 2205 -4036 -4835 1046 6802 2976 -5915 -5287 4941
2882D941L013p839n070M281O059J162o714o008N826R452k269r966j694Q415M027
$$ 4941 7954 115 -4955 -674 5385 6547 -167 -6175 -349 9103 6834 -3132 -4826 3589 7616
2897G616l559p647j334Q257O055p028r776L318J0090M35p992m691M313P522N54
$$ 7616 4057 -3590 -4924 3333 9388 2360 -7416 -4098 5992 6427 -1565 -6256 -1943 5579 6133
2912F133r402n924Q196Q460m642q810N27P278N023m221q947n20J0507M667q109
$$ 6133 -3269 -9193 -997 7463 2821 -5989 -5462 1816 6839 2618 -6329 -6849 3658 8325 216
2927B16p184N171Q201J30o806n250M457R201m39j0028k884R240N895n271p074
$$ 216 -6968 -1797 6404 6534 -272 -5522 -1065 8136 7697 -2331 -5215 4025 9920 4649 -2425
2942b425n96O820N448m698q795J793R923J778q332m900L812O385L61p490n321
$$ -2425 -3021 3799 9247 4549 -4246 -2453 7470 9248 916 -3984 -172 6213 6574 -916 -6237
2957f237N918R169l562j0124o35P674L990m327o993j402P845N884o438q592K973
$$ -6237 -319 8850 5288 -4836 -5471 2203 6193 1866 -5127 -6529 1316 7200 762 -7830 -4857
2972d857R184L10o652m304K949P735J365q324n241P091Q119l652p824r85O132
$$ -4857 4327 4637 -2015 -6319 -3370 4365 5730 -2594 -7835 -744 7375 3723 -4101 -5086 1046
2987A046N714k677p955j143R344M576p352o500L833O571N69n608m876L674Q274
$$ 1046 6760 4083 -3872 -5015 4329 8905 1553 -4947 -1114 5457 6026 418 -4458 -784 7490
3002G490j31r519l128P397M961m378o227n59N797N462m613q492J477Q762J121
$$ 7490 7359 -2160 -5288 2109 7070 2692 -3535 -4094 1703 7165 2552 -5940 -4463 4299 5420
3017E420p877l791M504N810L70o810n286N581Q318l758r157L08Q455L662m092
$$ 5420 -2457 -6248 -1744 4066 4436 -2374 -7660 -2079 6239 2481 -6676 -6368 2087 5749 1657
3032A657o645m58P732M811o894p206M684P883m69o540k924L770O080L06p747l277
$$ 1657 -4988 -5446 2286 7097 203 -7003 -2319 5564 5095 -1445 -4369 -599 5481 5787 -1960 -5237
3048e237P155N504m948n894J031M676L120k780n662J50O511R75o300k603M471
$$ -5237 1918 7422 2474 -3420 -2389 2287 5407 2627 -3035 -2885 3626 4601 -1699 -4302 169
3063A69L569k465l450j493K766L988k402o135J068O438N63m627k665K076K926
$$ 169 3738 1273 -2177 -3670 -904 3084 682 -5453 -4385 2053 2616 -2011 -4676 -2600 326
3078C26J310m054l569L188N988k085n471J56M103K552j730m071k198N895M447
$$ 326 1636 -2418 -5987 -2799 3189 1104 -4367 -4211 -108 2444 714 -3357 -5555 340 4787
3093D787m044n817K205N189J236k855l658j76N130K785m590m368K945M717j208
$$ 4787 743 -5074 -2869 2320 3556 701 -2957 -3133 1997 4782 192 -4176 -1231 3486 2278
3108B278l503j732J395L974M92m980k762N088L145l277l657N08J866K129j394
$$ 2278 -1225 -2957 -1562 2412 2904 -2076 -4838 250 3395 118 -3539 -3031 -1165 964 -430
3123d30l496N84M354R09n243j022L788J719j779l214l76L473L784k715n946J864
$$ -430 -3926 -3342 1012 1921 -3322 -4344 -556 1163 -616 -3830 -4206 -733 3051 336 -5610 -3746
3139c746O484M91n216k336K472M146J162m474m546M876O519l129o761N55N339
$$ -3746 2738 3229 -1987 -4323 -1851 2295 3457 -1017 -5563 -687 5832 2703 -4058 -3503 1836
3154A836L216k161n986j391O915M466o007o249K824O209O50m330l512J486N316
$$ 1836 5052 2891 -3095 -4486 2429 6895 888 -5361 -2537 3672 4322 -8 -3520 -2034 3282
3169C282J054n912l647N575L795l158m307P6L800K643j706n387M22O285P36n534
$$ 3282 4336 -1576 -5223 352 4147 989 -3318 -3242 558 3201 1495 -3892 -3470 2815 3551 -1983
3185a983j808L983K792j097l136j736K703M468k197n584J275O080P41l906k963
$$ -1983 -3791 192 2984 1887 -1249 -2985 -282 4186 1989 -3595 -2320 3760 4501 595 -2368
3200b368O89M447K340m182n271L364O274r61n467j513K334L781L45m720l659M773
$$ -2368 -1679 2768 5108 926 -4345 -981 5293 4332 -1135 -2648 -314 3467 3812 -908 -4567 206
3216B06N252k907n873l3L978L223j398m933k054M989M945m124n791J423M404J326
$$ 206 5458 2551 -3322 -3355 623 3846 2448 -2485 -4539 450 5395 1271 -4520 -3097 1307 2633
3232B633j740m305m92M923L222m850m316L950M297r12m126j654J906M812m16n865
$$ 2633 893 -3412 -3904 1019 4241 -609 -4925 -975 3322 2410 -1716 -3370 -1464 3348 2932 -2933
3248b933j114O035L133m177m275J621M080J788l445m797K388P101q79p677j542
$$ -2933 -4047 1988 5121 944 -3331 -1710 2370 4158 713 -4084 -1696 5405 4526 -3151 -4693
3263d693O227L975k940o115j796O838N866m835r118J955Q966J885p084n506K547
$$ -4693 1534 5509 2569 -3546 -5342 1496 7362 2527 -6591 -4636 4330 6215 -869 -6375 -3828
3278c828P907K336p541o606O148Q398k261q737k065O067O512j715p738l029Q225
$$ -3828 4079 6415 -1126 -7732 -1584 6814 4553 -4184 -6249 -182 6330 4615 -3123 -6152 2073
3293B073O332n777p290J785O326K151l278m870R41O393R86n921k893N087L883
$$ 2073 8405 2628 -4662 -2877 3449 5600 2322 -2548 -1607 4786 5772 -149 -3042 2045 5928
3308E928k818m031m76L486K970k289n403J269N764M79n813j996L492K891p29l955
$$ 5928 3110 -921 -1397 2089 5059 2770 -2633 -1364 4400 4879 -934 -2930 562 3453 2724 -1231
3324a231k571L983N109l205p020J56O096K770l213m945r12N823N126m865p797
$$ -1231 -3802 181 5290 2085 -4935 -4779 1317 4087 874 -4071 -4983 840 5966 1101 -6696
3339f696J258P902K360m745m361L45N889L777n313o794L107P477Q29n743l885
$$ -6696 -5438 2464 4824 79 -4282 -3937 1952 5729 416 -6378 -3271 4206 5035 -708 -4593
3354d593J661N913K269o234m884M367P155j692o468j207L175L750j398m442j313
$$ -4593 -2932 2981 5250 -984 -5868 -1501 5654 3962 -2506 -3713 -538 3212 1814 -2628 -3941
3369c941N278K971n501l540L326M008j608m064j270L308M979k593o939K22P500
$$ -3941 1337 4308 -1193 -4733 -1407 2601 993 -3071 -4341 -1033 3946 1353 -5586 -5364 2136
3384B136K268o383l931L325O196P78o548n160N446R065k181j0534j326Q497O030
$$ 2136 4404 -1979 -5910 -2585 3611 4389 -2159 -7319 -1873 7192 5011 -5523 -6849 1648 7678
3399G678l706q058j704Q342P242o178r077K149Q717J895o329n057K428P416J775
$$ 7678 3972 -4086 -5790 2552 9794 3616 -5461 -3312 5405 7300 971 -4086 -1658 5758 7533
3414G533p651m866N471O455l261o223p91M817K798k201m790n35N254J293m622
$$ 7533 -118 -4984 487 6942 3681 -2542 -3333 1484 4282 2081 -2709 -3244 2010 3303 -1319
3429a319k817L707K323k575k712L14L141K298l191n385K399N916m94n214j582
$$ -1319 -4136 -429 1894 -681 -3393 -3079 62 2360 -831 -6216 -3817 2099 1605 -3609 -5191
3444e191L672L659K59m769l521L981N689k120n629J00M483L095j837m404j954
$$ -5191 -1519 2140 2399 -2370 -5891 -1910 3779 1659 -3970 -3870 613 3708 1871 -2533 -4487
3459d487M853N025k902n905lM577K589j287m487k048M377N229k857n728r5L988
$$ -4487 366 5391 2489 -3416 -3419 1158 3747 2460 -2027 -4075 302 5531 2674 -3054 -3149 839
3475H39J820j773l741m36L653L431l408m905J647M253m64k606j918J397L741M72
$$ 839 2659 886 -2855 -3291 362 3793 385 -4520 -2873 1380 916 -1690 -3608 -2211 1530 2002
3491B002m245k390M056K646k964k655K732K795l46l286k118K919N464k384o380
$$ 2002 -2243 -4633 -577 2069 -895 -3550 -818 1977 1631 -1655 -3773 -854 4610 2226 -4154
3506d154L29P047K728n417n173J316P159L658o136p358M104R183j006q962l683
$$ -4154 -3825 3222 5950 533 -4640 -3324 3835 7493 1357 -6001 -1897 7286 6280 -2682 -6365
3521f365O144P299q86q724m224P079P636m841r510J24P934M130m104o888n66O572
$$ -6365 -221 7078 6192 -2532 -6756 323 7959 3118 -6392 -6268 1666 5796 1692 -5196 -5762 810
3537H10L328n590n002L121N652j132m245q50K003K352p31m014L96M707Q11m273
$$ 810 4138 -1452 -6454 -3333 2319 1187 -3058 -3908 -1905 447 -284 -4298 -3902 805 1616 -2657
3553b657r83L245J866j135k506m24L179K944l264m732K256N910P5m212l204K608
$$ -2657 -3640 -395 1471 336 -2170 -2594 585 3529 265 -4467 -2211 3699 3774 -438 -3642 -1034
3569a034M246J449m416n156L260O446m72n200k723K069M000J781m030m819K157
$$ -1034 3212 4661 245 -4911 -1651 4795 4323 -877 -3600 -1531 2469 4250 220 -4599 -2442
3584b442N583K12m686k590J421L773J933l454n322J584O058R26m619k888J289
$$ -2442 3141 3353 -1333 -3923 -2502 1271 3204 -250 -5572 -3988 2070 2996 -1623 -4511 -3222
3599c222M125K459l640n143J111O049N70l761j620J537K374N77k672j808K433
$$ -3222 903 3362 -278 -5421 -4310 1739 2309 -1452 -3072 -1535 839 1416 -1256 -3064 -631
3614f31K709j896k148J883K509j504k317r0K429K341j945l487R81N335j30o359
$$ -631 2078 182 -1966 -83 2426 922 -1395 -1485 944 3285 1340 -2147 -1166 4169 4039 -2320
3630b320k350M553N165j341o092k877N671O427l656r663p95R189N021m824p800
$$ -2320 -4670 -117 5048 3707 -2385 -5262 409 6836 3180 -6483 -7278 1911 6932 2108 -5692
3645e692o44P641N119n847q343K451Q911K128p225m867K477O123J763n867m542
$$ -5692 -6336 1305 6424 577 -7766 -5315 3596 5724 -1501 -6368 -3891 2232 3995 -1872 -6414
3660f414M420O258j701n343j038L142K081m7k062o64K417J018k628j183K493N27
$$ -6414 -1994 4264 2563 -2780 -3818 -676 1405 1358 -704 -1368 1049 2067 -561 -1744 749 1276
3676A276j830m71K197J266p52k317k207K440L817j451m740R48M051J298k749l535
$$ 1276 -554 -1025 1172 2438 1686 -631 -2838 -398 3419 1968 -2772 -1824 2227 3525 776 -2759
3692b759k36L589L270k752m574R81M687J136l310l062k40L852L705k161n428k54
$$ -2759 -2995 594 3864 1112 -3462 -2481 2206 3342 32 -3030 -3270 582 4287 2126 -3302 -3556
3708c556M149K560j660l058j527K611M440p90n222p25L461L261j339k901k014
$$ -3556 593 3153 1493 -1565 -3092 -481 3959 3169 -2053 -2778 683 3944 2605 -296 -2310
3723b310K598L877j228n286j43M425K146k342k490n40K227K373j423l545J114
$$ -2310 288 4165 2937 -2349 -2492 1933 4079 1737 -753 -1293 934 3307 1884 -1661 -547
3738e47L026j304k132J195J327n06j254j089J127L095j143m713o45N461K455m643
$$ -547 2479 1175 -957 238 1565 1059 -195 -1284 -157 2938 1795 -2918 -3563 1898 4353 -290
3754b90m026J680N277J251m680n627L446P815m2p934l554N470N912j360p382k839
$$ -290 -4316 -2636 2641 3892 -788 -6415 -2969 4846 4804 -3130 -6684 -1214 4698 3338 -4044 -6883
3770f883O267P498l172r147m30O789L606l824n296P21N729K841m747n326L406
$$ -6883 -616 6882 3710 -5437 -5867 922 4528 704 -4592 -3871 1858 4699 -48 -5374 -1968
3785a968M898p48m641k67L703J826j973l693q3M567J500m534j173M357J969l200
$$ -1968 2930 2182 -2459 -2726 977 2803 830 -2863 -2946 1621 3121 -1413 -2586 1771 3740 540
3801E40l275K91M392K577l469m981K742O307k60o388l054L877N565L67n074l869
$$ 540 -2735 -2444 1948 4525 1056 -3925 -1183 5124 4864 -1524 -4578 -701 4864 5231 157 -3712
3817c712L560O188j774o734q83M675L691q78m819k418L712M117k095n322J8M471
$$ -3712 -152 6036 4262 -2472 -3355 1320 5011 4133 -686 -3104 608 4725 2630 -2692 -2674 1797
3833A797K615j987l487k372K731L541p25l840m10K409J484o14k025k051J351L602
$$ 1797 4412 2425 -1062 -3434 -703 2838 2113 -1727 -2137 272 1756 1142 -883 -2934 -1583 2019
3849B019p37k729l5K045k54q09j235N07J884O04j965j357K578J717k750k339J778
$$ 2019 1282 -1447 -1482 563 309 -500 -1735 -1228 656 1260 -705 -2062 516 2233 -517 -2856 -1078
3866a078K445K74k271j906J954M230q88o535j175O449L613l554o116n24O097M938
$$ -1078 1367 1641 -630 -2536 -582 3648 2760 -3775 -4950 1499 5112 1558 -4558 -5082 1015 5953
3882E953m095q014L59R393K632p204n725K570P591K026p572n788M892Q044r83
$$ 5953 1858 -6156 -5797 3596 6228 -976 -6701 -4131 3460 5486 -2086 -7874 -2982 5062 4079
3897D079q270k191N564N437j892o913j645N973M661m045n202J983N289O0l798
$$ 4079 -4191 -6382 -818 4619 2727 -4186 -5831 142 4803 758 -4444 -2461 2828 2888 -910
3912i10j737K267L102n84m025o06N222J783m612l023L000L882j93l805k471L197
$$ -910 -2647 -380 2722 2138 -1887 -2493 2729 4512 -100 -3123 -123 3759 3566 -239 -2710 487
3928D87M686k274n948n17O102K652l638m153j65M901K678l846o097J793O355J768
$$ 487 5173 2899 -3049 -3566 2536 5188 1550 -2603 -2768 2133 4811 965 -5132 -3339 3016 4784
3944D784m691l851N14L725K237k994l804J401M375P90l072k478K70K181K256j341
$$ 4784 93 -3758 -3244 481 2718 -276 -4080 -2679 1696 2486 -586 -3064 -2794 -613 1643 302
3960C02k967N28L674M21k817j879P20K424K098r50l039M23K629J50k220p49J279
$$ 302 -2665 -2137 1537 1958 -859 -2738 -2018 406 2504 1554 -1485 -1062 1567 1717 -503 -1252 27
3977B7Q22R44q66j066P44N93j541j517K264K413j600k416j47J952J524j372l847
$$ 27 849 1793 927 -139 605 1198 -343 -1860 404 2817 1217 -1199 -1346 606 2130 758 -3089
3994c089q9N152J798m793l520K163M028N26m198l506K881O346k89o962k850M765
$$ -3089 -3178 1974 3772 -1021 -4541 -2378 1650 2176 -2022 -5528 -2647 3699 3410 -3552 -6402 -1637
4010a637M964j536n354j756M799N342k701o633l12N798K967l097l200O17L897
$$ -1637 3327 1791 -3563 -5319 -520 4822 2121 -4512 -4824 974 3941 844 -2356 -1739 2158
$$ [...]
8191B4
##END NTUPLES=NMR FID
##END=
