##TITLE=1H_TG-2268-b-2
 CDCl3, 8 sc, 
 10.1.2020
##JCAMPDX= 6.0         $$ Bruker NMR JCAMP-DX V2.0
##DATA TYPE= NMR FID
##DATA CLASS= NTUPLES
##ORIGIN= UXNMR, Bruker Analytische Messtechnik GmbH
##OWNER= root
$$ XWIN-NMR		Version 3.5
$$ Fri Jan 10 14:31:00 2020 Russian Standard Time (UT+4h)  she@DPX200
##.OBSERVE FREQUENCY= 200.1315
##.OBSERVE NUCLEUS= ^1H
##.DELAY= (6, 6)
##.ACQUISITION MODE= SIMULTANEOUS
##.ACQUISITION SCHEME= undefined
##.AVERAGES= 8
##.DIGITISER RES= 18
##SPECTROMETER/DATA SYSTEM= spect
##.PULSE SEQUENCE= zg30
##.SOLVENT NAME= CDCl3
##.SHIFT REFERENCE= (INTERNAL, CDCl3, 0, 15.7039)
##AUDIT TRAIL= $$ (NUMBER, WHEN, WHO, WHERE, WHAT)
$$ ##TITLE= Audit trail, XWIN-NMR		Version 3.5
$$ ##JCAMPDX= 5.01
$$ ##ORIGIN= Bruker BioSpin GmbH
$$ ##OWNER= she
$$ F:/spectra/data/she/nmr/H-F/1/audita.txt
$$ ##AUDIT TRAIL=  $$ (NUMBER, WHEN, WHO, WHERE, WHAT)
(   1,<2020-01-10 14:28:11.79 +0400>,<she>,<DPX200>,
      <created by zg, POWCHK disabled, PULCHK disabled
       configuration hash MD5:
       00 E9 B6 7A A2 85 ED C7 34 08 36 98 17 FE 4E 26
       data hash MD5: 16K
       E4 D9 99 F1 B5 60 CE F1 75 EC 5E 09 84 C1 55 E0>)
$$ ##END=
$$ 
$$ hash MD5
$$ D0 0A 36 D6 59 89 70 C7 1B FF AC 15 3E 2E 12 EC
##$RELAX= 
##$RELAX= 
##$RELAX= 
##$RELAX= 
##$RELAX= 
##$RELAX= 
$$ Bruker specific parameters
$$ --------------------------
##$DU= <F:/spectra>
##$EXPNO= 1
##$NAME= <H-F>
##$PROCNO= 1
##$TYPE= <nmr>
##$USER= <she>
##$AMP= (0..31)
100 100 100 100 100 100 100 100 100 100 100 100 100 100 100 100 100 100 
100 100 100 100 100 100 100 100 100 100 100 100 100 100 
##$AQSEQ= 0
##$AQ_mod= 1
##$AUNM= <au_zg>
##$AUTOPOS= <>
##$BF1= 200.13
##$BF2= 200.13
##$BF3= 200.13
##$BF4= 200.13
##$BF5= 200.13
##$BF6= 200.13
##$BF7= 200.13
##$BF8= 200.13
##$BYTORDA= 1
##$CFDGTYP= 0
##$CFRGTYP= 5
##$CHEMSTR= <none>
##$CNST= (0..31)
1 1 145 1 1 1 1 1 1 1 1 1 1 1 1 1 1 1 1 1 1 1 1 1 1 1 1 1 1 1 1 1 
##$CPDPRG= <>
##$CPDPRG1= <>
##$CPDPRG2= <>
##$CPDPRG3= <>
##$CPDPRG4= <mlev>
##$CPDPRG5= <mlev>
##$CPDPRG6= <mlev>
##$CPDPRG7= <mlev>
##$CPDPRG8= <mlev>
##$CPDPRGB= <>
##$CPDPRGT= <>
##$D= (0..31)
0 1.2 0 0 0 0 0 0 0 0.06 0 0.03 0 0 0 0 0.0002 0 0 0 0 0 0 0 0 0 0 0 0 
0 0 0 
##$DATE= 1578652091
##$DBL= (0..7)
120 120 120 120 120 120 120 120 
##$DBP= (0..7)
150 150 150 150 150 150 150 150 
##$DBP07= 0
##$DBPNAM0= <>
##$DBPNAM1= <>
##$DBPNAM2= <>
##$DBPNAM3= <>
##$DBPNAM4= <>
##$DBPNAM5= <>
##$DBPNAM6= <>
##$DBPNAM7= <>
##$DBPOAL= (0..7)
0.5 0.5 0.5 0.5 0.5 0.5 0.5 0.5 
##$DBPOFFS= (0..7)
0 0 0 0 0 0 0 0 
##$DE= 6
##$DECBNUC= <off>
##$DECIM= 24
##$DECNUC= <off>
##$DECSTAT= 4
##$DIGMOD= 1
##$DIGTYP= 9
##$DL= (0..7)
0 120 120 120 120 120 120 120 
##$DP= (0..7)
150 150 150 150 150 150 150 150 
##$DP07= 0
##$DPNAME0= <>
##$DPNAME1= <>
##$DPNAME2= <>
##$DPNAME3= <>
##$DPNAME4= <>
##$DPNAME5= <>
##$DPNAME6= <>
##$DPNAME7= <>
##$DPOAL= (0..7)
0.5 0.5 0.5 0.5 0.5 0.5 0.5 0.5 
##$DPOFFS= (0..7)
0 0 0 0 0 0 0 0 
##$DQDMODE= 0
##$DR= 18
##$DS= 0
##$DSLIST= <SSSSSSSSSSSSSSS>
$$ [...]
##$SUBNAM2= <"">
##$SUBNAM3= <"">
##$SUBNAM4= <"">
##$SUBNAM5= <"">
##$SUBNAM6= <"">
##$SUBNAM7= <"">
##$SUBNAM8= <"">
##$SUBNAM9= <"">
##$SW= 24.9337058887773
##$SWIBOX= (0..15)
0 0 2 0 0 0 0 0 0 0 0 0 0 0 0 0 
##$SW_h= 4990.01996007984
##$TD= 16384
##$TD0= 1
##$TE= 0
##$TE2= 300
##$TE3= 300
##$TEG= 300
##$TL= (0..7)
0 120 120 120 120 120 120 120 
##$TP= (0..7)
150 150 150 150 150 150 150 150 
##$TP07= 0
##$TPNAME0= <>
##$TPNAME1= <>
##$TPNAME2= <>
##$TPNAME3= <>
##$TPNAME4= <>
##$TPNAME5= <>
##$TPNAME6= <>
##$TPNAME7= <>
##$TPOAL= (0..7)
0.5 0.5 0.5 0.5 0.5 0.5 0.5 0.5 
##$TPOFFS= (0..7)
0 0 0 0 0 0 0 0 
##$TUNHIN= 0
##$TUNHOUT= 0
##$TUNXOUT= 0
##$USERA1= <user>
##$USERA2= <user>
##$USERA3= <user>
##$USERA4= <user>
##$USERA5= <user>
##$V9= 5
##$VALIST= <valist>
##$VCLIST= <CCCCCCCCCCCCCCC>
##$VD= 0
##$VDLIST= <DDDDDDDDDDDDDDD>
##$VPLIST= <PPPPPPPPPPPPPPP>
##$VTLIST= <TTTTTTTTTTTTTTT>
##$WBST= 1024
##$WBSW= 4
##$XGAIN= (0..3)
0 0 0 0 
##$XL= 0
##$YL= 0
##$YMAX_a= 749680
##$YMIN_a= -467979
##$ZGOPTNS= <>
##$ZL1= 120
##$ZL2= 120
##$ZL3= 120
##$ZL4= 120
##$ABSF1= 10
##$ABSF2= 0
##$ABSG= 5
##$ABSL= 3
##$ALPHA= 0
##$AQORDER= 0
##$ASSFAC= 0
##$ASSFACI= 0
##$ASSFACX= 0
##$ASSWID= 0
##$AUNMP= <proc_1d>
##$AZFE= 0.1
##$AZFW= 0.1
##$BCFW= 1
##$BC_mod= 2
##$BYTORDP= 1
##$COROFFS= 0
##$CY= 11.3945322036743
##$DATMOD= 1
##$DC= 2
##$DFILT= <>
##$DTYPP= 0
##$F1P= 16.9975609425685
##$F2P= -3.02152046262296
##$FCOR= 0.5
##$FTSIZE= 0
##$FT_mod= 4
##$GAMMA= 1
##$GB= 0.15
##$INTBC= 1
##$INTSCL= 1
##$ISEN= 128
##$LB= 0.24
##$LEV0= 0
##$LPBIN= 0
##$MAXI= 10000
##$MC2= 0
##$MEAN= 0
##$ME_mod= 0
##$MI= 1.114404
##$NCOEF= 0
##$NC_proc= 0
##$NLEV= 6
##$NOISF1= 3.799351
##$NOISF2= 2.8
##$NSP= 1
##$NTH_PI= 0
##$NZP= 0
##$OFFSET= 15.70392
##$PC= 1
##$PHC0= -10147.33
##$PHC1= 14.4008
##$PH_mod= 1
##$PKNL= yes
##$PPARMOD= 0
##$PSCAL= 0
##$PSIGN= 0
##$REVERSE= no
##$SF= 200.130013532006
##$SI= 16384
##$SIGF1= 3
##$SIGF2= 2
##$SINO= 400
##$SIOLD= 16384
##$SREGLST= <1H.CDCl3>
##$SSB= 0
##$STSI= 0
##$STSR= 0
##$SW_p= 3612.71676300578
##$SYMM= 0
##$S_DEV= 0
##$TDeff= 0
##$TDoff= 0
##$TI= <>
##$TILT= no
##$TM1= 0
##$TM2= 0
##$TOPLEV= 0
##$USERP1= <user>
##$USERP2= <user>
##$USERP3= <user>
##$USERP4= <user>
##$USERP5= <user>
##$WDW= 1
##$XDIM= 8192
##$YMAX_p= 0
##$YMIN_p= 0
$$ End of Bruker specific parameters
$$ ---------------------------------
##NTUPLES= NMR FID
##VAR_NAME=  TIME,          FID/REAL,        FID/IMAG
##SYMBOL=    X,             R,               I
##VAR_TYPE=  INDEPENDENT,   DEPENDENT,       DEPENDENT
##VAR_FORM=  AFFN,          ASDF,            ASDF
##VAR_DIM=   8192,          8192,            8192
##UNITS=     SECONDS,       ARBITRARY UNITS, ARBITRARY UNITS
##FACTOR=    0.0002004,     1,               1
##FIRST=     0,             0,               0
##LAST=      1.6414764,     0,               0
##MIN=       0,             -467979,         0
##MAX=       1.6414764,     749680,          0
$$ Real data points
##PAGE= N=1
##DATA TABLE= (X++(R..R)), XYDATA
$$ [...]
$$ plain form
2751 1232 430 -528 -1437 -2511 -834 106 -2608 -4344 -501 1491 -1283 -3308 -3377 -3200 -2522 -1377 -1954
2768 -1954 -1629 1664 1283 -3292 -4845 -2671 -2103 -1827 -1121 -1548 -626 2000 873 -3215 -2903 356 840
2785 840 -1090 -1459 -1084 -153 2058 915 -2774 -1090 2557 1378 -1194 -499 658 1533 2113 325 -2774
2802 -2774 -1215 2452 590 -2113 -1095 1264 1414 1401 -1087 -2910 206 3023 146 -3747 -1905 397
2818 397 663 -75 -1683 -2197 884 3199 -1057 -4228 -1237 1891 838 -1748 -2477 -2267 1128 2582
2834 2582 -1462 -3199 1427 3310 -81 -3137 -2575 152 2471 1655 -2823 -3178 1574 2479 -2450 -4363
2850 -4363 -215 2875 3084 -544 -4571 -3305 1776 920 -4651 -4952 788 2312 -302 -3019 -4799 -1689
2866 -1689 1735 -1344 -6511 -4137 1832 1582 -3375 -5220 -3176 -297 842 -3165 -6060 -1047 4376
$$ packed form
2751A232q02r58r09j074J677R40k714j736L843J992k774k025o9J77O78J145n77
2768a954L25L293l81m575j553K174N68K76P06m27R22K626j127m088L12L259M84
2785H40j930l69L75R31K211j143l689J684L647j179k572O95J157Q75N80j788l099
2802b774J559L667j862k703J018K359J50j3k488j823L116K817k877l893J842K302
2818C97K66p38j608n14L081K315m256l171K991L128j053k586p29K10L395J454
2834B582m044j737M626J883l391l056N62K727K319q16m478l55M752R05m929j913
2850d363M148L090K09l628m027J266N081q56n571l01N740J524k614k717j780L110
2866a689L424l079n167K374N969k50m957j845K044K879J139m007k895N013N423
$$ plain form
2881 4376 1116 -5337 -5478 -1319 1128 289 -3247 -3888 1679 4978 -1001 -6215 -2614 3130 3134 -683
2897 -683 -4099 -2646 2795 3545 -2847 -5761 682 5666 2985 -2122 -3908 -624 3445 1748 -4710
2912 -4710 -4888 2641 4980 -545 -5295 -2791 1803 3723 -582 -5968 -3387 4542 4632 -3501 -6270 -1455
2928 -1455 2169 952 -2560 -5068 -111 5685 2383 -5187 -4930 1597 2715 -1018 -4261 -2742 2871
2943 2871 5576 -196 -5918 -1478 5719 3532 -2478 -3987 75 3980 2956 -2987 -4934 2000 6513
2958 6513 717 -5619 -2534 3375 4551 97 -4989 -3580 3631 4780 -3006 -6879 -1206 4694 2458
2973 2458 -2885 -4886 -1382 4260 2426 -5273 -5851 1397 3737 -1735 -5568 -3207 1867 4176 130
2988 130 -4989 -3523 3622 3157 -2754 -4562 -317 2504 2247 -791 -3275 -24 4515 1919 -3594 -2641
$$ packed form
2881D376l260o453j41M159K447q39l536o41N567L299n979n214L601N744Ml817
2897f83l416J453N441P50o392k914O443M984k681n107j786L284M069j697o458
2912d710j78P529K339n525m750K504M594J920m305n386K581P929R0q133k769M815
2928a455L624j217l512k508M957N796l302p570K57O527J118l733l243J519N613
2943B871K705n772n722M440P197k187o010j509M062L905j024n943j947O934M513
2958F513n796o336L085N909J176m454n086J409P211J149p786l873N673N900k236
2973B458n343k001L504N642j834p699n78P248K340n472l833K361N074K309m046
2988A30n119J466P145m65n911j808M245K821k57l038k484L251M539k596n513R53
$$ plain form
3004 -2641 2941 3497 541 -1408 -1221 2062 3650 -878 -4393 69 4828 2984 -741 -780 251 2220
3020 2220 1512 -2348 -3726 1336 4619 869 -2822 -1245 2169 2935 913 -2678 -2831 2377 4331 -1283
3036 -1283 -3788 -301 2804 2236 144 -1962 -753 3083 2955 -1418 -2013 2010 3307 1251 -342 -518
3052 -518 1088 3574 2700 -1041 -602 3476 3770 1554 539 1418 1341 1760 955 -681 1250 3976 2475
3069 2475 299 1392 2829 1244 281 173 -358 1365 2400 868 -691 1028 2158 329 185 1069
3085 1069 705 893 1168 -262 -859 1836 2335 -886 -1325 757 1707 1224 1497 175 -5 2228 2564 -71
3103 -71 -338 1448 947 597 2310 1704 528 1810 2683 1093 1121 2112 635 766 1933 1288 -330 1420
3121 1420 2907 1475 592 757 839 1019 3064 1524 -1752 -221 2330 1518 459 -421 -670 1079 2857
$$ packed form
3004b641N582N56k956j949J87L283J588m528l515M462M759j844l725l9J031J969
3020B220p08l860j378N062L283l750l691J577L414P66k022l591j53N208J954n614
3036a283k505L487L105n68k092k106J209L836j28m373n95M023J297k056j593j76
3052e18J606K486q74l741M39M078K94k216j015Q79p7M19q05j636J931K726j501
3069B475k176J093J437j585r63j08n31J723J035j532j559J719J130j829j44Q84
3085A069l64J88K75j430n97K695M99l221m39K082R50m83K73j322j80K233L36k635
3103g1k67J786n01l50J713o06j176J282Q73j590K8R91j477J31J167o45j618J750
3121A420J487j432q83J65Q2J80K045j540l276J531K551q12j059q80k49J749J778
$$ plain form
3138 2857 1026 -1469 575 2346 836 -480 -143 -48 265 1556 159 -1249 1189 3053 1168 -248
3154 -248 193 345 431 1694 885 -855 716 2179 787 354 1840 813 -198 758 1009 661 1092 1089
3172 1089 -1020 -222 1852 1301 -700 -117 450 132 982 1198 -646 -813 1165 209 -1214 -926 375
3189 375 464 588 276 -1588 -491 2288 1071 -2198 -2261 -288 786 1165 35 -2246 -882 2407 1855
3206 1855 -1428 -1001 373 850 1516 619 -1233 -699 2399 892 -2398 -1069 1990 1649 333 -532 -1298
3223 -1298 672 2570 267 -2194 -1297 1189 148 -648 -239 -596 -245 1138 37 -1179 344 1123
3239 1123 -1728 -2208 -413 459 149 52 -1160 -1457 1245 1692 -1575 -2770 31 813 67 -732 -866 -929
3257 -929 843 334 -2700 -1883 1835 1908 -376 -1344 -1289 -262 1625 452 -3319 -3154 781 2288 -460
$$ packed form
3138B857j831k495K044J771j510j316L37R5L13J291j397j408K438J864j885j416
3154b48M41J52Q6J263q09j740J571J463j392m33J486j027j011R56K51l48M31l
3172A089k109P98K074n51k001N83N67l18Q50K16j844j67J978r56j423K88J301
3189C75Q9J24l12j864J097K779j217l269o3J973J074L79j130k281J364L289n52
3206A855l283M27J374M77O66q97j852N34L098j507l290J329L059l41j316q65p66
3223a298J970J898k303k461Q97K486j041p96M09l57L51J383j101j216J523P79
3239A123k851m80J795Q72l10r7j212k97K702M47l267j195K801P82p46p99j34o3
3257i29J772n09l034Q17L718P3k284r68N5J027J887j173l771J65L935J507k748
$$ plain form
3274 -460 -1487 -1522 -489 1322 465 -3361 -3161 381 491 -2106 -2828 -875 350 702 -1113 -3876 -2103
3291 -2103 1572 559 -3060 -3593 -1050 779 482 -1855 -3848 -1618 1757 327 -3276 -1693 1362
3306 1362 940 -1682 -2591 -1310 1326 1861 -2152 -3986 429 3009 213 -2833 -1438 1101 2080 97
3322 97 -3223 -2878 1881 2692 -2175 -3931 754 3787 1822 -2439 -4097 -676 4179 2028 -4631 -4496
3338 -4496 1827 3776 -162 -3892 -3397 586 3630 387 -4195 -1720 2791 1709 -2857 -3407 -993
3353 -993 2107 2000 -999 -3011 -22 3248 410 -3412 -2232 1022 1825 531 -673 -1486 589 879
3369 879 -1908 -2517 1434 2997 153 -1915 -1328 154 988 -388 -2990 -2477 1496 2314 -1449 -2817
3385 -2817 -1357 437 863 -900 -3359 -2360 1538 949 -3467 -3990 -785 1940 847 -2182 -3639 -1326
$$ packed form
3274d60j027l5J033J811q57l826K00L542J10k597p22J953J225L52j815k763J773
3291b103L675j013l619n33K543J829k97k337j993K230L375j430l603J583L055
3306A362m22k622r09J281K636N35m013j834M415K580k796l046J395K539R79j983
3322I7l320L45M759Q11m867j756M685L033j965m261j658L421M855k151o659J35
3338d496O323J949l938l730M95L983L044l243m582K475M511j082m566n50K414
3353i93L100j07k999k012K989L270k838l822J180L254Q03j294j204q13K075K90
3369H79k787o09L951J563k844k068N87J482Q34j376k602N13L973Q18l763j368
3385b817J460J794M26j763k459R99L898n89m416n23L205K725j093l029j457K313
$$ plain form
3401 -1326 2841 1567 -3862 -4838 -737 1919 1497 -755 -2450 -666 2745 1264 -3044 -2054 1965 2868
3417 2868 519 -1237 -476 1867 2648 -447 -2507 441 4055 2064 -1214 -647 1981 2164 928 -966
3433 -966 -656 2546 2489 -1477 -2417 2093 4562 1546 -2494 -2084 1526 3676 1125 -3765 -2826 3063 4071
3450 4071 -1011 -3518 -647 3110 2676 -1068 -3552 46 4520 1524 -4204 -3196 2424 3901 744
3465 744 -2546 -2444 1589 4005 735 -3671 -1392 2844 2528 46 -1329 -40 1276 656 -1234 -1727
3481 -1727 1325 3046 427 -1360 170 1012 -366 -1222 -1734 -540 1465 1014 -1515 -1092 1099 5
3497 5 -2259 -1607 388 1101 348 -1561 -3426 -1692 1867 1089 -1860 -1299 320 1729 1525 -595 -3086
3514 -3086 -1749 1606 1820 -395 -333 1153 1360 1211 -396 -1795 -156 3267 2908 75 -26 1902 2287
$$ packed form
3401a326M167j274n429r76M101K656m22k252j695J784L411j481m308R90M019R03
3417B868k349j756P61K343P81l095k060K948L614j991l278N67K628J83j236j894
3433i66L10L202n7l966r40M510K469l016m040M10L610K150k551m890R39N889J008
3450D071n082k507K871L757m34l744k484L598M474k996n728J008N620J477l157
3465G44l290J02M033K416l270m406K279M236l16k482j375J289J316o20j890m93
3481a727L052J721k619j787J530Q42j378q56n12J194K005m51k529M23K191j094
3497Ek264O52J995P13p53j909j865J734L559p78k949N61J619J409k04k120k491
3514c086J337L355K14k215O2J486K07j49j607j399J639L423l59k833j01J928L85
$$ plain form
3531 2287 1562 -685 -1840 428 4673 4113 663 -816 820 1687 1121 623 -316 915 3059 961
3547 961 -1041 193 1871 1030 -337 540 1197 1740 829 -1046 -1694 1153 2062 -282 -812 1520 2367
3564 2367 740 -956 -1159 748 3190 1066 -2745 -1205 3816 4490 253 -2972 -1457 2435 4614
3579 4614 1648 -2699 -522 3692 3551 -884 -1965 -87 2548 3271 672 -1873 122 3620 2182
3594 2182 -1504 -1470 791 1868 1573 121 -2105 -187 1945 1138 -536 -689 -115 -719 577 1012 131
3611 131 -535 -430 -552 -806 348 507 -1104 -20 1417 849 -393 -346 -1209 -850 643 967 1 316
3629 316 1319 796 -118 -81 -577 94 2335 1923 -671 -705 1189 1900 1172 -555 -2049 -53 3507 3633
3647 3633 -405 -2052 4 1793 1499 -527 -1817 268 3803 2823 -1853 -2643 378 2118 735 -896
$$ packed form
3531B287p25k247j155K268M245n60l450j479J636Q67n66m98r39J231K144k098
3547I61k002J234J678q41j367Q77O57N43r11j875o48K847R09k344n30K332Q47
3564B367j627j696k03J907K442k124l811J540N021O74m237l225J515L892K179
3579D614k966m347K177M214j41m435j081J878K635P23k599k545J995L498j438
3594B182l686L4K261J077k95j452k226J918K132q07j674j53N74o04J296M35q81
3611A31o66J05j22k54J154J59j611J084J437n68j242M7q63L59J493L24r66L15
3629C16J003n23r14L7m96O71K241m12k594l4J894P11p28j727j494J996L560J26
3647C633m038j647K056J789k94k026j290K085L535r80m676p90L021J740j383j631
$$ plain form
3663 -896 -595 1992 3435 504 -3701 -2656 2396 3156 897 -560 569 1740 1329 -908 -2463 131
3679 131 2682 1449 -694 727 2394 1168 -758 -1803 -599 2339 3127 204 -1167 1081 2464
3694 2464 -42 -1725 -1089 900 2287 1033 -562 -355 2189 1198 -2357 -2557 450 3071 1585 -487
3710 -487 -2262 -865 1462 675 -1739 -987 1497 1809 45 -1066 -1583 -1126 497 -7 -1106 78 1360
3727 1360 119 -957 -787 -314 -182 308 197 -732 -264 515 -20 -357 798 244 -1273 -302 830 787
3745 787 792 -410 -851 -430 733 407 -1025 -538 745 649 686 454 -578 -1408 46 663 -441 -52 488
3764 488 -311 305 416 -875 -635 724 795 -973 -1099 -18 621 1172 89 -1829 -2165 107 1426 301
3782 301 -109 124 -41 -252 -25 -1574 -1316 299 531 -75 311 118 -1365 -2026 -513 89 -190 364 187
$$ packed form
3663h96L01K587J443k931m205J045N052P60k259j457J129J171m11k237j555K594
3679A31K551j233k143J421J667j226j926j045J204K938P88k923j371K248J383
3694B464k506j683O36J989J387j254j595K07K544r91l555k00L007K621j486k072
3710d87j775J397K327p87k414P52K484L12j764j111n17M57J623n04j099J184J282
3727A360j241j076J70M73J32M90j11r29M68P79n35l37J155n54j517R71J132m3
3745G87Nj202m41M21J163l26j432M87J283r6L7k32j032q30J454O17j104L89N40
3764D88p99O16J11j291K40J359P1j768j26J081O39N51j083j918l36K272J319j125
3782C01m10K33j65k11K27j549K58J615K32o06L86j93j483o61J513O02k79N54j77
$$ plain form
3801 187 240 143 -881 -2994 -1803 1347 1063 -1258 -1873 -363 1371 1474 -1804 -4655 -1609 2875 2313
3818 2313 -1313 -2587 -599 1536 583 -2422 -3161 468 3871 1679 -2388 -2203 898 844 -1608 -2206
3834 -2206 -382 3101 3173 -580 -3263 -1146 1008 -359 -1381 224 1695 1778 -370 -2600 -1669 1094
3850 1094 879 -1996 -1742 1871 2984 216 -3112 -3362 -1 2588 147 -3403 -1464 2615 2091 -1621
3866 -1621 -3069 -1673 1053 1870 -1173 -2723 -32 3140 671 -3417 -3565 -175 2348 2016 -834 -2583
3882 -2583 -348 2104 -94 -2775 -2341 421 1743 933 -904 -1972 -128 1230 -534 -2382 -568
3897 -568 940 613 -1114 -2197 -1590 321 922 -1182 -2636 -541 899 -73 -1111 -1214 -706 -195 -800
3914 -800 -2748 -2129 1189 1473 -1729 -2896 -904 1204 298 -2205 -3390 -857 2872 1506 -2802 -3456
$$ packed form
3801A87N3r7j024k113J191L150k84k321o15J510J734J03l278k851L046M484n62
3818B313l626j274J988K135r53l005p39L629L403k192m067J85L101n4k452n98
3834b206J824L483P2l753k683K117K154j367j022J605J471Q3k148k230R31K763
3850A094k15k875K54L613J113k768l328k50L361K589k441l550J939M079n24l712
3866a621j448J396K726Q17l043j550K691L172k469m088j48L390K523l32k850j749
3882b583K235K452k198k681M34K762J322q10j837j068J844J358j764j848J814
3897e68J508l27j727j083O07J911O01k104j454K095J440r72j038j03N08N11o05
3914h00j948O19L318K84l202j167J992K108r06k503j185K533L729j366m308o54
$$ plain form
3930 -3456 33 1591 -276 -1977 -2110 1028 2999 440 -3545 -2017 1931 2074 -1453 -3476 -1014
3945 -1014 2687 3539 -470 -4088 -1301 2214 1090 -2045 -1779 455 2364 1173 -1757 -3497 -964
3960 -964 1288 170 -1218 73 1269 316 -1320 -3063 -2626 -24 1493 -22 -601 201 432 -1295
3976 -1295 -1840 -600 59 236 408 -517 -6 1218 41 -2048 -1606 567 1497 1334 411 -476 -204 1118
3994 1118 499 -1693 -1318 831 1723 1720 113 -1003 -892 711 137 -1608 -585 2024 1996 -159 -2649
4011 -2649 -3189 -1202 1247 731 -1969 -835 1311 914 -1301 -2950 -3354 -767 1432 -19 -1942 -1143
4027 -1143 609 -314 -2547 -2743 -1344 845 921 -1097 -2391 -229 1886 -287 -2371 -2056 -411 708
4043 708 621 -406 -1029 22 746 -1132 -1741 258 1319 390 -293 -798 101 1187 967 -1460 -1062 1296
$$ packed form
3930c456L489J558j867j701j33L138J971k559l985J528L948J43l527k023K462
3945a014L701Q52m009l618K787L515j124l135K66K234J909j191k930j740K533
3960i64K252j118j388J291J196r53j636j743M37K602J517j515n79Q02K31j727
3976a295n45J240O59J77J72r25N11J224j177k089M42K173R30j63r23q87K72J322
3994A118o19k192L75K149Q92lj607j116J11J603n74j745J023K609k8k155k490
4011b649n40J987K449n16k700J134K146l97k215j649m04K587K199j451j923P99
4027a143J752r23k233j96J399K189P6k018j294K162K115k173k084L15J645J119
4043G08q7j027o23J051P24j878o09J999J061r29o83n05Q99J086k20k427L98K358
$$ plain form
4061 1296 1707 -352 -1209 -554 290 594 -208 -911 -348 1339 317 -1667 -933 594 882 -585 -957 -1172
4079 -1172 40 1867 690 -861 -439 531 317 -377 -892 -124 984 1936 538 -1070 -335 727 -86
4096 -86 -811 409 1636 1967 1503 -44 -1036 256 906 -129 -240 743 1237 1828 1203 -82 -568 436
4114 436 1047 -408 -21 1687 1877 302 -899 -1405 -653 598 635 -761 -32 1950 1216 -932 -1993
4131 -1993 -1488 -333 806 635 -282 124 1064 -621 -2592 -1573 179 1299 800 -94 -866 120 894
4148 894 -791 -2267 -93 1896 1460 620 -318 -210 411 120 -1394 -1008 1485 2663 421 -994 -118
4165 -118 532 550 -261 -1065 -2 2290 2499 -315 -1660 -336 118 -834 -898 25 2121 2695 319 -2158
4183 -2158 -1641 1047 943 -1288 -1328 978 2281 1619 -1091 -2583 -260 2145 715 -1240 -815 1628
$$ packed form
4061A296M11k059q57O55Q44L04q02p03N63J687j022j984P34J527K88j467l72k15
4079a172J212J827j177j551M22R70k14o94n15P68J108R52j398j608P35J062q13
4096h6p25J220J227L31m64j547r92J292O50j035j11R83M94N91o25j285m86J004
4114D36O11j455L87J708J90j575j201n06P52J251L7j396P29J982p34k148j061
4131a993N05J155J139j71r17M06R40j685j971J019J752J120m99q94p72R86P74
4148H94j685j476K174J989m36q40r38J08O21k91j514L86K493J178k242j415Q76
4165a18O50J8q11q04J063K292K09k814j345J324M54r52o4R23K096N74k376k477
4183b158N17K688j04k231m0K306J303o62k710j492K323K405j430j955M25K443
$$ plain form
4199 1628 1529 224 -1174 -902 1351 2036 -378 -1868 577 2542 1387 -185 -1026 196 2075 1454
4215 1454 -897 -707 1920 2303 40 -898 400 1987 1864 544 -769 424 2329 1578 -1285 -1454
4231 -1454 1100 2314 1903 219 -558 353 2341 1186 -1099 -791 1404 1685 377 -20 13 1164 1638
4248 1638 70 -1479 -473 1723 1241 233 510 620 794 659 -1076 -1747 166 2259 1509 298 224
4265 224 679 114 -314 -951 -460 1940 2675 193 -1424 237 730 231 -1041 -678 771 1778 1640 -848
4283 -848 -1687 561 959 -723 -1090 394 1981 1828 347 -1882 -1122 949 857 -1385 -1160 1166 2419
4300 2419 1192 -1272 -2543 -743 1582 973 -746 144 1816 834 -1269 -1932 -1214 689 2034 615
4316 615 -776 125 805 -284 -1836 -1067 159 1165 1171 -34 -873 89 147 -1173 -906 790 1101 524
$$ packed form
4199A628r9j305j398K72K253O85k414j490K445J965j155j572q41J222J879o21
4215A454k351J90K627L83k263r38J298J587j23j320j313J193J905p51k863j69
4231a454K554J214m11j684p77R11J988j155k285L08K195K81j308l97L3J151M74
4248A638j568j549J006K196m82j008K77J10J74j35j735o71J913K093p50j211p4
4265B24M55n65m28o37M91K400P35k482j617J661M93m99j272L63J449J007j38k488
4283h48q39K248L98j682l67J484J587j53j481k229P60K071r2k242K25K326J253
4300B419j227k464j271J800K325o09j719Q90J672r82k103o63P18J903J345j419
4316F15j391R01O80j089j552P69J226J006Oj205q39R62N8j320K67J696L11n77
$$ plain form
4334 524 693 262 133 137 -517 -1205 -711 1160 1080 517 626 775 205 -399 -627 -140 932 1770 518 -297
4354 -297 260 823 291 -491 -306 318 1097 1161 -273 -1205 -59 951 310 149 239 100 237 489 -227 -413
4374 -413 695 1038 -134 -336 92 12 288 523 -258 -745 -278 298 -121 410 595 348 -46 445 -11 -897
4394 -897 -7 360 45 815 900 446 -357 -88 -466 -26 138 474 -396 229 926 108 -704 -198 -428 -454 -59
4415 -59 -213 -395 479 809 -373 -1766 -1025 -308 -493 -589 -372 -19 558 290 -1434 -2598 -1201 188 61
4434 61 -384 -414 -304 -230 -890 -1848 -1656 164 838 -105 -583 -205 -423 -399 -605 -1241 -728 1101 1016 -595 -694
4455 -694 73 135 -528 -901 -362 440 1403 759 -1094 -599 20 74 -739 -90 160 1352 1623 303 -1379
4474 -1379 -1288 512 10 -325 149 844 991 842 -724 -1888 -677 686 692 -247 131 631 76 -547 -1276
$$ packed form
4334E24J69m31j29Mo54o88M94J871q0n63J09J49n70o04k28M87J072Q38j252q15
4354b97N57N63n32p82J85O24P79O4j434r32J146J010o41j61R0j39J37K52p16j86
4374d13J108L43j172k02M28q0K76K35p81m87M67N76m19N31J85k47l94M91m56q86
4394h97Q90L67l15P70Q5m54q03K69l78M40J64L36q70O25O97q18q12N06k30k6L95
4415e9j54j82Q74L30j182j393P41P17j85r6K17L53N77k68j724j164J397J389j27
4434F1m45l0J10P4o60r58J92J820O74r43m78L78k18K4k06o36N13J829q5j611r9
4455f94P67O2o63l73N39Q02R63o44j853M95O19N4q13O49K50J192K71j320j682
4474a379R1J800n02l35M74O95J47j49j566j164J211J363Or39L78N00n55o23p29
$$ plain form
4493 -1276 -1403 39 1497 258 -770 -459 454 504 -471 -946 -1027 682 1491 -416 -845 499 1379 651
4511 651 -746 -616 -78 1515 1440 -556 -881 500 1324 97 -1006 -451 893 1979 824 -1348 -1159
4528 -1159 892 1392 -759 -1364 191 1187 954 -715 -1652 -182 1908 719 -1268 -1326 448 1221 -27
4545 -27 -1259 -1212 452 1175 -307 -2269 -327 1785 1219 -1059 -1594 -119 722 549 -1395 -1572 763
4562 763 2517 835 -1976 -1072 412 1385 67 -1003 -604 1841 2234 -836 -2683 -590 1640 1097
4578 1097 -548 -1317 45 1465 1286 -1623 -2366 503 1705 13 -1480 -835 699 1697 -293 -2708
4594 -2708 -1618 1187 1596 -849 -1221 -223 1060 646 -1615 -2444 -588 2253 1491 -1191 -1473 182 838
4611 838 -536 -1554 -1283 1232 2568 434 -1786 -960 794 639 -538 -760 609 1601 1684 -115 -1489
$$ packed form
4493a276j27J442J458j239j028L11R13N0r75m75q1J709Q09j907m29J344Q80p28
4511F51j397J30N38J593p5j996l25J381Q24j227j103N55J344J086j155k172J89
4528a159K051N00k151o05J555R96k33j669r37J470K090j189j987n8J774P73j248
4545b7j232M7J664P23j482j962J942K112n66k278n35J475Q41j73j944j77K335
4562G63J754j682k811R04J484R73j318j070L99K445L93l070j847K093K230n43
4578A097j645p69J362J420j79k909p43K869J202j692j493O45J534R98j990k415
4594b708J090K805M09k445l72R98J283m14k261q29J856K841p62k682k82J655O56
4611H38j374j018K71K515J336k134k220Q26J754j55j177k22J369R92Q3j799j374
$$ plain form
4628 -1489 360 1571 232 -712 -272 1366 2212 849 -930 -1113 772 1695 -555 -1051 751 2150
4644 2150 985 -662 -1813 -475 1585 1276 -990 -976 1205 1717 -380 -1878 -1290 646 1943 934
4660 934 -1208 -835 1353 870 -952 -1420 342 1608 1596 -214 -1641 143 1556 401 -1357 -605 1132
4677 1132 1400 505 -412 -382 744 1359 -109 -1449 -85 1464 822 124 78 -36 180 371 -850 -1068
4695 -1068 660 1304 -184 -783 -35 161 229 -417 -793 -402 1073 727 -1197 -662 254 884 -319 -737
4713 -737 -877 115 344 241 -717 -180 1026 520 -496 -841 -123 453 672 345 -274 -79 766 -123 -549
4732 -549 -81 1140 778 231 -294 -538 456 846 30 -314 948 1441 498 -224 -451 -67 229 1024 235
4751 235 246 743 762 -363 -194 -284 -93 150 697 243 334 1206 515 -892 -563 157 226 339 637 713 676 1217
$$ packed form
4628a489J849J211j339r44M40J638Q46j363j779j83J885R23k250m96J802J399
4644B150j165j647j151J338K060l09k266J4K181N12k097j498N88J936J297j009
4660I34k142L73K188m83j822m68J762J266j2j810j427J784J413j155j758P52J737
4677A132K68q95r17L0J126O15j468j340J364J549o42o98m6j14K16J91j221k18
4695a068J728O44j488n99P48J96O8o46l76L91J475l46j924N35R16O30j203m18
4713g37j40R92K29j03r58N37J206n06j016l45P18N76K19l27o19J95Q45q89m26
4732e49M68J221l62n47n25k44R94L90q16l44J262M93r43p22k27L84K96P95p89
4751B35J1M97J9j125J69r0J91K43N47m54R1Q72o91j407L29P20O9J13K98P6l7N41
$$ plain form
4773 1217 -341 -1487 -177 802 611 -10 575 1264 702 597 -627 -688 318 1341 712 -193 53 415
4791 415 626 613 13 -30 850 1274 289 -821 347 704 60 -144 211 147 787 565 -404 -694 344 474
4811 474 -305 212 324 368 582 149 -539 -686 59 -346 -436 -180 441 300 -14 -669 -825 -489 640 27
4831 27 -736 74 916 251 -798 -802 -223 303 401 -176 -718 66 651 150 -411 -533 -213 570 358 -109 -956
4852 -956 269 1259 439 -696 -604 -178 64 353 -129 -458 135 791 -118 -503 -362 76 125 555 -16 -554
4872 -554 464 753 -51 -497 115 459 214 100 -437 -362 354 984 -105 -450 258 349 -430 -712 151 85
4892 85 511 60 -713 -322 1043 639 -425 -815 -216 -144 -55 -110 -568 140 1446 728 -699 -578 447 414
4912 414 87 -397 -121 1165 1136 -61 -1288 -532 731 430 -154 -428 31 513 882 -300 -1462 -399
$$ packed form
4773A217j558j146J310R79j91o21N85O89n62j05j224o1J006J023o29r05K46L62
4791D15K11j3o00m3Q80M24r85j110J168L57o44k04L55o4O40k22r69k90J038J30
4811D74p79N17J12M4K14m33o88j47P45m05r0K56O21j41l14o55j56L36J129o13
4831B7p63Q10Q42o65j049mN79N26R8n77n42P84N85n01n61j22L20P83k12m67q47
4852i56J225R90q20j135R2M26K42K89m82l29N93O56r09l85J41M38M9M30n71n38
4872e54J018K89q04m46O12L44k45j14n37P5P16O30j089l45P08R1p79k82Q63o6
4892H5M26m51p73L91J365m04j064l90N99P2Q9n5m58P08J306p18j427J21J025l3
4912D14l27m84K76J286k9j197j227P56J263l01n84k74M59M82L69j182j162J063
$$ plain form
4930 -399 492 88 -725 -334 187 214 398 -615 -1013 301 698 -238 -817 -211 396 327 -404 -903 -492 486
4950 486 608 -557 -712 19 117 -223 -440 -327 128 698 -100 -1077 -691 317 490 -318 -574 -242 562 618
4970 618 -239 -1273 -96 836 246 -907 -382 556 651 289 -687 -811 191 797 -404 -1004 -461 890
4988 890 875 -459 -1088 -552 143 845 -512 -1378 320 1084 -336 -1102 -368 -227 74 -416 -726 -743 710
5007 710 682 -926 -1112 -125 474 40 -641 -644 318 902 161 -1020 -600 556 506 -904 -1129 79 593 661
5027 661 -371 -1066 -232 1107 658 -1119 -737 558 923 194 -455 -843 496 900 -283 -1112 39 821
5045 821 656 -732 -1023 281 970 744 -653 -1370 -93 471 -69 -830 -481 438 346 -102 -807 -733 318
5064 318 94 -1362 -1594 130 701 327 -231 -689 -237 635 -431 -1347 -596 433 566 -406 -720 -234 357
$$ packed form
4930c99Q91m04q13L91N21K7J84j013l98J314L97r36n79O06O07o9p31m99M11R78
4950D86J22j165j55P31R8l40k17J13M55N70p98r77L86J008J73q08k56L32Q04N6
4970F18q57j034J177R32n90j153N25R38R5l62r76j24J002O06j201o00N43J351
4988H90j5j334o29N36O95P02j357q66J698P64j420p66P34J41L01m90l10j7J453
5007G10k8j608j86R87N99m34o81lR62N84p41j181M20J156n0j410k25J208N14O8
5027F61j032o95Q34J339m49j777L82J295L65p29o49l88J339M04j183q29J151P82
5045H21j65j388k91J304O89k26j397p17J277N64n40p61L49R19r2m48p05P4J051
5064C18k24j456k32J724N71l74n58m58M52Q72j066r16P51J029J33r72l14M86N91
$$ plain form
5083 357 310 -919 -1270 -163 1739 591 -1373 -978 232 908 405 -1627 -1283 250 1240 -192 -1483
5100 -1483 -558 489 404 -345 -1409 -903 625 612 -626 -1442 -161 714 -80 -710 -1379 -391 567 186 -1273
5119 -1273 -982 348 791 -390 -883 -801 249 192 -638 -1150 -327 1076 252 -1216 -932 513 554 -450
5137 -450 -1265 -799 444 1017 48 -1384 -826 1014 496 -772 -1268 -379 813 549 -931 -1394 345 1746
5155 1746 86 -1508 -866 201 1120 464 -1260 -1536 421 1140 -693 -1542 -546 609 518 -448 -1089 -649
5173 -649 599 340 -1247 -1162 236 749 -393 -960 -381 271 503 -34 -884 -558 439 376 -472 -606 258
5192 258 495 225 -454 -707 218 949 128 -1272 -366 547 575 -39 -625 -772 223 774 61 -1249 -330 810
5212 810 531 -498 -1027 -432 171 217 -814 -1020 108 563 300 -807 -648 -324 441 609 -529 -1284 -93
$$ packed form
5083C57m7j229l51J107J902j148j964L95J210O76n03k032L44J533R90j432j291
5100a483R25J047q5p49j064N06J528j3j238q16J281Q75p94o30o69R88R58l81j459
5119a273K91J330M43j181m93Q2J050n7q30n12Q23J403q24j468K84J445M1j004
5137d50q15M66J243N73r69j432N58J840n18j268m96Q89J192k64j480m63J739J401
5155A746j660j594O42J067R19o56j724k76J957P19j833q49R96J155r1r66o41M40
5173f49J248k59j587Q5J398N13j142n67N79O52K32n37q50L26R97o3q48j34Q64
5192B58K37k70o79k53R25P31q21j400R06R13K8o14n86j47R95N51p13j310R19J140
5212H10k79j029n29N95O03M6j031k06J128M55k63j107J59L24P65J68j138p55J191
$$ plain form
5231 -93 768 164 -662 -621 -37 214 295 -573 -815 191 857 -479 -721 -16 395 359 -100 -658 -205 634 855
5252 855 -106 -152 662 548 152 57 -150 282 278 156 -469 321 1155 602 -772 -660 116 788 470 -463 -588
5273 -588 598 1122 198 -989 -476 467 480 18 -314 -184 314 1010 -252 -827 -18 1253 318 -106 -719
5292 -719 -103 689 952 -51 -722 270 823 468 141 -30 145 313 747 206 -273 537 675 362 -138 290
5312 290 302 373 391 -83 -112 326 486 404 144 137 -171 -156 356 301 -141 112 87 -286 42 448 305 -138 -254
5335 -254 -13 224 719 16 -644 -16 673 737 -482 -403 60 444 570 -408 -825 99 939 659 -687 -598
5355 -598 393 978 365 -700 -779 555 1032 319 -545 3 838 601 -200 -441 -135 341 572 -179 -434 547
5375 547 752 123 -554 -41 188 13 161 -49 159 793 245 -795 -226 515 533 -260 -131 305 919 739
$$ packed form
5231i3Q61o04q26M1N84K51Q1q68k42J006O66j336k42P05M11l6m59n58M53Q39K21
5252H55r61m6Q14j14l96r5k07M32mj22o25P90Q34n53j374J12P76O72l18r33j25
5273e88J186N24r24j187N13R43J3m62l32J30M98O96j262n75Q09J271r35m24o13
5292g19O16P92K63j003o71R92N53l55l27j71J75J68M34n41m79Q10J38l13n00M28
5312B90J2P1J8m74k9M38J60q2k60pl08J5N12n5m42K53k5l73L28M06j43m43j16
5335b54K41K37M95p03o60O28O89O4j219P9M63L84J26r78m17R24Q40k80j346Q9
5355e98R91N85o13j065p9J334M77p13q64N48Q35k37q01k41L06M76K31p51k55R81
5375E47K05o29o77N13K29j75J48k10K08O34n48j040N69P41J8p93J29M36O14j80
$$ plain form
5395 739 -609 -1124 52 1607 512 -499 -633 358 737 229 -466 -876 330 1089 -46 -553 129 546
5413 546 362 -177 -258 18 990 807 -368 -674 286 433 -169 -111 -11 397 520 282 -268 -100 279 240 -178
5434 -178 141 541 456 56 -266 -472 68 621 196 -505 134 832 420 -143 -452 -300 456 334 -122 -632
5454 -632 336 727 131 -840 -301 301 708 119 -658 -674 427 1095 -96 -1108 -586 222 425 233 -532
5473 -532 -518 463 268 37 -280 53 457 26 -309 -313 -195 765 660 -908 -819 396 517 -225 -630 -431 45
5494 45 354 -328 -787 -29 657 -21 -1057 -253 659 1018 75 -673 -718 629 1144 -188 -942 -508 1030
5513 1030 761 -501 -1131 -396 752 839 -714 -983 314 1087 34 -981 -690 922 1193 302 -1129
5530 -1129 -1002 133 819 -170 -1152 136 828 919 222 -650 -235 602 206 -629 -251 785 859 -84 -746
$$ packed form
5395G39j348n15J176J555j095j011j34R91L79n08o95m10J206P59j135n07O82M17
5413E46j84n39q1K76R72j83j175l06R60J47o02N8J00M08J23k38n50J68L79l9m18
5434a78L19M00q5m00l22k06N40N53m25p01O39O98m12n63l09J52P56j22m56n10
5454f32R68L91n96r71N39O02M07n89p77j6J101O68j191j012N22Q08K03j92p65
5473e32J4R81j95k31l17L33M04m31l35mJ18R60j05j568Q9J215J21p42m05J99M76
5494D5L09o82m59P58O86o78j036Q04R12L59r43p48m5J347N15j332p54M34J538
5513A030k69j262o30P35J148Q7j553k69J297P73j053j015K91J612K71q91j431
5530a129J27J135O86r89r82J288O92R1o97q72M15Q37l96q35L78J036P4r43o62
$$ plain form
5549 -746 -634 72 556 -164 -662 223 1053 464 -809 -557 167 310 177 -521 -293 670 985 -509 -1137
5568 -1137 -597 765 719 -361 -838 -703 827 844 -771 -1382 -292 1208 628 -292 -754 -334 439 141
5586 141 -1161 -771 -8 1113 249 -711 -619 -286 193 237 -454 -558 849 774 25 -644 -671 -149 -3 7 1
5607 1 -136 282 79 -251 -187 235 201 -394 -281 -328 427 543 6 -745 -462 444 -212 -541 -490 -92 393 334
5629 334 -276 -847 10 222 -116 -783 -134 531 460 -36 -686 -1094 207 947 -306 -1110 -231 426 209 -129
5649 -129 -596 -341 492 613 -270 -551 339 595 85 -238 -306 -358 272 205 -221 -13 342 518 -285 -418 -309
5670 -309 -14 215 140 219 358 100 -266 -1017 -495 560 269 -239 60 -44 -162 -193 -334 -545 111 668 159
5691 159 57 38 -205 -404 -121 -320 -196 405 796 340 -124 186 55 201 53 -301 -273 391 927 219 -144
$$ packed form
5549g46J12P06M84p20m98Q85Q30n89j273K52P24J43j33o98K28R63L15j494o28
5568a137N40J362m6j080m77J35J530J7j615o11J090J500n80r20m62M20P73k98
5586A41j302L90P63J121q64r60R2L33M79M4o91j04J407p5p49o69k7N22J46J0o
5607Aj37M18k03l30O4M22l4n95J13m7P55J16n37p51K83R06o56l29N1L98M85n9
5629C34o10n71Q57K12l38o67O49O65p1m96o50m08J301P40j253q04Q79O57k17l38
5649a29m67K55Q33J21q83k81Q90K56n10l23o8n2O30o7m26K08L55J76q03j33J09
5670c09K95K29p5P9J39k58l66p51N22J055k91n08K99j04j18l1j41k11O56N57n09
5691A59j02j9k43j99K83j99J24O01L91m56m64L10j31J46j48l54K8O64N36p08l63
$$ plain form
5712 -144 -260 -290 8 471 5 -84 281 533 64 -547 -124 -186 366 65 -13 -126 263 207 -528 -699 -145 189
5734 189 567 529 -214 -302 -504 -232 -415 -134 472 347 -209 175 -94 -131 -56 -465 -532 196 832 618 -151 -40
5756 -40 581 221 -592 -827 93 623 646 20 -550 218 452 -400 -743 -122 326 984 252 -471 -581 257 586
5777 586 -153 -369 58 566 89 84 -368 -189 460 215 -459 -309 475 864 219 -283 -120 322 687 169 -203
5798 -203 -3 293 458 -113 -98 396 -111 73 -186 -380 347 1023 217 -357 -373 342 407 -135 -328 -43 320
5819 320 680 -24 -525 104 575 164 -308 -185 172 1063 683 -529 -829 172 602 323 -832 -284 629
5838 629 885 84 -709 -863 374 697 387 -320 263 283 77 -682 -1225 -73 966 800 -772 -610 266
5857 266 728 -840 -1141 -296 481 1344 235 -1010 -474 712 241 -668 -746 44 894 681 -93 -837 34
$$ packed form
5712a44j16l0K98M63m66q9L65K52m69o11M23o2N52l01p8j13L89n6p35j71N54L34
5734A89L78l8p43q8k02K72j83K81O06j25n56L84k69l7P5m09o7P28O36k14p69J11
5756d0O21l60q13k35R20N30K3o26n70P68K34q52l43O21M48O58p32p23j10Q38L29
5777E86p39k16M27N08m77nm52J79O49k45o74J50P84L89o45n02J63M42L65n18l72
5798b03K00K96J65n71J5M94n07J84k59j94P27O76q06n74j6P15O5n42j93K85L63
5819C20L60p04n01O29M71m11m72J23L57Q91l80j212l00J001M30k79j155N48R13
5838F29K56q01p93j54J237L23l10p07N83K0k06p59n43J152J039j66j572J62Q76
5857B66M62j568l01Q45P77Q63j109j245N36J186m71r09p8P90Q50k13p74p44Q71
$$ plain form
5876 34 794 -176 -1185 -207 1316 1315 12 -770 -693 327 355 -300 -805 505 1030 67 -648 -800 -76 692
5896 692 225 -169 -325 701 829 -387 -1131 -513 464 880 261 -553 -249 837 293 -542 -628 388 872
5915 872 362 -200 -281 381 613 -349 -870 -407 683 803 -46 -260 -190 389 685 -421 -1129 177 686 174
5935 174 -146 -385 260 401 29 -616 -331 384 904 -72 -597 -223 635 299 -150 -440 -207 817 754 -260
5955 -260 -714 175 525 269 -825 -626 92 531 322 -402 -319 544 423 -318 -683 -518 0 550 176 -437
5975 -437 -116 78 232 -673 -264 -211 334 315 -264 -247 -108 454 -451 -474 84 357 26 -219 -365 -490 523
5996 523 31 -207 -332 534 647 -23 -552 -160 308 -41 -51 55 212 546 262 -317 -975 -246 194 -63
6016 -63 69 150 254 350 -458 -780 -601 380 524 273 245 257 111 -134 -464 -250 311 550 439 305 433 409
$$ packed form
5876C4P60r70j009R78J523jj303p82P7J020K8o55n05J310N25r63p15j52P24P68
5896F92m67l94j56J026J28j216p44O18R77M16o19q14L04J086n44q35q6J016M84
5915H72n10n62q1O62K32r62n21M63J090J20q49k14P0N79K96j106p08J306N09n12
5935A74l20k39O45J41l72o45K85P15N20r76n25L74Q58l36m49k90K33J024o3j014
5955b60m54Q89L50k56j094J99P18M39k09p24Q3Q63j21p41l65J65N18N50l74o13
5975d37L21J94J54r05M09N3N45j9n79J7J39N62r05k3N58K73l31k45j46j25J013
5996E23m92k38j25Q66J13o70n29L92M68l49j0J06J57L34k84n79o58P29M40k57
6016f3J32Q1J04R6q08l22J79R81J44k51k8J2j46k45l30K14N61K39j11j34J28k4
$$ plain form
6038 409 -164 -409 -335 108 505 476 -19 -323 420 206 -294 -409 -173 89 522 514 -348 -348 135 107 18 -211 280
6061 280 554 203 -200 -213 -384 -180 -64 -346 66 552 364 72 -360 -316 -37 -66 536 -128 277 443 -227
6082 -227 -548 -378 -92 -165 117 78 -148 308 -4 282 -304 -273 -317 35 169 60 44 108 376 -24 -376 25
6104 25 -106 -231 -218 -125 279 288 314 -633 -608 -128 348 -86 -269 -175 124 205 -23 -442 -407 219 234 -137 -369 -181
6128 -181 -113 -9 -208 -819 -581 229 570 85 -498 134 185 -151 -298 -818 -138 633 159 -419 -389 -99 104
6149 104 -48 -519 -410 334 563 322 -391 -510 71 40 -123 -108 236 317 234 -114 -907 -595 225 -41 -478
6170 -478 70 105 315 -12 -527 -305 -268 365 -87 -101 307 377 205 -257 -797 -472 2 408 42 -341 107
6191 107 459 -153 -645 -743 -145 569 522 -384 -420 176 161 -220 -833 -35 372 803 21 -507 -734 125 285
$$ packed form
6038D09n73k45P4M43L97k9m95l04P43k14n00j15K36K62M33qq62%M83k8q9k29M91
6061B80K74l51m03j3j71K04J16k82M12M86j88k92m32M4K79k9O02o64M05J66o70
6082b27l21J70K86p3K82l9k26M56l12K86n86L1m4L52J34j09j6O4K68m00l52M01
6104B5j31j25J3R3M04RK6r47K5M80M76m34j83R4K99Q1k28m19L5O26J5l71k32J88
6128a81O8J04j99o11K38Q10L41m85n83O32N1l36j47n20O80P71m74n78L0K90K03
6149A04j52m71J09P44K29k41p13j19N81l1j63J5L44Q1q3l48p93L12Q20k66m37
6170d78N48L5K10l27n15K22L7O33m52j4M08P0j72m62n40L25M74M06l66l83M48
6191A07L52o12m92r8N98P14m7r06l6N96j5l81o13P98M07M31p82n28k27Q59J60
$$ plain form
6212 285 -281 -456 -220 411 324 -388 -909 -258 385 77 -737 -482 477 648 104 -772 -1021 104 524 -177
6232 -177 -878 -409 776 223 -369 -845 -859 161 255 47 -882 395 544 194 -966 -1214 47 624 156
6251 156 -596 -330 623 384 -492 -1014 -386 458 112 -471 -601 -33 570 476 -458 -712 80 464 -330 -695
6271 -695 -262 163 479 34 -411 -530 227 266 -150 -539 92 78 115 -597 -661 76 447 385 -467 -429 500 74
6293 74 -197 -543 -686 243 503 -39 -510 -169 216 490 -301 -343 -177 89 158 -400 -184 231 374 -381 -525
6314 -525 -245 363 789 298 -360 -281 139 70 -625 -593 295 837 212 -169 -209 -413 178 103 -123 43 521 850
6336 850 -136 -349 -365 -154 219 -282 -306 358 934 258 -437 -669 195 233 -92 109 112 577 289 -226 -748 -182
6358 -182 338 294 -126 101 528 398 166 -670 -571 278 691 289 -67 -33 112 -43 -124 -668 -368 708 419
$$ packed form
6212B85n66j75K36O31q7p12n21O51O43l08q14K55R59J71n44q76k49J125M20p01
6232a77p01M69J185n53n92m76j4J020R4k08r29J277J49l50j160k48J261N77m68
6251A56p52K66R53k39q76n22O28Q44l46n83j30N68O03r4r34k54P92L84p94l65
6271f95M33M25L16m45m45j19P57L9m16l89O31j4L7p12o4P37L71o2q52L8R29m26
6293G4k71l46j43R29K60n42m71L41L85K74p91m2J66K66O9n58K16M15J43p55j44
6314e25K80O08M26m91o58P9M20o9o95L2Q88N42o25l81m0k04N91p5k26J66M78L29
6336H50r86k13j6K11L73n01k4O64N76o76o95k32Q64L8l25K01LM65k88n15n22N66
6358a82N20m4m20K27M27j30k32q36R9Q49M13m02l56L4J45j55q1n44L00J076k89
$$ plain form
6379 419 31 -285 -101 281 -583 -513 467 337 625 157 -298 86 475 218 -332 -176 245 489 381 -276
6399 -276 -438 294 471 3 -593 -35 710 697 0 -334 -342 433 144 -202 -582 222 762 217 -383 -513 63
6420 63 307 207 -397 -614 407 579 -10 -311 103 662 619 155 -737 -90 524 592 -177 -471 406 411 170
6441 170 -531 -312 436 709 335 -36 -83 196 -93 234 -47 345 730 571 236 -529 -32 681 623 -144 -246
6462 -246 588 654 510 -229 -540 245 698 213 -57 236 591 598 -188 -391 -238 541 885 339 -309 574 406
6483 406 275 -357 -426 -13 756 617 179 -88 347 580 -362 -550 -48 551 734 286 -526 -432 -43 287 -356
6504 -356 -170 57 696 549 114 -665 -133 261 389 25 -141 388 286 -9 -483 -381 -316 374 360 -319 -209
6525 -209 339 293 40 -292 -381 -283 361 162 134 329 441 -59 -682 -234 -50 322 396 -486 -291 107 408 30
$$ packed form
6379D19l88l16J84L82q64P0R80j30K88m68m55L84L89k57n50J56M21K44j08o57
6399b76j62P32J77m68n96N58P45j3o97l34qP75k89l46l80Q04N40n45o00j30N76
6420F3K44j00o04k17J021J72n89l01M14N59m3m64q92O47O14O8p69k94Q77Nk41
6441A70p01K19P48K73l74l71m7K79k89L27k81L92L85j59l35p65M97P13n8p67j02
6462b46Q34O6j44p39l11P85M53m85k70K93L55Pp86k03J53P79L44n46o48Q83j68
6483D06j31o32o9M13P69j39m38k67M35K33r42j88N02N99J83m48q12R4L89L30o43
6504c56J86K27O39j47m35p79N32L94J28l64j66N29j02k95m74J02O5O90j4o79J10
6525b09N48m6k53l32q9R8O44j99k8J95J12n00o23M48J84L72P4q82J95L98L01l78
$$ plain form
6547 30 -554 -49 445 520 164 -333 -441 146 395 -116 -192 113 498 276 -53 -182 -220 526 262 -102 -368
6568 -368 106 404 138 -68 -323 -30 513 236 -365 -103 235 146 -206 -332 -56 206 432 112 -248 365
6588 365 559 383 -60 -375 -230 613 231 98 230 191 456 192 -15 -364 389 154 39 -338 49 219
6608 219 99 254 -283 -3 96 6 -54 50 366 439 75 -545 -522 -316 242 -82 -445 254 99 19 -268 -588
6630 -588 -207 356 307 13 -230 233 170 -87 -236 -497 -75 321 -188 -407 -124 283 -107 -391 -687 -182 51
6651 51 56 19 -279 29 -46 -422 -386 -172 172 313 -20 -60 -375 -108 -144 -215 -289 287 353 342 -218 -321 62 82
6675 82 -119 -248 4 473 421 -97 -555 -230 198 -178 -57 -313 50 553 170 -532 -402 56 -321 234 -232
6696 -232 -42 398 492 5 -619 -303 230 89 -39 -125 140 173 -294 -357 -624 176 291 216 -347 9 500 282
$$ packed form
6547C0n84N05M94P5l56m97j08N87K49n11p6L05L85k22l29j29l8P46k64l64k66
6568c68M74K98k66k06k55K93N43k77o01K62L38q9l52j26K76K62K26l20l60O13
6588C65J94j76m43l15J45Q43l82j33J32l9K65k64k07l49P53k35j15l77L87J70
6608B19j20J55n37K80R9r0o0J04L16P3l64o20K3K06N58l24l63O99j55q0k87l20
6630e88L81N63m9k94k43M63o3k57j49k61M22L96n09k19K83M07l90k84k96N05K33
6651E1Nl7k98L08p5l76L6K14L44J41l33m0l15K67l6p1p4N76O6j1n60j03L83K0
6675H2k01j29K52M69n2n18m58L25M28l76J21k56L63N03l83p02J30M58l77N55m66
6696b32J90M40R4m87o24L16N33j41j28q6K65L3m67o3k67Q00J15p5n63L56M91k18
$$ plain form
6718 282 -154 -333 -151 385 693 -619 -317 -17 353 -111 -546 -257 408 665 -117 -564 -393 442 353 -340
6738 -340 -534 -181 219 458 -258 -448 22 381 123 -715 -255 344 334 136 -584 -285 -13 222 -278 -626
6758 -626 -289 561 670 -205 -328 -184 50 15 -466 -484 60 963 144 -300 -330 372 115 -302 -496 -601 412
6779 412 711 -119 -589 -124 522 270 -262 -670 107 563 430 -188 -774 7 376 -168 -359 -396 309 221 -200
6800 -200 -706 -576 130 599 -100 -521 6 223 365 -373 -890 -221 620 499 -572 -236 118 386 -79 -425
6820 -425 -314 143 303 -120 -364 -210 -18 73 -435 -585 13 442 413 -181 -130 77 255 -75 -548 -456 578
6841 578 23 93 -82 -33 210 373 -228 -395 258 772 346 -427 -478 -164 643 172 -349 -259 323 180 110 -92
6863 -92 -181 456 -31 30 -363 -295 603 201 -65 -205 -120 119 120 -25 -206 -81 104 78 -206 36 47 451 272
$$ packed form
6718B82m36j79J82N36L08j312L02L00L70m64m35K89O65K57p82m47J71Q35q9o93
6738c40j94L53M00K39p16j90M70L59k58q38M60N99j0j98p20K99K72K35n00l48
6758f26L37Q50J09q75j23J44K34l5m81j8N44R03q19m44l0P02k57m17j94j05J013
6779D12K99q30m70M65O46k52n32m08P77M56j33o18n86P81L69n44j91l7P05q8m21
6800b00n06J30P06M69o99m21N27K17J42p38n17O69Q41j21j071L36L54K68m65l46
6820d25J11M57J60m23k44J54J92R1n08j50N98M29k9n94N1K07J78l30m73R2J034
6841E78n55P0j75M9K43J63o01j67O53N14m26p73n1L14Q07m71n21R0N82j43p0k02
6863i2q9O37m87O1l93O8Q98m02k66j40Q5K39Jj45j81J25J85k6k84K42J1M04j79
$$ plain form
6886 272 -57 98 156 35 -294 -334 81 427 246 10 -13 -208 26 -21 -247 -43 266 198 -24 144 310 97
6908 97 535 3 -189 197 40 357 -160 -71 381 166 -46 -273 -494 -267 -1 306 124 -224 161 192 -207
6929 -207 -183 -120 -31 149 265 -294 -201 317 -172 -218 142 -312 71 32 -207 -121 -62 144 -119 207 250 -301 -18
6952 -18 23 166 111 82 4 -420 323 110 188 -35 -376 -3 -294 -104 -180 -219 -25 25 222 -49 -103 129 -34
6975 -34 -225 136 32 173 9 -35 -440 -157 238 195 -35 244 -119 -50 148 31 -432 -94 141 89 140 241
6997 241 -183 201 443 49 -250 102 420 71 -94 -92 10 181 67 -70 116 225 241 -165 -78 36 345
7018 345 20 33 -136 -22 220 42 -15 -449 250 515 -175 -170 -188 -45 -4 -227 -404 -194 436 333 -5 -139
7040 -139 -218 119 307 -88 -516 -57 591 149 -115 -219 30 155 136 -205 -308 -245 83 317 -191 291 302
$$ packed form
6886B72l29J55N8j21l29m0M15L46j81k36k3j95K34m7k26K04L09o8k22J68J66k13
6908I7M38n32j92L86j57L17n17Q9M52k15k12k27k21K27K66L07j82l48L85L1l99
6929b07K4O3Q9J80J16n59R3N18m89m6L60m54L83l9k39Q6N9K06k63L26M3n51K83
6952a8M1J43n5k9p8m24P43k13P8k23l41L73k91J90p6l9J94N0J97k71n4K32j63
6975c4j91L61j04J41j64m4m05K83L95m3k30K79l63O9J98j17m63L38K35n2N1J01
6997B41m24L84K42l94k99L52L18l49j65KJ02J71j14j37J86J09J6m06Q7J14L09
7018C45l25J3j69J14K42j78n7m34O99K65o90Nj8J43M1k23j77K10O30j03l38j34
7040a39p9L37J88l95m28M59O48m42k64j04K49J25j9l41j03O3L28K34n08M82J1
$$ plain form
7061 302 346 178 -513 -395 225 217 -194 -331 281 575 53 -552 -379 -226 309 96 -396 -339 203 268 -33 -494
7083 -494 -196 221 138 -118 -174 -182 316 330 -216 -577 -214 653 267 -259 -122 0 359 219 -435 -422 91 538
7105 538 74 -546 -195 260 501 65 -462 -117 462 692 -70 -536 -49 543 246 -141 118 -52 367 94
7125 94 -568 47 22 264 -319 -423 31 637 666 -164 -597 -116 415 388 -341 -93 231 205 95 -116 -7 279
7147 279 387 -394 -361 60 327 599 -449 -439 59 391 255 -225 -672 339 476 -14 46 -288 169 239 -297
7168 -297 -452 81 257 244 -250 -520 -217 217 506 30 -476 -55 316 187 -234 -89 1 83 237 -210 -486
7189 -486 417 170 -164 -319 -41 382 315 -145 -412 -62 283 100 183 -281 -214 301 -97 -183 -393 91 48 -243
7211 -243 -373 29 511 572 -24 -143 336 314 325 -210 -181 -135 501 391 -309 -315 374 356 98 -173 11 121 163
$$ packed form
7061C02M4j68o91J18O20qm11j37O12K94n22o05J73J53N35k13m92N7N42O5l01m61
7083d94K98M17q3k56n6qM98J4n46l61L63Q67l86n26J37J22L59j40o54J3N13M47
7105E38m64o20L51M55K41m36n27L45N79K30p62m66M87N92k97l87K59j70M19k73
7125I4o62O15k5K42n83j04M54O06K9q30m33M81N31k7p29K48L24k6j10k11J09K86
7147B79J08p81L3M21K67K72j048J0M98L32j36m80m47J011J37m90O0l34M57P0n36
7168b97j55N33J76j3m94k70L03M34K89m76n06M21L71j29m21J45R0Q2J54m47k76
7189d86R03k47l34j55K78M23o7m60k67L50L45j83Q3m64O7N15l98q6k10M84m3k91
7211b43j30M02M82O1n96j19M79k2J1n35K9M6O36j10p00oO89j8k58k71J84J10M2
$$ plain form
7234 163 -323 -504 -220 -2 88 -149 -235 -31 180 -70 -294 -252 35 175 75 -340 -81 293 193 -87 -41
7255 -41 -150 189 137 -190 101 218 281 -186 -384 138 147 164 -7 -230 -115 206 3 173 26 -64 40 418
7277 418 -118 -101 20 255 164 -301 -98 173 234 103 -263 14 197 156 179 31 -151 165 -33 -386 55 -59
7299 -59 235 53 -415 -129 187 -28 -107 -355 240 51 271 12 1 -5 141 220 -66 153 10 211 156 69 -355
7322 -355 111 58 -154 -240 -122 197 110 -246 -236 -400 117 121 -68 18 37 70 482 50 -418 -5 -22 -15 -148 -125
7346 -125 13 53 110 -269 -247 158 3 137 -404 -98 55 145 134 -247 -83 424 334 -216 -195 -144 210 -188 -384
7369 -384 -166 -204 225 4 77 -63 -3 175 -31 64 -300 64 30 16 86 55 24 114 0 -73 165 201 -159 -120
7393 -120 111 148 -48 -324 -245 -150 -66 278 146 -321 -230 163 30 -216 -198 -144 88 145 3 -180 -265 126 222
$$ packed form
7234A63m86j81K84K18R0k37q6K04K11k50k24M2K87J40j00m15K59L74j00k80M6
7255d1j09L39n2l27K91J17O3m67j98N22RJ7j71k23J15L21k03J70j47r0J04L78
7277D18n36J7J21K35r1m65K03K71O1j31l66K77J83m1K3j48j82L16j98l53M41j14
7299e9K94j82m68K86L16k15p9k48N95j89K20k59j1oJ46P9k86K19j43K01n5q7m24
7322c55M66n3k12q6J18L19q7l56J0j64N17Mj89Q6J9L3M12m32m68M13j7Pj33K3
7346a25J38M0N7l79K2M05j55J34n41L06J53R0j1l81J64N07r0n50K1N1L54l98j96
7369c84K18l8M29k21P3j40O0J78k06R5l64L64l4j4P0l1l1R0j14p3K38L6l60L9
7393a20K31L7j96k76P9R5Q4L44j32m67R1L93j33k46J8N4K32N7j42j83q5L91R6
$$ plain form
7416 222 -176 -332 39 160 -77 -153 -176 53 -17 442 -371 -345 26 5 -47 -280 -199 130 144 54 -182 -167 98
7439 98 229 -120 -101 -120 394 239 -103 -158 -26 251 218 -247 -120 130 252 77 -533 -49 -262 -195 -87 -244
7461 -244 -69 26 -22 -46 -286 170 279 -192 -223 -74 312 432 -116 -203 -251 210 -50 12 -386 -92 469 113
7483 113 -331 -276 104 285 165 -248 -168 85 107 32 -289 130 -55 308 -64 21 133 434 -247 -378 82 22
7505 22 374 -117 -190 -85 252 141 -194 -351 -246 319 167 -106 137 83 348 241 -294 -292 10 -29 215 -607
7527 -607 11 411 128 -187 -316 -187 88 350 -15 -292 -85 257 196 -63 -260 -67 204 436 -208 -518
7547 -518 273 408 296 -225 -186 46 306 60 74 -9 -30 212 -293 -320 13 341 19 -382 -334 274 350 -156
7569 -156 -429 -99 178 158 -251 -253 -226 199 204 -57 -224 127 65 76 -78 -545 349 246 362 119 6 308 550
$$ packed form
7416B22l98j56L71J21k37p6k3K29p0M59q13K6L71k1n2k33Q1L29J4r0k36J5K65
7439I8J31l49J9j9N14j55l42n5J32K77l3m65J27K50J22j75o10M84k13O7J08j57
7461b44J75R5m8k4k40M56J09m71l1J49L86J20n48q7m8M61k60O2l98K94N61l56
7483A13m44N5L80J81j20m13Q0K53K2p5l21M19j85L63l72Q5J12L01o81j31M60o0
7505B2L52m91p3J05L37j11l35j57J05N65j52k73K43n4K65j07n35KL02l9K44q22
7527f07O18M00k83l15j29J29K75K62l65k77K07L42o1k59j97J93K71K32o44l10
7547e18P91J35j12n21L9K32K60k46J4q3k1K42n05k7L33L28l22m01M8O08P6n06
7569a56k73L30K77k0m09kK7M25Nk61j67L51o2J1j54m67Q94j03J16k43j13L02K42
$$ plain form
7592 550 -70 -387 -281 130 467 -68 -242 61 396 291 -490 -519 126 302 341 -116 -117 66 282 -228 -200 -357
7614 -357 220 207 -19 -148 22 495 115 -144 -360 -128 271 259 -73 -328 342 181 18 -242 -304 394 217
7635 217 164 -183 -129 317 -46 -144 -83 -96 197 332 -268 -349 -107 143 111 -67 -143 409 -35 4 -185 -238 325
7658 325 167 -245 -427 -34 305 317 -173 -294 -264 -35 255 -222 -71 235 123 -10 -29 -116 -95 209 -116 -283
7680 -283 -105 232 505 232 -168 -61 226 121 -339 -118 72 34 -231 -26 -369 181 176 134 84 -116 178 188
7702 188 196 -12 -176 49 288 -131 -102 206 381 -189 -92 -376 8 280 -100 -459 -150 84 -62 -203 -173 -94
7724 -94 236 20 89 76 -187 150 -18 -179 -73 -122 183 -202 -373 -265 322 -24 131 -301 80 292 214 -8
7746 -8 -169 -65 256 206 -55 -263 256 268 -186 -257 -206 -164 26 158 -27 -98 202 65 -279 -5 -50 -28 -4 1
$$ packed form
7592E50o20l17J06M11L37n35j74L03L35j05p81k9O45J76L9m57jJ83K16n10K8j57
7614c57N77j3k26j29J70M73l80k59k16K32L99j2l32k55O70j61j63k60o2O98j77
7635B17n3l47N4M46l63r8O1j3K93J35o00q1K42K50l2j78p6N52m44L9j89n3N63
7658C25j58m12j82L93L39J2m90j21L0K29K90m77J51L06j12j33j9q7K1L04l25j67
7680b83J78L37K73k73m00J07K87j05m60K21J90l8k65K05l43N50nm2n0k00K94J0
7702A88Qk08j64K25K39m19K9L08J75n70R7k84L84K72l80l59L09K34j46j41L0P9
7724i4L30k16O9j3k63L37j68j61J06m9L05l85j71J08N87l46J55m32L81K12p8k22
7746hj61J04L21n0k61k08N19J2m54p1N1M2J90J32j85p1L00j37l44K74m5K2K4N
$$ plain form
7770 1 17 100 324 40 -324 -214 251 -9 -269 30 -168 207 127 -28 -296 -202 98 -149 276 -72 207 -206
7792 -206 135 -484 -366 239 237 3 -221 -4 189 139 117 -365 -206 -44 89 -21 -340 -249 155 387 58 -333
7814 -333 -55 208 224 -74 -216 88 112 97 -413 -168 -70 473 69 -104 -18 149 36 -148 -25 77 -55 107
7836 107 117 -377 62 292 17 68 -371 -49 130 18 38 -192 -45 179 -354 52 -95 139 444 -38 -89
7857 -89 17 39 15 30 -44 -110 249 230 -112 -106 -201 -16 117 28 22 -242 135 -2 -396 16 245 182 215 -53 -36
7882 -36 341 117 -418 -232 -329 263 -42 93 -143 411 411 -9 -312 -268 95 -10 -39 -68 -213 213 2 -165
7904 -165 -226 -343 253 30 -256 100 -3 68 255 -228 409 67 386 10 -177 -281 27 -11 -150 -350 191
7925 191 110 179 -312 -204 -170 103 -97 132 -162 72 63 -87 10 -167 550 516 -195 -485 81 -97 55 59 -260
$$ packed form
7770AJ6Q3K24k84l64J10M65k60k60K99j98L75q0j55k68R4L00k47M25l48K79m13
7792b06L41o19J18O05kk34k24K17J93n0k2m82J59J62J33j10l19R1M04K32l29l91
7814c33K78K63J6k98j42L04K4j5n10K45R8N43m04j73Q6J67j13j84J23J02j32J62
7836A07J0m94M39K30k75N1m39L22J79j12K0k30J47K24n33M06j47K34L05m82n1
7857h9J06K2k4J5p4o6L59j9l42Or5J85J33q9ok64L77j37l94M12K29o3L3k68J7
7882c6L77k24n35J86r7N92l05J35k36N54%m20l03M4L63j05k9k9j45M26k11j67
7904a65o1j17N96k23k86L56j03P1J87m83O37l42L19l76j87j04L08l8j39k00N41
7925A91q1O9m91J08L4K73k00K29k94K34rj50R7j77P17l4p11k90N66j78J52Ml19
$$ plain form
7948 -260 -413 104 183 -43 70 357 101 -48 -119 -320 340 260 158 -48 2 125 -106 -26 -266 -27 -10 -224
7970 -224 -413 -229 -81 -170 78 19 -366 398 167 66 76 -142 211 165 -382 -436 -77 132 268 -105 -409 -51
7992 -51 72 127 -219 -179 76 190 135 108 -60 84 280 222 -193 106 355 159 -11 -254 228 27 -45 -99 -181
8015 -181 -67 183 -98 -293 88 47 57 -105 -400 239 -33 314 -178 -212 -203 61 -293 197 -69 -62 403 -80
8037 -80 19 -221 323 -20 -223 -352 -91 430 147 -46 -81 -12 -173 124 59 8 94 214 71 -270 7 74 267
8060 267 -20 -328 -186 125 283 -189 -290 -5 264 281 115 131 86 139 -211 0 -70 -13 154 381 46 280
8082 280 11 4 -94 -470 -158 346 -8 4 -123 117 144 -181 -362 -116 254 449 31 -287 -97 257 -9 -223
8104 -223 -251 61 281 119 -195 -500 -124 230 62 -309 -348 21 437 172 -283 -358 -60 51 50 -204 91 266
$$ packed form
7948b60j53N17P9k26J13K87k56j49p1k01O60q0j02k06N0J23k31Q0k40K39J7k14
7970b24j89J84J48q9K48n9l85P64k31j01J0k18L53m6n47n4L59K09J36l73l04L58
7992e1J23N5l46M0K55J14n5k7j68J44J96n8m15K99K49j96j70k43M82k01p2n4q2
8015a81J14K50k81j95L81m1J0j62k95O39k72L47m92l4RK64l54M90k66PM65m83
8037h0R9k40N44l43k03j29K61N21k83j93l5O9j61K97o5n1Q6J20j43l41K77O7J93
8060B67k87l08J42L11J58m72j01K85K69J7j66J6m5N3l50K11p0N7J67K27l35K34
8082B80k69pr8l76L12N04l54J2j27K40K7l25j81K46L70J95m18l18J90L54k66k14
8104b23k8L12K20j62l14l05L76L54j68l71l9L69M16k65m55p5K98J11jk54K95J75
$$ plain form
8126 266 336 -21 -340 -170 262 450 118 -276 -55 433 24 -26 -128 102 129 27 -335 -27 236 183 57
8147 57 -153 -180 57 12 -105 -94 -345 -131 -20 -314 -90 23 428 105 -69 -48 -73 285 66 -144 -140 65 -95
8170 -95 -74 -280 14 352 29 -142 -287 162 449 18 -125 -270 3 146 203 -203 -168 206 79 -72 -15
$$ packed form
8126B66P0l57l19J70M32J88l32l94K21M88m09n0j02K30K7j02l62L08K63n3j26
8147E7k10k7K37m5j17J1k51K14J11k94K24J13M05l23j74K1k5L58k19k10MK05j60
8170i5K1k06K94L38l23j71j45M49K87m31j43j45K73J43N7m06L5L74j27j51N7
8191a5
$$ Imaginary data points
##PAGE= N=2
##DATA TABLE= (X++(I..I)), XYDATA
$$ plain form
0 0 0 0 0 -8 8 -8 9 -16 17 -24 32 -40 48 -59 74 -88 105 -129 153 -177 209 -241 278 -321 371 -423 481
27 481 -547 620 -698 787 -885 993 -1108 1238 -1380 1533 -1702 1890 -2096 2318 -2567 2843
43 2843 -3148 3489 -3870 4301 -4793 5361 -6019 6798 -7737 8894 -10358 12284 -14942
56 -14942 18863 -25246 37456 -69335 327414 749680 133911 -115519 85709 450551 373815
67 373815 66860 -83836 203025 478882 372590 24436 -34881 181279 328881 199230
77 199230 11212 9557 226237 322799 129220 -83682 10600 211244 211740 62792 7479
88 7479 78413 168479 160517 74758 47306 114333 107667 16254 31191 166356 202262 85153
100 85153 -23220 -5765 122300 234220 181026 31257 12331 133138 174193 68117 -42298
$$ packed form
0@%%%qJ6j6J7k5L3m1N6p2Q8j07J33j62J93k34K82l30L86m50N19n99O92p94R04
27D81j028J167j318J485j672J878k101K346k618K913l235L592l986M414m885N410
43B843n991O637p359Q171r094J0154j1380J2817j4535J6631j9252K2642k7226
56a4942L3805m4109O2702j06791L96749M22266o15769k49430K01228L64842p6736
67C73815l06955j50696K86861K75857j06292l48154n9317K16160J47602j29651
77A99230j88018j655K16680R6562j93579k12902R4282K00644M96j48948n5313
88G479P0934R0066p962q5759k7452O7027o666r1413J4937J35165L5906j17109
100H5153j08373J7455J28065J11920n3194j49769j8926J20807M1055j06076j10415
$$ plain form
111 -42298 -30296 106919 228166 168026 6718 -10333 108021 128790 21204 -46866 736
122 736 106475 156732 50234 -114003 -92098 102888 184501 43056 -122888 -110764 64359
133 64359 191319 84071 -121740 -122494 61269 130440 4951 -101772 -48728 97470 173743
144 173743 82083 -51199 -18668 113315 108479 -9354 -22699 90463 173344 141430 42074
155 42074 2683 94534 190131 143606 57963 85462 152363 142671 103812 105519 127979 137102 103112
168 103112 51801 85371 193538 208224 99921 46601 106970 150725 106246 24255 -6321
179 -6321 72115 178726 148213 10114 -26331 60771 102543 55373 15292 31483 75451 81346
191 81346 1825 -82988 -50825 44948 75329 48496 26032 2725 -4487 23772 20249 -32170
$$ packed form
111d2298J2002J37215J21247o0140j61308j7051J18354K0769j07586o8070M7602
122G36J05739N0257j06498j64237K1905J94986Q1613j41445j65944J2124J75123
133F4359J26960j07248k05811p54J83763O9171j25489j06723N3044J46198P6273
144A73743r1660j33282L2531J31983m836j17833j3345J13162Q2881l1914r9356
155D2074l9391R1851R5597m6525q5643K7499O6901r692l8859J707K2460R123l3990
168A03112n1311L3570J08167J4686j08303n3320O0369M3755m4479q1991l0576
179f321P8436J06611l0513j38099l6445Q7102M1772m7170m0081J6191M3968N895
191H1346p9521q4813L2163R5773L0381k6833k2464k3307p212K8259l523n2419
$$ plain form
203 -32170 -42573 10289 51065 58597 39133 -20690 -55657 -866 59579 31625 -21291 -11785
215 -11785 46840 99511 73386 -40651 -103203 -24127 59505 17517 -42973 -2327 78815 94484
227 94484 18655 -86105 -103729 -11401 46745 -1898 -44706 -17740 675 -23435 -52411 -70047
239 -70047 -53282 3865 23206 -27577 -60625 -47427 -56329 -80082 -59355 -23846 -20098 -33125
251 -33125 -47133 -46154 -15365 -9082 -65432 -85076 -8818 40426 -13428 -73985 -61023 -11296 21326
264 21326 -252 -61758 -65431 18890 72680 30348 -20918 -24722 -11941 -2530 -11812 -41654 -30175
277 -30175 40864 70253 19092 -24007 -19130 -7046 8105 20540 -1936 -27703 -6442 20267
289 20267 8190 -15918 -37505 -43383 4343 61365 28740 -53597 -59768 3006 39738 21137
$$ packed form
203c2170j0403N2862M0776P532j9464n9823l4967N4791O0445k7954n2916R506
215a1785N8625N2671k6125j14037o2552P9076Q3632m1988o0490M0646Q1142J5669
227I4484p5829j04760j7624R2328N8146m8643m2808K6966J8415k4110k8976j7636
239g0047J6765N7147J9341n0783l3048J3198q902k3753K0727L5509L748j3027
251c3125j4008R79L0789O283n6350j9644P6258M9244n3854o0557J2962M9727L2622
264B1326k1578o1506l673Q4321N3790m2332n1266l804J2781R411r282k9842J1479
277c0175P1039K9389n1161m3099M877J2084J5151J2435k2476k5767K1261K6709
289B0267j2077k4108k1587n878M7726N7022l2625q2337o171O2774L6732j8601
$$ plain form
301 21137 -32500 -74885 -46022 19248 18775 -27116 -18440 26549 30465 -3844 -37730 -47094 -9786
314 -9786 32238 8295 -32993 -9083 28262 7674 -23711 -17103 1489 22458 39460 21242
326 21242 -9128 -9742 -10737 -28431 -9252 33485 26768 -12787 -19640 5695 34686 45206 798
339 798 -60771 -42813 31556 44857 -5048 -31063 -18912 202 9646 -11236 -39059 -10430 44987
352 44987 39663 -11273 -33530 -31143 -26766 -19638 -27215 -37118 5811 68357 47017 -40213 -84689
365 -84689 -55040 5415 44490 17585 -46015 -47979 10032 21741 -28635 -61167 -44685 74
377 74 41198 27770 -29462 -39185 2504 -1767 -53481 -61164 -15875 18454 14912 -19353 -42813
390 -42813 -9405 31055 -2891 -62000 -49289 2750 18412 5873 -13378 -35603 -39268 -27668
$$ packed form
301B1137n3637m2385K8863O5270m73m5891Q676M4989L916l4309l3886r364L7308
314i786M2024k3943m1288K3910L7345k0588l1385O608J8592K0969J7002j8218
326B1242l0370o14r95j7694J9179M2737o717l9555o853K5335K8991J0520m4408
339G98o1569J7958P4369J3301m9905k6015J2151J9114R444k0882k7823K8629N5417
352D4987n324n0936k2257K387M377P128p577r903M2929O2546k1340q7230m4476
365h4689K9649O0455L9075k6905o3600j964N8011J1709n0376l2532J6482M4759
377G4M1124j3428n7232r723M1689m271n1714p683M5289L4329l542l4265k3460
390d2813L3408M0460l3946n9109J2711N2039J5662j2539j9251k2225l665J1600
$$ plain form
402 -27668 -28426 -11821 38520 45376 -18433 -57671 -25852 9163 -2475 -42052 -58912 -8607 62185
415 62185 39142 -58278 -79746 -3216 40272 2680 -40095 -31525 12725 28307 -29936 -91754
427 -91754 -47881 43741 39397 -43302 -76219 -23396 44156 48374 -27334 -93157 -54833 22344
439 22344 16527 -41147 -47409 -7737 14845 7814 -17274 -32076 -11366 8808 -9527 -20631 6705
452 6705 13849 -17550 -29656 -11243 4236 15589 20781 7269 4066 18929 9134 -15327 2586
465 2586 35098 19498 -18952 -24458 3809 42835 54662 10105 -32507 -2944 45263 30247
477 30247 -14156 -20807 971 25610 30765 -4845 -43371 -23914 20598 23408 7230 8002 10404
490 10404 2679 -10185 -34751 -46063 -7155 31754 13841 -16950 -11392 3260 4792 2588 -10488
$$ packed form
402b7668p58J6605N0341O856o3809l9238L1819L5015j1638l9577j6860N0305P0792
415F2185k3043r7420k1468P6530M3488l7592m2775Q570M4250J5582n8243o1818
427i1754M3873R1622m344q2699l2917N2823O7552M218p5708o5823L8324P7177
439B2344n817n7674o262L9672K2582p031k5088j4802K0710K0174j8335j1104K7336
452F705P144l1399j2106J8413J5479J1353N192j3512l203J4863r795k4461J7913
465B586L2512j5600l8450n506K8267L9026J1827m4557m2612K9563M8207j5016
477C0247m4403o651K1778K4639N155l5610l8526J9457M4512K810j6178P72K402
490A0404p725j2864k4566j1312L8908L8909j7913l0791N558J4652J532k204j3076
$$ plain form
503 -10488 -20927 805 24672 11080 -7287 -522 -389 -11408 -5229 9166 17668 28587 26213
516 26213 3078 6326 34243 18295 -31774 -35394 12993 48867 40856 4885 -19623 5934 37887
529 37887 7517 -40786 -14656 49654 51833 -8885 -60868 -52082 8550 42035 -7456 -58401
541 -58401 -13670 57058 35004 -49939 -85702 -39533 26710 30279 -35874 -67607 -7295 42699
553 42699 -2500 -62733 -44299 14700 36153 4630 -37505 -25675 30486 36053 -29309 -59122
565 -59122 -4340 46979 36449 4415 931 33521 57823 20864 -38628 -22389 51545 65548
577 65548 12665 -10891 22896 57503 47598 176 -21412 30485 86098 51637 -22427 -24606
589 -24606 31231 55623 23171 -20439 -17321 40952 72158 15918 -45641 -14005 54841 56432
$$ packed form
503a0488j0439K1732K3867j3592j8367O765J33j1019O179J4395Q502J0919k374
516B6213k3135L248K7917j5948n0069l620M8387L5874q011l5971k4508K5557L1953
529C7887l0370m8303K6130O4310K179o0718n1983Q786O0632L3485m9491n0945
541e8401M4731P0728k2054q4943l5763M6169O6243L569o6153l1733O0312M9994
553D2699m5199o0233J8434N8999K1453l1523m2135J1830N6161N567o5362k9813
565e9122N4782N1319j0530l2034l484L2590K4302l6959n9492J6239P3934J4003
577F5548n2883k3556L3787L4607r905m7422k1588N1897N5613l4461p4064k179
589b4606N5837K4392l2452m3610L118N8273L1206n6240o1559L1636O8846J591
$$ plain form
601 56432 -1153 -42336 -24332 32161 51187 -3320 -46627 -4230 55185 42844 -10370 -30102
613 -30102 2299 48968 47407 -14837 -49510 336 52466 30819 -14305 -11536 29212 58473
625 58473 38161 -17690 -33766 16442 50157 14850 -22764 -8730 23406 31017 8085 -22063
637 -22063 -14871 26043 27226 -24425 -42103 1053 28371 -980 -45691 -57460 -25465 9545
649 9545 -8916 -53739 -40791 12095 12175 -42919 -76114 -59250 -23464 -9122 -37686 -66020 -35777
662 -35777 10506 -12165 -73224 -77625 -22728 19237 4293 -48576 -70420 -23978 19936 -13745
674 -13745 -66911 -49544 8355 28627 3087 -28231 -27249 9260 27375 -11690 -45649 -16180
686 -16180 26933 22557 -9101 -24620 -9263 25117 31212 -9272 -32547 5358 40693 16956
$$ packed form
601E6432n7585m1183J8004N6493J9026n4507m3307M2397N9415j2341n3214j9732
613c0102L2401M6669j561o2244l4673M9846N2130k1647m5124K769M0748K9261
625E8473k0312n5851j6076N0208L3715l5307l7614J4034L2136P611k2932l0148
637b2063P192M0914J183n1651j7678M3156K7318k9351m4711j1769L1995L5010
649I545j8461m4823J2948N2886Q0n5094l3195J6864L5786J4342k8564k8334L0243
662c5777M6283k2671o1059m401N4897M1965j4944n2869k1844M6442M3914l3681
674a3745n3166J7367N7899K0272k5540l1318R82L6509J8115l9065l3959K9469
686a6180M3113m376l1658j5519J5357L4380O095m0484k3275L7905L5335k3737
$$ plain form
698 16956 -25076 -35125 -16173 8076 10816 -11326 -13151 18041 22352 -18788 -43987 -25572 1815
711 1815 10504 -4324 -29308 -24489 11687 13464 -33735 -54378 -16251 24755 25130 -5048 -31060
724 -31060 -17330 18007 9679 -35870 -41955 1804 25116 7511 -12166 -8719 18895 37964 7969
737 7969 -39832 -30161 21506 32234 -3554 -26578 -11211 20234 31800 35 -33817 -10822
749 -10822 31247 17950 -27536 -34564 -5569 11472 -448 -28507 -32815 1433 21182 -16762
761 -16762 -54193 -31018 10905 12316 -17297 -41910 -36694 -6939 794 -33735 -52029 -17648 10700
774 10700 -6597 -30009 -25130 -3687 9612 -6424 -40471 -39922 -367 11939 -19747 -33551 -4604
787 -4604 24668 24566 -2974 -30309 -19528 15483 15230 -16782 -18599 10592 19407 3346 -11814
$$ packed form
698A6956m2032j0049J8952K4249K740k2142j825L1192M311m1140k5199J8415K7387
711A815Q689j4828k4984M819L6176J777m7199k0643L8127M1006L75l0178k6012
724c1060J3730L5337q328m5549o085M3759K3312j7605j9677L447K7614J9069k9995
737G969m7801R671N1667J0728l5788k3024J5367L1445J1566l1765l3852K2995
749a0822M2069j3297m5486p028K8995J7041j1920k8059m308L4248J9749l7944
761a6762l7431K3175M1923J411k9613k4613N216K9755P733l4529j8294L4381K8348
774A0700j7297k3412M879K1443J3299j6036l4047N49L9555J2306l1686j3804K8947
787d604K9272j02k7540k7335J0781L5011k53l2012j817K9191Q815j6061j5160
$$ plain form
800 -11814 -12898 4126 23027 9820 -17365 -8939 19300 16437 -9297 -22153 -16703 -791 10925
813 10925 -3257 -19772 -2066 20845 5610 -19696 -17964 -6805 -4886 -5976 -12087 -12482 2931
826 2931 8566 -13286 -24648 -4216 11753 8197 2372 -3625 -8585 -637 4103 -10661 -14248 8066
840 8066 19437 7194 1237 7303 11452 14443 9420 -1924 5298 23662 14998 -8388 -5219 13510
854 13510 15966 11896 12253 10234 14240 22598 12753 -6060 -3764 6747 2828 -1399 4761 9313 13803
869 13803 16181 844 -13287 -1992 9506 -3245 -9918 4421 10446 978 -8556 -14904 -12865
882 -12865 1155 3597 -9602 -5682 14745 11153 -9455 -15367 -9551 -4560 -736 -7576 -20331 -9358
896 -9358 14087 10555 -9312 -8333 4682 5319 -3652 -16566 -22006 -4625 11773 -3407 -21608 -5709
$$ packed form
800a1814j084J7024J8901j3207k7185Q426K8239k863k5734j2856N450J5912J1716
813A0925j4182j6515J7706K2911j5235k5306J732J1159J919j090o111l95J5413
826B931N635k1852j1362K0432J5969l556n825n997m960P948M740j4764l587K2314
840H066J1371j2243n957O066M149K991n023j1344P222J8364q664k3386L169J8729
854A3510K456m070L57k019M006Q358r845j8813K296J0511l919m227O160M552M490
869A3803K378j5337j4131J1295J1498j2751o673J4339O025r468r534o348K039
882a2865J4020K442j3199L920K0427l592k0608n912N816M991L824o840j2755J0973
896i358K3445l532j9867R79J3015O37q971j2914n440J7381J6398j5180j8201J5899
$$ plain form
910 -5709 14182 5368 -10927 -14051 -7963 2650 2424 -17627 -25754 -3355 10701 -7344 -21585
923 -21585 -13376 -3059 -62 -6282 -18720 -14616 7482 7549 -19759 -28116 -9720 -882 -9372 -17491
937 -17491 -17491 -4166 12848 3009 -21763 -16930 7714 4409 -19323 -26375 -14182 1715 7970 -5319
951 -5319 -19058 -2279 18906 3878 -21549 -17756 1206 7856 1865 -12515 -18488 -24 13690
964 13690 -4870 -21494 -3981 16428 11330 -3901 -12955 -8772 6474 7787 -16109 -24251 2996
977 2996 18607 963 -13909 -6447 6841 12009 924 -19404 -15499 9839 11896 -12770 -20117
990 -20117 -3018 7946 5437 -4676 -13808 -2937 18055 9406 -19923 -20550 3020 8073 -6276
1003 -6276 -16159 -11792 4187 14198 -2546 -22388 -7003 16744 7960 -14296 -16758 -5897 2294
$$ packed form
910e709J9891q814j6295l124O088J0613k26k0051q127K2399J4056j8045j4241
923b1585Q209J0317K997o220j2438M104K2098O7k7308q357J8396Q838q490q119
937a7491%J3325J7014r839k4772M833K4644l305k3732p052J2193J5897O255j3289
951e319j3739J6779K1185j5028k5427L793J8962O650n991j4380n973J8464J3714
964A3690j8560j6624J7513K0409n098j5231r054M183J5246J313k3896q142K7247
977B996J5611j7644j4872P462J3288N168j1085k0328L905K5338K057k4666p347
990b0117J7099J0964k509j0113r132J0871K0992q649k9329o27K3570N053j4349
1003f276r883M367J5979J0011j6744j9842J5385K3747q784k2256k462J0861Q191
$$ plain form
1016 2294 372 -14350 -20902 2212 21181 4039 -17132 -9873 6370 7608 -3751 -19126 -18191
1029 -18191 6173 16824 -6681 -20819 -1193 16229 6225 -8964 -10856 -519 13690 7904
1041 7904 -14939 -17013 6743 12420 -7181 -16005 -4561 8906 15294 4455 -14852 -10485 13169
1054 13169 10548 -15054 -20365 -2874 7253 3077 -7688 -12875 1734 18439 4644 -20009 -13134
1067 -13134 7514 5627 -9329 -16408 -11487 3882 13410 -2208 -19248 -5265 14896 7576 -8826
1080 -8826 -10160 -2570 6170 6412 -9336 -16957 2617 18639 2402 -12507 -1879 12861 15825
1093 15825 7026 -8509 -11294 7793 16763 -2107 -14655 -1298 12568 12442 6335 -1914 -1844 11903
1107 11903 13679 -6866 -13321 4052 11310 -285 -8496 -6473 2791 14914 9314 -11642 -11579 10714
$$ packed form
1016B294j922j4722o552K3114J8969j7142k1171P259J6243J238j1359j5375R35
1029a8191K4364J0651k3505j4138J9626J7422j0004j5189j892J0337J4209n786
1041G904k2843k074K3756N677j9601q824J1444J3467O388j0839j9307M367K3654
1054A3169k621k5602n311J7491J0127m176j0765n187J4609J6705j3795k4653O875
1067a3134K0648j887j4956p079M921J5369R528j5618j7040J3983K0161p320j6402
1080h826j334P590Q740K42j5748p621J9574J6022j6237j4909J0628J4740K964
1093A5825q799j5535k785J9087Q970j8870j2548J3357J3866j26o107q249P0J3747
1107A1903J776k0545o455J7373P258j1595q211K023R264J2123n600k0956O3K2293
$$ plain form
1121 10714 14906 -3801 -13852 -8596 1738 7998 433 -14219 -6546 15344 12152 -8648 -9260
1134 -9260 6746 12789 5939 -8169 -15781 147 20136 8464 -14323 -7228 16793 22060 9363
1147 9363 -4610 -6984 9133 21026 2975 -15994 -759 21908 14600 -3368 -5958 5781 20710
1160 20710 19191 -3778 -14579 8581 25703 6845 -15480 -12238 4264 15608 12443 -5542
1172 -5542 -9990 11890 21051 -1135 -17085 -4243 9207 6019 -4795 -11747 -2879 15663 11972
1185 11972 -11837 -13689 10967 20151 4915 -8502 -8563 3569 15518 6166 -14153 -7255 19608
1198 19608 21092 98 -6248 7382 20786 19466 -59 -14371 3779 29348 17332 -11481
1210 -11481 -9723 15296 28315 19053 -796 -7393 14201 32470 12105 -15962 -7511 16949 20522
$$ packed form
1121A0714M192j8707j0051N256J0334O260p565j4652P673K1890l192k0800o12
1134i260J6006O043o850j4108p612J5928J9989j1672k2787P095K4021N267j2697
1147I363j3973k374J6117J1893j8051j8969J5235K2667p308j7968k590J1739J4929
1160B0710j519k2969j0801K3160J7122j8858k2325L242J6502J1344l165j7985
1172e542m448K1880R161k2186j5950J2842J3450l188j0814o952Q868J8542l691
1185A1972k3809j852K4656R184j5236j3417o1J2132J1949r352k0319O898K6863
1198A9608J484k0994o346J3630J3404j320j9525j4312J8150K5569j2016k8813
1210a1481J758K5019J3019r262j9849o597K1594J8269k0365k8067Q451K4460L573
$$ plain form
1223 20522 5938 -6015 -150 21392 27666 1337 -17135 3205 26356 15273 -6378 -9568
1235 -9568 4007 18642 15730 -6304 -10609 14245 27117 7517 -6803 4639 18025 17219 4469
1248 4469 -8692 51 22999 20131 -5004 -4790 23427 33903 15830 -2337 -2198 15608 28635
1261 28635 11403 -11802 1235 32491 30245 2593 -6925 9687 29477 28883 4001 -12880 8929
1274 8929 35541 20198 -11542 -10351 14397 26917 15979 -4711 -6657 18367 32158 7311
1286 7311 -16269 -2693 19062 15804 -342 -7473 278 17873 19283 -2721 -10524 11597 25518
1299 25518 11419 -2806 -1258 6574 10328 4629 -6065 1831 24853 24192 1602 -2925 12325
1312 12325 17732 9509 1061 812 12687 25436 13071 -6964 -32 19823 19306 5336 2698 10321
$$ packed form
1223B0522j4584j1953N865K1542O274k6329j8472K0340K3151j1083k1651l190
1235i568J3575J4635k912k2034m305K4854J2872j9600j4320J1442J3386q06j2750
1248D469j3161Q743K2948k868k5135K14K8217J0476j8073j8167J39J7806J3027
1261B8635j7232k3205J3037L1256k246k7652r518J6612J9790n94k4882j6881K1809
1274H929K6612j5343l1740J191K4748J2520j0938k0690j946K5024J3791k4847
1286G311k3580J3576K1755l258j6146p131P751J7595J410k2004p803K2121J3921
1299B5518j4099j4225J548P832L754n699j0694P896K3022o61k2590m527J5250
1312A2325N407q223q448k49J1875J2749j2365k0035O932J9855n17j3970k638P623
$$ plain form
1326 10321 21913 22892 2817 -13106 2440 23356 13903 -6411 -4655 13171 25602 20179 -2008
1339 -2008 -14473 4311 23029 10365 -8537 -4133 9247 12909 5680 -6541 -7203 11791 22587
1352 22587 6200 -7627 2279 12925 6934 -3211 -8057 -1526 14528 17877 120 -7542 7163
1365 7163 14813 5253 1283 5398 8265 8175 2537 -5789 1825 16539 10181 -7864 -3332 15107 19094
1380 19094 8349 -3969 -7123 5360 16282 2423 -14819 -4221 15568 12739 -1723 -6302
1392 -6302 448 9928 9675 -7758 -16166 3201 18866 3200 -18377 -15805 785 11967 7567
1405 7567 -9095 -15252 2334 13936 447 -11364 -6561 -2717 -4498 -4692 -6024 -5533 2742 5449
1419 5449 -3622 -4609 3137 -298 -8820 -8019 -3665 -2529 1667 1845 -5889 -7048 -2109 -5555 -7096 3955
$$ packed form
1326A0321J1592R79k0075j5923J5546K0916r453k0314J756J7826J2431n423k2187
1339b008j2465J8784J8718j2664j8902M404J3380L662p229j2221o62J8994J0796
1352B2587j6387j3827R906J0646n991j0145m846O531J6054L349j7757p662J4705
1365G163P650r560l970M115K867r0n638q326P614J4714o358j8045M532J8439L987
1380A9094j0745j2318l154J2483J0922j3859j7242J0598J9789k829j4462m579
1392f302O750R480k53j7433q408J9367J5665j5666k1577K572J6590J1182m400
1405G567j6662o157J7586J1602j3489j1811M803L844j781j94j332M91Q275K707
1419E449r071r87P746l435q522Q01M354J136M196J78p734j159M939l446j541J1051
$$ plain form
1435 3955 8562 -2691 -10305 -8066 -5656 -1790 -899 -9908 -13145 -489 6205 -1518 -6580 -6335 -9843
1450 -9843 -6620 1903 -826 -9960 -9655 -6311 -7880 -6040 -4793 -9337 -7046 3142 2553 -5923 -5429
1465 -5429 -3141 -8862 -12520 -13090 -12301 -483 13659 5912 -13374 -14687 -2990 2022 -880 -7036
1479 -7036 -10729 -1395 10798 2947 -14438 -13646 -2715 938 2330 4631 754 -1173 1258 -3078
1493 -3078 -9467 -4347 2353 -927 -1938 -76 -3402 -2780 4941 3576 -5783 -6178 -267 1960 4618
1508 4618 3290 -9185 -15109 -3826 4333 -305 -2854 -76 1154 4246 3477 -8129 -13625 -4873
1522 -4873 -1237 -6680 -2289 4918 1026 -6135 -7528 -6712 -1983 4722 -678 -9649 -5248 774 -6532
1537 -6532 -11451 -3801 808 -2944 -6226 -7546 -3623 5704 4231 -13236 -16742 523 8432 -3700
$$ packed form
1435C955M607j1253p614K239K410L866Q91r009l237J2656O694p723n062K45l508
1450i843L223Q523k729r134L05L344j569J840J247m544K291J0188n89q476M94
1465e429K288n721l658n70P89J1818J4142p747j9286j313J1697N012k902o156
1479g036l693R334J2193p851j7385P92J0931L653J392K301l877j927K431m336
1493c078o389N120O700l280j011J862l326O22P721j365r359l95N911K227K658
1508D618j328j2475n924J1283Q159m638k549K778J230L092p69j1606n496Q752
1522d873L636n443M391P207l892p161j393Q16M729O705n400q971M401O022p306
1537f532m919P650M609l752l282j320L923R327j473j7467l506J7265P909j2132
$$ plain form
1551 -3700 -16046 -15388 -2467 10607 4765 -15301 -16392 3736 9407 -5688 -13254 -6549 1483 1907
1565 1907 -7939 -19070 -10232 9059 8362 -7140 -9624 -1901 1505 492 -4757 -13445 -11861 -688
1579 -688 1620 -3653 -2702 -1320 -4820 -2126 1175 -4603 -9076 -4225 -1490 -1764 1716 -266 -9133 -9499
1595 -9499 -2505 -3159 -3180 3727 5593 -671 -3235 -4372 -8510 -6810 -2254 -1539 1728 7185 99 -10763
1611 -10763 -4395 6929 3116 -6290 -5472 3497 10906 6199 -13196 -22222 -1326 17828 6674 -11796
1625 -11796 -8305 9159 17277 5021 -18212 -21899 3805 19259 -642 -19791 -6956 15569
1637 15569 15495 -6546 -25356 -14790 15401 21011 -6039 -20698 -3901 9484 -860 -16230 -16306
1650 -16306 -527 15925 10607 -10687 -13171 1625 3098 -10682 -13309 -1756 7944 6720 -5598
$$ packed form
1551c700j2346O58J2921J3074n842k0066j091K0128N671j5095p566O705Q032M24
1565A907r846j1131Q838J9291o97j5502k484P723L406j013n249q688J584J1173
1579f88K308n273R51J382l500K694L301n778m473M851K735k74L480j982q867l66
1595i499O994o54k1O907J866o264k564j137m138J700M556P15L267N457p086j0862
1611a0763O368J1324l813r406Q18Q969P409m707j9395r026K0896J9154j1154j8470
1625a1796L491J7464Q118j2256k3233l687K5704J5454j9901j9149J2835K2525
1637A5569p4k2041j8810J0566L0191N610k7050j4659J6797J3385j0344j5370p6
1650a6306J5779J6452n318k1294k484J4796J473j3780k627J1553R700j224j2318
$$ plain form
1663 -5598 -16051 -6709 8024 1755 -11329 -4467 10179 8790 -4274 -12009 -8086 4581 7257
1676 7257 -9182 -17562 1957 20566 11532 -8317 -14172 -3607 9894 9113 -10573 -19195 673
1689 673 19140 8017 -12237 -15420 -1397 13410 11044 -8851 -16452 3151 16699 -134 -20522
1702 -20522 -14749 6372 18473 7449 -16858 -20305 6039 22455 4102 -17990 -12963 5745
1714 5745 13558 1889 -15891 -13375 9876 17643 -3150 -15375 -1182 13652 8637 -5108 -9691
1727 -9691 2385 15317 4898 -17547 -14017 12578 20700 4622 -6111 557 10070 8244 -6879
1740 -6879 -14237 3924 21387 7349 -15027 -8216 15710 19450 -1545 -20539 -11642 19022 29633
1753 29633 -184 -25924 -8109 20959 15401 -12664 -23275 -3047 23920 22524 -6646 -18726
$$ packed form
1663e598j0453R342J4733o269j3084O862J4646j389j3064p735L923J2667K676
1676G257j6439q380J9519J8609r034j9849n855J0565J3501p81j9686q622J9868
1689F73J8467j1123k0254l183J4023J4807k366j9895p601J9603J3548j6833k0388
1702b0522N773K1121J2101j1024k4307l447K6344J6416j8353k2092N027J8708
1714E745P813j1669j7780K516K3251P767k0793j2225J4193J4834n015j3745m583
1727i691J2076J2932j0419k2445L530K6595Q122j6078j0733O668R513j826j5123
1740f879p358J8161J7463j4038k2376O811K3926L740k0995j8994Q897L0664J0611
1753B9633k9817k5740J7815K9068n558k8065j0611K0228K6967j396k9170j2080
$$ plain form
1765 -18726 4554 19569 84 -21196 -12919 12347 25323 10105 -16192 -17962 6850 19431
1777 19431 4585 -8015 -570 10940 12499 2695 -8723 -7824 5304 9592 4224 6524 13084 6329
1791 6329 -3458 -1661 4790 7507 6955 2707 840 7378 10799 667 -5715 2970 9904 6164 2881
1806 2881 4043 7263 11860 6301 -10620 -15909 875 15193 12487 2102 -4244 -1279 9673 11509
1820 11509 -5136 -16767 -4162 13776 16836 5850 -8959 -14172 -552 13180 5870 -6889
1832 -6889 -1236 11947 13201 1792 -10902 -10178 7014 16819 1879 -13279 -3004 14926 15566
1845 15566 2753 -8056 -6323 7829 15007 2582 -9558 -3471 6656 6665 3932 1100 -2327 -1028
1859 -1028 4114 4455 4175 4448 -1997 -8923 -2641 6557 1786 -5622 -3272 3571 4331 -743 -8529 -6967
$$ packed form
1765a8726K3280J5015j9485k1280Q277K5266J2976j5218k6297j770K4812J2581
1777A9431j4846j2600P445J1510J559r804j1418Q99J3128M288n368K300O560o755
1791F329r787J797O451K717n52m248j867O538L421j0132o382Q685O934l740l283
1806B881J162L220M597n559j6921n289J6784J4318k706j0385o346K965J0952J836
1820A1509j6645j1631J2605J7938L060j0986j4809n213J3620J3732p310j2759
1832f889N653J3183J254j1409j2694P24J7192R805j4940j5158J0275J7930O40
1845A5566j2813j0809J733J4152P178j2425j2140O087J0127Rk733k832l427J299
1859a028N142L41k80K73o445o926O282R198m771p408K350O843P60n074p786J562
$$ plain form
1875 -6967 7030 10961 -6214 -17170 -4602 9725 5833 -8220 -14709 -5296 11704 11587 -7668
1888 -7668 -14835 505 11336 3677 -7884 -10968 -6133 1795 3489 -1254 1272 9059 4799 -7303
1902 -7303 -8018 -1264 967 622 2128 2141 3334 2362 -4968 -8330 471 5031 -2110 -4132 5623 9044
1918 9044 1682 -8718 -12863 -5623 6637 4647 -8275 -8510 5334 9062 -357 -8228 -8841 -4025
1932 -4025 2508 1014 -5799 -3193 3101 -1138 -9085 -7836 -1237 2086 4924 3519 -2360 -5301 -4574
1947 -4574 -6807 -5957 937 2873 -352 2745 6343 -545 -9375 -9456 -3218 5278 9478 1986 -6818 -2370
1963 -2370 2868 -3813 -10299 -4384 3517 5872 3697 -1545 -3839 22 -195 -9554 -11180 -1744 2562
1978 2562 -1454 -2370 -455 -1255 -3217 -7955 -10665 -2917 5495 -1385 -11912 -6724 3115 -976 -11714
$$ packed form
1875f967J3997L931j7175j0956J2568J4327l892j4053o489R413J7000j17j9255
1888g668p167J5340J0831p659j1561l084M835P928J694m743K526P787m260j2102
1902g303p15O754K231l45J506J3J193r72p330l362Q801M560p141k022R755L421
1918I044p362j0400m145P240J2260j990j2922k35J3844L728r419p871o13M816
1932d025O533j494o813K606O294m239p947J249O599L323K838j405n879k941P27
1947d574k233Q50O894J936l225L097L598o888q830q1O238Q496M200p492q804M448
1963b370N238o681o486N915P901K355k175n242k294L861k17r359j626R436M306
1978B562m016r16J915q00j962m738k710P748Q412o880j0527N188R839m091j0738
$$ plain form
1993 -11714 -15546 -5985 8269 9570 -6340 -17392 -6309 5351 -1868 -12773 -10188 614 6687
2006 6687 515 -13047 -13216 2467 10685 -1605 -11826 -6438 2176 2994 -2745 -9971 -8198 2247
2020 2247 5172 -3538 -6867 -1200 733 -966 -627 -2057 -4952 -4336 -3429 -4656 -1527 2086 -1076 -4477
2036 -4477 -1747 -1263 -5200 -3882 -179 170 -474 -1575 -5686 -6485 -394 121 -4783 -4897 -943 923
2052 923 2831 3397 -2172 -7891 -4835 -864 -1418 -1780 -3271 -3732 3593 10878 3067 -9870 -10616 -1543
2068 -1543 4177 3800 -587 -3523 2269 6008 -3979 -14482 -6685 7445 9809 2001 -4911 -5143 2066
2083 2066 4457 -6597 -13933 -4027 7870 5600 -2792 -6849 -5812 -2112 262 -2894 -4118 1183
2097 1183 884 -6370 -7019 -1171 -2129 -7090 -6752 -2829 2662 6242 19 -8570 -7569 -2132 -5334 -9130
$$ packed form
1993a1714l832R561J4254J301j5910j1052J1083J1660p219j0905K585J0802O073
2006F687o172j3562j69J5683Q218j2290j0221N388Q614Q18n739p226J773J0445
2020B247K925q710l329N667J933j699L39j430k895O16R07j227L129L613l162l401
2036d477K730M84l937J318L703L49o44j101m111p99O091N15m904j14L954J866
2052I23J908N66n569n719L056L971n54l62j491m61P325P285p811j2937p46R073
2068a543N720l77m387k936N792L739r987j0503P797J4130K364p808o912k32P209
2083B066K391j1054p336R906J1897k270q392m057J037L700K374l156j224N301
2097A183k99p254o49N848r58m961L38L923N491L580o223q589J001N437l202l796
$$ plain form
2113 -9130 -2929 4869 5327 -358 -8068 -9914 -2220 2704 -4188 -7699 1721 9207 3883 -5970 -11995
2128 -11995 -10840 -1803 5033 1849 -1130 2010 1371 -3351 -4101 -1480 -2622 -3081 -1486 -651 -71 1651
2144 1651 -1322 -4825 -753 2590 -1977 -4041 1117 3502 591 -3774 -6592 -3648 4852 4977 -5681
2159 -5681 -8068 3514 10092 3625 -6948 -10892 -3770 8813 8545 -4075 -8695 79 5068 -92
2173 -92 -5096 -3575 3241 8635 3718 -7575 -7393 2940 5704 -2978 -7208 -4356 2966 7693 3105
2188 3105 -6747 -6258 4721 6817 -1642 -7100 -5922 -1335 3585 3804 -1021 -1842 1931 -1364 -6348
2203 -6348 -3289 2716 3289 1236 -613 -2510 -813 976 -3584 -7026 -598 6642 3792 -1463 -1398 1270
2219 1270 2573 -87 -7172 -6981 5349 10559 -594 -9156 -2082 8772 8544 -2399 -11737 -5062
$$ packed form
2113i130O201P798M58n685p710j846P694M924o892l511R420P486n324r853o025
2128a1995J155R037O836l184k979L140o39m722p50K621j142m59J595Q35N80J722
2144A651k973l503M072L343m567k064N158K385k911m365k818K944Q500J25j0658
2159e681k387J1582O578o467j0573l944P122J2583k68j2620m620Q774M989n160
2173i2n004J521O816N394m917j1293J82J0333K764q682m230K852P322M727m588
2188C105r852M89J0979K096q459n458J178M587M920K19m825q21L773l295m984
2203f348L059O005N73k053j849j897J697J789m560l442O428P240k850n255O5K668
2219A270J303k660p085J91J2330N210j1153q562P074J0854k28j0943r338O675
$$ plain form
2233 -5062 12487 15194 -2410 -13286 -4424 7544 6600 -2755 -6919 3397 16792 11247 -9229
2246 -9229 -14175 1760 12738 5600 -5229 -4225 8207 14719 2730 -14115 -9225 10886 17254
2259 17254 4982 -4125 -279 7212 7314 -2462 -9408 57 14562 10509 -1810 -1634 7011 9389
2273 9389 2207 -6914 -5842 6925 14297 4805 -5449 70 8573 5007 -3952 -4891 2973 11921 10246
2288 10246 -1710 -6205 2135 7376 -1138 -7663 -1584 8654 12571 5010 -7145 -8078 4509 10039
2302 10039 1351 -5763 -1312 6153 6477 -252 -7717 -3902 8704 10803 -253 -5838 1281 7297
2316 7297 4426 -2584 -6848 -1260 9044 8599 -2887 -5732 3430 8900 4255 -2986 -5274 285 8655
2331 8655 6324 -4093 -3727 5605 5989 -2194 -6516 -1512 6863 9875 1854 -6687 -1460 7776 4035
$$ packed form
2233e062J7549K707j7604j0876Q862J1968r44r355m164J0316J3395n545k0476
2246i229m946J5935J0978p138j0829J004J2432O512j1989j6845M890K0111O368
2259A7254j2272r107L846P491J02r776o946R465J4505m053j2319J76Q645K378
2273I389p182r121J072J2767P372r492j0254N519Q503l566q959r39P864Q948j675
2288A0246j1956m495Q340N241q514o525O079J0238L917p561j2155r33J2587N530
2302A0039q688p114M451P465L24o729p465L815J2606K099j1056n585P119O016
2316G297k871p010m264N588J0304m45j1486k845R162N470m645p241k288N559Q370
2331H655k331j0417L66R332L84q183m322N004Q375L012q021q541N227R236l741
$$ plain form
2346 4035 -5715 -6298 1570 6146 4386 -1827 -3997 4372 9732 1112 -7986 -3590 5324 4992 -1142
2361 -1142 -4235 821 9663 9022 -4107 -10237 1061 11606 7306 -1166 -2038 3098 7484 3272 -6001
2376 -6001 -4560 8260 13102 4002 -3271 -413 5396 6973 2283 -3795 -777 9461 10672 -112
2390 -112 -5893 -568 5289 6463 3263 -895 1478 7888 6311 -2628 -5274 40 2428 1721 1455 1281
2406 1281 3717 7410 3765 -5320 -6161 -1 4041 3393 2326 492 1163 3208 26 -6244 -3106 5345
2422 5345 6634 2848 1450 1785 528 -536 -3898 -4678 2326 9487 4227 -3064 -2097 2327 3062 1416
2438 1416 -2654 -2884 3390 6890 -305 -6449 -2016 3697 1371 -2735 -3133 636 6096 4074 -5384
2453 -5384 -7874 -15 3477 -2308 -5374 -1787 2761 3584 -638 -6083 -5359 1564 2234 -2784 -1707 2974
$$ packed form
2346D035r750n83P868M576j760o213k170Q369N360q620r098M396Q914l32o134
2361a142l093N056Q842o41j3129o130J1298J0545m300q472q72N136M386m212r273
2376f001J441J2820M842r100p273K858N809J577m690o078L018J0238J211j0784
2390a12n781N325N857J174l200m158K373O410j577q939k646N314K388p07k66j74
2406A281K436L693l645r085q41O160M042o48j067j834O71K045l182o270L138Q451
2422E345J289l786j398L35j257j064l362p80P004P161n260p291R67M424P35j646
2438A416m070k30O274L500p195o144M433N713k326m106l98L769N460k022r458
2453e384k490P859L492n785l066L587M548Q23m222n445P24O923O70n018J077M681
$$ plain form
2469 2974 2704 -2182 -5865 -5419 587 6634 2859 -3575 -597 5282 3620 -2601 -3439 -746 2768 4539
2485 4539 1074 -2211 1987 5955 2336 -672 1192 2704 1992 2044 776 365 3579 5162 963 -1844
2501 -1844 727 1693 1506 3362 4164 1649 1604 1539 -619 -880 1867 513 -1379 1395 4201 2190 547
2518 547 776 -207 826 2338 -588 -2445 1388 3609 400 -1220 1025 928 479 1115 -412 -427 3579
2535 3579 4443 -1331 -4159 -2008 231 2250 3391 513 -1838 1302 2078 -2351 -3897 166 2573
2550 2573 2542 1042 -2365 -4190 -1721 -1488 -4180 -2848 2686 3805 673 -1921 -4499 -5037 -2052 -1792
2566 -1792 -4784 -3428 1780 1918 -1895 -3002 -3060 -3194 -2300 -3416 -4455 -80 4203 92 -5604 -4251
2582 -4251 -662 -1210 -2165 -1938 -486 3470 4196 -2140 -6574 -1893 2528 7 -1992 -446 1538 3087
$$ packed form
2469B974k70m886l683M46O006O047l775o434K978N879j662o221q38K693L514J771
2485D539l465l285M198L968l619l008J864J512p12N2j268m11L214J583m199k807
2501a844K571R66j87J856Q02k515m5o5k158k61K747j354j892K774K806k011j643
2518E47K29r83J033J512k926j857L833K221l209j620K245r7m49O36j527j5M006
2535C579Q64n774k828K151K239K019J141k878k351L140P76m429j546M063K407
2550B573l1j500l407j825K469K33k692J332N534J119l132k594k578n38K985K60
2566a792k992J356N208J38l813j107n8j34Q94j116j039M375M283m111n696J353
2582d251L589n48r55K27J452L956P26o336m434M681M421k521j999J546J984J549
$$ plain form
2598 3087 858 -5017 -4326 4356 7526 677 -4139 -1326 2136 1217 -1931 -5232 -1385 6089 5708 -2082
2614 -2082 -4214 884 2054 -1025 -3880 -4043 192 4449 1834 -4331 -2922 2524 1549 -3212 -3857 -1392
2630 -1392 2024 3753 -37 -4711 -1976 1852 -1381 -5114 -1649 2507 2827 474 -2689 -3130 583
2645 583 2880 -2297 -5163 -812 2135 -266 -2537 -2611 -1112 2071 2300 -3437 -5042 -329 1313 -2157
2661 -2157 -3881 -2099 -908 514 -1715 -5464 -4474 1637 2584 -2817 -4619 -2483 -1612 -1959 -2743 -4309
2677 -4309 -2745 1431 422 -4156 -4314 -932 -691 -1545 -1308 -1925 -1300 474 -769 -4551 -2910 1111
2693 1111 -62 -1471 -517 131 481 1423 -1349 -3556 -1002 1297 -1091 -2149 909 2286 808 -975
2709 -975 -2516 -2921 792 2898 -239 -1532 1048 1169 -2718 -3849 -3171 -1664 2184 3102 -627 -1977
$$ packed form
2598C087k229n875O91Q682L170o849m816K813L462r19l148l301L847P474l81p790
2614b082k132N098J170l079k855j63M235M257k615o165J409N446r75m761o45K465
2630a392L416J729l790m674K735L828l233l733L465M156L20k353l163m41L713
2645E83K297n177k866M351K947k401k271p4J499L183K29n737j605M713J642l470
2661b157j724J782J191J422k229l749R90O111R47n401j802K136Q71l47p84j566
2677d309J564M176j009m578j58L382K41q54K37o17O25J774j243l782J641M021
2693A111j173j409R54O48L50R42k772k207K554K299k388j058L058J377j478j783
2709i75j541m05L713K106l137j293K580J21l887j131O78J507L848R18l729j350
$$ plain form
2725 -1977 773 -144 -4158 -3669 -1413 564 1059 86 -2712 -2091 1566 73 -3369 -1593 1591 1192
2741 1192 -135 -910 -2105 -533 1418 -335 -3573 -132 2803 1611 -565 -764 -1258 -50 1486 -621
2757 -621 -1961 1256 2868 -406 -2821 -1468 -564 128 1242 795 -204 1458 594 -3812 -4552 -1131 -18
2774 -18 -432 304 64 -113 778 -156 -3749 -3279 762 1227 -1876 -1363 -391 319 1123 -64 -2523 -1436
2792 -1436 2351 798 -1957 -1047 1247 1281 764 -1009 -2680 -578 2958 1128 -1720 -301 2314 1978
2808 1978 195 -1021 -2018 644 3308 -3 -3740 -1388 2406 1895 -523 -1135 -1276 1128 2231 -1915
2824 -1915 -4731 -840 2242 84 -2696 -2674 -1281 1432 1866 -1968 -3819 690 2538 -1660 -4184 -1791
2840 -1791 1020 2370 406 -2866 -2848 1833 2876 -1871 -3165 1847 4607 2266 -1382 -3641 -1124
$$ packed form
2725a977K750r17m014M89K256J977M95r73k798O21L657j493l442J776L184l99
2741A192j327p75j195J572J951j753l238L441K935j192k176j99m94J208J536k107
2757f21j340L217J612l274k415J353R04O92J114m47r99J662q64m406p40L421J113
2774a8m14P36k40j77Q91r34l593M70M041M65l103N13R72P10Q04j187k459J087
2792a436L787j553k755R10K294L4n17j773j671K102L536j830k848J419K615l36
2808A978j783j216r97K662K664l311l737K352L794n11k418o12j41K404J103m146
2824a915k816L891L082k158k780K2J393K713M34l834j851M509J848m198k524K393
2840a791K811J350j964l272J8M681J043m747j294N012K760k341l648k259K517
$$ plain form
2855 -1124 3789 2934 -2311 -1981 4020 5340 932 -1839 -1685 1595 3786 853 -3364 -693 5099 3259
2871 3259 -2558 -2916 662 2946 2669 -862 -3322 1383 5416 586 -6029 -3789 1457 2983 604
2886 604 -2561 -2063 2569 4154 -1660 -6347 -1330 4689 2869 -1953 -3735 -1313 3087 3571 -2429 -4192
2902 -4192 2553 6751 1781 -3368 -2668 1140 4122 1911 -3304 -2181 5023 6249 -640 -4193 -81
2917 -81 4691 4324 -259 -3913 -649 6584 4751 -3631 -4897 1372 4675 2075 -2156 -2328 2104 5757
2933 5757 1440 -5630 -4199 3319 3971 -1316 -3339 -148 4423 4586 -972 -5625 -228 6742 3042
2948 3042 -3746 -3243 2096 4801 2643 -2545 -2873 4120 6905 701 -4849 -290 6327 5399 193 -3332
2964 -3332 -392 6110 6131 -1624 -4178 2771 8015 3529 -1961 -2213 2231 6061 3380 -3644 -3062 4321
$$ packed form
2855a124M913q55n245L30O001J320m408k771J54L280K191k933m217K671N792j840
2871C259n817l58L578K284k77l531k460M705M033m830o615K240N246J526k379
2886F04l165M98M632J585n814m687N017O019j820m822j782K422M400M84o000j763
2902d192O745M198m970n149P00L808K982k211n215J123P204J226o889l553M112
2917h1M772l67m583l654L264P233j833q382j266O269L303k600m231j72M432L653
2933E757m317p070J431P518O52n287k023L191M571J63n558m653N397O970l700
2948C042o788N03N339K705k158n188l28O993K785o204n550M559O617r28n206l525
2964c332K940O502K1p755k554O949N244m486n490k52M444L830k681p024N82P383
$$ plain form
2980 4321 5870 -469 -3703 328 4695 4499 -239 -4890 -1761 4522 3708 -3439 -3742 1696 3838 2152
2996 2152 -1362 -2850 710 4139 1074 -4166 -1813 3992 3411 -411 -1881 -503 2581 3372 -600
3011 -600 -2952 1619 5926 2961 -1605 -801 1837 2700 2018 -1037 -1254 3937 5837 1179 -2503 524
3027 524 3840 3248 186 -2163 -853 3962 4893 -890 -3235 1270 4195 2105 -580 -1533 265 2865
3043 2865 2482 -1578 -2175 2313 3027 187 -1553 -365 1326 2411 1675 -1906 -909 2960 3319 -479
3059 -479 -955 639 966 1101 860 -153 1446 3654 2157 -533 842 2219 1019 -452 704 823
3075 823 1620 2702 986 -334 1484 2425 272 -575 1380 957 277 768 -32 -559 892 1503 -1417
3092 -1417 -2002 732 1344 -24 -99 -773 -1011 393 633 -1816 -1771 -167 -240 -645 480 226 -1547 -746
$$ packed form
2980D321J549o339l234M031M367j96m738m651L129O283q14p147l03N438K142j686
2996B152l514j488L560L429l065n240K353N805n81l822j470J378L084P91l972
3011f00k352M571M307k965m566Q04K638Q63o82l055k17N191J900m658l682L027
3027E24L316n92l062k349J310M815R31n783k345M505K925k090k685r53J798K600
3043B865l83m060n97M488P14k840j740J188J691J085p36l581R97L869L59l798
3059d79m76J594L27J35k41j013J599K208j497k690J375J377j200j471J156J19
3075H23P97J082j716j320J818R41k153q47J955m23o80M91q00n27J451O11k920
3092a417n85K734O12j368p5o74k38J404K40k449M5J604p3m05J125k54j773Q01
$$ plain form
3110 -746 690 -676 -1338 -348 -905 -1072 546 -121 -1178 128 1642 -156 -1238 -590 -325 23 964
3127 964 -82 -2684 -1241 1562 846 -1311 -1574 -599 485 1430 -105 -2370 -1257 958 -636 -2463
3143 -2463 -1370 -722 -734 -105 -903 -2049 -557 1062 -1029 -2768 -1916 -876 -1090 -407 -684 -2435 -1198
3160 -1198 733 -749 -1278 -310 -424 -1514 -959 -175 -627 -595 -342 -1563 -1257 1250 405 -1462 -1199 377
3178 377 271 -109 37 -1325 -1474 506 -79 -1753 -1251 333 436 46 -158 -1431 -835 1191 -40 -3449
3196 -3449 -2509 259 803 -209 -1168 -2211 -1329 1531 262 -2793 -2372 173 97 -728 -892 -2140 -1146
3213 -1146 718 -189 -2816 -1315 1610 930 -1456 -1440 -1301 -61 1309 -747 -3108 -1062 1635 348
3229 348 -1372 -489 -408 -588 508 -441 -1825 -1043 49 -2040 -2342 -41 608 -147 -930 -1393 -1346 193
$$ packed form
3110g46J436j366o62R90n57j67J618o67j057J306J514j798j082O48K65L48R41
3127I64j046k602J443K803p16k157k63R75J084R45j535k265J113K215j594j827
3143b463J093O48j2O29p98j146J492J619k091j739Q52J040k14O83k77j751J237
3160a198J931j482n29R68j14j090N55P84m52L2K53j221L06K507q45j867K63J576
3178C77j06l80J46j362j49J980n85j674N02J584J03l90k04j273N96K026j231l409
3196c449R40K768N44j012r59j043Q82K860j269l055M21K545p6q25j64j248R94
3213a146J864r07k627J501K925o80k386J6J39J240J370k056k361K046K697j287
3229C48j720Q83Q1j80J096r49j384P82J092k089l02K301O49p55p83m63M7J539
$$ plain form
3247 193 221 -2514 -2966 -98 913 -1406 -1943 -1447 -1034 5 -568 -2646 -1625 1393 1366 -1696 -2644 -1010
3265 -1010 -93 405 -497 -3475 -2393 2008 2495 -710 -2030 -968 422 1247 35 -2683 -1666 1840
3281 1840 1907 -1683 -1584 518 1502 747 -961 -2419 -729 2917 1558 -2610 -2996 526 2035 637 -1427
3298 -1427 -2493 -545 2519 700 -2985 -1151 1968 981 -1973 -1774 94 2042 1620 -1714 -3257 1290
3314 1290 3818 295 -2607 -580 2034 1940 -249 -2414 -1412 2903 3058 -1489 -1862 2239 4648 1043
3330 1043 -2821 -2664 1291 4977 1829 -3962 -3012 3427 4879 -675 -3619 -1307 2491 4076 336
3345 336 -3613 -1336 3290 1369 -3784 -2898 886 3126 1581 -1463 -2764 43 2587 -72 -3739
3360 -3739 -1689 1954 1673 -267 -1359 -1206 604 1147 -1152 -1323 2174 3048 -534 -2472 -473 1379
$$ packed form
3247A93K8k735m52K868J011k319n37M96M13J039n73k078J021L018k7l062r48J634
3265a010R17M98r02k978J082M401M87l205j320J062J390Q25j212k718J017L506
3281A840O7l590R9K102R84p55j708j458J690L646j359m168l86L522J509j398k064
3298a427j066J948L064j819l685J834L119r87k954J99J868J948m22l334j543M547
3314A290K528l523k902K027K614r4k189k165J002M315J55m547l73M101K409l605
3330A043l864J57L955L686l148n791R50O439J452n554k944K312L798J585l740
3345C36l949K277M626j921n153Q86L784K240j545l044j301K807K544k659l667
3360c739K050L643k81j940j092J53J810N43k299j71L497Q74l582j938J999J852
$$ plain form
3376 1379 1478 269 -1426 -395 3027 3338 -177 -1949 639 2634 2005 231 -876 -2 3321 2213
3392 2213 -1709 -1992 2116 3763 1998 -1068 -1454 875 3894 1616 -3532 -2951 1922 4001 1590 -1116
3408 -1116 -1879 369 2995 1314 -2744 -1524 3187 3250 -440 -1732 94 1650 1621 -609 -2153 915
3424 915 4625 1867 -1972 -527 2099 2038 151 -744 280 2404 2366 -698 -1267 2796 4309 234 -2429
3441 -2429 -822 2771 3364 383 -3297 -1701 3997 3826 -1777 -3553 610 3256 1785 -2336 -3623
3456 -3623 143 3536 480 -4710 -2490 2834 3503 -1194 -3402 -2009 1865 3001 -810 -4081 -1249
3471 -1249 3059 1749 -1422 -1238 207 825 541 -540 -316 2323 3197 26 -1678 630 1866 158
3487 158 -355 516 1845 2877 2172 -554 -340 2240 1706 -516 -39 2706 2632 1007 -668 -1255 619
$$ packed form
3376A379R9j209j695J031L422L11l515j772K588J995o29j774j107Q74L323j108
3392B213l922k83M108J647j765l066l86K329L019k278n148N81M873K079k411k706
3408a116p63K248K626j681m058J220M711O3l690j292J826J556k9k230j544L068
3424I15L710k758l839J445K626o1j887q95J024K124l8l064n69M063J513m075k663
3441b429J607L593N93k981l680J596N698j71n603j776M163K646j471m121j287
3456c623L766L393l056n190K220N324O69m697k208J393L874J136l811l271K832
3471a249M308j310l171J84J445O18k84j081K24K639Q74l171j704K308J236j708
3487A58n13Q71J329J032p05k726K14K580n34k222M77K745p4j625j675n87J874
$$ plain form
3504 619 3687 2194 -1282 -692 1681 1626 472 -1417 -2548 -642 2363 1996 -420 -992 874 702 -276
3521 -276 -972 -1721 -41 2651 1789 -1284 -1786 624 822 -143 -1175 -1943 931 3964 2585 -2132 -2282
3538 -2282 298 1499 678 -58 -435 1114 2321 407 -1666 -147 1803 669 -937 343 1177 789
3554 789 -10 -1682 -1463 975 1756 -764 -1231 1058 1562 -791 -2405 -1593 82 1675 -503 -3471 -1716
3571 -1716 3229 2574 -2563 -4371 -1233 2174 2797 -492 -3951 -1463 3222 2107 -2662 -3266 496 2812
3587 2812 1879 -720 -2279 -63 2656 1362 -2612 -1546 1510 2194 872 -455 -1402 386 2536 1423
3603 1423 -872 -738 244 209 517 975 285 -1026 -294 -193 -416 454 220 -945 -356 918 -83 -1567
3621 -1567 -1403 -1276 -1138 249 649 -875 -619 360 -441 -1704 -1246 -794 -62 821 465 -1864 -1899 503
$$ packed form
3504F19L068j493l476N90K373n5j154j889j131J906L005l67k416n72J866j72r78
3521b76o96p49J680K692q62l073n02K410J98r65j032p68K874L033j379m717j50
3538b282K580J201q21p36l77J549J207j914k073J519J950j134j606J280Q34l88
3554G89p99j672K19K438P81k520m67K289N04k353j614Q12J675J593k178k968J755
3571a716M945o55n137j808L138L407O23l289l459K488M685j115m769o04L762K316
3587B812r33k599j559K216K719j294l974J066L056O84j322j327r47J788K150j113
3603A423k295J34R82l5L08M58o90j311P32J01k23Q70k34j165N89J274j001j484
3621a567J64J27J38J387M00j524K56R79q01j263M58M52P32Q83l56k329l5K402
$$ plain form
3639 503 862 -436 -2018 -1792 248 2925 2073 -2229 -3775 -300 1874 146 -1985 -1645 701 2841
3655 2841 1369 -3367 -3313 647 2464 -112 -1950 -966 1082 1377 -1557 -4704 -2326 2495 2909 -888
3671 -888 -2429 -1100 -36 -846 -2046 -2680 -116 2086 276 -2269 -1070 598 -381 -2474 -2054 -485
3687 -485 1533 1428 -1479 -3064 -14 1333 -1629 -2872 -828 1625 1422 317 -1722 -1377 1022 425
3703 425 -2711 -2449 1572 2806 652 -1885 -2437 -422 1833 1070 -1661 -1229 1684 1233 -828 -2046
3719 -2046 -1450 -262 670 415 -989 149 1147 -299 -1703 -997 -160 -375 -140 -163 -1148 -752 25 -292
3737 -292 -650 57 -353 -1882 -412 1017 549 -932 -1202 -1593 -998 688 -50 -1360 -1031 465 355 -648
3755 -648 -731 -1417 -1474 -33 -15 -1215 -981 -488 -729 -924 -536 -1206 -1195 15 -227 -1497 -1799 -255 -420 -576
$$ packed form
3639E03L59j298j582K26K040K677q52m302j546L475K174j728k131L40K346K140
3655B841j472m736N4L960J817k576j838R84K048K95k934l147K378M821M14l797
3671h88j541J329J064q10j200o34K564K202j810k545J199J668r79k093M20J569
3687d85K018j05k907j585L050J347k962j243K044K453k03j105k039L45K399n97
3703D25l136K62M021J234k154k537n52K015K255p63k731M32K913m51k061j218
3719b046N96J188R32k55j404J138R98j446j404P06Q37k15K35k3r85L96P77l17
3737b92l58P07m10j529J470J429m68j481k70l91N95J686p38j310L29J496j10j003
3755f48q3o86n7J441J8j200K34M93k41j95L88o70J1J210k42j270l02J544j65j56
$$ plain form
3775 -576 -1425 -2460 -2666 328 1507 -535 -1098 -741 -830 -1037 -764 -1431 -1295 252 611 -319 -607 -517 -1708
3794 -1708 -1647 217 871 312 -85 -119 -733 -785 -1123 -1922 -832 2167 1790 -1633 -1796 112 1295 397 -2329
3813 -2329 -3139 153 3808 2062 -2220 -2862 309 1823 478 -2125 -1965 1364 3869 439 -3523 -1863
3829 -1863 1028 680 -1398 -1328 1055 3195 1985 -2090 -3629 -452 1957 445 -1010 590 1549 739
3845 739 -1381 -2405 -797 1877 1457 -1407 -1428 1978 2085 -1328 -3838 -2105 1399 3034 278 -2889
3861 -2889 -1263 2959 1494 -2818 -3523 -591 1658 1544 -1674 -2678 226 2358 -360 -4098 -2724
3876 -2724 1270 2908 1101 -2100 -3286 -395 1721 -173 -2727 -1651 1620 2190 428 -1473 -1571 298
3892 298 1636 -74 -1524 539 1785 825 -942 -826 298 1514 1650 -460 -1563 929 2320 434
$$ packed form
3775e76q49j035k06K994J179k042n63L57q9k07K73o67J36J547L59r30k88R0j191
3794a708O1J864O54n59l97l4o14n2l38p99J090K999l77l423j63J908J183q98k726
3813b329q10L292L655j746m282o42L171J514j345k603J60L329K505l430l962J660
3829a863K891l48k078P0K383K140j210m075j539L177K409j512j455J600R59q10
3845G39k120j024J608K674m20k864k1L406J07l413k510J733L504J635k756l167
3861b889J626M222j465m312p05K932K249j14l218j004K904K132k718l738J374
3876b724L994J638j807l201j186K891K116j894k554J076L271N70j762j901r8J869
3892B98J338j710j450K063J246r60j767J16J124J216J36k110j103K492J391j886
$$ plain form
3908 434 -645 2 639 884 -129 -1310 -762 2285 2126 -1198 -2381 448 1980 268 -1815 -1905 466
3925 466 3010 1153 -3154 -2584 1287 2187 -69 -2100 -944 1471 2263 -603 -3927 -1567 2595 2194
3941 2194 -1841 -2685 785 3498 2254 -1708 -3842 -428 3322 1825 -1921 -1299 1772 2302 544 -2142
3957 -2142 -2133 529 2917 958 -720 333 1168 6 -1568 -2029 -587 1568 2278 378 -1384 -65
3973 -65 140 -1251 -1398 84 639 470 210 -613 -617 24 -578 -2233 -614 1024 1604 795 -664 -1443 -633
3992 -633 351 222 -1669 -295 1873 2134 874 -756 -1050 -605 1316 1122 -495 874 3059 2271 -727
4009 -727 -1962 -996 1454 3627 1976 -60 126 2281 1473 -920 -1656 -270 1983 3482 1484 -1248
4025 -1248 -55 2128 781 -1309 -915 1271 2225 1625 -595 -1329 895 2184 126 -2180 -594 1580
$$ packed form
3908D34j079O47O37K45j013j181N48L047j59l324j183K829J532j712k083r0K371
3925D66K544j857m307N70L871R00k256k031J156K415P92k866l324K360M162m01
3941B194m035q44L470K713j244l962k134L414L750j497l746O22L071N30j758k686
3957b142RK662K388j959j678J053Q35j162j574m61J442K155P10j900j762J319
3973f5K05j391j47J482N55j69k60q23mO41o02j655J619J638N80q09j459p79Q10
3992f33R84j29j891J374K168K61j260j630k94M45J921j94j617J369K185p88k998
4009g27j235R66K450K173j651k036J86K155q08k393p36J386K253J499j998k732
4025a248J193K183j347k090L94K186R54o00k220p34K224J289k058k306J586K174
$$ plain form
4041 1580 1902 800 128 -616 710 856 -332 -825 1096 2013 640 -161 82 887 1374 893 -705 -176
4059 -176 2250 1859 -182 -882 306 1340 1403 836 143 512 1518 372 -1072 -392 1524 1213 -513
4076 -513 -692 -651 581 1507 343 -1929 -1133 357 187 -910 -1035 210 743 805 -857 -2232 -878 122
4094 122 -703 -925 348 1216 546 -437 -1487 -2093 -222 1441 107 -467 734 1221 601 249 -442 -802
4112 -802 682 1109 428 165 1867 1811 -201 -1043 -393 669 1875 1406 441 774 2491 1484 -753 -1178
4130 -1178 423 1733 2484 1580 441 549 1265 -269 -1604 -227 2194 2583 1509 -193 -687 431
4146 431 1102 34 -1096 965 3208 1876 0 -448 135 542 395 -123 266 1901 2294 174 -1495
4163 -1495 362 1489 957 28 22 877 2798 2127 -988 -1875 148 935 475 425 1447 2046 2256 -311
$$ packed form
4041A580L22j102o72p44J326J46j188m93J921R17j373q01K43Q05M87m81j598N29
4059a76K426l91k041p00J188J034O3n67o93L69J006j146j444O80J916l11j726
4076e13j79M1J232R26j164k272P96J490j70j097j25J245N33O2j662j375J354J000
4094A22q25k22J273Q68o70r83j050o06J871J663j334n74J201M87o20l52o91l60
4112h02J484M27o81k63J702n6k012q42O50J062J206m69r65L33J717j007k237m25
4130a178J601J310P51r04j139J08P16j534j335J377K421L89j074j702m94J118
4146D31O71j068j130K061K243j332j876m48N83M07j47n18L89J635L93k120j669
4163a495J857J127n32r29oQ55J921o71l115q87K023P87m60n0J022N99K10k567
$$ plain form
4181 -311 -2697 -1104 1770 1538 -692 -530 1150 1780 98 -2261 -2365 303 2203 455 -1704 -851
4197 -851 1287 1160 -1068 -2042 -1052 1131 1170 -1127 -2329 30 1909 283 -1499 -1563 -362 1453 420
4214 420 -1589 -1571 1182 1304 -1102 -1473 -53 1394 1170 -423 -1702 -218 1483 872 -1647 -1085 1396
4231 1396 2248 590 -1191 -1168 -17 1540 509 -1512 -737 1571 1423 -74 -946 -118 567 826 -781
4248 -781 -2197 -59 2234 1504 -506 -689 61 16 -320 -784 -766 864 2505 1070 -724 -863 -330 -416
4266 -416 -776 -458 441 1805 1752 -924 -2140 -331 951 49 -1028 -385 849 1375 512 -1920 -1301 337
4284 337 954 -537 -1168 832 1776 858 -1076 -2115 -751 1310 811 -1285 -1179 1369 1769 -227 -2163
4301 -2163 -1914 -65 1969 523 -1225 -670 951 -297 -2114 -2202 -319 1430 1478 -44 -1710 -551
$$ packed form
4181c11k386J593K874k32k230J62J680O30j682k359j04K668J900j748k159Q53
4197h51K138j27k228r74R90K183L9k297j202K359J879j626j782o4J201J815j033
4214D20k009J8K753J22k406l71J420J447k24j593j279J484J701o11k519N62K481
4231A396Q52j658j781K3J151J557j031k021P75K308j48j497q72Q28O85K59j607
4248g81j416K138K293p30k010j83P50m5l36m64J8J630J641j435j794j39N33q6
4266d16l60L18Q99J364n3k676j216J809J282r02j077O43J234N26q63k432O19J638
4284C37O17j491o31K000R44r18j934j039J364K061m99k096J06K548M00j996j936
4301b163K49J849K034j446j748N55J621j248j817q8J883J749M8j522j666J159
$$ [...]
8191a33
##END NTUPLES=NMR FID
##END=
