##TITLE=1H_TG-2265-1
 CDcl3, 8 sc, 
 19.12.2019
##JCAMPDX= 6.0         $$ Bruker NMR JCAMP-DX V2.0
##DATA TYPE= NMR FID
##DATA CLASS= NTUPLES
##ORIGIN= UXNMR, Bruker Analytische Messtechnik GmbH
##OWNER= root
$$ XWIN-NMR		Version 3.5
$$ Thu Dec 19 14:06:19 2019 Russian Standard Time (UT+4h)  she@DPX200
##.OBSERVE FREQUENCY= 200.1315
##.OBSERVE NUCLEUS= ^1H
##.DELAY= (6, 6)
##.ACQUISITION MODE= SIMULTANEOUS
##.ACQUISITION SCHEME= undefined
##.AVERAGES= 8
##.DIGITISER RES= 18
##SPECTROMETER/DATA SYSTEM= spect
##.PULSE SEQUENCE= zg30
##.SOLVENT NAME= CDCl3
##.SHIFT REFERENCE= (INTERNAL, CDCl3, 0, 15.7039)
##AUDIT TRAIL= $$ (NUMBER, WHEN, WHO, WHERE, WHAT)
$$ ##TITLE= Audit trail, XWIN-NMR		Version 3.5
$$ ##JCAMPDX= 5.01
$$ ##ORIGIN= Bruker BioSpin GmbH
$$ ##OWNER= she
$$ F:/spectra/data/she/nmr/H-F/1/audita.txt
$$ ##AUDIT TRAIL=  $$ (NUMBER, WHEN, WHO, WHERE, WHAT)
(   1,<2019-12-19 14:05:05.35 +0400>,<she>,<DPX200>,
      <created by zg, POWCHK disabled, PULCHK disabled
       configuration hash MD5:
       00 E9 B6 7A A2 85 ED C7 34 08 36 98 17 FE 4E 26
       data hash MD5: 16K
       59 1F 4D 21 0E E8 36 7B CB 12 A9 35 FC D9 39 B7>)
$$ ##END=
$$ 
$$ hash MD5
$$ 31 8D E8 A1 BC 99 98 CF 49 25 7C 96 6F AA E9 35
##$RELAX= 
##$RELAX= 
##$RELAX= 
##$RELAX= 
##$RELAX= 
##$RELAX= 
$$ Bruker specific parameters
$$ --------------------------
##$DU= <F:/spectra>
##$EXPNO= 1
##$NAME= <H-F>
##$PROCNO= 1
##$TYPE= <nmr>
##$USER= <she>
##$AMP= (0..31)
100 100 100 100 100 100 100 100 100 100 100 100 100 100 100 100 100 100 
100 100 100 100 100 100 100 100 100 100 100 100 100 100 
##$AQSEQ= 0
##$AQ_mod= 1
##$AUNM= <au_zg>
##$AUTOPOS= <>
##$BF1= 200.13
##$BF2= 200.13
##$BF3= 200.13
##$BF4= 200.13
##$BF5= 200.13
##$BF6= 200.13
##$BF7= 200.13
##$BF8= 200.13
##$BYTORDA= 1
##$CFDGTYP= 0
##$CFRGTYP= 5
##$CHEMSTR= <none>
##$CNST= (0..31)
1 1 145 1 1 1 1 1 1 1 1 1 1 1 1 1 1 1 1 1 1 1 1 1 1 1 1 1 1 1 1 1 
##$CPDPRG= <>
##$CPDPRG1= <>
##$CPDPRG2= <>
##$CPDPRG3= <>
##$CPDPRG4= <mlev>
##$CPDPRG5= <mlev>
##$CPDPRG6= <mlev>
##$CPDPRG7= <mlev>
##$CPDPRG8= <mlev>
##$CPDPRGB= <>
##$CPDPRGT= <>
##$D= (0..31)
0 1.2 0 0 0 0 0 0 0 0.06 0 0.03 0 0 0 0 0.0002 0 0 0 0 0 0 0 0 0 0 0 0 
0 0 0 
##$DATE= 1576749904
##$DBL= (0..7)
120 120 120 120 120 120 120 120 
##$DBP= (0..7)
150 150 150 150 150 150 150 150 
##$DBP07= 0
##$DBPNAM0= <>
##$DBPNAM1= <>
##$DBPNAM2= <>
##$DBPNAM3= <>
##$DBPNAM4= <>
##$DBPNAM5= <>
##$DBPNAM6= <>
##$DBPNAM7= <>
##$DBPOAL= (0..7)
0.5 0.5 0.5 0.5 0.5 0.5 0.5 0.5 
##$DBPOFFS= (0..7)
0 0 0 0 0 0 0 0 
##$DE= 6
##$DECBNUC= <off>
##$DECIM= 24
##$DECNUC= <off>
##$DECSTAT= 4
##$DIGMOD= 1
##$DIGTYP= 9
##$DL= (0..7)
0 120 120 120 120 120 120 120 
##$DP= (0..7)
150 150 150 150 150 150 150 150 
##$DP07= 0
##$DPNAME0= <>
##$DPNAME1= <>
##$DPNAME2= <>
##$DPNAME3= <>
##$DPNAME4= <>
##$DPNAME5= <>
##$DPNAME6= <>
##$DPNAME7= <>
##$DPOAL= (0..7)
0.5 0.5 0.5 0.5 0.5 0.5 0.5 0.5 
##$DPOFFS= (0..7)
0 0 0 0 0 0 0 0 
##$DQDMODE= 0
##$DR= 18
##$DS= 0
##$DSLIST= <SSSSSSSSSSSSSSS>
$$ [...]
##$SUBNAM2= <"">
##$SUBNAM3= <"">
##$SUBNAM4= <"">
##$SUBNAM5= <"">
##$SUBNAM6= <"">
##$SUBNAM7= <"">
##$SUBNAM8= <"">
##$SUBNAM9= <"">
##$SW= 24.9337058887773
##$SWIBOX= (0..15)
0 0 2 0 0 0 0 0 0 0 0 0 0 0 0 0 
##$SW_h= 4990.01996007984
##$TD= 16384
##$TD0= 1
##$TE= 0
##$TE2= 300
##$TE3= 300
##$TEG= 300
##$TL= (0..7)
0 120 120 120 120 120 120 120 
##$TP= (0..7)
150 150 150 150 150 150 150 150 
##$TP07= 0
##$TPNAME0= <>
##$TPNAME1= <>
##$TPNAME2= <>
##$TPNAME3= <>
##$TPNAME4= <>
##$TPNAME5= <>
##$TPNAME6= <>
##$TPNAME7= <>
##$TPOAL= (0..7)
0.5 0.5 0.5 0.5 0.5 0.5 0.5 0.5 
##$TPOFFS= (0..7)
0 0 0 0 0 0 0 0 
##$TUNHIN= 0
##$TUNHOUT= 0
##$TUNXOUT= 0
##$USERA1= <user>
##$USERA2= <user>
##$USERA3= <user>
##$USERA4= <user>
##$USERA5= <user>
##$V9= 5
##$VALIST= <valist>
##$VCLIST= <CCCCCCCCCCCCCCC>
##$VD= 0
##$VDLIST= <DDDDDDDDDDDDDDD>
##$VPLIST= <PPPPPPPPPPPPPPP>
##$VTLIST= <TTTTTTTTTTTTTTT>
##$WBST= 1024
##$WBSW= 4
##$XGAIN= (0..3)
0 0 0 0 
##$XL= 0
##$YL= 0
##$YMAX_a= 204462
##$YMIN_a= -142981
##$ZGOPTNS= <>
##$ZL1= 120
##$ZL2= 120
##$ZL3= 120
##$ZL4= 120
##$ABSF1= 10
##$ABSF2= 0
##$ABSG= 5
##$ABSL= 3
##$ALPHA= 0
##$AQORDER= 0
##$ASSFAC= 0
##$ASSFACI= 0
##$ASSFACX= 0
##$ASSWID= 0
##$AUNMP= <proc_1d>
##$AZFE= 0.1
##$AZFW= 0.1
##$BCFW= 1
##$BC_mod= 2
##$BYTORDP= 1
##$COROFFS= 0
##$CY= 11.3945322036743
##$DATMOD= 1
##$DC= 2
##$DFILT= <>
##$DTYPP= 0
##$F1P= 16.9975609425685
##$F2P= -3.02152046262296
##$FCOR= 0.5
##$FTSIZE= 0
##$FT_mod= 4
##$GAMMA= 1
##$GB= 0.15
##$INTBC= 1
##$INTSCL= 1
##$ISEN= 128
##$LB= 0.24
##$LEV0= 0
##$LPBIN= 0
##$MAXI= 10000
##$MC2= 0
##$MEAN= 0
##$ME_mod= 0
##$MI= 1.114404
##$NCOEF= 0
##$NC_proc= 0
##$NLEV= 6
##$NOISF1= 3.799351
##$NOISF2= 2.8
##$NSP= 1
##$NTH_PI= 0
##$NZP= 0
##$OFFSET= 15.70392
##$PC= 1
##$PHC0= -10147.77
##$PHC1= 15.60082
##$PH_mod= 1
##$PKNL= yes
##$PPARMOD= 0
##$PSCAL= 0
##$PSIGN= 0
##$REVERSE= no
##$SF= 200.130013532006
##$SI= 16384
##$SIGF1= 3
##$SIGF2= 2
##$SINO= 400
##$SIOLD= 16384
##$SREGLST= <1H.CDCl3>
##$SSB= 0
##$STSI= 0
##$STSR= 0
##$SW_p= 3612.71676300578
##$SYMM= 0
##$S_DEV= 0
##$TDeff= 0
##$TDoff= 0
##$TI= <>
##$TILT= no
##$TM1= 0
##$TM2= 0
##$TOPLEV= 0
##$USERP1= <user>
##$USERP2= <user>
##$USERP3= <user>
##$USERP4= <user>
##$USERP5= <user>
##$WDW= 1
##$XDIM= 8192
##$YMAX_p= 0
##$YMIN_p= 0
$$ End of Bruker specific parameters
$$ ---------------------------------
##NTUPLES= NMR FID
##VAR_NAME=  TIME,          FID/REAL,        FID/IMAG
##SYMBOL=    X,             R,               I
##VAR_TYPE=  INDEPENDENT,   DEPENDENT,       DEPENDENT
##VAR_FORM=  AFFN,          ASDF,            ASDF
##VAR_DIM=   8192,          8192,            8192
##UNITS=     SECONDS,       ARBITRARY UNITS, ARBITRARY UNITS
##FACTOR=    0.0002004,     1,               1
##FIRST=     0,             0,               0
##LAST=      1.6414764,     0,               0
##MIN=       0,             -142981,         0
##MAX=       1.6414764,     204462,          0
$$ Real data points
##PAGE= N=1
##DATA TABLE= (X++(R..R)), XYDATA
$$ [...]
$$ plain form
2368 3294 4971 -2015 -5101 -170 3718 2421 851 -2388 -4068 865 4780 21 -3930 -1635 324
2383 324 291 1597 559 -1936 -625 2077 539 -140 1834 745 -2092 166 2738 800 -326 -475
2399 -475 -2384 -308 4092 1763 -3524 -1979 1755 2373 2266 870 -2855 -1079 4735 4444 -1433 -2411
2415 -2411 139 933 2353 1921 -1993 -3058 1782 2762 -92 378 900 -859 627 2682 1427 -81
2431 -81 1126 107 -1677 1589 3366 -761 -2902 -430 918 1657 2138 -1096 -4115 735 5210 1878
2447 1878 -1855 -1249 45 1464 4001 141 -4363 -1338 3017 1560 -1192 -789 -1383 -649 2017 1628
2463 1628 -2109 -1097 1434 -84 -70 2298 422 -2100 -630 428 -70 1157 831 -3619 -2990 2356
2479 2356 2650 -1100 -2218 -2006 -674 3316 3197 -2891 -4412 855 3148 782 -860 -2276 -3132 892
$$ packed form
2368C294J677o986l086M931L888j297j570l239j680M933L915m759l951K295J959
2383C24l3J306j038k495J311K702j538o79J974j089k837K258K572j938j126j49
2399d75j909K076M400k329n287J545L734O18j07j396l725J776N814k91n877r78
2415b411K550P94J420m32l914j065M840R80k854M70N22j759J486K055j255j508
2431h1J207j019j784L266J777m127k141K472J348P39M81l234l019M850M475l332
2447A878l733O06J294J419K537l860m504L025M355j457k752M03n94P34K666l89
2463A628l737J012K531j518J4K368j876k522J470J058m98J227l26m450O29N346
2479B356K94l750j118K12J332L990j19o088j521N267K293k366j642j416q56M024
$$ plain form
2495 892 3286 -650 -3635 -602 95 -490 1136 686 -2157 -1078 910 87 -345 1758 -424 -3278
2511 -3278 -739 1938 478 -1322 -1471 -2557 -139 3572 1078 -4073 -2494 1912 1887 1024 -688 -2715
2527 -2715 -1169 3339 2491 -2683 -2594 234 481 774 853 -2077 -1862 1821 1555 -729 2 1266 -607
2544 -607 -615 1811 1141 -213 25 -1006 -1916 1435 3160 -1060 -3468 -464 1801 2272 1674 -1610 -3544
2561 -3544 1371 4790 1280 -2271 -1415 582 1919 2732 -312 -3815 -723 3097 996 -1119 -222 -641
2577 -641 -467 1669 1177 -1227 262 1870 -386 -758 1958 1273 -1517 -822 -26 -270 1474 1358 -2723
2594 -2723 -2623 2380 3048 -519 -1529 -902 170 2873 2514 -2231 -3801 1371 3074 605 -1058 -2025
2610 -2025 -1814 1267 2944 -988 -2962 -422 1155 40 519 497 -1496 -789 1048 -16 -526 783
$$ packed form
2495H92K394l936k985L033O97n85J626m50k843J079J988q23m32K103k182k854
2511c278K539K677j460j800j49j086K418L711k494n151J579M406k5q63j712k027
2527b715J546M508q48n174Q9K828K47K93P9k930K15L683k66k284P31J264j873
2544f07qK426o70j354K38j031r10L351J725m220k408L004K265M71n98l284j934
2561c544M915L419l510l551Q56J997J337Q13l044l503L092L820k101k115Q97m19
2577f41J74K136m92k404J489J608k256l72K716o85k790O95P96k44J744j16m081
2594b723J00N003O68l567j010O27J072K703l59m745j570N172J703k469j663r67
2610b025K11L081J677l932j974K540J577j115M79k2j993P07J837j064n10J309
$$ plain form
2626 783 -563 -3096 -665 2060 140 -1267 -1453 -1999 -129 3053 735 -3726 -1979 1651 1847 744
2642 744 -1065 -2882 -1717 2420 1623 -2662 -2705 -155 -136 537 678 -1579 -2458 893 1152 -941 -147 382
2660 382 -1452 -987 999 373 -918 -552 -1118 -1925 635 2115 -1391 -2918 -216 1397 1118 539 -1595
2677 -1595 -3011 1055 3341 124 -2915 -1313 -121 722 1606 -606 -3028 -824 1976 652 -1112
2692 -1112 20 -535 -686 1334 1252 -726 -479 222 -1106 -497 2089 849 -2344 -1652 333 127 1205
2709 1205 621 -2510 -1980 2545 2759 -731 -1571 -578 342 1881 1574 -2481 -2641 902 2000 -251 -1056
2726 -1056 -977 -1248 931 1677 -775 -1894 405 1063 -97 557 967 -1726 -699 612 45 -318 447
2743 447 -769 -2833 -81 2449 108 -1460 -1097 -605 1029 2824 -27 -3463 -1790 2069 1515 -294
$$ packed form
2626G83j346k533K431K725j920j407j86n46J870L182k318m461J747L630J96j103
2642G44j809j817J165M137p97m285m3K550J9O73J41k257q79L351K59k093P94N29
2660C82j834M65J986o26j291L66n66q07K560J480l506j527K702J613k79n79k134
2677a595j416M066K286l217l039J602J192Q43Q84k212k422K204K800j324j764
2692a112J132n55j51K020q2j978K47P01j328O09K586j240l193O92J985k06J078
2709A205n84l131N30M525K14l490q40R93R20J539l07m055j60L543J098k251q05
2726a056P9k71K179P46k452j119K299O58j160O54M10k693J027J311n67l63P65
2743D47j216k064K752K530k341j568L63M92J634J795k851l436J673L859n54j809
$$ plain form
2759 -294 -960 -2372 -812 2291 1206 -2105 -2004 -57 339 188 1148 -910 -1620 733 891 -666 236
2776 236 600 -1712 -1517 1271 906 -763 -886 -1119 -1199 1585 1977 -1589 -2636 460 2148 844 268
2793 268 -1277 -2439 1136 3097 -331 -2741 -759 510 360 874 -602 -2218 -72 1878 389 -978
2809 -978 446 305 -559 504 859 -586 -393 175 -1507 -483 2027 556 -2036 -1675 622 1008 1601
2826 1601 166 -2387 -1596 2726 2405 -1153 -2136 -541 181 1478 1096 -2230 -2333 1313 1829 -577 -1120
2843 -1120 -415 -403 802 1559 -352 -1145 677 926 -572 -88 950 -317 -832 366 170 205 1136 -303
2861 -303 -1799 133 2440 611 -1132 -514 -328 1049 2699 283 -2776 -805 2180 1582 -239 -1095
2877 -1095 -1429 -128 2490 1467 -1893 -1431 766 1244 667 903 -265 -1204 645 1217 318 9 828
$$ packed form
2759b94o66j412J560L103j085l311J01J947L96j51R60k058p10K353J58j557R02
2776B36L64k312J95K788l65j669j23k33q0K784L92l566j047L096J688j304n76
2793B68j545j162L575J961l428k410J982J269j50N14j476j616K146J950j489j367
2809i78J424j41q64J063L55j445J93N68j682J024K510j471k592L61K297L86N93
2826A601j435k553P91M322l21l558r83J595P22J297l82l326j03L646N16k406n43
2843a120P05J2J205P57j911p93J822K49j498M84J038j267n15J198j96L5R31j439
2861c03j496J932K307j829j743O18J86J377J650k416l059J971K985n98j821q56
2877a095l34J301K618j023l360M62K197M78n77K36j168r39J849N72q99l09Q19
$$ plain form
2894 828 -1284 -795 1571 1232 -452 -448 -343 -537 1858 2059 -1040 -1988 493 2138 1023 233 -1142 -1524
2912 -1524 1031 2437 308 -2004 -409 619 624 1554 196 -1622 -83 1634 742 -96 583 178 -660
2929 -660 953 1429 -168 -126 35 -503 -453 1811 899 -1667 -578 1265 1189 1034 300 -1581 -628 2612
2947 2612 2044 -1210 -1773 -108 444 1046 962 -1208 -1877 1281 1706 -328 -729 136 -216 728 1094 -191
2965 -191 -1049 514 209 -840 287 1193 -771 -1178 184 545 323 731 -380 -1631 552 1999 162
2982 162 -1414 -767 106 674 1640 -373 -2665 -561 1708 798 -854 -878 -989 -363 1556 425 -1665
2999 -1665 -891 390 -16 57 640 -379 -1309 -37 592 -187 -180 -36 -1738 -1149 1212 959 -1154 -1271 -866
3018 -866 -71 1254 1262 -1679 -2357 600 1479 354 -702 -1325 -1582 583 1611 -536 -2209 -384 573
$$ packed form
2894H28k112M89K366l39j684MJ05j94K395K01l099r48K481J645j115p90j375l82
2912a524K555J406k129k312J595J028NR30j358j818J539J717q92q38O79m05q38
2929f60J613M76j597M2J61n38N0K264r12k566J089J843p6j55p34j881R53L240
2947B612n68l254n63J665N52O02q4k170o69L158M25k034m01Q65l52R44L66j285
2965a91q58J563l05j049J127R06j964m07J362L61k22M08j111j251K183J447j837
2982A62j576O47Q73N68R66k013k292K104K269r10j652k4j11O26J919j131k090
2999a665P74J281m06P3N83j019r30J272O29p79PJ44j702N89K361k53k113j17M05
3018h66P95J325Qk941o78K957Q79j125j056o23k57K165J028k147j673J825R57
$$ plain form
3035 573 68 728 114 -1193 -495 760 -90 -257 593 -367 -1415 -280 1075 -54 -752 -228 -1056 -302
3053 -302 1692 551 -1963 -800 1191 1018 405 -136 -1567 -338 1961 1388 -1388 -1393 452 663 910
3070 910 481 -1234 -1037 1274 1638 -178 -169 333 -21 243 769 36 -768 362 429 -654 518 1396 -389
3089 -389 -953 444 689 1047 1313 -312 -1182 694 2285 725 -1032 -729 557 968 1580 -382 -2064
3106 -2064 -126 1691 978 -793 -614 -374 127 1518 1016 -1252 -572 1405 828 -200 600 -143 -958
3123 -958 266 721 -137 127 280 -878 -519 1213 1115 -565 -597 -167 96 1426 1023 -1283 -1870 581
3141 581 1638 152 -484 -910 -1027 884 1738 95 -1501 -202 1062 456 831 213 -1344 -648 1032
3158 1032 559 -342 379 -282 -800 350 1137 110 -655 -500 -596 210 1543 618 -1429 -886 1062 845
$$ packed form
3035E73n05O60o14j307O98J255q50j67Q50r60j048J135J355j129o98N24q28P54
3053c02J994j141k514J163J991j73o13n41j431J229K299n73k776nJ845K11K47
3070I10m29j715J97K311L64j816RN02l54K64N26p33q04J130O7j083J172Q78j785
3089c89n64J397K45L58K66j625q70J876J591j560j757L03J286M11O12j962j682
3106b064J938J817p13j771J79K40N01J391n02k268O80J977n77j028Q00p43q15
3123i58J224M55q58K64J53j158L59J732r8j680l2M30K63J330m03k306n87K451
3141E81J057j486o36m26j17J911Q54j643j596J299J264o06L75o18j557O96J680
3158A032m73r01P21o61n18J150P87j027p65J55r6Q06J333r25k047N43J948k17
$$ plain form
3176 845 185 -197 -1355 -789 1507 1085 -1407 -806 988 580 603 465 -908 -973 848 882 -546 -176 377
3195 377 -504 12 858 113 -391 368 196 -517 469 1120 -474 -811 165 570 476 336 -252 -772 874 1993
3215 1993 259 -1274 -213 276 507 923 -395 -1641 -319 1334 686 -504 -209 -113 -88 1076 543
3232 543 -652 -469 664 -262 -112 633 5 -1172 -61 572 29 136 268 -795 -332 1270 887 -531
3250 -531 -735 -90 271 858 764 -994 -1543 737 1002 254 -350 -599 -664 538 1350 -239 -1249 355 763
3269 763 403 366 428 -1038 -550 716 152 26 276 -202 -1106 250 1423 234 -741 -217 -166 232 1188
3288 1188 282 -1487 -549 1237 868 -49 -313 -1248 -324 1155 948 -780 -836 150 322 390 318 -681 -695 989
3308 989 669 -105 13 402 -319 -432 346 450 -280 -101 126 -450 351 1011 -180 -996 436 1017 263
$$ packed form
3176H45o60l82j158N66K296m22k492O01J794m08K3j38j373o5J821L4j428L70N53
3195C77q81N16Q46p45n04P59j72p13R86O51j594l37R76M05r4j40n88n20J646J119
3215A993j734j533J061M89K31M16j318j246J322J653o48j190K95R6K5J164n33
3232E43j195J83J133r26J50P45o28j177J111O33n43J07J32j063M63J602l83j418
3250e31k04O45L61N87r4j758n49K280K65p48o04k49o5J202Q12j589j010J604M08
3269G63l60l7O2j466M88J266n64j26K50m78r04J356J173j189r75N24N1L98R56
3288A188r06j769R38J786l69r17k64r35R24J479k07j728n6R86J72O8p2r99j4J684
3308I89l20p74J18L89p21j13P78J04p30J79K27n76Q01O60j191q16J432N81p54
$$ plain form
3327 263 373 -453 -826 335 1540 -23 -1204 -428 499 745 665 -259 -1134 -225 1404 355 -472 34
3345 34 106 113 801 618 -288 -97 890 46 -343 766 250 -584 -59 579 29 582 238 -869 -643 1242
3365 1242 1180 -370 -655 -206 378 895 1049 -898 -1314 785 1494 91 -406 -450 -405 522 1443 -119 -1032
3384 -1032 176 503 203 233 136 -589 -251 1038 547 -519 162 -209 -708 309 1325 -117 -585 -158
3402 -158 -78 392 1149 27 -1310 -449 942 560 -224 -205 -547 -189 901 994 -656 -861 485 615 94
3421 94 292 -444 -1034 89 716 -22 -69 139 -492 -640 797 520 -528 -379 -158 -457 475 700 -411
3440 -411 -592 2 791 -71 -71 -732 -1015 216 1192 -106 -1305 -641 659 41 699 -348 -884 -267 863
3459 863 176 -538 146 -156 -258 204 298 -637 -496 41 62 29 279 87 -864 -195 468 75 234 -210 -538
$$ packed form
3327B63J10q26l73J161J205j563j181P76R27K46q0r24q75R09J629j049q27N06
3345C4P2PO88j83r06J91R87q44l89J109n16q34N25O38n50N53l44j107K26J885
3365A242o2j550k85M49N84N17J54j947m16K099P09j403m97m4M5R27R21j562r13
3384a032J208L27l00L0r7p25L38J289m91j066O81l71m99J017J016j442m68M27
3402a58Q0M70P57j122j337Q61J391l82p84J9l42L58J090R3j650k05J346J30n21
3421I4J98p36n90J123O27p38m7K08o31j48J437k77j048J49K21k99R32K25j111
3440d11j81N94P89q62%o61k83J231R76j298j199O64J300o18O58j047n36O17J130
3459H63o87p14O84l02j02M62R4r35J41N37K1l3K50j92r51O69O63l93J59m44l28
$$ plain form
3480 -538 -205 733 847 -773 -1003 -307 388 375 441 -1020 -1159 328 1016 -25 -460 -322 -183 443 943
3499 943 -74 -607 -67 205 -184 159 775 -456 -444 224 421 -234 205 -219 -633 20 1063 30 -583
3518 -583 -160 304 513 717 176 -998 -120 1346 742 -274 -126 -445 -104 1058 818 -734 -202 397
3536 397 586 385 594 -30 -601 304 454 319 162 495 -105 -55 676 1111 -273 144 149 198 888 1018 -138
3557 -138 -1046 452 981 604 222 -289 -250 600 1429 301 -907 320 800 596 740 402 -399 95 1191
3576 1191 414 -254 145 273 -116 -18 548 -72 130 308 279 163 600 300 -311 154 615 695 570 186 -180
3597 -180 -397 778 1103 -497 -467 65 328 591 575 -632 -776 821 1214 -83 -424 185 -344 303 1088
3616 1088 78 -418 132 505 -27 -281 541 -117 -248 149 278 -156 718 -122 -348 106 981 112 -518
$$ packed form
3480e38L33R38J14j620k30O96O95j3O6j461j39J487O88j041m35J38J39O26N00
3499I43j017n33N40K72l89L43O16j231J2O68J97o55M39m24m14O53J043j033o13
3518e83M23M64K09K04n41j174Q78J466o04j016J48l19L41J162k40j552N32N99
3536C97J89k01K09o24n71R05J50j35j57L33o00N0P31M35j384M17NM9O90J30j156
3557a38r08J498N29l77l82n11L9Q50Q29j128j208J227M80k04J44l38q01M94J096
3576A191p77o68L99J28l89R8N66o20K02J78k9j16M37l00o11M65M61Q0j25l84l66
3597a80k17J175L25j600L0N32K63K63j6j207j44J597L93j297l41O09n29O47P85
3616A088j010m96N50L73n32k54Q22o58j31L97J29m34Q74q40k26M54Q75q69o30
$$ plain form
3635 -518 -326 -286 170 753 266 -1071 -458 665 241 -291 -180 -626 -132 784 581 -309 -567 131 210 -135
3655 -135 374 -447 -813 -139 306 -254 -488 -223 -438 -102 407 482 -345 -216 -225 187 275 40 -468 -1121 29
3676 29 1010 142 -628 -629 -666 80 617 138 -1039 -49 85 179 -236 111 -764 -517 400 166 -337 -385 -184 -445
3698 -445 84 545 -588 -371 -114 -364 -50 497 52 -916 -658 260 434 18 -223 -594 -383 597 397 -810
3718 -810 -865 -87 258 375 228 -498 -912 503 700 46 -189 -143 -267 51 493 -60 -439 -37 356 77
3738 77 12 486 -339 -677 592 600 55 5 44 -503 195 986 369 -678 -203 331 185 364 -49 -866 -497
3759 -497 734 693 -696 -399 -309 -73 811 412 -449 -453 472 435 -140 382 1 -313 106 294 29 -118 233
3780 233 -303 -271 474 678 -790 -579 17 207 458 316 -541 -734 274 835 7 -170 -444 -148 809 717
$$ packed form
3635e18J92M0M56N83m87j337O13J123m24n32J11m46M94R16k03q90k58O98P9l45
3655a35N09q21l66O74M45n60k34K65k15L36N09P5q27J29rM12Q8k35n08o53J150
3676B9R81q68p70jl7P46N37m79j177R90J34R4m15L47q75K47R17k34n03m8K01k61
3698d45N29M61j133K17K57k50L14N47m45r68K58R18J74m16k41l71K11R80k00j207
3718h10n5P78L45J17j47p26m14J415J97o54k35M6j24L18M42n53l79M02L93k79
3738G7o5M74q25l38J269Qn45n0L9n47O98P91o17j047M75N34j46J79m13q17L69
3759d97J231m1j389K97R0K36Q84l99q61mR25l7n75N22l81l14M19J88k65j47L51
3780B33n36L2P45K04j468K11N96J90K51j42q57j93J008N61q28j77k74K96R57r2
$$ plain form
3800 717 -190 -1304 24 459 75 -54 -61 -396 -470 393 149 -375 -6 -5 -515 31 612 -225 -507 -78 -42
3821 -42 162 312 -90 -637 -652 442 527 66 -28 -546 -142 533 662 -666 -887 168 293 242 100 -472 -805
3842 -805 493 624 -364 -430 117 -98 -92 251 81 -397 193 182 -159 0 346 -146 -421 -7 147 64 124 -149
3864 -149 -543 102 712 -13 -746 -261 207 210 794 -167 -1018 -226 941 633 184 -268 -231 139 358 468 -274
3885 -274 -452 278 303 -105 -79 110 -535 -299 419 -14 -466 340 -58 -260 592 445 -513 -558 0 172 331
3906 331 277 -541 -804 24 793 -27 -506 -481 -388 131 430 -241 -663 -257 313 194 -131 129 -496 -472 448
3927 448 259 -427 252 20 -505 335 694 -210 -395 -327 102 120 461 354 -996 -299 446 639 -97 -258
3947 -258 -619 -399 365 575 -523 -774 202 204 36 -77 -287 -599 187 594 -117 -277 112 -275 -455 238
$$ packed form
3800G17r07j114J328M35l84j29pl35p4Q63k44n24L69Jn10N46N81q37k82M29L6
3821d2K04J50m02n47j5J094Q5m61r4n18M04O75J29j328k21J055J25n1j42n72l33
3842h05J298J31r88o6N47k15OL43j70m78N90j1l41J59L46m92k75M14J54q3O0k73
3864a49l94O45O10p25p33M85M68LN84r61q51P92J167l08m49m52L7L70K19J10p42
3885b74j78P30K5m08K6J89o45K36P18m33m52Q06l98k02Q52j47r58m5N58J72J59
3906C31n4q18k63Q28P69q20m79K5R3N19K99o71m22M06N70j19l25K60o25K4R20
3927D48j89o86O79k32n25Q40L59r04j85O8M29J8L41j07j350O97P45J93p36j61
3947b58l61K20P64K10j098k51R76Kj68j13k10l12P86M07p11j60L89l87j80O93
$$ plain form
3967 238 44 -461 -222 108 17 268 584 -397 -737 142 421 -261 -185 -242 -228 51 591 318 -635 -329 278
3988 278 196 476 57 -642 -236 753 362 -357 87 192 -114 281 254 -296 -377 256 366 129 192 133 -566 -130
4010 -130 455 -261 51 40 -231 -137 554 237 -549 -670 53 305 533 221 -392 -485 475 1054 66 -110 80
4031 80 -57 377 509 -109 -473 -83 410 182 168 203 -315 -34 365 414 -333 -180 89 -371 500 686 219
4052 219 -544 -128 99 1 445 -5 -997 -252 793 440 96 -455 -401 81 467 609 -670 -1201 71 418
4072 418 194 349 -77 -487 179 711 -188 -392 55 -267 -240 420 190 -141 -368 -32 -113 32 648 -249 -476
4093 -476 -7 482 230 -188 -193 -502 196 790 101 -508 -462 332 175 -112 -20 -707 -229 417 92 -460 -378 210
4115 210 -439 -224 32 -361 -637 165 108 -217 136 -183 -608 -138 456 -1 -227 -59 -112 -319 231 429 -594
$$ packed form
3967B38j94n05K39L30r1K51L16r81l40Q79K79o82P6n7J4K79N40k73r53L06O07
3988B78q2K80m19o99M06R89l91p19M44J05l06L95k7n50q1O33J10k37O3n9o99M36
4010a30N85p16L12j1k71R4O91l17p86j21P23K52K28l12o13r3R60N79r88j76J90
4031H0j37M34J32o18l64L90M93k28j4L5n18K81L99M9p47J53K69m60Q71J86m67
4052B19p63M16K27r8M44m50r92P45J045l53l44n51N4M82L86J42j279n31J272L47
4072D18k24J55m26m10O66N32q99k04M47l22K7O60k30l31k27L36q1J45O16q97k27
4093d76M69M89k52m18nl09O98N94o89o09M6P94j57k87R2o87M78O46l25n52Q2N88
4115B10o49K15K56l93k76Q02n7l25L53l19m25M70N94m57k26J68n3k07N50J98j023
$$ plain form
4136 -594 -224 -10 3 255 434 -744 -869 285 588 158 -530 -147 -453 -110 517 -245 -548 -346 355 -41
4156 -41 -238 206 -419 -270 110 295 -64 -260 -266 -446 98 437 -166 -785 -153 -163 46 285 -377 -749 -632
4177 -632 482 62 -206 -145 -170 47 162 434 -950 -752 56 432 176 -237 -395 -558 -96 425 -290 -503
4197 -503 -300 -66 -341 263 354 -914 -294 -54 140 186 542 -255 -637 -136 337 269 -544 -514 -346 83 739
4218 739 14 -614 -394 62 -218 226 104 -606 -436 397 77 -186 -210 -306 -56 193 241 -125 -160 102 -3
4239 -3 -435 267 -5 -473 -319 721 -20 -78 69 -356 -215 452 343 -640 -191 200 392 296 -23 -161 -578
4260 -578 744 633 18 -431 95 -12 261 443 69 -476 -52 489 99 -115 127 -465 -532 151 648 69
4280 69 -294 -161 -159 230 466 37 -521 -85 281 231 185 -176 -482 -163 1056 371 -236 -190 -100 152 679 522
$$ packed form
4136e94L70K14J3K52J79j178j25J154L03m30o88L83l06L43O27p62l03K02P01l96
4156d1j97M44o25J49L80J85l59j96oj80N44L39o03o19O32j0K09K39o62l72J17
4177f32J114m20k68O1k5K17J15K72j384J98Q08L76k56m13j58j63M62N21p15k13
4197e03K03K34k75O04R1j268O20K40J94M6L56p97l82N01M73o8q13L0J68M29O56
4218G39p25o28K20M56k80M44j22p10J70Q33l20k63k4r6K50K49M8l66l5K62j05
4239cm32P02k72m68J54J040p41n8J47m25J41O67j09r83M49L91J92r6l19j38m17
4260e78J322j11o15m49N26j07K73J82l74n45M24N41l90k14K42n92o7O83M97n79
4280F9l63J33KL89K36m29n58M36L66n0m6l61l06L19J219o85o07M6R0K52N27j57
$$ plain form
4302 522 -589 -425 420 113 -38 144 92 -514 -134 563 -156 -246 80 -203 -227 310 346 -380 -212 -63 6
4323 6 355 490 -730 -839 -165 455 74 -181 -431 -202 97 640 -52 -737 -510 597 35 330 -97 -717
4343 -717 -164 473 -36 -474 -130 -88 -27 -72 232 104 -75 -7 -268 -3 197 192 -271 -299 590 179 -272 -80
4365 -80 -221 -480 574 346 -263 -488 130 -11 81 212 -316 -168 582 632 -117 -290 -75 328 571 355 -56
4386 -56 -474 -136 408 72 -28 150 -332 -300 451 515 -223 -156 -112 -378 203 549 -144 -512 -214 454 423 222
4408 222 255 -730 189 393 564 -643 -347 68 -15 424 299 -288 -607 20 325 43 48 -238 -386 108 441
4429 441 -48 -571 168 57 122 464 250 -130 -199 76 -61 43 278 -566 -578 -19 563 -6 -172 -121 -289
4450 -289 -179 808 0 -598 -106 359 122 271 -88 -576 300 113 346 -443 64 197 -415 193 695 -157
$$ packed form
4302E22j111J64Q45l07j51J82n2o06L80O97p19r0L26k83k4N37L6p26J68J49O9
4323FL49J35j220j09O74O20l81k55k50K29K99N43o92o85K27J107n62K95m27o20
4343g17N53O37n09m38L44M2O1m5L04j28j79O8k61K65K00nm63k8Q89m11m51J92
4365h0j41k59J054k28o09k25O18j41R2J31n28J48P50N0p49j73K15M03K43k16m11
4386e6m18L38N44l36j00J78m82L2P51O4p38O7M4k66N81L46o93l68K98O68l1k01
4408B22L3r85R19K04J71j207K96M15q3M39j25n87l19O27L05k82Nk86j48M94L33
4429D41m89n23P39j11O5L42k14l80o9K75j37J04K35q44j2N59N82n69j66N1j68
4450b89J10R87q08n98M92M65k37J49l59m88Q76j87K33p89N07J33o12O08N02q52
$$ plain form
4470 -157 -440 -91 -63 10 205 220 -627 -172 381 73 -53 -8 -213 -419 178 616 -205 -247 147 237 -5 254
4492 254 -116 -247 184 300 -102 -621 62 88 170 495 57 -391 -114 682 -143 -232 148 -243 -404 310 541
4513 541 25 -29 482 32 141 590 120 -466 74 315 -193 91 21 -333 -195 668 355 -254 -271 35 -123
4534 -123 313 309 -530 -451 342 57 27 -69 97 -263 113 166 273 33 -94 -29 -245 358 481 -166 -295 22
4556 22 -33 181 -5 -284 -492 304 529 172 -372 -284 -284 401 380 -5 -563 -4 478 -63 -16 -368 -100 -193 627
4579 627 105 -182 -76 227 -410 223 529 -338 -603 -284 66 -213 11 -89 -570 -290 589 -2 -366 -139
4599 -139 -437 85 557 344 -336 -187 80 243 -50 -54 -446 -295 -59 616 -295 -252 -9 -225 -8 231 66
4620 66 -355 -69 147 275 142 19 -52 -461 184 558 12 147 74 -122 -35 403 297 -289 -216 361 -31 51
$$ packed form
4470a57k83L49K8P3J95J5q47M55N53l08j26M5k05k06N97M38q21m2L94R0k42K59
4492B54l70j31M31J16m02n19O83K6Q2L25m38m48K77P96q25q9L80l91j61P14K31
4513E41n16n4N11m50J09M49m70n86N40K41n08K84p0l54J38Q63l13o09j7L06j58
4534a23M36mq39P9P93k85l0r6J66l60L76N3J07k40j27O5k16O03J23o47j29L17
4556B2n5K14j86k79k08P96K25l57n44Q8%O85k1l85n58N59M82n41M7l52K68r3Q20
4579F27n22k87J06L03o37O33L06q67k65L19L50k79K24j00m81K80Q79n91l64K27
4599a39k98N22M72k13o80J49K67J63k93ml92J51K36O75r11M3K43k16K17K39j65
4620F6m21K86K16J28j33j23p1m09O45L74n46J35p3j96Q7M38j06n86P3N77l92Q2
$$ plain form
4642 51 -10 -476 116 538 206 -534 -395 37 -205 317 337 -299 -211 25 603 -250 34 53 -429 -157 345 -214
4664 -214 -200 -109 117 -128 470 86 -395 -283 375 554 -32 277 -24 -395 269 484 168 -166 -75 -171 197
4685 197 244 104 -468 149 141 47 -149 22 -303 -96 258 468 -355 -113 210 153 237 225 118 -651 -169 210
4707 210 -70 135 37 -139 -263 438 422 -442 -44 -179 -137 382 366 -609 -218 169 551 -10 -47 -138 -257 176
4729 176 441 -32 -542 125 -148 -241 335 180 -278 -239 344 29 -10 -63 -284 -579 180 379 -82 -146 -67 57
4751 57 332 365 199 -660 -166 318 91 -75 140 -245 -36 583 377 -234 -77 337 -54 471 250 -143 -462
4772 -462 -83 300 71 -239 157 -417 329 197 88 -254 -54 -90 -108 552 31 -233 -326 413 363 32 177
4793 177 -249 -61 479 312 164 -322 4 -64 52 552 83 -271 -273 263 118 -319 38 113 -209 363 243
$$ packed form
4642E1o1m66N92M22l32p40J39M32k42N22K0o36Q8K36N78q53K84J9m82K72N02n59
4664b14J4R1K26k45N98l84m81J12O58J79n86L09l01l71O64K15l16l34R1r6L68
4685A97M7j40n72O17qr4j96J71l25K07L54K10q23K42L23n7Q4j2j07p69M82L79
4707B10k80K05r8j76j24P01j6q64L98j35M2N19j6r75L91L87L82n61l7r1j19M33
4729A76K65m73n10O67k73r3N76j55m58L9N83l15l9n3k21k95P59J99m61o4P9J24
4751E7K75L3j66q59M94M84k27j66K15l85K09O19k06o11J57M14l91N25k21l93l19
4772d62L79L83k29l10L96n74P46j32j09l42K00l6j8O60n21k64r3P39n0l31J45
4793A77m26J88N40j67j48m86L26o8J16N00m69l54kN36j45m37L57P5l22N72j20
$$ plain form
4814 243 -379 -36 319 -154 -71 342 33 -197 58 175 251 236 28 -365 144 559 177 -289 -248 -97 -154 606
4836 606 -26 -295 -388 441 176 32 61 11 -205 93 529 -73 -436 -92 69 274 267 249 -158 -92 -30 -30 -63 183
4860 183 -131 -492 -115 527 -2 -289 258 -18 159 528 219 -370 -35 519 49 -141 102 -307 83 280
4880 280 276 -262 -79 -111 -60 13 534 26 -240 -73 106 -56 86 206 -339 -42 370 -65 -292 -196 -109 -86 258
4903 258 386 -420 -347 510 252 -451 182 -84 -472 11 574 -68 -308 -237 233 224 309 240 -376 -40 349 130
4925 130 -95 -186 -207 -43 418 265 -163 25 -53 -244 434 374 21 -426 32 389 154 328 -3 -384 38
4946 38 284 102 -21 -103 32 33 245 321 -21 -388 155 393 -11 160 -213 -314 100 690 56 -297 -14 317
4968 317 -102 215 502 -381 -105 122 408 306 52 9 -704 129 626 110 -376 -14 -161 -157 499 -274 -317
$$ packed form
4814B43o22L43L55m73Q3M13l09k30K55J17P6j5k08l93N09M15l82m66M1J51n7P60
4836F06o32k69r3Q29k65j44K9n0k16K98M36o02l63L44J61K05pj8m07O6O2%l3K46
4860A83l14l61L77O42n29k87N47k76J77L69l09n89L35N54m70j90K43m09L90J97
4880B80mn38J83l2N1P3N21n08k66J67J79j62J42J20n45K97M12m35k27R6Q7K3L44
4903B58J28q06P3Q57k58p03O33k66l88M83N63o42k40P1M70rQ5o9o16L36L89k19
4925A30k25r1k1J64M61j53m28J88p8j91O78o0l53m47M58L57k35J74l31l81M22
4946C8K46j82j23q2J35JK12P6l42l67N43K38m04J71l73j01M14N90o34l53K83L31
4968C17m19L17K87q83K76K27K86j02k54m3p13Q33M97n16m86L62j47MO56p73m3
$$ plain form
4989 -317 -138 429 92 234 194 -384 -98 350 268 -119 34 129 134 -125 212 -112 -38 204 92 -81 -241 -138
5011 -138 -362 109 480 25 -169 -37 -89 53 353 225 -303 -391 -77 148 39 -15 -233 -52 96 131 -202
5032 -202 -91 20 -178 232 23 286 -307 -20 391 93 -44 180 -31 -387 142 436 -151 45 40 -98 303
5053 303 383 -51 -576 -102 522 162 26 -5 -370 -121 596 -47 -213 50 248 124 72 99 -433 -435 335 467
5075 467 -22 -258 159 -106 83 337 252 -90 328 20 -112 72 68 -456 -436 186 -35 -24 -132 -268 -267 65
5097 65 456 107 -385 103 -72 257 313 160 -607 -302 518 -64 103 -125 -51 -85 265 323 -199 -140 -133 -55 255
5120 255 69 -71 47 260 407 141 326 -52 -144 -86 398 157 103 -106 -10 -237 67 388 -452 -334 245
5141 245 449 -119 -74 -395 -565 -12 266 -16 -331 80 -219 -193 41 -319 -376 -171 440 -160 -209 -142 -125 -210
$$ packed form
4989c17J79N67l37J42m0n78K86M48q2l87J53R5Nk59L37l24P4K42j12j73j60J03
5011a38k24M71L71m55j94J32n2J42L00j28n28q8L14K25j09n4k18J81J48L5l33
5032b02J11J11j98M10k09K63n93K87M11k98j37K24k11l56N29K94n87J96nj38M01
5053C03Q0m34n25M74O24l60j36l1l65K49P17o43j66K63J98j24n2K7n32kP70J32
5075D67m89k36M17k65J89K54q5l42M18l08j32J84mn24K0O22k21J1j08j36JL32
5097F5L91l49m92M88j75L29N6j53p67L05Q20n82J67k28P4l4L50N8n22N9PP8L10
5120B55j86j40J18K13J47k66J85l78r2N8M84k41n4k09R6k27L04L21q40J18N79
5141B45K04n68M5l21j70N53K78k82l15M11k99K6K34l60n7K05O11o00m9O7J7q5
$$ plain form
5163 -210 158 211 -215 -157 -80 -357 254 430 147 -320 -36 81 15 84 -15 113 -148 269 224 -311 -174 44
5185 44 -383 192 38 -486 -279 -86 266 -95 93 55 -237 259 121 -67 -521 -320 7 8 316 239 -388 -177
5207 -177 317 -9 -139 69 34 -399 92 264 -262 -485 -74 -155 64 11 -109 -300 -158 129 161 -140 48
5228 48 -358 -271 144 247 -206 -111 -40 -26 -35 416 -119 -342 170 154 143 -94 -103 -293 -50 532 550 -299 77 97
5252 97 -165 208 41 -706 -370 25 20 -182 -92 30 -40 178 440 -98 -160 -18 27 -34 91 191 -282 133 313
5275 313 128 58 191 -279 -235 -135 215 -69 -365 -1 91 -114 107 53 -259 124 340 20 -69 -90 -351 -141
5297 -141 436 208 -166 -266 150 -40 13 -40 104 -197 76 -114 -147 28 -149 -267 25 412 290 -452 -201
5318 -201 228 261 458 120 -412 -141 290 195 35 133 -254 -57 110 524 37 -309 70 -108 263 133 -107
$$ packed form
5163b10L68N3m26N8P7k77O11J76k83m67K84J17o6O9r9J28k61M17m5n35J37K18
5185D4m27N75j54n24K07J93L52l61J88l8k92M96j38j88m54K01L27JL08p7o27K11
5207a77M94l26j30K08l5m33M91J72n26k23M11q1K19n3j20j91J42K87L2l01J88
5228D8m06Q7M15J03m53R5P1J4rM51n35k23N12j6j1k37rj90K43N82J8q49L76K0
5252I7k62L73j67p47L36L95nk02R0J22p0K18K62n38o2J42M5o1J25J00m73M15J80
5275C13j85p0J33m70M4J00L50k84k96L64R2k05K21n4l12L83K16l20q9k1k61K10
5297a41N77k28l74j00M16j90N3n3J44l01K73j90l3J75j77j18K92L87j22p42K51
5318b01M29L3J97l38n32K71M31r5j60R8l87J97J67M14m87l46L79j78L71j30k40
$$ plain form
5339 -107 -523 -241 219 11 121 -311 47 -316 416 547 -84 78 182 47 104 212 -46 -738 -209 85
5359 85 -263 -282 223 -168 -106 284 107 -291 -203 135 -167 201 62 -126 -356 280 149 6 183 -380 -272
5380 -272 197 547 -190 -375 -270 96 -208 -130 -18 -288 -33 266 -68 54 -203 -177 -73 -6 229 -147 -352
5401 -352 -72 -58 -141 80 -143 -480 -134 102 56 -6 28 -219 -263 271 29 -300 -35 115 108 61 194 -137 -152
5424 -152 -40 287 198 -63 -212 -461 -70 567 -69 -60 65 110 -31 385 -1 -311 -242 55 23 -291 60 -113
5446 -113 -135 93 302 -91 -57 -332 177 -230 3 -158 -131 -198 270 51 136 -177 -35 -296 377 121 -125 234
5468 234 214 -24 -123 222 -194 -105 -68 115 123 -92 -232 -321 50 704 -145 83 -40 -21 -2 350 -80 -466 -241
5491 -241 72 121 -201 -72 93 -238 289 145 -246 -171 86 140 -139 -33 47 -162 -515 98 135 -114 -179 271
$$ packed form
5339a07m16K82M60k08J10m32L58l63P32J31o31J62J04j35N7J08k58o92N29K94
5359H5l48j9N05l91O2L90j77l98Q8L38l02L68j39j88k30O36j31j43J77n63J08
5380b72M69L50p37j85J05L66l04P8J12k70K55K99l34J22k57K6J04O7K35l76k05
5401c52K80J4q3K21k23l37L46K36m6o2L4k47m4N34k42l29K65J50pm7J33l31j5
5424a52J12L27q9k61j49k49L91O37o36RJ25M5j41M16l86l10O9K97l2l14L51j73
5446a13k2K28K09l93L4k75N09m07K33j61K7o7M68k19Q5l13J42k61O73k56k46L59
5468B34k0k38r9L45m16Q9L7J83Qk15j40q9L71O54q49K28j23J9J9L52m30l86K25
5491b41L13M9l22J29J65l31N27j44l91P5K57N4k79J06Q0k09l53O13L7k49o5M50
$$ plain form
5513 271 -155 196 129 -184 -558 -34 68 20 153 -415 -144 -112 111 -63 -19 204 -44 65 -2 -165 -203 14
5535 14 -140 -195 224 -70 -28 -250 -131 190 22 106 -112 -85 62 156 78 -395 -64 129 -2 337 587 -576
5557 -576 -366 296 251 -111 69 113 -131 321 358 -187 -452 91 -103 157 38 -42 -355 -451 435 -95 -512 197
5579 197 -121 138 261 76 -92 -243 27 197 234 83 -70 -189 125 217 466 -38 -204 -422 -92 321 22
5600 22 -239 24 207 95 8 61 -438 -159 286 58 -189 -89 -242 -60 204 358 -45 -197 -170 57 155 73
5622 73 -58 -351 -352 70 196 -329 -3 -82 88 556 331 -252 15 -147 -11 172 336 -112 -239 48 153
5643 153 290 2 97 116 23 273 119 -50 -144 104 -155 -24 200 -326 -199 17 257 -241 -249 -139 -21 -225
5665 -225 -7 15 -560 -196 146 33 -102 -1 24 -336 270 -18 -172 -66 -83 -182 59 64 -129 -182 119 -261
$$ packed form
5513B71m26L51o7l13l74N24J02m8J33n68K71L2K23j74M4K23k48J09o7j63l8K17
5535A4j54n5M19k94M2k22J19L21j68Q4k18K7J47R4p8m73L31J93j31L39K50j163
5557e76K10O62m5l62J80M4k44M52L7n45k65N43j94K60j19q0l13r6Q86n30m17P09
5579A97l18K59J23j85j68j51K70J70L7j51j53j19L14R2K49n04j66k18L30M13k99
5600B2k61K63J83j12q7N3m99K79M45k28k47J00j53J82K64J54m03j52K7K27R8q2
5622G3j31k93jM22J26n25L26p9J70M68k25n83K67j62J36J83J64m48j27K87J05
5643A53J37k88R5J9r3K50j54j69r4K48k59J31K24n26J27K16K40m98qJ10J18k04
5665b25K18K2n75L64L42j13j35J01K5l60O06k88j54J06j7r9K41Nj93n3L01l80
$$ plain form
5687 -261 15 99 -355 -246 219 141 102 -243 -102 -9 -152 336 71 -339 -143 71 174 323 150 -24 -359
5708 -359 218 303 -53 -116 -52 -2 66 171 241 -409 118 103 96 181 85 -332 -373 175 255 -281 49 -61 -107 190 262
5733 262 -97 -392 -36 -90 -53 179 -96 -432 -323 354 130 74 13 -173 -172 -51 332 -163 -440 29 192 -59
5755 -59 334 -225 -222 165 102 -59 -212 206 -236 -54 294 -62 -70 -169 45 72 280 69 -124 -213 34 129 -258
5778 -258 -225 -119 -135 -8 418 369 -374 -91 188 204 73 590 -89 -328 372 -21 -257 -187 -23 -120 42 316
5800 316 -24 -389 90 204 -156 44 21 -74 -276 8 -27 -379 -3 66 13 0 254 -286 -46 -98 24 139
5822 139 167 75 -390 27 417 207 -233 116 -80 -121 292 -21 -301 -183 -119 47 41 93 77 -245 235 303 -19
5845 -19 108 -133 -47 62 370 -159 -485 -5 -160 33 171 312 -280 -398 45 187 -76 268 53 -371 209
$$ packed form
5687b61K76Q4m54J09M65p8l9l45J41R3j43M88k65m10J96K14J03J49j73j74l35
5708c59N77Q5l56o3O4N0O8J05P0o50N27j5pQ5r6m17m1N48Q0n36L30j10m6K97P2
5733B62l59k95L56n4L7K32k75l36J09O77k24n6o1j86JJ21L83m95k77M69J63k51
5755e9L93n59LL87o3j61j53M18m42J82L48l56qr9K14K7K08k11j93q9K47R5l87
5778b58L3J06j6J27M26m9p43K83K79J6j31N17o79k39P00l93k36P0J64r7J62K74
5800C16l40l65M79J14l60K00k3r5k02K84l5l52L76O9n3j3K54n40K40n2J22J15
5822A39K8r2m65M17L90k10m40L49j96m1M13l13k80J18O4J66oN2j6l22M80O8l22
5845a9J27k41Q6J09L08n29l26M80j55J93J38J41n92j18M43J42k63L44k15m24N80
$$ plain form
5866 209 117 -123 -281 285 117 -45 159 -143 -202 -137 320 79 -175 -367 -297 -58 323 338 -322 -3 -216 -23
5888 -23 -171 273 -442 -343 168 401 14 -23 -102 -196 197 368 123 -215 -63 231 219 52 215 -413 -149 14
5910 14 451 144 -341 -4 -235 42 62 -22 -330 -18 -119 -78 225 2 -269 -281 308 347 -373 -32 -158 -44
5932 -44 42 262 -535 -244 67 269 58 274 -419 -621 -47 475 64 -272 -140 -54 209 425 172 27 -219
5953 -219 137 -51 47 177 -205 -270 168 434 -131 -53 150 -40 140 76 -137 -253 -86 112 54 283 101 -197
5975 -197 -193 305 398 19 -216 -230 50 195 334 126 -341 393 44 85 260 14 -226 -74 113 5 -244 -146
5997 -146 -153 26 -25 255 -261 -127 299 -3 14 148 -158 -200 283 275 7 -77 2 93 188 158 154 -491 -73 29 -117
6022 -117 295 163 -9 -169 275 132 -223 -94 -119 -426 172 319 -83 -122 54 239 59 43 12 -388 -8
$$ packed form
5866B09r2k40j58N66j68j62K04l02n9O5M57k41k54j92P0K39L81J5o60L19k13J93
5888b3j48M44p15R9N11K33l87l7p9r4L93J71k45l38J52K94j2j67J63o28K64J63
5910A4M37l07m85L37k31K77K0q4l08L12j01M1L03k23k71j2N89L9p20L41j26J14
5932d4Q6K20p97K91L11K02k11K16o93k02N74N22m11l36J32Q6K63K16k53j45k46
5953b19L56j88R8J30l82o5M38K66n65P8K03j90J80o4k13j16J67J98n8K29j82k98
5975a97MM98R3l79k35j4K80J45J39k08m67P34l49M1J75k46k40J52J87j08k49R8
5997a46pJ79n1K80n16J34M26l02J7J34l06m2M83qk68q4P9R1R5l0mo45M18J02j46
6022a17M12j32j72j60M44j43l55J29k5l07N98J47m02l9J76J85j80j6l1m00L80
$$ plain form
6043 -8 146 -8 10 -177 -350 182 190 95 -720 -340 254 69 -2 406 -78 -242 116 285 -234 104 -201 234
6065 234 45 406 -59 -389 -29 -9 70 -78 -56 -225 -13 221 422 -313 -78 -206 -206 30 252 -141 -447 -54
6087 -54 125 184 275 382 -337 32 238 -33 -97 -5 -15 -356 1 249 -313 -620 243 275 -16 29 -361 -599 87
6110 87 331 174 -85 92 -20 -298 211 89 -435 -593 571 -46 13 267 -171 -329 114 -119 -158 -112 195
6131 195 -233 167 458 -27 -192 -255 117 -83 223 -55 -99 -181 -212 46 -174 -117 -137 -664 163 482 93 42
6153 42 -322 19 -45 -9 -281 -473 268 357 26 -280 186 87 -108 390 68 -330 -66 -91 240 -147 158 -210
6175 -210 -202 -27 125 -36 -232 86 -109 -85 124 80 -292 -77 190 -181 281 331 -258 -154 200 -19 -438 98
6197 98 118 -68 51 403 -59 -497 145 -86 60 -85 -3 -309 -69 453 113 -48 -74 213 2 126 392
$$ packed form
6043hJ54j54J8j87j73N32Qr5q15L80N94j85p1M08m84j64L58J69n19L38l05M35
6065B34j89L61m65l30L60K0P9j48K2j69K12K34K01p35K35j28%K36K22l93l06L93
6087e4J79N9R1J07p19L69K06k71o4R2j0l41L57K48n62l07Q63L2k91M5l90k38O86
6110H7K44j57k59J77j12k78N09j22n24j58J164o17N9K54m38j58M43k33l9M6L07
6131A95m28M00K91m85j65o3L72k00L06k78m4q2l1K58k20N7k0n27Q27L19l89n1
6153D2l64L41o4L6k72j92P41Q9l31l06M66r9j95M98l22l98K64k5L31l87L05l68
6175b10QJ75J52j61j96L18j95K4K09m4l72K15K67l71M62N0n89J04L54k19m19N36
6197I8K0j86J19L52m62m38O42k31J46j45Q2l06K40N22l40j61k6K87k11J24K66
$$ plain form
6218 392 -176 -453 -84 360 -109 75 161 -482 14 462 50 -16 132 -146 126 470 175 -404 -241 429 312
6239 312 65 305 -286 -185 294 216 -385 225 -96 159 297 240 -105 -128 -133 -30 152 -164 193 -223 -278 468
6261 468 26 -169 -177 -91 -201 179 67 -102 -417 137 38 -28 -10 -16 -188 36 310 172 -94 -102 55 -20 400 141
6285 141 -446 34 -17 338 121 -31 -14 -382 257 204 -96 92 303 -20 3 190 483 -384 59 183 -169
6306 -169 265 140 -170 -203 139 106 -306 142 -289 -30 52 542 -271 -382 98 -64 -223 77 -25 -445 252
6327 252 503 -169 -73 173 -183 -218 319 94 -363 -226 304 -140 289 171 -94 -153 158 191 -164 -281 94
6348 94 -5 -38 180 154 -286 -346 198 -54 289 16 -263 -302 217 132 -23 -8 -39 147 55 128 205 -495 58 187
6372 187 -250 193 237 -438 -52 114 154 -178 143 -200 -194 435 171 -239 -175 241 124 28 -53 31 -576 -160 174
$$ packed form
6218C92n68k77L69M44m69J84Q6o43M96M48m12o6J48k78K72L44k95n79J63O70j17
6239C12k47K40n91J01M79p8o01O10l21K55J38n7l45k3nJ03J82l16L57m16n5P46
6261D68m42j95qQ6j10L80j12j69l15N54r9o6J8oj72K24K74j38k66qJ57p5M20k59
6285A41n87M80n1L55k17j52J7l68O39n3l00J88K11l23K3J87K93q67M43J24l52
6306a69M34j25l10l3L42l3m12M48m31K59Q2M90q13j11M80j62j59L00j02m20O97
6327B52K51o72R6K46l56l5N37k25m57J37N30m44M29j18k65n9L11L3l55j17L75
6348I4r9l3K18k6m40o0N44k52L43k73k79l9N19q5j55J5l1J86r2P3P7p00N53J29
6372A87m37M43M4o75L86J66M0l32L21l43OO29k64m10O4M16j17r6q1Q4o07M16L34
$$ plain form
6395 174 -45 150 66 -48 38 -7 -5 -167 -175 142 -144 -39 239 -154 -158 105 151 -133 -7 -24 -186 -263 160 -48
6419 -48 -146 130 251 109 162 115 -188 -118 240 300 -156 -183 -199 61 44 193 -50 -334 44 249 304 93 -103
6442 -103 -336 35 275 -43 232 -8 -185 18 121 41 -65 -291 176 11 -28 258 78 -70 -35 552 61
6463 61 -5 -132 -189 181 408 -55 22 -80 84 300 105 -64 -11 -125 573 224 -20 13 -254 -345 277 324 -143
6486 -143 -345 59 212 -19 213 357 101 -130 187 383 -37 -276 381 -71 327 528 69 -94 334 362
6506 362 30 -243 -15 -24 262 270 -237 -370 -127 -337 -152 415 175 -241 -91 107 34 -45 70 -34 -194 119
6528 119 186 -153 -300 -15 -3 -46 40 28 -398 -247 447 150 163 164 -201 -165 241 317 -236 -226 170 186 29 311
6552 311 -308 -397 182 92 -263 -214 -50 -87 37 157 -17 -168 -39 125 -233 318 226 -301 -90 170 -101 105
$$ packed form
6395A74k19J95q4j14Q6m5Kj62qL17k86J05K78l93mK63M6k84J26j7j62p7M23k08
6419d8r8K76J21j42N3m7l03P0L58O0m56k7j6K60j7J49k43k84L78K05N5k11j96
6442a03k33L71K40l18K75k40j77K03J03q0j06k26M67j65l9K86j80j48L5N87m91
6463F1o6j27n7L70K27m63P7j02J64K16j95j69N3j14O98l49k44L3k67r1O22M7m67
6486a43k02M04J53k31K32J44k56k31L17J96m20k39O57m52L98K01m59j63M28K8
6506C62l32k73K28rK86Qn07j33K43k10J85N67k40m16J50J98p3p9J15j04j60L13
6528A19O7l39j47K85J2m3Q6j2m26J51O94k97J3Jl65L6M06P6n53J0L96J6j57K82
6552C11o19q9N79r0l55M9J64l7J24J20j74j51J29J64l58N51r2n27K11K60k71K06
$$ plain form
6574 105 294 -350 -243 64 245 -122 -16 -1 -225 103 270 208 -390 -248 221 225 87 158 -272 -91 147 -69
6596 -69 -232 24 -91 -163 132 385 5 -223 219 378 123 -195 -1 16 180 460 -55 -61 -99 -193 196 -142
6618 -142 393 -118 -203 49 6 121 64 56 -78 144 390 14 -37 66 289 -154 7 146 -432 94 229 20
6640 20 123 12 -221 -256 -230 257 -264 49 45 -10 223 510 -215 -475 195 88 49 -296 104 -293 -64 195
6662 195 -190 -282 -204 4 -53 -64 221 68 -137 267 325 74 -112 -122 -81 32 385 92 -242 342 60 -18 162
6685 162 118 -127 -280 171 90 119 126 70 -190 6 344 -103 -219 304 54 164 470 125 -212 156 59 37 86
6708 86 -18 -197 66 393 268 -398 135 210 28 -46 133 28 -376 -91 255 103 -128 -26 -38 -166 63
6729 63 72 -250 157 134 80 330 240 -314 -229 -3 69 198 135 -12 -416 -32 234 -107 141 -85 -22 99 477
$$ packed form
6574A05J89o44J07L07J81l67J06J5k24L28J67o2n98J42M69Mj38P1m30J81K38k16
6596f9j63K56j15p2K95K53l80k28M42J59k55l18J94J7J64K80n15ol8r4L89l38
6618a42N35n11q5K52m3J15n7qj34K22K46l76n1J03K23m43J61J39n78N26J35k09
6640B0J03j11k33l5K6M87n21L13mn5K33K87p25k60O70j07l9l45M00l97K29K59
6662A95l85r2P8K08n7j1K85j53k05M04N8k51j86j0M1J13L53k93l34N84k82p8J80
6685A62m4k45j53M51q1K9Pn6k60J96L38m47j16N23k50J10L06l45l37L68r7k2M9
6708H6j04j79K63L27j25o66N33P5j82p4J79j05m04K85L46j52k31J02j2j28K29
6729F3Rl22M07k3n4K50r0n54Q5K26P2J29o3j47m04L84K66l41K48k26O3J21L78
$$ plain form
6752 477 221 -414 -205 69 9 -211 44 -147 -185 282 -76 12 83 117 -161 -122 129 59 -388 -358 -268 -221 28
6775 28 23 -435 -87 330 -80 -212 -86 -244 -225 33 88 -40 -281 117 134 -149 29 -205 -370 -66 437 -3
6797 -3 -59 -44 11 33 151 216 -37 -345 171 170 5 205 -89 -111 153 158 -165 188 -113 -31 43 58 -56 -223 88
6822 88 120 -47 -40 -145 -93 -99 504 -67 -261 -201 89 -82 -121 278 -303 -75 214 21 17 -141 165 -278 -8 59
6846 59 190 -369 -244 -214 135 117 80 -94 -318 160 -220 7 47 57 -314 277 171 -238 -538 -71 125 34
6868 34 245 -73 -131 -14 264 403 -251 212 -29 -47 174 453 26 -213 201 -128 23 404 -58 -441 -216
6889 -216 152 40 -297 15 -121 -201 345 29 -158 -81 252 -251 211 206 -10 -303 127 91 7 -115 -26 -355
6911 -355 172 265 -91 -254 -168 49 -154 -44 -2 -153 -401 24 38 -2 145 -198 53 98 516 214 -341 66
$$ packed form
6752D77k56o35K09K74o0k20K55j91l8M67l58Q8P1L4k78L9K51p0m47L0R0M7K49
6775B8nm58L48M17m10j32J26j58J9K58N5j28k41L98J7k83J78k34j65L04N03m40
6797cn6J5N5K2J18O5k53l08N16jj65K00k94k2K64Nl23L53l01Q2P4J5j14j67L11
6822H8L2j67Pj05N2oO03n71j94O0K90j71l9L99n81K28K89j93mj58L06m43K70O7
6846E9J31n59J25L0L49j8l7j74k24M78l80K27M0J0l71N91j06m09l00M67J96r1
6868C4K11l18n8J17K78J39o54M63k41j8K21K79m27k39M14l29J51L81m62l83K25
6889b16L68j12l37L12j36q0N46l16j87P7L33n03M62nk16k93M30l6q4j22Q9l29
6911c55N27R3l56j63Q6K17k03J10M2j51k48M25J4m0J47l43K51M5M18l02n55M07
$$ plain form
6933 66 -52 -219 291 -13 -198 -216 135 91 -9 -175 -275 95 2 -54 -92 -87 199 14 -187 165 184 -249 158
6956 158 1 48 -34 -330 -112 38 435 -2 -190 -84 417 -99 192 207 93 -25 399 129 54 128 -172 -49
6978 -49 606 433 -144 -22 -262 -86 -55 228 166 -342 232 41 -48 109 -97 117 -195 224 455 -61 -167
6999 -167 -34 -54 -188 499 -50 -256 150 280 248 169 -175 -133 -56 298 149 -125 -381 -163 599 391 78 -391
7021 -391 -50 -110 143 45 -81 -247 -105 0 51 -74 182 181 69 -298 416 28 -328 -147 210 67 -103 31
7043 31 36 -149 233 490 70 75 32 138 3 274 -161 -477 -73 435 66 -94 -60 -318 -145 -125 77 -206 -94
7066 -94 83 -90 -170 278 -236 -83 216 190 -417 -8 -44 -173 -110 208 155 86 -221 -61 -77 -332 389 -339 -154
7089 -154 104 -218 -206 -85 -57 -232 70 606 35 -389 281 -150 -97 -23 155 -372 -32 412 32 26 164 -127
$$ packed form
6933F6j18j67N10l04j85j8L51m4j00j66j00L70r3n6l8NK86j85k01L52J9m33M07
6956A58j57M7q2k96K18J50L97m37j88J06N01n16K91J5j14j18M24k70p5P4l00J23
6978d9O55j73n77J22k40J76L1K83o2n08N74j91q9J57k06K14l12M19K31n16j06
6999a67J33k0j34O87n49k06M06J30l2p9l44M2P7L54j49k74k56K18P62k08l13m69
7021c91L41o0K53r8j26j66J42J05N1j25K56jj12l67P14l88l56J81L57j43j70J34
7043C1Nj85L82K57m20Nm3J06j35K71m35l16M04N08l69j60L4k58J73K0K02k83J12
7066i4J77j73q0M48n14J53K99k6o07M09l6j29O3L18n3o9l07J60j6k55P21p28J85
7089a54K58l22J2J21K8j75L02N36n71m24O70m31N3P4J78n27L40M44l80oJ38k91
$$ plain form
7111 -127 54 199 283 60 -346 -126 -163 -6 250 -75 -328 21 332 128 -90 -47 -355 105 543 104 -233
7132 -233 -285 -136 97 134 90 -399 -11 253 61 309 143 46 100 -17 569 251 -44 3 97 132 -38 75 -337
7155 -337 8 402 443 -58 -169 -48 -282 74 245 -71 72 199 168 -63 284 -246 -204 -209 247 66 -106 333
7177 333 -87 -39 127 128 -328 -42 -125 -238 -292 125 -107 -204 100 376 -23 -179 -448 -224 -28 148 87 -197
7199 -197 30 -52 -173 264 -189 -595 -298 346 234 -224 -45 -147 -435 320 47 -121 -333 -84 194 -108
7219 -108 -31 51 -244 -31 358 -163 37 78 -162 -166 222 265 -391 -100 -87 -35 -96 314 -19 -145 -76 220 4
7242 4 289 -129 -280 -166 234 391 -194 62 -15 -81 274 47 -69 -32 144 137 9 233 -127 -138 147 221 63
7265 63 -430 188 -59 -179 -197 103 -383 -537 203 -180 -83 77 -4 -27 -44 122 -149 -392 -71 97 -175 151
$$ packed form
7111a27J81J45Q4k23m06K20l7J57K56l25k53L49L11k04k18M3l08M60M38m39l37
7132b33n2J49K33L7m4m89L88K64j92K48j66r7N4j17N86l18k95M7R4L5j70J13m12
7155c37L45L94M1n01j11J21k34L56J71l16J43J27l1k31L47n30M2nM56j81j72M39
7177C33m20M8J66Jm56K86q3j13n4M17k32r7L04K76l99j56k69K24J96J76o1k84
7199a97K27q2j21M37m53m06K97O44j12m58J79j02k88P55k73j68k12K49K78l02
7219a08P7Q2k95K13L89n21K00M1k40mL88M3o56K91J3N2o1M10l33j26O9K96k16
7242DK85m18j51J14M00J57n85K56p7o6L55k27j16L7J76pj28K24l60j1K85P4j58
7265F3m93O18k47j20j8L00m86j54P40l83R7J60q1k3j7J66k71k43L21J68k72L26
$$ plain form
7287 151 -135 -621 26 -25 -49 -230 -192 -363 -417 -122 -146 113 162 188 258 -61 177 -216 -516 265 -51 -412 -129
7310 -129 -76 -173 51 553 74 -156 -105 -70 65 289 98 -291 -221 75 10 -62 -98 136 24 -81 134 -208 -327
7333 -327 44 132 -228 174 79 -286 33 336 -77 -10 291 -84 -303 336 245 -167 122 255 1 156 236 -67
7355 -67 -132 49 457 -224 -100 118 145 -33 408 192 -270 167 323 10 277 59 109 -257 372 152 -227
7376 -227 89 -165 -6 -95 415 40 0 -4 204 -265 82 34 -119 13 202 6 -83 -131 140 -193 88 70 -180
7399 -180 93 152 77 -18 224 -277 -370 -58 414 -276 -240 -113 -196 -86 235 115 -192 -226 84 70 -44 200 -285
7422 -285 -317 108 156 -301 -143 -147 -143 30 382 195 -490 -47 -112 -159 180 -164 -436 -121 295 153 -388 -188 102
7445 102 -64 453 78 -278 -126 106 127 -232 -163 45 -362 -72 325 298 -69 271 117 -244 222 113 -210
$$ packed form
7287A51k86m86O47n1k4j81L8j71n4K95k4K59M9K6P0l19K38l93l00P81l16l61K83
7310a29N3r7K24N02m79k30N1L5J35K24j91l89P0K96o5p2l6K34j12j05K15l42j19
7333c27L71Q8l60M02r5l65L19L03m13O7L01l75k19O39r1m12K89J33k54J55Q0l03
7355f7o5J81M08o81J24K18K7j78M41k16m62M37J56l13K67k18N0l66O29k20l79
7376b27L16k54J59q9N10l75m0mK08m69L47m8j53J32J89j96q9m8K71l33K81j8k50
7399a80K73N9p5r5K42n01r3L12M72o90L6J27q3J10L21j20l07l4L10j4j14K44m85
7422b85l2M25M8m57J58mMJ73L52j87o85M43o5m7L39l44k72L15M16j42n41K00K90
7445A02j66N17l75l56J52K32K1l59O9K08m07K90L97k7l67L40j54l61M66j09l23
$$ plain form
7466 -210 -536 -121 -3 -135 202 -44 -250 261 2 -101 -108 -72 59 -134 176 335 -233 -8 60 209 46
7487 46 -163 -468 -151 218 -208 -217 -89 -184 -195 280 372 180 -376 33 145 333 360 -85 -255 -526 349 456
7509 456 -253 265 -61 -107 557 136 -323 -98 158 74 -18 122 -119 -462 322 250 -20 -235 -79 36 48 54
7531 54 -22 -179 25 88 93 151 347 158 -339 54 467 -299 46 -111 -320 -118 96 63 -527 -359 138 116 122
7554 122 129 -338 -75 422 246 -132 -98 -45 59 109 100 -239 -122 -190 102 96 266 144 -368 -312 76 2 8 44 53 -25
7580 -25 123 142 -389 -175 33 22 162 96 -171 -556 139 13 240 -120 -243 116 24 152 -25 -311 -112 106
7602 106 -420 63 113 -48 -305 297 166 167 101 -147 -131 -187 624 -44 -300 -161 -163 -22 346 15 -176 -215 58
7625 58 81 -357 112 46 127 287 416 -148 -296 123 -12 -76 210 302 -168 17 258 207 -46 -30 -79 -41 222
$$ packed form
7466b10l26M15J18j32L37k46k06N11k59j03pL6J31j93L10J59n68K25O8J49j63
7487D6k09l05L17L69m26rJ28r5j1M75R2j92n56M09J12J88K7m45j70k71Q75J07
7509D56p09N18l26m6O64m21m59K25K56q4r2J40k41l43P84p2k70k15J56J15J2O
7531E4p6j57K04O3NN8J96j89m97L93M13p66L45j57k09K02K14l3n90J68M97k2O
7554A22Pm67K63M97j76l78L4N3J04N0rl39J17o8K92oJ70j22n12N6L88p4OL6Rp8
7580b5J48J9n31K14K08j1J40o6k67l85O95j26K27l60j23L59r2J28j77k86J99K18
7602A06n26M83N0j61k57O02j31Jo6k48J6n6Q11o68k56J39kJ41L68l31j91l9K73
7625E8K3m38M69o6Q1J60J29n64j48M19j35o4K86R2m70J85K41n1k53J6m9L8K63
$$ plain form
7648 222 89 -112 -62 119 235 70 -73 -482 -436 309 428 -96 -213 104 -276 171 305 -33 -532 -29 426
7669 426 88 1 287 -89 -3 189 196 -86 -19 168 96 269 119 -181 -201 140 130 -168 331 132 212 -97 244
7692 244 64 97 -27 -462 -413 284 409 -201 -292 194 274 239 108 -147 -306 -14 380 -182 21 -73 -11 -16 4
7715 4 237 -346 79 95 -118 -162 19 -266 -76 86 -89 -6 -85 126 9 -29 280 179 -183 249 -59 114
7737 114 270 7 -439 -84 239 10 97 -210 -19 -250 219 462 -115 -203 286 -101 -242 62 -30 -70 -84 286
7759 286 -54 -1 420 -63 -136 322 57 -289 170 70 -48 -132 422 -70 -369 241 549 -106 -262 179 -62
7780 -62 15 -131 -128 -447 252 -167 -128 12 -93 -199 6 306 83 -294 -60 -208 -302 205 -39 -239 -156 94
7802 94 80 -258 81 -99 -224 -158 193 60 61 -168 -20 39 460 439 -213 -414 234 121 10 29 -253 -441 183
$$ packed form
7648B22j33k01N0J81J16j65j43m09M6P45J19n24j17L17l80M47J34l38m99N03M55
7669D26l38q7K86l76Q6J92Pk82O7J87p2J73j50l00k0L41j0k98M99j99Q0l09L41
7692B44j80L3j24m35M9O97J25o10r1M86Q0l5j31k55j59K92L94n62K03r4O2nK0
7715DK33n83M25J6k13m4J81k85J90J62j75Q3p9K11j17l8L09j01l62M32l08J73
7737A14J56k63m46L55L23k29Q7l07J91k31M69K43n77q8M89l87j41L04r2m0j4L70
7759B86l40N3M21m83p3M58k65l46M59j00j18q4N54m92k99O10L08o55j56M41k41
7780f2P7j46Ll19O99m19L9J40j05j06K05L00k23l77K34j48r4N07k44k00Q3K50
7802I4j4l38L39j80j25O6L51j33Jk29J48N9M21k1o52k01O48j13j11J9k82j88O24
$$ plain form
7825 183 142 -58 -7 260 -288 -149 352 -43 -216 294 13 39 137 151 -276 -116 101 36 -128 43 -187 -330
7847 -330 247 397 -212 -156 -45 -6 185 -97 -12 -190 2 561 187 40 2 -49 -218 254 267 -105 -43 71
7869 71 -33 99 89 27 -299 19 149 -271 -114 171 -224 -118 183 -95 339 -198 258 -17 -143 213 -220
7890 -220 -17 311 143 -203 -100 208 -100 -58 262 56 -207 104 226 -167 -2 12 34 112 322 -29 -307
7911 -307 133 25 -234 -75 71 -338 -252 -8 32 -42 77 -161 -309 39 529 53 -103 -57 -55 -173 339 -170
7933 -170 -337 -118 240 66 236 -88 -183 -136 -22 299 -255 -338 45 46 212 114 -119 -253 38 203 10 108
7955 108 240 53 -366 225 68 -294 -171 119 -409 -4 412 -151 -490 60 194 -203 190 -126 -340 16
7975 16 331 114 1 120 -110 -129 218 270 -268 23 297 242 -124 128 195 -44 82 257 -141 -312 -114 -222
$$ packed form
7825A83m1k00N1K67n48J39N01l95j73N10k81K6R8J4m27J60K17o5j64J71k30j43
7847c30N77J50o09N6J11L9J91k82Q5j78J92N59l74j47l8n1j69M72J3l72O2J14
7869G1j04J32j0o2l26L18J30m20J57K85l95J06L01k78M34n37M56k75j26L56m33
7890b20K03L28j68l46J03L08l08M2L20k06k63L11J22l93J65J4K2P8K10l51k78
7911c07M40j08k59J59J46m09Q6K44M0p4J19k38j48L48M90m76j56M6Kj18N12n09
7933a70j67K19L58j74J70l24r5M7J14L21n54q3L83JJ66r8k33j34K91J65j93R8
7955A08J32j87m19N91j57l62J23K90n28M05M16n63l39N50J34l97L93l16k14L56
7975A6L15k17j13J19k30j9L47N2n38K91K74n5l66K52O7k39J26J75l98j71J98j08
$$ plain form
7997 -222 -35 134 104 -59 -38 103 206 -20 61 -335 23 276 376 46 -155 -227 282 -29 266 83 -73
8018 -73 108 391 155 -71 68 32 314 394 187 -123 -27 12 -328 104 114 -88 -132 -63 -124 -79 -238 64 -305
8041 -305 27 236 160 147 -37 69 -118 130 204 -369 -223 -90 136 44 -47 -86 -212 216 297 -56 -332 23
8063 23 -79 169 68 -2 -548 126 245 -129 196 95 -85 -56 243 4 -183 -99 -26 -85 308 276 141 -325
8085 -325 165 44 84 62 139 -93 -77 68 73 -34 89 -157 -19 -9 -64 -235 -230 316 -99 -53 164 -74 -247 -148
8109 -148 29 -217 -265 98 -214 115 61 8 -26 -97 -110 -48 -205 -33 -128 -99 200 132 83 -29 279 176 -120 630
8133 630 44 -410 98 6 -10 285 60 -166 -43 366 -93 -277 267 31 90 -57 247 -121 -84 98 -7
8154 -7 102 158 -33 -53 -153 426 -50 -280 132 -461 -382 259 54 -530 -324 -216 103 -64 29 -13 23 397 177
$$ packed form
7997b22J87J69l0j63K1J41J03k26Q1l96L58K53J00l30k01p2N09l11K95j83j56
8018g3J81K83k36k26J39l6K82Q0k07l10R6L9l40M32J0k02m4O9o1M5j59L02l69
8041c05L32K09p6j3j84J06j87K48P4n73J46J33K26r2r1l9j26M28Q1l53k76L55
8063B3j02K48j01p0n46O74J19l74L25j01j80K9K99k39j87Q4P3n9L93l2j35m66
8085c25M90j21M0k2P7k32J6J45Nj07J23k46J38J0n5j71NN46m15M6K17k38j73R9
8109a48J77k46m8L63l12L29n4n3l4p1j3O2j57J72r5K9K99o8m9j12L08j03k96P50
8133F30n86m54N08r2j6K95k25k26J23M09m59j84N44k36N9j47L04l68L7J82j05
8154gJ09N6j91k0j00N79m76k30M12n93P9O41k05n84K06J08L19j67R3m2L6L74k20
$$ plain form
8177 177 57 -133 223 114 116 154 -163 -4 80 -7 -9 -136 -114 -182
$$ packed form
8177A77j20j90L56j09KL8l17J59Q4q7kj27K2o8
8191a82
$$ Imaginary data points
##PAGE= N=2
##DATA TABLE= (X++(I..I)), XYDATA
$$ plain form
0 0 0 0 0 0 0 0 0 -8 8 -8 8 -9 16 -16 24 -24 32 -40 46 -53 63 -72 83 -98 113 -127 145 -164 187 -210 236
31 236 -266 298 -333 371 -413 460 -511 568 -629 696 -772 854 -945 1048 -1163 1291 -1439
48 -1439 1609 -1807 2043 -2325 2670 -3111 3690 -4488 5662 -7574 11219 -20667 95025 204462
62 204462 18026 -14672 42050 109843 131575 97395 -18555 -22091 85082 112554 37212 26097
74 26097 38007 27112 57455 95755 50870 34214 80376 61748 10729 62855 109833 48646
86 48646 -4749 12374 29279 61744 82689 2587 -68718 19091 114206 65331 -6469 -7701
98 -7701 11560 63048 110919 41572 -54620 -6481 82244 59600 4059 -14764 -28339 2371
110 2371 61200 25653 -47467 -12596 44778 15454 615 34652 21382 -4241 19190 18570 -2518
$$ packed form
0@%%%%%%%qJ6j6J6j7K5l2M0m8N6p2Q6r9J16j35J55j81K11k40K72l09L51l97M46
31B36n02N64o31P04p84Q73r71J079j197J325j468J626j799J993k211K454k730
48a439L048l416L850m368M995n781O801q178J0150j3236J8793l1886J15692J09437
62B04462j86436l2698N6722O7793K1732l4180j15950l536J07173K7472p5342j1115
74B6097J1910j0895L0343L8300m4885j6656M6162j8628n1019N2126M6978o1187
86D8646n3395J7123J6905L2465K0945q0102p1305Q7809R5115m8875p1800j232
98g701J9261N1488M7871o9347r6192M8139Q8725k2644n5541j8823j3575L0710
110B371N8829l5547p3120L4871N7374k9324j4839L4037j3270k5623K3431o20k1088
$$ plain form
123 -2518 28308 30395 -42123 -48429 26195 34132 -14952 -29806 -38130 -26136 47021 60787 -38128
136 -38128 -71419 17192 63092 28268 -7050 -41325 -42153 32111 57189 -32518 -75202 -15120
148 -15120 11973 -7339 -1912 -15820 -42594 -3237 35646 -2650 -18205 19529 6361 -28079
160 -28079 2217 23868 -5846 -15784 -19311 -46173 -14328 47140 3089 -78187 -46625 27971
172 27971 39061 18419 -18366 -58233 -10843 79249 51416 -45507 -52828 -2907 18638 29773
184 29773 6153 -60752 -55917 25930 36885 -17927 -18534 2205 -8835 7090 34410 11709 -2825
197 -2825 16262 -4003 -24719 26192 48751 -18341 -51602 -13288 12691 24764 26147 -27574
209 -27574 -60756 15240 79641 29753 -26798 -17571 6883 40553 60857 1725 -58311 -7387
$$ packed form
123b518L0826K087p2518o306P4624P937m9084j4854q324J1994P3157J3766r8915
136c8128l3291Q8611M5900l4824l5318l4275q28P4264K5078q9707m2684O0082
148a5120K7093j9312N427j3908k6774L9357L8883l8296j5555L7734j3168l4440
160b8079L0296K1651k9714r938l527k6862L1845O1468m4051q1276L1562P4596
172B7971J1090k0642l6785l9867M7390R0092k7833r6923p321M9921K1545J1135
184B9773k3620o6905M835Q1847J0955n4812o07K0739j1040J5925K7320k2701j4534
197b825J9087k0265k0716N0911K2559o7092l3261L8314K5979J2073J383n3721
209b7574l3182P5996O4401m9888n6551R227K4454L3670K0304n9132o0036N0924
$$ plain form
221 -7387 53701 18766 -20804 -12319 -10474 791 33600 16562 -21278 7718 37825 8494 4047
234 4047 37636 23228 -6396 8522 13390 2128 24064 19434 -37168 -31966 38721 43111 -8459
247 -8459 -22247 -10312 13526 59226 48712 -30634 -38608 39618 62359 16113 -11804 -22924
259 -22924 -16419 32645 44467 -21105 -45573 6315 25578 6070 11492 8957 -9498 11483 32332
272 32332 5658 3598 32871 6284 -32632 331 34693 9381 -15154 -22966 -29022 9405 54607
285 54607 8692 -57238 -23001 43560 46042 17371 -14981 -39511 3002 67923 32451 -49432
297 -49432 -43174 9553 21177 13290 -6308 -41407 -24877 33678 27373 -18304 -6532 16604 -489
310 -489 1012 22297 8315 -4280 5880 -13320 -28369 16102 34785 -22764 -51731 -13094 17561
$$ packed form
221g387O1088l4935l9570Q485J845J1265L2809j7038l7840K8996L0107k9331m447
234D047L3589j4408k9624J4918M868j1262K1936m630n6602N202P0687M390n1570
247h459j3788J1935K3838M5700j0514p9346p974P8226K2741m6246k7917j1120
259b2924O505M9064J1822o5572k4468N1888J9263j9508N422k535j8455K0981K0849
272C2332k6674k060K9273k6587l8916L2963L4362k5312k4535p812o056L8427M5202
285E4607m5915o5930L4237O6561K482k8671l2352k4530M2513O4921l5472q1883
297d9432O258N2727J1624p887j9598l5099J6530N8555o305m5677J1772K3136j7093
310d89J501K1285j3982j2595J0160j9200j5049M4471J8683n7549k8967L8637L0655
$$ plain form
323 17561 26170 17614 -31543 -49704 22579 71479 15326 -40183 -25471 4419 28488 33774 -19077
336 -19077 -61735 -14354 36835 7195 -26567 -16774 -11389 -1453 23045 8594 -21031 2170 22797
349 22797 -6434 -11956 18697 8458 -20802 -14821 -8141 -9573 10463 3674 -43369 -35133 26393
362 26393 30710 -13706 -25135 -13682 4924 38365 25979 -39124 -44597 19271 34427 -6525
374 -6525 -28686 -32965 -23472 16309 23996 -28529 -43121 2594 16810 -2046 3389 1987 -16442
387 -16442 -2354 15005 -4866 -9227 9147 -14059 -40190 -6656 20641 -5745 -25876 -23993
399 -23993 -21818 8903 39873 -1045 -50565 -17000 35023 27437 -178 -21852 -36642 -5350
411 -5350 39147 9488 -48484 -35456 5261 7420 2230 -4221 -26158 -16328 23150 17422 -13199
$$ packed form
323A7561Q609q556m9157j8161P2283M8900n6153n5509J4712K9890K4069N286n2851
336a9077m2658M7381N1189k9640l3762R793N385R936K4498j4451k9625K3201K0627
349B2797k9231n522L0653j0239k9260N981O680j432K0036o789m7043Q236O1526
362B6393M317m4416j1429J1453J8606L3441j2386o5103n473O3868J5156m0952
374f525k2161m279R493L9781P687n2525j4592M5715J4216j8856N435j402j8429
387a6442J4088J7359j9871m361J8374k3206k6131L3534K7297k6386k0131J883
399b3993K175L0721L0970m0918m9520L3565N2023p586k7615k1674j4790L1292
411e350M4497k9659n7972J3028M0717K159n190o451k1937R830L9478n728l0621
$$ plain form
424 -13199 -1024 12045 -9228 -8369 13712 3329 -12482 -7722 -17982 -21345 15944 22591 -26956
437 -26956 -40271 3122 26374 20003 5614 -24998 -27475 28927 52770 -3196 -40841 -15784
449 -15784 10340 18610 14647 -21808 -44493 -1331 34224 4914 -16949 -2015 1141 2929 21794
462 21794 14997 -7749 3613 12354 -9675 -3834 23789 5497 -26878 -14915 4648 7739 15683
475 15683 1848 -32179 -12114 42383 35555 -10549 -16797 1051 16853 34254 17199 -32382
487 -32382 -27805 25272 28863 -8811 -17879 -10375 -3743 20001 23799 -10682 -14865 19914 21390 1955
501 1955 11946 15531 -4570 -1309 11697 1828 2627 12987 -11015 -29445 7647 33975 6159
514 6159 -16665 -10604 1195 27875 42120 -156 -37337 -5 43093 26076 -5992 -18914
$$ packed form
424a3199J2175J3069k1273Q59K2081j0383j5811M760j0260l363L7289O647m9547
437b6956j3315M3393K3252o371j4389l0612k477N6402K3843n5966l7645K5057
449a5784K6124Q270l963l6455k2685M3162L5555k9310k1863J4934L156J788J8865
462B1794o797k2746J1362Q741k2029N841K7623j8292l2375J1963J9563L091P944
475A5683j3835l4027K0065N4497o828m6104o248J7848J5802J7401j7055m9581
487c2382M577N3077L591l7674r068P504O632K3744L798l4481m183L4779J476j9435
501A955R991L585k0101L261J3006r869P99J0360k4002j8430L7092K6328k7816
514F159k2824O061J1799K6680J4245m2276l7181L7332M3098j7017l2068j2922
$$ plain form
526 -18914 -20557 7109 35624 5840 -35818 -15268 19551 14169 5061 5610 -5412 480 23086
539 23086 13056 -7213 9218 16412 -11781 -13637 12454 10705 -5584 -8616 -16299 -11038 24445
552 24445 26837 -20652 -29863 12941 32260 18795 144 -23191 -18787 28481 39307 -15403 -42370
565 -42370 -10514 14527 13326 2636 -23390 -30948 9258 31751 34 -18056 726 5013 897
578 897 11173 4594 -13068 -3715 1883 -16764 -10759 13833 -2204 -31099 -19032 3376 8704
591 8704 10771 -7087 -34686 -12040 36184 24069 -23156 -30472 -9115 7527 17440 -2587 -43292
604 -43292 -35516 11794 15513 -16943 -24859 -17282 -9979 9493 11273 -18476 -22171 5071 3386 -14896
618 -14896 -6133 -1661 -19589 -20291 -9295 -14391 -11630 -3346 -23290 -36371 -3784 17360 -8224
$$ packed form
526a8914j643K7666K8515k9784m1658K0550L4819n382r108N49j1022N892K2606
539B3086j0030k0269J6431P194k8193j856K6091j749j6289l032p683N261L5483
552B4445K392m7489r211M2804J9319j3465j8651k3335M404M7268J0826n4710k6967
565d2370L1856K5041j201j0690k6026p558M0206K2493l1717j8090J8782M287m116
578H97J0276o579j7662R353N598j8647O005K4592j6037k8895J2067K2408N328
591H704K067j7858k7599K2646M8224j2115m7225p316K1357J6642R913k0027m0705
604d3292P776M7310L719l2456p916P577P303J9472J780k9749l695K7242j685j8282
618a4896Q763M472j7928p02J0996n096K761Q284j9944j3081L2587K1144k5584
$$ plain form
631 -8224 -26518 -18845 -9690 7596 16301 -17780 -46863 -16477 16691 229 -25686 -32409 -31125
644 -31125 -8949 13806 -10062 -41590 -22151 5703 -1959 -8706 -5461 -16611 -17133 920 -3949
657 -3949 -18943 -9459 -7370 -28940 -24600 873 -3346 -20474 -20607 -20744 -13737 13672 11490 -28869
671 -28869 -32883 5425 18460 604 -16098 -29142 -22047 12604 16355 -26344 -40783 -9859 6471
684 6471 398 -4169 -17534 -22782 5242 20710 -4385 -16225 -27 304 -6425 2857 917 -13207
698 -13207 -8794 -4234 -15228 -4545 15181 -4544 -28543 -8788 16690 14371 5451 -9105 -21739
711 -21739 1299 35203 15424 -25884 -23610 805 11140 14066 -3310 -32784 -19968 21061
723 21061 19836 -9415 -11631 -1478 1111 11756 15556 -4716 -9099 6416 1401 -8739 5781
$$ packed form
631h224j8294P673R155J7286Q705l4081k9083L0386L3168j6462k5915o723J284
644c1125K2176K2755k3868l1528J9439K7854p662o747L245j1150n22J8053m869
657c949j4994R484K089k1570M340K5473m219j7128j33j37P007K7409k182m0359
671b8869m014L8308J3035j7856j6702j3044P095L4651L751m2699j4439L0924J6330
684F471o073m567j3365n248K8024J5468k5095j1840J6198L31o729R282j940j4124
698a3207M413M560j0994J0683J9726j9725k3999J9755K5478k319q920j4556j2634
711b1739K3038L3904j9779m1308K274K4415J0335K926j7376k9474J2816M1029
723B1061j225k9251k216J0153K589J0645L800k0272m383J5515n015j0140J4520
$$ plain form
736 5781 7753 -15829 -17739 22 3046 3215 4648 -14121 -21258 11863 29265 1455 -18491 -9529
750 -9529 2428 15411 16546 -15720 -34703 -2806 22365 847 -20014 -16120 -9960 3063 15635
763 15635 -2208 -21840 -3332 14205 1363 -4121 2287 -5790 -10417 544 -2794 -11726 -1267
776 -1267 -2700 -23788 -16698 11308 8125 -13039 -15681 -10300 2169 20826 9394 -27353 -24498
789 -24498 12883 19121 -4565 -19098 -23818 -13903 13254 12321 -24443 -31470 -186 12078 1022
802 1022 -4753 -11771 -12004 8465 13652 -9975 -14613 3597 -1621 -14596 -4969 56 -10078 -9463
816 -9463 -7864 -14697 -1615 15426 -3433 -25691 -7406 15698 12123 814 -13634 -23647 430
829 430 28233 4694 -33486 -25832 2877 11557 6315 -11351 -29939 -11544 22917 15770 -13266
$$ packed form
736E781J972k3582j910J7761L024J69J433j8769p137L3121J7402k7810j9946Q962
750i529J1957J2983J135l2266j8983L1897K5171k1518k0861L894O160J3023J2572
763A5635j7843j9632J8508J7537j2842n484O408q077m627J0961l338q932J0459
776a267j433k1088P090K8006l183k1164k642N381J2469J8657j1432l6747K855
789b4498L7381O238k3686j4533m720R915K7157r33l6764p027L1284J2264j1056
802A022n775p018k33K0469N187k3627m638J8210n218j2975R627N025j0134O15
816i463J599o833J3082J7041j8859k2258J8285K3104l575j1309j4448j0013K4077
829D30K7803k3539l8180P654K8709Q680n242j7666j8588J8395L4461p147k9036
$$ plain form
842 -13266 -12698 -467 1128 7576 8027 -10467 -14308 1305 -2039 -11656 993 4129 -15575 -17013
856 -17013 176 5571 6177 3967 -14978 -18822 13465 27609 -2033 -21859 -11488 1405 11621
869 11621 10618 -16114 -31677 -3842 19333 2334 -14089 -10710 -6248 4674 16756 1364 -16117
882 -16117 -1288 12233 -414 -5283 2446 -4698 -11118 -1259 -1468 -7786 854 -470 -16724 -8059
896 -8059 15535 9069 -9378 -8150 -1329 5026 16902 6571 -22586 -18203 13203 15440 -6718
909 -6718 -15989 -15377 -5637 15240 12171 -17326 -19537 8009 14800 3100 556 -3646 -7901 6080
923 6080 11687 -4948 -9580 2313 -3614 -11798 1353 6824 -5687 -7444 -2875 -3930 7397 18274
937 18274 -1506 -19508 -93 19989 11215 -2957 -11580 -14694 4089 22694 1275 -26579 -13910
$$ packed form
842a3266N68J2231J595O448M51j8494l841J5613l344r617J2649L136j9704j438
856a7013J7189N395O06k210j8945l844L2287J4144k9642j9826J0371J2893J0216
869A1621j003k6732j5563K7835K3175j6999j6423L379M462J0922J2082j5392j7481
882a6117J4829J3521j2647m869P729p144o420R859k09o318Q640j324j6254Q665
896h059K3594o466j8447J228O821O355J1876j0331k9157M383L1406K237k2158
909f718r271O12R740K0877l069k9497k211K7546O791j1700k544m202m255J3981
923F080N607j6635m632J1893n927q184J3151N471j2511j757M569j055J1327J0877
937A8274j9780j8002J9415K0082q774j4172q623l114J8783J8605k1419k7854J2669
$$ plain form
950 -13910 9893 11406 5421 -3816 -15267 -1997 22371 14089 -8629 -5058 4401 1499 4696 7484
964 7484 -5489 -9903 1437 -1141 -5071 8083 8029 -12525 -11158 10150 14915 8176 1791 -11501
978 -11501 -9192 19016 24740 -6873 -21748 -6090 7627 12086 7374 -14337 -22708 5331 22674
991 22674 3906 -9316 -2371 1378 5835 13948 3569 -9285 810 7423 -4182 -3342 7216
1004 7216 -2184 -12388 -3207 2642 1325 6024 906 -13641 -2889 20664 12460 -9051 -8486 624
1018 624 6970 13184 1265 -22164 -13760 15138 11971 -10188 -13833 -7010 1437 13594 8651 -14330
1032 -14330 -11335 12376 12567 -1601 -1938 -1672 -5529 2259 5414 -7302 -7181 3185 -4917 -12765 2982
1047 2982 10583 -2659 -7781 -3031 -547 10302 16056 -6544 -21730 526 19712 7053 -9497
$$ packed form
950a3910K3803J513n985r237j1451J3270K4368q282k2718L571R459k902L197K788
964G484j2973m414J1340k578l930J3154n4k0554J367K1308M765o739o385j3292
978a1501K309K8208N724l1613j4875J5658J3717M459m712k1711q371K8039J7343
991B2674j8768j3222O945L749M457Q113j0379j2854J0095O613j1605Q40J0558
1004G216r400j0204R181N849j317M699n118j4547J0752K3553q204k1511N65R110
1018F24O346O214j1919k3429Q404K8898l167k2159l645O823Q447J2157m943k2981
1032a4330K995K3711J91j4168l37K66l857P788L155j2716J21J0366q102p848J5747
1047B982P601j3242n122M750K484J0849N754k2600j5186K2256J9186j2659j6550
$$ plain form
1060 -9497 -15882 -13334 6467 19708 -2723 -25975 -9449 14251 11408 2237 -5025 -11141 1082
1073 1082 18584 6608 -12650 -5119 4214 -2713 -1897 2841 -5018 -7379 442 -3151 -5269 9117
1087 9117 9643 -10606 -10606 9157 13542 5977 -1829 -13152 -9358 15536 18541 -11400 -23292 -5059
1101 -5059 8522 10134 3863 -14276 -18032 8879 22477 2589 -10266 -2566 1569 5237 10292
1114 10292 -309 -12291 -2533 4987 -4514 -4066 5253 -3001 -11579 -1328 5336 3114 5662 251
1128 251 -12273 -1315 19372 9606 -11459 -9924 -575 4080 9203 -392 -20547 -12127 13036 10429
1142 10429 -8082 -8776 -3102 2004 11589 7978 -10138 -8323 10220 7723 -4866 -2523 -1559 -6786
1156 -6786 -867 3725 -5684 -5415 3809 -3554 -8686 6247 11440 -2764 -6490 335 2913 8596 9945
$$ packed form
1060i497o385K548J9801J3241k2431k3252J6526K3700k843r171p262o116J2223
1073A082J7502j1976j9258P531R333o927Q16M738p859k361P821l593k118J4386
1087I117N26k0249%J9763M385p565p806j1323L794K4894L005k9941j1892J8233
1101e059J3581J612o271j8139l756K6911J3598j9888j2855P700M135L668N055
1114A0292j0601j1982R758P520r501M48R319q254q578J0251O664k222K548n411
1128B51j2524J0958K0687r766k1065J535R349M655N123r595k0155Q420K5163k607
1142A0429j8511o94N674N106R585l611j8116J815J8543k497j2589K343R64n227
1156f786N919M592r409K69R224p363n132J4933N193j4204l726O825K578N683J349
$$ plain form
1171 9945 -8786 -18556 2626 16297 2034 -11559 -11456 -7138 7555 16947 -2301 -19420 -2680
1184 -2680 14838 9298 1621 -1828 -7474 -219 13030 4439 -9752 -3063 2215 -4873 -1446 6691
1198 6691 -675 -6506 569 481 1691 12244 8627 -10872 -7352 12320 13234 1760 -5344 -10710 -4976
1213 -4976 14819 13434 -12700 -17660 2756 11438 8088 3057 -7848 -8747 11805 18997 -62 -7679
1227 -7679 1523 2968 2306 6800 467 -8661 -1118 4038 -3096 926 9156 -1215 -9349 3017 11487
1242 11487 6975 4289 -1489 -8759 3956 19433 5359 -14750 -8965 3379 6958 7472 -2344 -16319
1256 -16319 -4911 16792 10693 -6719 -4713 2256 4421 9448 5940 -7284 -5030 8145 2935
1269 2935 -6302 -211 1854 -6120 -3067 3311 -1149 206 4860 -3537 -6977 8720 12887 -2910
$$ packed form
1171I945j8731r770K1182J3671j4263j3593J03M318J4693R392j9248j7119J6740
1184b680J7518n540p677l449n646P255J3249q591j4191O689N278p088L427Q137
1198F691p366n831P075q8J210J0553l617j9499L520J9672R14j1474p104n366N734
1213d976J9795j385k6134m960K0416Q682l350n031j0905q99K0552P192j9059p617
1227g679R202J445o62M494o333r128P543N156p134M022Q230j0371q134J2366Q470
1242A1487m512k686n778p270J2715J5477j4074k0109N785J2344L579N14r816j3975
1256a6319J1408K1703o099j7412K006O969K165N027l508j3224K254J3175n210
1269B935r237O091K065p974L053O378m460J355M654q397l440J5697M167j5797
$$ plain form
1283 -2910 -8442 -781 3331 7243 5700 -11782 -17258 4350 15224 -1796 -13043 -8404 -1165 9342
1297 9342 12392 -5238 -15935 1354 14473 4364 -4057 -4037 -5991 -565 7398 -851 -10873 -2097
1311 -2097 1910 -6815 -3219 7171 1808 -5666 -1965 -612 2182 11428 4424 -14747 -9776 10179
1325 10179 10427 -2752 -9528 -12432 -4295 13514 10169 -14306 -16216 4687 12406 5920 -91 -7968
1339 -7968 -6294 10652 13503 -5274 -10181 1004 1489 -1537 2075 -1491 -7787 -277 3329 -3077
1353 -3077 698 8594 -551 -7926 2783 9480 4429 1574 -3935 -9464 2488 15394 1704 -15996
1367 -15996 -8591 5014 7393 5544 -3424 -13382 -1286 16918 9909 -6754 -4846 2174 3313 7656
1381 7656 4245 -8810 -6540 6098 2486 -5388 452 1592 -5479 -1392 5114 1898 1685 4448 -3197
$$ packed form
1283b910n532P661M112L912j543j7482n476K1608J0874j7020j1247M639P239J0507
1297I342L050j7630j0697J7289J3119j0109q421K0j954N426P963q249j0022Q776
1311b097M007q725L596J0390n363p474L701J353K794R246p004j9171M971J9955
1325A0179K48j3179o776k904Q137J7809l345k4475j910K0903P719o486o011p877
1339g968J674J6946K851j8777m907J1185M85l026L612l566o296P510L606o406
1353c077L775P896r145p375J0709O697n051k855n509n529J1952J2906j3690j7700
1367a5996P405J3605K379j849q968r958J2096J8204p009j6663J908P020J139M343
1381G656l411j3055K270J2638l612p874N840J140p071M087O506l216k13K763p645
$$ plain form
1396 -3197 -5026 9669 11485 -5001 -9070 -914 2724 4767 3697 -9945 -13143 5234 13159 -1183
1410 -1183 -9122 -3440 1305 7667 10320 -3545 -12149 2617 11291 1166 -4315 -2375 -4651 -2156
1424 -2156 5462 132 -7076 -157 1958 -4547 969 9426 1844 -6028 -655 2389 3156 8132 674
1439 674 -14109 -6732 11070 7714 -5524 -9078 -7216 459 13303 7743 -11880 -9836 8236 10837
1453 10837 2896 -238 -4650 -4892 7222 8971 -4928 -7165 1808 181 -2250 3436 2081 -4381
1467 -4381 -30 3505 -302 4425 9429 -1579 -8163 3554 10678 3295 -2144 -4727 -6640 4926
1481 4926 12786 -1365 -14223 -2930 8996 7437 3752 -2145 -7954 2841 16023 6359 -7790
1494 -7790 -3027 3769 2438 4070 2531 -6218 -4446 4789 1876 -2804 3917 3816 -4984 -875 8295
$$ packed form
1396c197j829J4695J816j6486m069Q156L638K043j070j3642l198J8377P925j4342
1410a183p939N682M745O362K653j3865q604J4766Q674j0125n481J940k276K495
1424b156P618n330p208O919K115o505N516Q457p582p872N373L044P67M976p458
1439F74j4783P377J7802l356j3238l554J862P675J2844n560j9623K044J8072K601
1453A0837p941l134m412k42J2114J749j3899k237Q973j627k431N686j355o462
1467d381M351L535l807M727N004j1008o584J1717P124p383n439k583j913J1566
1481D926P860j4151j2858J1293J1926j559l685n897n809J0795J3182r664j4149
1494g790M763O796j331J632j539q749J772R235k913m680O721j01q800M109R170
$$ plain form
1509 8295 5610 2049 1500 -4028 -2861 10749 9463 -7583 -9993 631 4932 5454 2169 -9128
1523 -9128 -9170 8710 14030 -1291 -7583 -450 3761 6527 7134 -3605 -8487 2952 7666 -2276 -4367
1538 -4367 654 -2300 -2548 2976 727 -2849 3090 2678 -4676 999 10474 2637 -6792 -2853 1528
1553 1528 3479 5755 -2728 -14245 -4768 11698 6263 -7392 -8267 -3429 4188 11449 4351 -11849
1567 -11849 -7147 9504 8926 -777 -3395 -4887 -3341 6179 4783 -7125 -6598 2946 317 -3132 2793
1582 2793 3164 -2711 -152 1708 -372 4069 7526 -3500 -9826 1947 8620 1500 -4115 -6348 -6030
1597 -6030 4894 11599 -1954 -13231 -2003 9726 7132 1776 -3463 -6702 2981 12464 2711 -9276
1611 -9276 -3492 3272 824 1759 518 -5608 -3123 5169 2073 -2536 3310 3466 -3940 -96 7103
$$ packed form
1509H295k685l561n49n528J167J3610j286j7046k410J0624M301N22l285j1297
1523i128m2J7880N320j5321o292P133M211K766O07j0739m882J1439M714r942k091
1538d367N021k954k48N524k249l576N939m12p354N675R475p837r429L939M381
1553A528J951K276q483j1517R477J6466n435j3655q75M838P617P261p098j6200
1567a1849M702J6651n78r703k618j492J546R520j396j1908N27R544k629l449N925
1582B793L71n875K559J860k080M441L457j1026o326J1773O673p120n615k233L18
1597f030J0924O705j3553j1277J1228J1729k594n356n239l239R683R483r753j1987
1611i276N784O764k448R35j241o126K485Q292l096m609N846J56p406L844P199
$$ plain form
1626 7103 3760 -172 -505 -4580 -2890 8497 6384 -8786 -9899 1638 5909 4681 900 -7825
1640 -7825 -6671 9193 12395 -1547 -6880 -862 2167 4754 5239 -3724 -8904 630 5522 -1732 -2791
1655 -2791 1205 -2334 -2904 3737 3196 -1074 2174 985 -4528 1551 9203 594 -7260 -2984 1631
1670 1631 1892 3539 -2708 -11120 -2601 10088 4577 -6047 -4669 -184 3808 8229 2232 -9092
1684 -9092 -4738 7780 5002 -3563 -3568 -3054 -2952 3033 3238 -4780 -4196 2877 189 -2044 4544 3840 -3184
1701 -3184 -1607 2311 857 3137 3830 -5603 -8638 3617 8254 -645 -5747 -4448 -1925 6445 9759
1716 9759 -2690 -9863 1624 9764 4805 31 -2582 -4624 2330 8831 915 -7608 -1525 3169
1730 3169 156 1408 2700 -2126 -1495 4647 2455 172 5160 2952 -4295 -252 7395 4404 -1620
$$ packed form
1626G103l343l932l33m075J690J1387k113j5170j113J1537M271j228l781q725
1640g825J154J5864L202j3942n333O018L029K587M85q963n180R534M892p254j059
1655b791L996l539n70O641n41m270L248j189n513O079P652q609p854M276M615
1670A631K61J647o247q412Q519J2689n511j0624J378M485L992M421n997j1324
1684i092M354J2518k778q565nN14J02N985K05q018N84P073k688k233O588p04p024
1701c184J577L918j454K280O93r433l035J2255M637q899n102J299K523Q370L314
1716I759j2449p173J1487Q140m959m774k613k042O954O501p916q523O083M694
1730C169l013J252J292m826O31O142k192k283M988k208p247M043P647k991o024
$$ plain form
1745 -1620 -1829 -3338 -90 9005 4761 -7869 -6526 5653 7865 4048 278 -5068 -2187 10091
1759 10091 10449 -2928 -5996 1006 3124 3477 3484 -2833 -5868 2252 5024 -629 -136 3682 -688 -2340
1775 -2340 4276 5612 1406 1510 -929 -4080 3078 9152 -349 -9152 -3308 3034 3896 3127 -3035 -8782
1791 -8782 85 11239 4798 -5380 -3209 1729 4023 5599 445 -7977 -2824 6419 2375 -4784
1805 -4784 -2523 -729 -1556 1651 1874 -3244 -1111 3956 -45 -2497 3470 4004 -3106 -3042 263 45
1821 45 1924 2133 -6981 -8073 3798 7740 -1893 -6361 -3788 168 6426 7200 -4599 -9904 1796
1836 1796 8930 2601 -3490 -4860 -4646 2022 6426 -1518 -7969 -1460 3149 -268 124 2183 -1807
1851 -1807 -1710 2846 1123 -533 3613 1462 -6199 -2459 5292 2416 -2707 -3790 -4553 -391 7458 3918
$$ packed form
1745a620k09j509L248R095m244j2630J343J2179K212l817l770n346K881J2278
1759A0091L58j3377l068P002K118L53Po317l035Q120K772n653M93L818m370j652
1775b340O616J336m206J04k439l151P158O074r501q803N844O342Q62p69o162n747
1791h782Q867J1154o441j0178K171M938K294J576n154q422N153R243m044p159
1805d784K261J794q27L207K23n118K133N067m001k452N967N34p110O4L305k18
1821D5J879K09r114j092J1871L942r633m468K573L956O258P74j1799n305J1700
1836A796P134o329o091j370K14O668M404p944o451O509M609l417L92K059l990
1851a807R7M556j723j656M146k151p661L740P751k876n123j083p63M162P849l540
$$ plain form
1867 3918 -7482 -6315 4895 7021 2806 -766 -5219 -2572 7597 7164 -4451 -6732 206 2164
1881 2164 1748 2196 -2883 -5175 1551 4929 -234 -104 3018 -972 -1725 4089 4416 -505 -561 -1179 -3281
1898 -3281 2765 7089 -1413 -8063 -1683 4041 4281 2918 -2071 -6479 1456 10395 4095 -4875 -2549
1913 -2549 1469 2495 4262 760 -6037 -2720 5093 2053 -2680 -324 950 -1074 1770 3478 -465
1928 -465 542 3324 -348 -1751 4495 3877 -3337 -3303 1835 1468 2009 1638 -4740 -5014 5436 7363 -1459
1945 -1459 -3937 -280 2595 5611 5443 -3710 -6552 3283 7714 725 -3237 -2440 -1829 2000 5431 -584
1961 -584 -4885 364 3737 670 1944 3843 -682 -1725 2862 2371 781 2739 -328 -5857 -556
1976 -556 6606 2794 -3286 -3171 -1734 2544 7464 3072 -6593 -3707 6420 6530 1531 -1376 -3728
$$ packed form
1867C918j1400J167J1210K126m215l572m453K647J0169m33j1615k281O938J958
1881B164m16M48n079k292O726L378n163J30L122l990p53N814L27m921n6o18k102
1898c281O046M324q502o650O380N724K40j363m989m408P935Q939o300q970K326
1913b549M018J026J767l502o797L317P813l040m733K356J274k024K844J708l943
1928d65J007K782l672j403O246o18p214L4N138l67N41l71o378k74J0450J927q822
1945a459k478L657K875L016j68r153k842R835M431o989l962P97O11L829L431o015
1961e84m301N249L373l067J274J899m525j043M587m91j590J958l067n529N301
1976e56P162l812o080J15J437M278M920m392r665K886J0127J10m999k907k352
$$ plain form
1991 -3728 -1187 6134 4971 -4275 -4572 1504 2220 1077 2507 -732 -2724 1982 4084 338 1102 3167
2007 3167 -1411 -2780 3445 4378 -705 -1736 -2167 -2178 3195 6091 -2167 -7404 -49 5708 3813 1325
2023 1325 -2506 -4552 2791 8646 1972 -6072 -2612 1832 1992 2273 -728 -4863 -1436 4188 1141
2038 1141 -2372 1119 1493 -1780 822 3210 760 -1 1162 -2004 -1985 4220 3108 -4305 -4838 607
2054 607 2119 2356 824 -5357 -3998 5502 6818 -1928 -4771 -325 2514 3905 2288 -4801 -5746 3008
2070 3008 5227 -1433 -4044 -1755 -448 1996 3408 -1187 -3725 1688 3771 -765 61 2634 -621
2085 -621 -1725 835 904 168 1743 -1463 -5878 -663 6445 2457 -3707 -3375 -633 3255 6779 1761
2101 1761 -7157 -3244 6189 5649 104 -2849 -4077 -979 5333 4037 -4709 -4197 1654 2278 859 2037
$$ packed form
1991c728K541P321j163r246k97O076P16j143J430l239j992M706K102l746P64K065
2007C167m578j369O225R33n083j031m31j1N373K896q258n237P355N757j895k488
2023A325l831k046P343N855o674q044L460M444J60K81l001m135L427N624l047
2038A141l513L491L74l273K602K388k450p61J163l166J9O205j112p413n33N445
2054F07J512K37j532o181J359R500J316q746k843M446K839J391j617p089r45Q754
2070C008K219o660k611K289J307K444J412m595k538N413K083m536Q26K573l255
2085f21j104K560O9p36J575l206m415N215P108l988o164L32K742L888L524n018
2101A761q918L913R433n40n545k953j228L098O312j296q746N12N851O24j419J178
$$ plain form
2117 2037 24 -2073 1925 3501 106 777 2387 -1834 -3040 2282 3695 -898 -1595 -1743 -1788 3211
2133 3211 5744 -1475 -5992 658 5508 3676 1246 -2101 -3589 2017 6962 1027 -5530 -2191 1753
2148 1753 1526 2014 -132 -4023 -922 4436 1723 -998 1160 1298 -1777 860 3335 32 -850 -30
2164 -30 -2151 -1166 3628 1825 -4943 -4022 1510 2443 1706 86 -4225 -2897 5113 5108 -2331 -4499 -428
2181 -428 1210 2072 1136 -4255 -5342 1435 3790 -1703 -3246 -913 -1046 297 2102 -532 -3239 600
2197 600 1295 -1945 -226 1789 -1879 -3933 -495 390 -845 229 -2283 -5186 -459 5074 781 -4421
2213 -4421 -2919 -251 2003 3810 -769 -6969 -3048 4322 2788 -2681 -3966 -3266 -1328 3621 1950
2228 1950 -4150 -3624 1413 900 -83 1448 -300 -2913 -34 1920 -41 -56 342 -3311 -3569 2534 3565
$$ packed form
2117B037k013k097L998J576l395O71J610m221j206N322J413m593o97j48m5M999
2133C211K533p219m517O650M850j832k430l347j488N606M945n935o557L339L944
2148A753k27M88k146l891L101N358k713k721K158J38l075K637K475l303q82Q20
2164c0k121R85M794j803o768R21N532R33p37j620m311J328Q010np439k168M071
2181d28J638Q62r36n391j087O777K355n493j543K333j33J343J805k634k707L839
2197F00O95l240J719K015l668k054L438Q85j235J074k512k903M727N533m293n202
2213d421J502K668K254J807m579o200L921P370j534n469j285P00J938M949j671
2228A950o100N26N037n13r83J531j748k613K879J954j961j5L98l653k58O103J031
$$ plain form
2245 3565 -1449 -3281 -2083 -577 3564 4381 -2691 -5544 1186 4942 1999 -1197 -2360 -2961 1792
2260 1792 4728 -931 -4875 -982 1870 677 1031 338 -2377 -264 3366 1098 -878 1678 1255 -2324
2276 -2324 45 3205 697 -1554 -999 -1963 -437 4041 1588 -4814 -3239 3237 3580 1322 -585 -3334
2292 -3334 -1214 5173 4264 -3406 -4335 194 2049 1588 333 -3623 -3630 2204 2926 -1521 -1948 749 -112
2309 -112 -228 2064 176 -1707 770 249 -2451 202 2525 -1778 -4178 -1014 776 547 802 -2307
2325 -2307 -4501 431 5292 1112 -4177 -2828 775 2271 2817 -1764 -6468 -2090 3911 1460 -3398
2340 -3398 -3398 -2084 -164 2763 1070 -4204 -2676 1972 708 -721 387 -646 -3001 -1050 579 -1253
2356 -1253 -835 -225 -3741 -3685 1844 2947 -1935 -3426 -1793 -604 2673 2737 -3496 -5862 193 3991
$$ packed form
2245C565n014j832J198J506M141Q17p072k853O730L756k943l196j163o01M753
2260A792K936n659l944L893K852j193L54o93k715K113L630k268j976K556m23l579
2276b324K369L160k508k251N55r64J526M478k453o402J575O476L43k258j907k749
2292c334K120O387r09p670r29M529J855m61j255l956pN834P22m447m27K697q61
2309a12j16K292j888j883K477n21k700K653K323m303k400L164J790k29K55l109
2325b307k194M932M861m180n289J349L603J496N46m581m704M378O001k451m858
2340c398%J314J920K927j693n274J528M648j264j429J108j033k355J951J629j832
2356a253M18O10l516N6N529J103m882j491J633J189L277O4o233k366O055L798
$$ plain form
2372 3991 810 -2162 -3806 -3387 547 3398 -1372 -5148 -1615 1253 487 203 -124 -2365 -858 2161
2388 2161 451 -1766 431 -169 -2954 -784 2069 -300 -2088 -1245 -1769 -573 2813 1083 -4101 -2082
2404 -2082 2744 2505 197 -1250 -3273 -1445 3876 2557 -3938 -4180 342 1209 965 163 -2649 -2706 1807
2421 1807 2760 -1016 -1432 303 -522 -363 1640 285 -1880 -859 -328 -1524 578 2234 -1978 -3994
2437 -3994 18 2185 932 97 -1785 -3340 1025 4494 529 -4069 -1988 1074 1416 1680 -1486 -4817
2453 -4817 -1523 3289 955 -2711 -1791 -765 -154 1951 1107 -2699 -1465 1566 305 -1041 719 -239
2469 -239 -2890 -1357 903 -607 -248 -473 -2857 -2030 2770 2798 -2044 -3175 -924 840 2235 1543 -3772
2486 -3772 -4561 1239 3725 -220 -2555 -2703 -1814 1059 3075 -1080 -3900 -517 1330 328 29 364
$$ packed form
2372C991l181k972j644M19L934K851m770l776L533K868p66k84l27k241J507L019
2388B161j710k217K197o00k785K170K853k369j788Q43n24J196L386j730n184K019
2404b082M826k39k308j447k023J828N321j319o495k42M522Q67k44q02k812n7M513
2421A807R53l776m16J735q25J59K003j355k165J021N31j196K102J656m212k016
2437c994M012K167j253q35j882j555M365L469l965m598K081L062L42K64l166l331
2453d817L294M812k334l666R20J026O11K105q44l806J234L031j261j346J760r58
2469b39k651J533K260j510L59k25k384Q27M800K8m842j131K251J764J395o92n315
2486c772p89N800K486l945k335j48Q89K873K016m155k820L383J847j002k99L35
$$ plain form
2502 364 -1707 -1347 1416 244 -934 262 -800 -3265 -435 2452 223 -2140 -1372 -1022 473 2842
2518 2842 204 -4143 -1925 2735 2377 -611 -1795 -2723 -834 2894 1462 -3876 -3405 1025 1014 76
2534 76 -130 -1795 -1753 1783 2070 -1254 -1100 509 -621 -1133 1169 633 -1747 -1204 -778 -1399 484 2263
2552 2263 -1977 -3956 40 2433 1011 -261 -2153 -2713 1249 4572 -336 -4252 -2027 1194 1467
2567 1467 764 -1636 -4266 -608 3241 612 -2369 -968 279 -116 1197 660 -2035 -1151 1183 -662
2583 -662 -1431 982 642 -2672 -1597 475 149 440 -66 -2579 -2132 2836 2961 -1657 -2731 -391 1096
2600 1096 1966 1115 -3204 -3540 1531 3264 -525 -2354 -1603 -274 1447 2930 -1035 -3086 180 2425
2616 2425 428 -101 540 -1010 -846 1392 727 -875 232 -246 -2067 255 2867 607 -1787 -717
$$ packed form
2502C64k071L60K763j172j178J196j062k465K830K887k229k363P68L50J495K369
2518B842k638m347K218M660l58k988j184r28J889L728j432n338M71M430j1r38
2534G6k06j665M2L536K87l324J54J609j130n12K302n36k380N43M26o21J883J779
2552B263m240j979L996K393j422j272j892n60L962L323m908l916K225L221K73
2567A467p03k400k630L658L849k629k981J401J247l95J313n37k695Q84K334j845
2583f62p69K413l40l314J075K072l26K91n06k513M47M968J25m618j074K340J487
2600A096Q70q51m319l36N071J733l789j829P51J329J721J483l965k051L266K245
2616B425j997n29O41j550J64K238o65j602J107m78j821K322K612k260k394J070
$$ plain form
2632 -717 79 1238 2780 524 -3255 -1552 3000 2273 -352 -1347 -1956 -369 2835 2094 -2594 -2282 1426
2649 1426 1763 583 807 -698 -1399 1385 2167 -446 -547 795 -506 -1090 1311 708 -1502 -1138 124
2666 124 -702 1150 2383 -1361 -2501 896 2428 716 -511 -1577 -2087 1601 3233 -723 -3504 -1115
2682 -1115 1254 879 626 -680 -2725 -209 3032 670 -1692 -163 297 -662 911 937 -986 -1282 220
2699 220 -563 -758 1307 330 -2291 -1711 1421 810 158 72 -1994 -1165 2624 2095 -2084 -2397 -41 497
2717 497 852 367 -2379 -2934 1403 2413 -1100 -1709 -716 -347 740 1656 -821 -2268 516 1298 -526
2734 -526 -351 549 -1183 -984 765 312 -576 125 -243 -1885 696 2801 210 -2005 -1066 875 1164
2751 1164 1747 -615 -3104 -940 2955 1585 -1731 -1359 -1260 -129 2480 1067 -2229 -1513 1610 1297
$$ packed form
2632g17P96J159J542k256l779J703M552p27k625r95o09J587L204p41m688L12L708
2649A426L37j180K24j505p01K784P82k613j01J342j301n84K401o03k210L64J262
2666A24q26J852J233l744j140L397J532j712j227j066n10L688J632l956k781K389
2682a115K369l75k53j306k045K516L241k362k362J529M60r59J573K6j923k96J502
2699B20p83j95K065r77k621N80L132o11o52q6k066Q29L789n29m179l13K356N38
2717D97L55m85k746n55M337J010l513o09R93L69J087R16k477j447K784P82j824
2734e26J75R00j732J99J749m53q88P01l68j642K581K105k591k215R39J941K89
2751A164N83k362k489K164L895j370l316L72R9J131K609j413l296P16L123l13
$$ plain form
2767 1297 324 627 -636 -926 932 1584 -71 -391 887 -855 -939 1566 1507 -1039 -1015 117 272 1832
2785 1832 2121 -1382 -2449 1270 2723 998 -901 -1308 -1096 1718 2888 -857 -2902 -345 1679 782
2801 782 403 -134 -1849 176 2439 494 -1358 102 753 -823 486 930 -754 -439 378 -544 135
2818 135 1798 752 -2333 -1331 1609 1270 318 -699 -1750 -853 2763 1853 -2510 -2717 107 1028 1106
2835 1106 128 -2219 -2118 1334 1883 -1000 -1649 -166 -379 490 869 -1086 -2244 168 921 -1213 -756
2852 -756 122 -1072 -1574 -188 -74 -874 -262 -556 -2158 -61 1920 -470 -2371 -1023 -53 570 836
2869 836 -1139 -3494 -1373 2261 675 -1979 -1816 -1033 -399 1396 315 -2623 -1878 1381 548 -360 -325
2886 -325 -1329 -1712 131 730 -1044 -999 -100 -1152 -1041 1083 561 -1603 -1400 -10 -300 1089 1229 -1916
$$ packed form
2767A297r73L03j263k90J858O52j655l20J278j742q4K505n9k546K4J132J55J560
2785A832K89l503j067L719J453j725j899m07K12K814J170l745k045K557K024q97
2801G82l79n37j715K025K263j945j852J460O51j576J309M44j684L15Q17r22O79
2818A35J663j046l085J002K940l39r52j017j051Q97L616r10m363k07K824R21P8
2835A106r78k347J01L452N49k883o49J483k13Q69L79j955j158K412P53k134M57
2852g56Q78j194n02J386J14q00O12k94j602K097J981k390j901J348R70O23K66
2869H36j975k355K121L634j586k654J63P83O34J795j081k938P45L259q33r08L5
2886c25j004l83J843N99j774M5Q99j052J11K124n22k164K03J390k90J389J40l145
$$ plain form
2904 -1916 -2496 639 1837 199 -1209 -1555 -1152 853 2083 -609 -2392 -500 956 555 183 -405
2920 -405 -1356 -111 1927 85 -1067 63 214 -716 362 899 -516 -991 266 -56 27 1430 148
2937 148 -1919 -962 1800 863 173 -393 -1456 -504 1968 1062 -2236 -1899 366 899 581 226 -1477 -1314
2955 -1314 1517 1933 -618 -955 243 61 450 940 -237 -1128 102 549 -491 -31 825 -550 -1116
2972 -1116 685 699 108 229 -392 -1005 751 2288 -72 -1860 -294 647 581 885 -506 -2062 -169
2989 -169 1996 476 -1348 -426 52 292 1615 670 -1706 -690 1241 676 -167 113 -260 -1247 160
3006 160 1012 -401 -443 10 -974 -508 1727 1172 -976 -1349 148 940 1049 606 -1756 -2056 1095 2135
3024 2135 -161 -1562 -1117 -264 1040 1904 -456 -2153 -10 1170 301 361 -51 -1113 -357 953 258
$$ packed form
2904a916n80L135J198j638j408l46M03K005J230k692j783J892J456m01l72n88
2920d05r51J245K038j842j152J130J51r30J078N37j415m75J257l22Q3J403j282
2937A48k067R57K762r37o90n66j063R52K472r06l298L37K265N33l18l55j703J63
2955a314K831M16k551l37J198j82L89M90j177q91J230M47j040M60Q56j375n66
2972a116J801J4n91J21o21o13J756J537k360j788J566R41o6L04j391j556J893
2989a69K165j520j824R22M78K40J323r45k376J016J931n65q43K80l73r87J407
3006A60Q52j413m2M53r84M66K235n55k148l73J497P92J09m43k362l00L151J040
3024B135k296j401M45Q53J304Q64k360j697K143J180q69O0m12j062P56J310o95
$$ plain form
3041 258 -712 458 -24 -1163 228 1332 -110 -739 -269 -206 313 1274 416 -1789 -392 1587 1042 -423
3059 -423 -878 -1148 -562 1631 522 -2038 -1757 879 844 413 -330 -1235 -964 1316 1372 -860 -594 375 86
3078 86 -46 505 -240 -708 175 176 -620 -26 849 -437 -1145 536 910 319 233 -422 -803 699 2161 34
3098 34 -1834 -430 875 961 496 -832 -1782 97 2206 572 -1005 -496 306 605 1371 603 -1225 -512
3116 -512 1341 455 -458 131 124 -720 113 861 31 -223 433 -209 -376 1316 1217 -615 -751 539 844 952
3136 952 685 -1359 -1528 1098 1951 241 -1123 -461 -249 1478 1859 -268 -1684 322 1340 605 574
3153 574 214 -756 -148 1107 949 -418 345 67 -350 513 1361 392 -847 176 165 620 1042 247 -1403
3172 -1403 -477 1542 897 -60 -405 -374 10 1677 794 -949 -734 935 1079 500 147 -386 -606 721
$$ packed form
3041B58r70J170m82j139J391J104j442o29M70O3N19R61q58k205J397J979n45j465
3059d23m55k70N86K193j109k560K81K636l5m31p43r05K71K280N6k232K66R69k89
3078H6j32N51p45m68Q83Jp96N94Q75j286p08J681L74n91q6o55l81J502J462k127
3098C4j868J404J305Q6m65j328r50J879K109j634j577N09Q02K99P66p68j828P13
3116e12J853q86r13N89pq44Q33P48q30k54O56o42j67J692r9j832j36J290L05J08
3136I52k67k044j69K626Q53j710j364O62K12J727L81k127j416K006J018p35l1
3153E74l60r70O08J255j58j367P63k78m17Q63Q48r69j239J023j1M55M22p95j650
3172a403R26K019o45r57l45L1L84J667q83j743K15J669J44n79l53n33k20J327
$$ plain form
3190 721 1205 -448 -324 709 45 -242 633 257 -795 119 193 -104 248 997 -330 -1034 628 1069 259
3209 259 -105 -331 -714 304 1810 -212 -1883 -390 913 477 246 -678 -1508 -23 1733 180 -1214
3226 -1214 -364 -58 -8 689 97 -1060 -697 371 12 -639 137 111 -1230 -319 608 189 -314 -32 -597
3245 -597 -530 844 487 -1039 -1018 75 393 370 24 -1050 -1426 720 1086 -908 -915 -372 -268 405 798 -691
3265 -691 -1544 -12 913 -214 -370 -192 -636 -623 714 84 -431 -150 -251 -987 355 1040 -248 -1304
3283 -1304 -438 -35 367 1046 -344 -1773 -891 1430 850 -718 -1020 -750 18 1278 572 -1464 -1316 921
3301 921 690 -169 -173 -506 -749 429 999 -588 -524 342 -97 -759 493 194 -380 -28 -125 -420 37 761
3321 761 -774 -1082 393 1024 -78 -584 -280 -902 452 1259 -135 -1719 -187 845 480 -155 -407
$$ packed form
3190G21M84j653J24J033o64k87Q75l76j052R14P4k97L52P49j327p04J662M41q10
3209B59l64k26l83J018J506k022j671J493J303m36k31r24q30J485J756j553j394
3226a214Q50L06N0O97n92j157L63J068l59o51P76k6j341R11R27m19n03K82n65
3245e97O7J374l57j526K1J093L18k3l46j074l76K146L66j994pN43J04O73L93j489
3265f91q53J532R25j127j56J78m44J3J337o30n15K81j01p36J342O85j288j056
3283a304Q66M03M02O79j390j429Q82K321n80j568l02K70P68J260p06k036J48K237
3301I21k31q59ml33k43J178N70j587O4Q66m39o62J252k99n74L52r7k95M57P24
3321G61j535l08J475O31j102n06L04o22J354Q07j394j584J532J032l65o35k52
$$ plain form
3338 -407 -1047 -49 1579 2 -1461 -347 250 194 576 288 -802 -422 310 109 -336 -34 251 -809
3356 -809 -285 660 -63 -229 -190 -371 -767 913 774 -716 -990 -99 281 523 -70 -726 -938 747 1131
3375 1131 -349 -899 -329 9 521 685 -380 -1456 -122 703 -261 -590 -254 -627 -567 553 210 -379
3393 -379 -135 -212 -577 432 752 -28 -890 127 178 582 772 165 -1141 -282 1175 629 -488 -724 -1
3412 -1 193 995 512 -965 -718 500 796 253 112 -486 -681 546 804 -73 -70 197 -115 136 859 758
3432 758 -252 -177 318 89 771 935 39 -491 434 949 69 -317 -110 -222 319 1216 -169 -1197 -28
3451 -28 803 686 344 -182 -455 136 1611 627 -580 -282 470 71 567 280 -359 -320 390 -10 -40 638
3471 638 246 -408 -291 873 414 -105 -192 -163 -9 838 876 -513 -991 358 531 460 314 -869 -717 1015
$$ packed form
3338d07o40R98J628j577j463J114N97n6L82k88j090L80P32k01m45L02K85j060
3356h09N24R45p23j66L9j81l96J680j39j490k74Q91L80K42n93o56k12J685L84
3375A131j480n50N70L38N12J64j065j076J334Q25r64l29L36l73O0J120l43n89
3393c79K44p7l65J009L20p80q62J017N1M04J90o07j306Q59J457n46j117k36P23
3412aJ94Q02m83j477K47J218K96n43j41n98j95J227K58q77LK67l12K51P23j01
3432G58j010P5M95k29O82J64q96n30R25N15q80l86K07j12N41Q97j385j028J169
3451b8Q31j17l42n26k73N91J475r84j207K98P52l99M96k87o39L9P10m00l0O78
3471F38l92o54J17J164m59n19q7K9J54Q47L8j389m78J349J73p1j46j183J52J732
$$ plain form
3491 1015 985 -208 -559 -101 125 230 846 -5 -779 131 922 78 -11 82 -242 -602 520 240 -148 -94
3511 -94 -237 -525 333 932 -64 -969 -387 535 470 470 -236 -875 -185 1069 608 -436 -479 -80 215 827 420
3532 420 -835 -551 504 880 -235 -267 -238 -626 118 536 -263 -446 84 -192 10 595 508 -411 -464 340
3552 340 96 357 736 -325 -676 567 1268 409 -491 -443 -248 695 1344 -183 -1272 510 986 466 -164
3571 -164 -172 -413 210 866 174 -546 -128 169 -189 353 828 -208 -239 313 280 13 629 313 -568 -433 669
3592 669 619 -65 119 -381 -206 1206 815 -793 -807 427 680 568 211 -767 -506 878 918 -263 -661
3611 -661 -84 192 304 537 37 -710 25 698 185 -152 261 -105 -268 724 283 -70 123 144 -541 240
3631 240 1079 257 -692 -498 194 322 728 -102 -817 -332 998 448 -489 -26 -486 108 557 258 -701 -597
$$ packed form
3491A015l0j193l51M58K26J05O16q51p74R10P91q44q9R3l24l60J122k80l88N4
3511i4j43k88Q58N99r96r05N82R22o5%p06o39O90J254m61j044m3L99K95O12m07
3532D20j255K84J055L76j115l2K9l88P44M18p99j83N30k76K02N85q7r19n3Q04
3552C40k44K61L79j061l51J243P01q59r00M8J95R43O49j527j089J782M76n20o30
3571a64qk41O23O56o92p20M18K97l58N42M75j036l1N52l3k67O16l16q81J35J102
3592F69n0o84J84n00J75J412l91j608j4J234K53j12l57r78K61J384M0j181l98
3611f61N77K76J12K33n00p47P35O73n13l37M13l66j63R92m41l53J93K1o85P81
3631B40Q39q22r49J94O92J28M06q30p15M85J330n50r37M63m60N94M49k99r59J04
$$ plain form
3651 -597 906 498 -341 -136 -34 -401 -199 754 -84 -268 -5 182 -338 319 332 -385 -781 10 -17 187
3671 187 370 -719 -798 674 967 -42 -696 -340 -130 216 882 -468 -939 -296 709 292 -132 -219 -483
3690 -483 -302 554 421 -483 -400 7 -430 195 673 35 -669 -101 271 -67 248 -116 -421 -658 641 720
3710 720 -294 -414 -341 -119 1043 545 -544 -711 212 832 38 -190 -495 -395 157 679 -155 -929 -348
3729 -348 -31 35 291 -150 -670 -321 327 -77 -172 76 -146 -557 46 359 -148 -218 -353 -316 -14 552 -78
3750 -78 -956 -256 563 -3 -126 -234 -919 41 735 440 -563 -448 -103 -86 411 153 -854 -612 566 328
3770 328 -194 -128 29 -479 57 645 -209 -280 149 -337 -119 569 211 -587 -461 65 308 16 13 -529 -848
3791 -848 456 1128 -504 -374 -339 -225 306 614 -298 -1039 -8 684 15 -332 33 -337 -127 199 356
$$ packed form
3651e97J503m08q39K05J02l67K02R53q38j84K63J87n20O57J3p17l96P91k7K04
3671A87J83j089p9J472K93j009o54L56K10L46O66j350m71O43J005m17m24q7k64
3690d83J81Q56j33r04Q3M07m37O25M78o38p04N68L72l38L15l64l05k37J299P9
3710G20j014j20P3K22J162m98j089j67R23O20p94k28l05J00N52N22q34p74N81
3729c48L17O6K56m41n20L49O48m04r5K48k22m11O03L13n07p0j35L7L02N66o30
3750g8q78P00Q19n66j23j08o85R60O94k95j003J15L45J7M97k58j007K42J178k38
3770C28n22O6J57n08N36N88q54p1M29m86K18O88l58p98J26N26K43k92ln42l19
3791h48J304O72j632J30L5J14N31L08r12p41J031O92o69l47L65l70K10L26J57
$$ plain form
3810 356 -603 -183 -144 -111 -122 504 -150 -840 -14 182 322 281 -101 -921 -300 956 625 -340 -276 -48 -64 552
3832 552 667 -719 -943 460 808 433 -45 -153 -217 371 964 -226 -253 229 147 -109 258 171 -400 66
3852 66 277 129 -15 226 -88 -914 179 594 -14 -46 340 -103 307 851 45 -924 -117 564 549 248 -349
3873 -349 -588 -415 999 555 -647 -430 179 155 382 105 -157 -491 319 543 -644 42 -152 -253 207
3892 207 573 262 -200 242 95 -92 417 618 -214 -531 168 120 164 116 -666 -424 357 899 114 -455 -74
3913 -74 356 310 608 -4 -786 88 674 506 -121 -46 -355 -328 567 378 -647 -325 -5 -355 26 828 -204
3934 -204 -777 0 432 19 303 -97 -899 -339 861 530 -262 -194 -75 -302 518 656 -630 -485 319 644
3954 644 266 -130 -408 -471 176 547 -171 -439 230 189 105 482 188 -431 -420 95 121 -108 462 -428 -594 286
$$ packed form
3810C56r59M20L9L3j1O26o54o90Q26J96J40m1l82q20O21J256l31r65O4K28j6O16
3832E52J15j386k24J403L48l75m78j08o4N88N93j190k7M82q2k56L67q7n71M66
3852F6K11j48j44K41l14q26J093M15o08l2L86m43M10N44q06r69Q07O81j5l01n97
3873c49k39J73J414m44j202K17O09k4K27k77k62l34Q10K24j187O86j94j01M60
3892B07L66l11m62M42j47j87N09K01q32l17O99m8M4m8p82K42P81N42p85n69L81
3913g4M30m6K98o12p82Q74N86j68o27P5l09K7Q95j89j025L22L20l50L81Q02j032
3934b04n73P77M32m13K84m00q02N60J200l31p92O8J19k27Q20J38j286J45Q04L25
3954F44l78l96k78o3O47L71p18k68O69m1q4L77k94o19J1N15K6k29N70q90j66Q80
$$ plain form
3976 286 527 -15 -318 169 -400 353 422 85 -891 7 304 140 -2 -182 -641 -87 430 175 -431 -227
3996 -227 332 57 22 228 -92 -571 96 562 -89 -221 -168 -469 -76 364 175 -208 -183 -1 -294 162 426
4017 426 -471 -527 142 448 -220 -131 -282 -522 271 759 -306 -691 18 71 -5 65 -284 -906 -249 535 159
4038 159 -190 146 -373 -257 302 574 -25 -459 -34 -62 -221 631 204 -659 -407 364 119 7 -184 -543
4058 -543 -303 526 400 -543 -489 -210 -36 489 356 -582 -875 524 380 -21 -76 -203 -453 291 739 -179
4078 -179 -229 109 213 -91 333 249 -553 -195 161 -98 -1 399 -4 -645 10 619 124 -463 -276 -378 180
4099 180 1041 -106 -884 -334 375 309 -5 -89 -311 215 662 644 -392 96 284 65 293 390 -90 -322 372
4120 372 641 -442 71 407 -180 248 726 276 -196 -115 27 -232 398 303 -462 -756 270 313 184 173 -314
$$ packed form
3976B86K41n42l03M87n69P53O9l37r76Q98K97j64j42j80m59N54N17k55o06K04
3996b27N59k75l5K06l20m79O67M66o51j32N3l01L93M40j89l83K5J82k93M56K64
4017D26q97n6O69L06o68Q9j51k40P93M88j065l85P09N3p6P0l49o22O57P84l76
4038A59l49L36n19J16N59K72n99m34M25k8j59Q52m27q63K52P71k45j12j91l59
4058e43K40Q29j26r43N4K79J74N25j33r38k93J399j44m01n5j27k50P44M48r18
4078a79n0L38J04l04M24q4q02L58L56k59R7M00m03o41O55O09m95n87J87j02N58
4099A80Q61j147p78N50P09o6l14q4k22N26M47j8j036M88J88k19K28R7m80k32O94
4120C72K69j083N13L36n87M28M78m50m72Q1J42k59O30r5p65k94J026M3j29j1m87
$$ plain form
4141 -314 -407 487 405 76 -572 -528 43 287 374 -228 -820 -200 639 -143 -99 -195 -96 -398 340 343 -121 -388 -363
4164 -363 -311 -338 363 -108 -853 -310 276 -153 63 -94 -835 -363 683 536 -726 -484 -400 -8 201 232 -642
4185 -642 -537 372 539 69 -417 -654 -526 13 482 -96 -788 -219 -220 -144 332 226 -804 -440 481 344 28
4206 28 274 -434 -586 116 256 -71 -396 -631 26 91 832 -190 -1015 -103 384 186 -255 -49 -349 -257 490
4227 490 300 -579 -283 217 -166 20 235 -251 -407 56 481 -163 -113 95 -312 -211 272 209 -538 105 15
4248 15 -179 315 410 -242 -311 160 355 -10 -121 -64 -340 513 597 -43 -803 143 190 219 512 1 -416 -50
4270 -50 477 70 -34 289 -234 -234 490 508 -336 -388 27 201 34 696 92 -971 86 399 92 -225 2
4291 2 -693 -114 730 621 -496 -357 335 121 268 243 -575 -695 668 326 15 -345 -22 -264 137 446
$$ packed form
4141c14r3Q94q2l29o48M4N71K44Q7o02n92O20Q39p82M4r6R9l02P38Lm64k67K5
4164c63N2k7P01m71p45N43N86m29K16j57p41M72J046j47j262K42Q4L92K09L1q74
4185f42J05R09J67m70m86k37J28N39M69n78o92N69jP6M76j06j030L64R21j37l16
4206B8K46p08j52P02J40l27l25k35O57O5P41j022q25R12M87j98m41K06l00R2P47
4227D90j90q79K96N00l83J86K15m86j56M63M25o44N0K08m07J01M83o3p47O43r0
4248A5j94M94R5o52o9M71J95l65j11N7k76Q53Q4o40p60R46M7K9K93n11m17L66
4270e0N27m07j04L23n23%P24J8q44n2M15J74j67O62o04j063J057L13l07l17K27
4291Bo95N79Q44j09j117J39O92k14J47k5q18j20J363l42l11l60L23k42M01L09
$$ plain form
4311 446 -249 -445 -70 178 -194 345 69 -390 -288 422 254 -183 225 -316 -578 310 852 -177 -382 -76
4331 -76 -201 94 627 -63 -691 92 762 33 -186 -231 -534 35 614 44 -138 -175 113 57 -202 119 -93
4352 -93 -351 191 231 22 522 514 -554 -342 537 121 -186 -43 -48 -218 276 240 -734 -621 10 316 38 -508
4374 -508 -522 -299 331 475 -189 -580 -257 51 86 64 90 -687 -360 544 -8 -73 166 -269 -78 220 572 -446
4396 -446 -588 -26 71 -54 317 78 -512 -227 256 60 -33 182 -522 -130 627 137 -424 -236 -108 37 284
4417 284 345 -611 -516 388 478 -70 -245 -149 -294 -192 138 -100 -434 -110 -219 -206 294 171 -342 -400 208 100
4439 100 97 -2 -228 -83 507 577 -88 -454 -124 107 286 -10 128 -824 -224 477 54 -188 37 -305 -101
4460 -101 365 313 -285 -454 252 191 62 491 102 -395 39 345 -43 -344 329 -446 71 345 361 -93 -128
$$ packed form
4311D46o95j96L75K48l72N39k76m59J02P10j68m37M08n41k62Q88N42j029k05L06
4331g6j25K95N33o90o28P83O70p29k19m5l03N69N79n70j82l7K88n6k59L21k12
4352i3k58N42M0k09N00qj068K12Q79m16l07J43nj70M94l6r74J13O31L06k78n46
4374e08j4K23O30J44o64l91L23L08L5k2K6p77L27R04n52o5K39m35J91K98L52j018
4396d46j42N62R7j25L71k39n90K85M83j96r3K15p04L92P57m90n61J88J28J45K47
4417B84O1r56R5R04R0n48j75R6j45J02L30k38l34L24j09J3N00j23n13n8O08j08
4439A00lr9k26J45N90P0o65l66L30K31J79k96J38r52O00P01m23k42K25l42K04
4460a01M66n2n98j69P06o1j29M29l89m97M34L06l88l01O73p75N17K74J6m54l5
$$ plain form
4481 -128 71 -153 625 221 -654 -341 397 406 -82 -153 -384 -66 22 659 -12 -486 -136 57 165 -90 -36 -269
4503 -269 -47 465 409 -22 221 237 -412 230 442 105 -213 108 -168 139 648 -5 -790 -138 695 216 -285
4524 -285 -226 -259 62 396 435 -661 -38 140 -39 188 -24 -301 -487 336 282 -140 -134 258 -247 29 273 -168
4546 -168 -196 -120 -202 166 4 302 -799 -298 275 54 -17 -46 -35 -494 384 220 85 -223 4 -8 -140 263
4568 263 -23 -613 -29 727 -94 -279 66 -39 -32 534 267 -343 -34 15 -99 341 248 14 -419 115 56 171
4590 171 133 -224 -352 -167 420 274 -250 -149 293 -58 121 -66 -301 -400 233 361 -34 -169 13 -403 344
4611 344 480 -272 -333 -65 237 -29 179 -328 -216 27 539 80 4 280 -91 -310 113 419 -179 -150 35
4632 35 -206 -256 410 135 -467 -184 305 -53 -116 113 -280 87 385 515 -94 -615 291 -61 -61 30 -377 -313
$$ packed form
4481a28J99k24P78m04q75L13P38Rm88p1k31L18Q8O37o71m74L50J93J08k55N4k33
4503b69K22N12n6m31K43J6o49O42K12l37l18L21k76L07N09o53p85O52Q33m79n01
4524b85N9l3L21L34L9j096O23J78j79K27k12k77j86Q23n4m22OL92n05K76K44m41
4546a68k8P6q2L68j62K98j101N01N73k21p1k9J1m59Q78j64j35l08K27j2j32M03
4568B63k86n90N84P56q21j85L45j05PN66k67o10L09M9j14M40r3k34m33N34n9J15
4590A71l8l57j28J85N87j46n24J01M42l51J79j87k35r9O33J28l95j35J82m16P47
4611C44J36p52o1K68L02k66K08n07J12K43N12m59p6K76l71k19M23L06n98K9J85
4632C5k41n0O66k75o02K83M89l58o3K29l93L67K98J30o09n21R06l52%R1m07O4
$$ plain form
4654 -313 470 117 -160 -329 65 183 -70 295 -382 -164 -43 226 -117 440 342 -770 -709 234 359 8
4674 8 150 -133 -584 442 575 -432 -226 -189 41 -66 219 -588 -628 -539 660 179 -332 -183 -548 -325 28
4695 28 -21 -391 -216 -123 250 -118 145 -505 -523 -248 396 -41 -78 -46 -111 -91 318 368 -511 -430 35 122 -3 63
4719 63 -681 -430 266 283 -123 -156 -296 -307 352 152 -57 -446 454 -191 -34 271 90 -299 -380 147 232 173
4741 173 83 -282 -275 250 318 -379 -480 121 -252 114 431 -88 -367 -166 427 -54 -133 123 -2 -195 163 175
$$ packed form
4654c13P83l53k77j69L94J18k53L65o77K18J21K69l43N57r8j112O1R43J25l51
4674HJ42k83m51J026J33j007K06L7K30j07K85q07m0Q9J199m81n11J49l65K23L53
4695B8m9l70J75R3L73l68K63o50j8K75O44m37l7L2o5K0M09N0q79Q1M65Q7j25O6
4719F3p44K51O96J7m06l3j40j1O59k00k09l89R00o45J57L05j81l89q1N27Q5n9
4741A73r0l65PN25O8o97j01O01l73L66L17n19k79K01N93m81p9K56j25j93L58J2
$$ [...]
8191a53
##END NTUPLES=NMR FID
##END=
