##TITLE=1H_TG-2264
 CDCl3, 8 sc, 
 22.11.2019
##JCAMPDX= 6.0         $$ Bruker NMR JCAMP-DX V2.0
##DATA TYPE= NMR FID
##DATA CLASS= NTUPLES
##ORIGIN= UXNMR, Bruker Analytische Messtechnik GmbH
##OWNER= root
$$ XWIN-NMR		Version 3.5
$$ Fri Nov 22 14:09:45 2019 Russian Standard Time (UT+4h)  she@DPX200
##.OBSERVE FREQUENCY= 200.1315
##.OBSERVE NUCLEUS= ^1H
##.DELAY= (6, 6)
##.ACQUISITION MODE= SIMULTANEOUS
##.ACQUISITION SCHEME= undefined
##.AVERAGES= 8
##.DIGITISER RES= 18
##SPECTROMETER/DATA SYSTEM= spect
##.PULSE SEQUENCE= zg30
##.SOLVENT NAME= CDCl3
##.SHIFT REFERENCE= (INTERNAL, CDCl3, 0, 15.7039)
##AUDIT TRAIL= $$ (NUMBER, WHEN, WHO, WHERE, WHAT)
$$ ##TITLE= Audit trail, XWIN-NMR		Version 3.5
$$ ##JCAMPDX= 5.01
$$ ##ORIGIN= Bruker BioSpin GmbH
$$ ##OWNER= she
$$ F:/spectra/data/she/nmr/H-F/1/audita.txt
$$ ##AUDIT TRAIL=  $$ (NUMBER, WHEN, WHO, WHERE, WHAT)
(   1,<2019-11-22 14:08:32.21 +0400>,<she>,<DPX200>,
      <created by zg, POWCHK disabled, PULCHK disabled
       configuration hash MD5:
       00 E9 B6 7A A2 85 ED C7 34 08 36 98 17 FE 4E 26
       data hash MD5: 16K
       5C 9E 13 B1 44 72 E0 4D 9A C9 3B 86 34 CA 35 4D>)
$$ ##END=
$$ 
$$ hash MD5
$$ 6A 72 BF 50 2C FE F1 C0 81 5E A5 AC B6 0A B6 AF
##$RELAX= 
##$RELAX= 
##$RELAX= 
##$RELAX= 
##$RELAX= 
##$RELAX= 
$$ Bruker specific parameters
$$ --------------------------
##$DU= <F:/spectra>
##$EXPNO= 1
##$NAME= <H-F>
##$PROCNO= 1
##$TYPE= <nmr>
##$USER= <she>
##$AMP= (0..31)
100 100 100 100 100 100 100 100 100 100 100 100 100 100 100 100 100 100 
100 100 100 100 100 100 100 100 100 100 100 100 100 100 
##$AQSEQ= 0
##$AQ_mod= 1
##$AUNM= <au_zg>
##$AUTOPOS= <>
##$BF1= 200.13
##$BF2= 200.13
##$BF3= 200.13
##$BF4= 200.13
##$BF5= 200.13
##$BF6= 200.13
##$BF7= 200.13
##$BF8= 200.13
##$BYTORDA= 1
##$CFDGTYP= 0
##$CFRGTYP= 5
##$CHEMSTR= <none>
##$CNST= (0..31)
1 1 145 1 1 1 1 1 1 1 1 1 1 1 1 1 1 1 1 1 1 1 1 1 1 1 1 1 1 1 1 1 
##$CPDPRG= <>
##$CPDPRG1= <>
##$CPDPRG2= <>
##$CPDPRG3= <>
##$CPDPRG4= <mlev>
##$CPDPRG5= <mlev>
##$CPDPRG6= <mlev>
##$CPDPRG7= <mlev>
##$CPDPRG8= <mlev>
##$CPDPRGB= <>
##$CPDPRGT= <>
##$D= (0..31)
0 1.2 0 0 0 0 0 0 0 0.06 0 0.03 0 0 0 0 0.0002 0 0 0 0 0 0 0 0 0 0 0 0 
0 0 0 
##$DATE= 1574417311
##$DBL= (0..7)
120 120 120 120 120 120 120 120 
##$DBP= (0..7)
150 150 150 150 150 150 150 150 
##$DBP07= 0
##$DBPNAM0= <>
##$DBPNAM1= <>
##$DBPNAM2= <>
##$DBPNAM3= <>
##$DBPNAM4= <>
##$DBPNAM5= <>
##$DBPNAM6= <>
##$DBPNAM7= <>
##$DBPOAL= (0..7)
0.5 0.5 0.5 0.5 0.5 0.5 0.5 0.5 
##$DBPOFFS= (0..7)
0 0 0 0 0 0 0 0 
##$DE= 6
##$DECBNUC= <off>
##$DECIM= 24
##$DECNUC= <off>
##$DECSTAT= 4
##$DIGMOD= 1
##$DIGTYP= 9
##$DL= (0..7)
0 120 120 120 120 120 120 120 
##$DP= (0..7)
150 150 150 150 150 150 150 150 
##$DP07= 0
##$DPNAME0= <>
##$DPNAME1= <>
##$DPNAME2= <>
##$DPNAME3= <>
##$DPNAME4= <>
##$DPNAME5= <>
##$DPNAME6= <>
##$DPNAME7= <>
##$DPOAL= (0..7)
0.5 0.5 0.5 0.5 0.5 0.5 0.5 0.5 
##$DPOFFS= (0..7)
0 0 0 0 0 0 0 0 
##$DQDMODE= 0
##$DR= 18
##$DS= 0
##$DSLIST= <SSSSSSSSSSSSSSS>
$$ [...]
##$SUBNAM2= <"">
##$SUBNAM3= <"">
##$SUBNAM4= <"">
##$SUBNAM5= <"">
##$SUBNAM6= <"">
##$SUBNAM7= <"">
##$SUBNAM8= <"">
##$SUBNAM9= <"">
##$SW= 24.9337058887773
##$SWIBOX= (0..15)
0 0 2 0 0 0 0 0 0 0 0 0 0 0 0 0 
##$SW_h= 4990.01996007984
##$TD= 16384
##$TD0= 1
##$TE= 0
##$TE2= 300
##$TE3= 300
##$TEG= 300
##$TL= (0..7)
0 120 120 120 120 120 120 120 
##$TP= (0..7)
150 150 150 150 150 150 150 150 
##$TP07= 0
##$TPNAME0= <>
##$TPNAME1= <>
##$TPNAME2= <>
##$TPNAME3= <>
##$TPNAME4= <>
##$TPNAME5= <>
##$TPNAME6= <>
##$TPNAME7= <>
##$TPOAL= (0..7)
0.5 0.5 0.5 0.5 0.5 0.5 0.5 0.5 
##$TPOFFS= (0..7)
0 0 0 0 0 0 0 0 
##$TUNHIN= 0
##$TUNHOUT= 0
##$TUNXOUT= 0
##$USERA1= <user>
##$USERA2= <user>
##$USERA3= <user>
##$USERA4= <user>
##$USERA5= <user>
##$V9= 5
##$VALIST= <valist>
##$VCLIST= <CCCCCCCCCCCCCCC>
##$VD= 0
##$VDLIST= <DDDDDDDDDDDDDDD>
##$VPLIST= <PPPPPPPPPPPPPPP>
##$VTLIST= <TTTTTTTTTTTTTTT>
##$WBST= 1024
##$WBSW= 4
##$XGAIN= (0..3)
0 0 0 0 
##$XL= 0
##$YL= 0
##$YMAX_a= 471525
##$YMIN_a= -238441
##$ZGOPTNS= <>
##$ZL1= 120
##$ZL2= 120
##$ZL3= 120
##$ZL4= 120
##$ABSF1= 10
##$ABSF2= 0
##$ABSG= 5
##$ABSL= 3
##$ALPHA= 0
##$AQORDER= 0
##$ASSFAC= 0
##$ASSFACI= 0
##$ASSFACX= 0
##$ASSWID= 0
##$AUNMP= <proc_1d>
##$AZFE= 0.1
##$AZFW= 0.1
##$BCFW= 1
##$BC_mod= 2
##$BYTORDP= 1
##$COROFFS= 0
##$CY= 11.3945322036743
##$DATMOD= 1
##$DC= 2
##$DFILT= <>
##$DTYPP= 0
##$F1P= 16.9975609425685
##$F2P= -3.02152046262296
##$FCOR= 0.5
##$FTSIZE= 0
##$FT_mod= 4
##$GAMMA= 1
##$GB= 0.15
##$INTBC= 1
##$INTSCL= 1
##$ISEN= 128
##$LB= 0.24
##$LEV0= 0
##$LPBIN= 0
##$MAXI= 10000
##$MC2= 0
##$MEAN= 0
##$ME_mod= 0
##$MI= 1.114404
##$NCOEF= 0
##$NC_proc= 0
##$NLEV= 6
##$NOISF1= 3.799351
##$NOISF2= 2.8
##$NSP= 1
##$NTH_PI= 0
##$NZP= 0
##$OFFSET= 15.70392
##$PC= 1
##$PHC0= -9791.828
##$PHC1= 17.40086
##$PH_mod= 1
##$PKNL= yes
##$PPARMOD= 0
##$PSCAL= 0
##$PSIGN= 0
##$REVERSE= no
##$SF= 200.130013532006
##$SI= 16384
##$SIGF1= 3
##$SIGF2= 2
##$SINO= 400
##$SIOLD= 16384
##$SREGLST= <1H.CDCl3>
##$SSB= 0
##$STSI= 0
##$STSR= 0
##$SW_p= 3612.71676300578
##$SYMM= 0
##$S_DEV= 0
##$TDeff= 0
##$TDoff= 0
##$TI= <>
##$TILT= no
##$TM1= 0
##$TM2= 0
##$TOPLEV= 0
##$USERP1= <user>
##$USERP2= <user>
##$USERP3= <user>
##$USERP4= <user>
##$USERP5= <user>
##$WDW= 1
##$XDIM= 8192
##$YMAX_p= 0
##$YMIN_p= 0
$$ End of Bruker specific parameters
$$ ---------------------------------
##NTUPLES= NMR FID
##VAR_NAME=  TIME,          FID/REAL,        FID/IMAG
##SYMBOL=    X,             R,               I
##VAR_TYPE=  INDEPENDENT,   DEPENDENT,       DEPENDENT
##VAR_FORM=  AFFN,          ASDF,            ASDF
##VAR_DIM=   8192,          8192,            8192
##UNITS=     SECONDS,       ARBITRARY UNITS, ARBITRARY UNITS
##FACTOR=    0.0002004,     1,               1
##FIRST=     0,             0,               0
##LAST=      1.6414764,     0,               0
##MIN=       0,             -238441,         0
##MAX=       1.6414764,     471525,          0
$$ Real data points
##PAGE= N=1
##DATA TABLE= (X++(R..R)), XYDATA
$$ [...]
2597a734Q46K874k619q44K830j771j297L400K22m470K467L881m414k532L690j21
$$ -1734 -888 1986 -633 -1477 1353 -418 -1715 1685 1907 -2563 -96 3785 -629 -3161 529 408
2613D08k631K829J045l437J272K468m318p19M179M77k680K059j020l191J897L223
$$ 408 -2223 606 1651 -1786 -514 1954 -2364 -3083 1096 1573 -1107 952 -68 -3259 -1362 1861
2629A861l615j556N695n1m457K44J623j929J459K736l736r18M337q86m035J866
$$ 1861 -1754 -3310 2385 2334 -2123 -1879 -256 -2185 -726 2010 -1726 -2644 1693 807 -3228 -1362
2645a362J808j647J409K151l787p87N424q82n123J191K966k045M08K360k267k79
$$ -1362 446 -1201 208 2359 -1428 -2215 3209 2327 -2796 -1605 1361 -684 -276 2084 -183 -462
2661d62M269j884m744J878K918j544J78J861k580q70L722j454m734L362M680l342
$$ -462 3807 1923 -2821 -943 1975 431 609 2470 -110 -980 2742 1288 -3446 -84 4596 1254
2677A254j833J980j044r96K571o37l256K541L063m150p55L351j210j142K786j576
$$ 1254 -579 1401 357 -639 1932 1295 -1961 580 3643 -507 -1262 2089 879 -263 2523 947
2693I47l374L235K891m395j441M441l28k890J327J34j077K666J121m529o05M123
$$ 947 -2427 808 3699 -696 -2137 2304 1976 -914 413 547 -530 2136 3257 -1272 -1877 2246
2709B246j339l103K666P41j855K469J264n531o55N331j7l705Q39J277j409J495
$$ 2246 907 -2196 470 1211 -644 1825 3089 -2442 -3097 2234 2217 -1488 -649 628 -781 714
2725G14M33l857K43N060j821l574K355J443k339J154J618m368l33M674j118m006
$$ 714 1147 -2710 -2467 2593 772 -2802 -447 996 -1343 -189 1429 -2939 -3272 1402 284 -3722
2741c722K440L104k571j51P46k595M34L875j772l464L276J957l776k94K955j703
$$ -3722 -1282 1822 -749 -900 -154 -2749 -2315 1560 -212 -3676 -400 1557 -2219 -2513 442 -1261
2757a261M5L298j591l629K681K017l493m18K585q31m42K514j927k263L494J486
$$ -1261 -1216 2082 491 -3138 -457 1560 -1933 -2351 234 -597 -1039 1475 -452 -2715 779 2265
2773B265m084j37L546j792j233K664q74k687L040J728m412l15M310r04j716J686
$$ 2265 -1819 -1956 1590 -202 -1435 1229 355 -2332 708 2436 -1976 -2291 2019 1115 -601 1085
2789A085j244k043K950N50l562J047M521k004l043K260M29k899J911K253l222
$$ 1085 -159 -2202 748 1298 -2264 -1217 3304 1300 -1743 517 946 -1953 -42 2211 -1011
2804a011L77L148k007k793K490R65j791J695Q91l139R64L334k494k659L149O65
$$ -1011 -634 2514 507 -2286 204 1169 -622 1073 1964 -1175 -211 3123 629 -2030 1119 1784
2820A784l209J362K538l049r1L366j542k593K366J36k500K285J753l624J4L193
$$ 1784 -1425 -63 2475 -574 -665 2701 1159 -1434 932 1068 -1432 853 2606 -1018 -1004 2189
2836B189k179k509L179J307k921R84K313l188q60L007j418j953K849L63k818J100
$$ 2189 10 -2499 680 1987 -934 50 2363 -825 -1685 1322 -96 -2049 800 1163 -1655 -555
2852e55K098l210k7L647j307k749K266J027k804P99J982k448o04L251j207k264
$$ -555 1543 -1667 -1694 1953 646 -2103 163 1190 -1614 -815 1167 -1281 -1885 1366 159 -2105
2868b105K805J397l724M94J856k292m37K835o54k674K889J466l710K52K642j876
$$ -2105 700 2097 -1627 -1133 723 -1569 -2006 829 175 -2499 390 1856 -1854 -1602 1040 -836
2884h36o58L186j386k864K718J490l618J45L369j392j691K667o07k560L173R74
$$ -836 -1494 1692 306 -2558 160 1650 -1968 -1823 1546 154 -1537 1130 523 -2037 1136 2110
2900B110l728J57L228j687j570K540k69k046K351J162l596o5L934j459k137J907
$$ 2110 -1618 -1461 1767 80 -1490 1050 781 -1265 1086 2248 -1348 -1413 2521 1062 -1075 832
2916H32n8j495J698J055l140Q61M040k094l029K324O35k104J519J314l171R28
$$ 832 774 -721 977 2032 -1108 -247 3793 1699 -1330 994 1629 -475 1044 2358 -813 115
2932A15L266k128k666K624R54k454J178J375k826P45K986k542k460K908J386k881
$$ 115 3381 1253 -1413 1211 2165 -289 889 2264 -562 183 3169 627 -1833 1075 2461 -420
2948d20M77K135k157M54K504l360j913L804J089m353R08K627j306l9J308k247
$$ -420 57 2192 35 489 2993 -367 -2280 1524 2613 -1740 -832 1795 489 450 1758 -489
2964d89j288L776M95m215R17K608j561r49J881k109j294M213K28m531P69L461
$$ -489 -1777 1999 2494 -1721 -804 1804 243 -706 1175 -934 -2228 1985 2213 -2318 -1549 1912
2980A912k014j275J597n15j216K541k30l762J775L172k249j906K233n9j618K017
$$ 1912 -102 -1377 220 -295 -1511 1030 800 -2962 -1187 1985 -264 -2170 63 4 -1614 403
2996D03Nl438J833K944k638j975K811N95j960J762k07k903J757K697k646k252
$$ 403 408 -3030 -1197 1747 -891 -2866 -55 540 -1420 342 135 -2768 -1011 1686 -960 -3212
3012c212L455O64k550J170L21k032J905K602l273j658L696M65l010M19J174j700
$$ -3212 243 907 -1643 -473 -152 -2184 -279 2323 -950 -2608 1088 1553 -1457 -1038 136 -1564
3028a564J604J605k937r64L914K56l489Q89J872k016L59J776k769l79L828k86
$$ -1564 40 1645 -1292 -2256 1658 1914 -1575 -686 1186 -830 -471 1305 -1464 -1843 1985 1699
3044A699l513Q33K605j676o26J762j998j94L093r20l359J458K698j921q23J976
$$ 1699 -1814 -981 1624 -52 -678 1084 -914 -1108 1985 1065 -2294 -836 1862 -59 -882 1094
3060A094j416q49L053p55l397K157K534k473j420J883l86n36K161p60k853K414
$$ 1094 -322 -1171 1882 1127 -2270 -113 2421 -52 -1472 411 25 -511 1650 890 -1963 451
3076D51K440l419j080K669m19j661J949n42j942J969K597l300j464K923j7j833
$$ 451 2891 -528 -1608 1061 642 -1019 930 388 -1554 415 3012 -288 -1752 1171 1154 -679
3092f79R83k41j989K794J412l801p59L616m8k486J245M76j869J732J038l164p37
$$ -679 304 63 -1926 868 2280 -1521 -2280 1336 1288 -1198 47 523 -1346 386 1424 -1740 -2477
3109b477L608k74k519R40P52j483J835J167l395l67L629q70k995J856J096j921
$$ -2477 1131 857 -1662 -722 30 -1453 382 1549 -1846 -2213 1416 546 -2449 -593 503 -1418
3125a418P57K153k891k59L338j012l145J904J879k063j3J233j646J44L020j777
$$ -1418 -661 1492 -1399 -1658 1680 668 -2477 -573 1306 -757 -770 463 -1183 -1039 1981 204
3141B04k936K591K042k586q93K344j285n59K511j614k632K910K110k868q20J732
$$ 204 -2732 -141 1901 -685 -1578 766 -519 -1078 1433 -181 -2813 97 2207 -661 -1481 251
3157B51j69k80K134k465k311L400K044l670j322L407l38r49J066q90j443K622
$$ 251 82 -198 1936 -529 -2840 560 2604 -1066 -2388 1019 681 -268 798 -92 -1535 1087
3173A087R40l245l29K804l27j599J492o96j065K309R05l447l00L674r74k412J683
$$ 1087 2027 -1218 -1547 1257 930 -669 823 127 -938 1371 2276 -1171 -1471 2203 1229 -1183 500
3190E00Q83j571R31P96k714P61L025j488k662K095J069j445P12O3k588J137L301
$$ 500 1383 -188 743 1539 -1175 -414 2611 1123 -1539 556 1625 180 892 955 -1633 -496 2805
3207B805k131k827K748J649k013n50J077j322Q36J685k175j985L007J386k818
$$ 2805 674 -2153 595 2244 231 -319 758 -564 272 1957 -218 -2203 804 2190 -628
3222f28Q8J484j557O26K228k334k103K896J520k928r12K224p01k67J904k010j182
$$ -628 -540 944 -613 13 2241 -93 -2196 700 2220 -708 -1620 604 -97 -364 1540 -470 -1652
3239a652K714O69l052L12K377j068p46J567j880j364K907J112l711K7L223j009
$$ -1652 1062 1731 -1321 -1009 1368 300 -446 1121 -759 -2123 784 1896 -1815 -1788 1435 426
3255D26r73M45j74q17J886l36k659J360K775k093j689K021K81j687J608J47k620
$$ 426 -547 -102 -276 -1093 793 457 -2202 -842 1933 -160 -1849 172 453 -1234 374 521 -2099
3272b099J389K911k223k447K347P90j208N01j96j224J591J987k855j768L370N77
$$ -2099 -710 2201 -22 -2469 -122 668 -540 -39 -235 -1459 132 2119 -736 -2504 866 1443
3288A443k331J66J030j280J164K050k745j636K797P97k199M07J145j395P57J046
$$ 1443 -888 -722 308 -972 192 2242 -503 -2139 658 1455 -744 -337 808 -587 170 1216
3304A216k042n63K670O8k639J248J459j678o36J917j389q68K080M16k286N22K004
$$ 1216 -826 -1389 1281 1349 -1290 -42 1417 -261 -897 1020 -369 -1237 843 1259 -1027 -505 1499
3321A499j681l13J372p08q94J903n41k688K348J771k353r87K624o75j486K193
$$ 1499 -182 -495 877 169 -725 1178 637 -2051 297 2068 -285 -1272 1352 677 -809 1384
3337A384o02j969J301J935k131r19J882k37r88J523m27j959J599J697k892n81
$$ 1384 782 -1187 114 2049 -82 -1001 881 644 -344 1179 752 -1207 392 2089 -803 -1384
3353a384K396n9j710R20P89k202J298J532k234n99K287l45j276J006K55j698J139
$$ -1384 1012 953 -757 163 952 -1250 48 1580 -654 -1253 1034 689 -587 419 674 -1024 115
3370A15J369k478m59K924p76k449J507J310j679j3J396j205n79K275p32k436J752
$$ 115 1484 -994 -1453 1471 695 -1754 -247 1063 -616 -629 767 -438 -1017 1258 526 -1910 -158
3387a58J264j802L18J698j715m38K050j165k074J884J542k146l10J733n64j146
$$ -158 1106 -696 -378 1320 -395 -833 1217 52 -2022 -138 1404 -742 -1052 681 117 -1029
3403a029J604o99j572J849Q75j882k87J708j018r03J540k95j413J496J449k852
$$ -1029 575 -124 -1696 153 1028 -854 -1141 567 -451 -1354 186 -109 -1522 -26 1423 -1429
3419a429K73J978q57j670J774l76j004J156J219j872p6J851j070j161J714o1j501
$$ -1429 -1156 822 -35 -1705 69 -307 -1311 -155 1064 -808 -884 967 -103 -1264 450 389 -1112
3436a112J121J004j710k42K023q12j557J712P04j471L48R43j301k13J856j042
$$ -1112 9 1013 -697 -939 1084 272 -1285 427 1131 -340 8 951 -350 -563 1293 251
3452B51j073J589O55j831J152N00j819j17K613j361j611J240J202j330N4M70r86
$$ 251 -822 767 1422 -409 743 1243 -576 -693 1920 559 -1052 188 1390 60 114 584 -402
3469d02r0K021j173j719J970R37j698O7R15j677M37K130j553j346J698J394k203
$$ -402 -492 1529 356 -1363 607 1544 -154 -87 828 -849 -412 1718 165 -1181 517 1911 -292
3486b92m39J210o14m1J342j200j135K056N09k329K03K181j456n22J612n68j287
$$ -292 -731 479 -135 -176 1166 -34 -1169 887 1396 -933 -730 1451 -5 -527 1085 517 -770
3503g70J455P73k502L88K285j115j109R66l05l70J078j70k164J038K136j651r84
$$ -770 685 1458 -1044 -656 1629 514 -595 371 66 -304 774 604 -1560 -522 1614 -37 -1021
3520a021J569j29j437O80Q72j736N25J825j430j294J342M34j555J207L76j345
$$ -1021 548 419 -1018 -338 534 -1202 -677 1148 -282 -1576 -234 200 -1355 -148 228 -1117
3536a117M48J646j641j064J812p8j177O84J216j779M27J471j242r51J724j1j595
$$ -1117 -669 977 -664 -1728 84 6 -1171 -487 729 -1050 -623 848 -394 -1345 379 368 -1227
3553a227J332N11j327L74J459j765r18J682P40j485J102M74j563J45J329n36j292
$$ -1227 105 616 -711 -337 1122 -643 -1561 121 861 -624 478 952 -611 -466 863 327 -965
3570i65J518K53j514Q05J009j263l90J206q28l52J486K7j789O15J676j591n31
$$ -965 553 806 -708 97 1106 -157 -547 659 -169 -521 965 992 -797 -182 1494 -97 -628
3587f28J270j70j155J553J74k011J124J207j532o02J566m9j016J079j95j566P81
$$ -628 642 472 -683 870 1044 -967 157 1364 -168 -770 796 747 -269 810 615 -951 -170
3604a70J792j668p37J501q6p68J080p5j128L59R48j383k95K092r31j523J477M75
$$ -170 1622 -46 -783 718 632 -136 944 869 -259 100 1048 -335 -630 1462 531 -992 485 960
3622I60j342M42R34j087m04J688n21j574J295N44j728O4J422n08o48J168p95j109
$$ 960 -382 60 994 -93 -497 1191 670 -904 391 935 -793 -729 693 185 -463 705 -90 -1199
3640a199J900L10k226J19J791l06j261J197m95j003J135L67j496K68K164j061
$$ -1199 701 1011 -1215 -1096 695 389 -872 325 -170 -1173 -38 329 -1167 -899 1265 204
3656B04j164R26J12j082J073M21j600M84J964j576p52J042K05j102Q75N36j031
$$ 204 -960 -34 78 -1004 69 490 -1110 -626 1338 -238 -990 52 257 -845 30 566 -465
3673d65P4J638j537r45J438N72j829J116L62q41J43J019q94j128J645K10j652
$$ -465 -391 1247 -290 -1235 203 775 -1054 62 424 -417 -274 745 -149 -1277 368 578 -1074
3690a074J102J237j929M9J310o43j256J913j15j209O19J102j369o0J016r96l76
$$ -1074 28 1265 -664 -615 695 52 -1204 709 594 -615 4 1106 -263 -323 693 -303 -679
3707f79J401L01j564M90R56p18p39J379j011n48J784R9j671N87N78m42q07Q82
$$ -679 722 1023 -541 -51 905 187 -552 827 -184 -732 1052 1151 -520 67 645 203 -604 278
3725B78k2l76J503Pk308Q85J249o63j067J157k0p26R29P0k039P50J891j375r44
$$ 278 256 -120 1383 1390 -918 -33 1216 553 -514 643 623 -103 826 896 -1143 -393 1498 123 -821
3744h21J412j44n86R61n07j167Q68J348j896l95J546L25j648P35K32q06O47O07
$$ -821 591 447 -139 822 315 -852 16 1364 -532 -927 619 944 -704 31 263 -543 104 711
3762G11j486k46K012k29j951Q38P37q91K26P75j352N7J837o57j984J343J165j352
$$ 711 -775 -1021 991 762 -1189 -351 386 -505 -279 496 -856 -799 1038 381 -1603 -260 905 -447
3780d47m14J031k67m13J050n41j660J456R56j208p45J542q4j032J095o26j084
$$ -447 -861 170 -97 -510 540 -1 -1661 -205 751 -457 -1202 340 256 -776 319 -307 -1391
3797a391J012J266j593K12R00n06n82J110m27j166R25J289j149o78R94j76r82
$$ -1391 -379 887 -706 -494 406 -100 -682 428 1 -1165 -240 1049 -100 -778 216 40 -942
3814i42J104L91j494J177P47j306j87J131m31q96R87j19r90J029J022j086q74
$$ -942 162 553 -941 236 983 -323 -510 621 190 -706 281 162 -828 201 1223 137 -737
3831g37J352l74q30R76K6j033P70J358k043l05J193Or90J100K83j230N54R58j653
$$ -737 615 241 -589 387 413 -620 150 1508 -535 -840 353 359 -631 469 752 -478 76 1034 -619
3850f19l59K066p32r49N42Q68m62l4K90j259K33J352n19j543J799L69j373k37
$$ -619 -978 1088 356 -593 -51 817 355 321 611 -648 -415 937 418 -1125 674 1043 -330 -567
3868e67J036q54P2J168m32j066J035O44j400l37J042q11L23P69l93j132J190N93
$$ -567 469 -385 -313 855 423 -643 392 1036 -364 -701 341 -470 -147 622 229 -903 287 880
3886H80j418k75J323l50q72J187j59j067N22P29j262K26J044o91j27P58j56j470
$$ 880 -538 -813 510 160 -712 475 316 -751 -229 500 -762 -536 508 -183 -310 448 292 -1178
3904a178J403M00j103l97J404n06n59J064r0j406N13J005r32k00J182n77p56J119
$$ -1178 225 625 -478 -875 529 23 -536 528 438 -968 -455 550 -382 -582 600 23 -733 386
3922C86l20j096R40Q89j408l9J549q73r95Q71K35r64P07P61j183KJ176m91j180
$$ 386 66 -1030 -90 799 -609 -648 901 28 -967 -96 139 -825 -118 643 -540 -538 638 147 -1033
3941a033J166M40j261R43Q1p42K01J184q64j180J144N71o89k41N48n12K10R96
$$ -1033 133 573 -688 255 336 -406 -205 979 115 -1065 79 650 -39 -280 268 -244 -34 962
3959I62j191n59P68J024j032k49O65m73pJ191j352m57J497M27j451k07J003m50
$$ 962 -229 -788 -20 1004 -28 -277 388 -85 -92 1099 -253 -710 787 1214 -237 -444 559 109
3977A09m7N48r95o09J798L47j386j32J012k89o81Q39l62q95J690k1j393j19J283
$$ 109 62 610 -385 -994 804 1151 -235 -367 645 356 -325 514 152 -743 947 926 -467 -586 697
3996F97o23q61J015q0l22O24J10j057K48N58o58m06J284J56r59O02m0r91r2J584
$$ 697 74 -787 228 148 -174 450 560 -497 -249 309 -349 -755 529 685 -274 328 288 -703 -795 789
4016G89j080l86J479k30j008L81J05p18Q35N64r24n80J684k08j529O27L91n40
$$ 789 -291 -677 802 572 -436 -55 50 -668 167 731 -193 -773 911 703 -826 -199 192 -348
4034c48Q5J153j240l26J493O7j492J91M56j55L25O77j301k92J352j89j173J16
$$ -348 -263 890 -350 -676 817 884 -608 -417 39 -116 209 886 -415 -707 645 456 -717 -601
4052f01R85q45L12P08p48m84J253k05j342N82J109p53m46R09p80k88J072n4j302
$$ -601 384 -461 -149 559 -189 -673 580 375 -967 -385 724 -29 -475 434 -346 -634 438 384 -918
4071i18J012P26j045m53J331k45j098J022O8j307J001P12j193j57J290o93n47
$$ -918 94 820 -225 -678 653 408 -690 332 400 -907 94 806 -387 -544 746 53 -494
4088d94O45K81r87R28N00j283m58J556l33r71N34N72n96M49J61q82m23J312M7
$$ -494 151 432 -555 373 873 -410 -868 688 355 -616 -82 490 -106 343 504 -378 -801 511 558
4107E58j222L63R09p82M81J04q90l23J370k45j226N27J437r83k75P68r64J1J000
$$ 558 -664 -301 608 -174 307 411 -479 -802 568 323 -903 -376 1061 78 -197 571 -393 -382 618
4126F18k90j102R62M75o40k72M43q88K76J029r1j124P66N67j311J12J035o03m26
$$ 618 328 -774 188 663 23 -249 194 -694 -418 611 520 -604 162 729 -582 -470 565 -38 -464
4145d64Q06J02p45M05L74o36l09P40o63j55J201l72p10O08P51j692M2J186l88
$$ -464 342 444 -301 104 478 -158 -467 273 -390 -545 656 284 -426 182 933 -759 -717 469 81
4164H1n83M08L15p20K95O13j161J57J488p47n55P69n04n97R59K35j061L20R43
$$ 81 -502 -94 221 -499 -204 409 -752 -595 893 146 -409 360 -144 -741 218 453 -608 -288 655
4183F55m15r18L29N32o48L18L88q52M56O78o67n22Q48p0q52N04O63o60j91J171
$$ 655 240 -678 -349 183 -465 -147 241 -611 -155 523 -144 -666 182 112 -740 -236 427 -233 -424 747
4203G47m56j064N77M71j354J055O96j135J08P05k90q45Q55K36p78O61O24j027
$$ 747 291 -773 -196 275 -1079 -24 672 -463 -355 350 60 -785 70 306 -472 189 813 -214
4221b14n04J066k25o60M59M69p91M16L72l24m92O54r4n44R42q7j092P41P45q89
$$ -214 -718 348 123 -537 -78 391 -400 16 388 64 -428 226 132 -412 530 443 -649 92 837 -52
4241e2l15P79l28p24P38P23j120J96P83m10l51n9L63p06Q95J12j138M21O41l32
$$ -52 -367 412 84 -640 98 821 -299 -103 680 270 -81 -140 223 -483 412 524 -614 -193 448 116
4261A16p73R60l7k71K53K99j103J0Q19p2q21O93L67q11O56L25j017J58N35k60
$$ 116 -657 303 266 -5 248 547 -556 -546 273 201 -620 73 440 -371 285 610 -407 -249 286 26
4281B6o06P76R4q28O96P7q71j80J387n11l37L00K13o12L94L39p12j34J035m28
$$ 26 -580 196 290 -538 158 235 -636 -816 571 60 -277 23 236 -376 18 357 -355 -489 546 118
4301A18p73P79l0n64R8N70l28l7P09jj454J332q8q25q9R04m63n02R04o27n03Q65
$$ 118 -655 124 94 -470 -372 198 -130 -167 542 541 -913 419 331 -494 -583 321 -142 -644 260 -367 -870 -5
4323eJ80n92K26R07q43j60M69K5p17M83J68o10N03P88q93p5L84k70k47M47J36
$$ -5 175 -417 -191 716 -127 -287 182 207 -510 -27 141 -469 34 822 -71 -146 238 -32 -279 168 304
4344C04q40N88O24o32n01P68j36q39J043J69q11K23P53m92m63M55p5l32M65M16
$$ 304 -536 52 676 44 -457 311 175 -664 379 548 -263 -40 713 221 -242 213 138 -194 271 687
4364F87j041P2J000o11m70P46j02o24P70M2r12L32N94m51l47P21l29r5M42J69
$$ 687 -354 -282 718 107 -363 383 281 -343 427 469 -443 -111 483 32 -315 406 77 -18 424 593
4384E93p66n2P96m28p97J029o1p90O28M67j008J33N20k61l92L08M78o13M04P9
$$ 593 -173 -225 571 143 -654 375 314 -476 152 619 -389 -256 264 3 -389 -81 397 -216 188 267
4404B67o96J73N78n43k54O91K27r39O19L30p46j22O19l52n08N33O33j180K47P68
$$ 267 -429 -256 322 -221 -475 216 443 -496 123 453 -293 -415 204 -148 -656 -123 510 -670 -423 345
4424C45o62r4O59k24n72Q25m9p94K79M06m44k22O13O5m89O62k13n95J54Q77n32
$$ 345 -317 -411 248 24 -548 277 228 -566 -287 119 -325 -547 66 131 -358 304 91 -504 -350 527 -5
4445en21O50Nn23Q76k10q39K22Q31o68k05Q08j46m64M97L9o98J46R80n95m40O20
$$ -5 -526 124 129 -394 482 272 -567 -345 486 -182 -387 421 275 -189 308 347 -351 -205 775 180 -260 360
4467C60j49m34K81L6p38O18P53p61l58M86n7m09J23N16o37N07P55j141m32J000
$$ 360 211 -223 58 94 -644 -26 727 -34 -392 94 37 -372 -249 267 -370 137 892 -249 -681 319
4487C19J01q12O45N9m91M11M15m67n21N89j79l28L61O44q84L96K01k48n09N66
$$ 319 420 -392 253 312 -179 232 647 180 -341 248 69 -259 102 746 -138 258 459 211 -298 268
4507B68O7r57P76M08m38m50P55n60n34J011P0j139P10Q05p06l28L84k24k12O15
$$ 268 335 -622 154 562 124 -326 429 -131 -665 346 416 -723 -13 792 86 -242 142 -82 -294 321
4527C21j04p46K95O37l43o33O61j41m81O77K63q26J55M82k69m38N02l84J49L38
$$ 321 217 -529 -234 403 60 -573 88 -53 -534 143 406 -420 -265 217 -52 -490 12 -372 -223 115
4547A15j13n26L84N85l24m69N87j55l00J79M37l62j73M91n81k90Q67J15q69K22
$$ 115 2 -524 -140 445 121 -348 239 84 -216 -37 400 38 -135 356 -225 -515 352 467 -402 -180
4567a80K88m64k63J013n29n64J014k41p08O65L77p32J78K96m96r4P35p0q80P06
$$ -180 108 -356 -619 394 -135 -699 315 74 -634 31 408 -324 -146 150 -346 -440 295 225 -655 51
4587E1R5k45j45L01L2j68M82K53j037q9R40p94J21M68R0q82J023q4q14K49M87
$$ 51 146 -99 -244 57 89 -79 403 656 -381 -470 470 -324 -203 265 355 -527 496 412 -402 -153 334
4608C34n12L79N45n70n14P05j1o70N20M83p18L44Q1l46l96O34j3p66L07P21n78
$$ 334 -178 201 746 176 -338 367 356 -314 206 689 -29 315 396 50 -346 288 275 -491 -184 537 -41
4629d1l00N72l50k10L22L92o35K01M49l94j20L18j63l66Q64k01q71M91O56r48
$$ -41 -341 231 -119 -329 -7 385 -250 -49 400 6 -114 204 41 -325 539 338 -533 -42 614 -334
4649c34O5M78l78j98O10j01l60K5M98n01j06K26K70n13M62n2m71Q1R03p40m18
$$ -334 -269 209 -169 -367 243 142 -218 -193 305 -196 -302 -76 194 -319 143 91 -380 -299 604 -136 -554
4670e54Q27j75k91J69k01j28J43N05n89k57O44L79p39L79K17m31k39M84m73k40
$$ -554 273 98 -193 -24 -225 -353 -210 295 -294 -551 93 472 -267 112 329 -102 -341 143 -330 -570
4690e70R72l78q04O29L09o05LN34l0n67P20m0m97J54M06p04L51L21j90l60Q53
$$ -570 402 24 -780 -151 158 -447 -444 90 60 -507 213 173 -324 -170 236 -468 -117 204 14 -346 507
4711E07m97m74N04K71k84l19J94K90k78L68j34m39K40K60l43o0N85m67j81N57
$$ 507 10 -464 40 311 27 -292 -98 192 -86 282 148 -291 -51 209 -134 -194 391 -76 -257 300
4731C00j96l33K91O69n55p33J102j69o94L52O4k64J91J99l78LP52n97Q0K75l67
$$ 300 104 -229 62 731 176 -557 545 376 -318 34 98 -166 25 224 -154 -151 601 4 84 359 -8
4752hm78N25N71r33l93J463m99m39R8L43n06L22J09k13p3N36l61n04N53Q7l06
$$ -8 -486 39 610 -323 -716 747 248 -191 -93 250 -256 66 175 -38 -111 425 64 -440 113 200 -106
4773a06M56k2o57J04Q72n73o10L92P23o40j8M84n59m5M67n2p06N53M57q11j5N98
$$ -106 350 328 -329 -225 647 74 -536 -144 579 -61 -79 405 -154 -199 268 216 -490 63 520 -291 -306 292
4795B92m7n93L03R0o28O88M47n06m26P67l04k33J92q3k68N2M21l87L4O53o21l25
$$ 292 245 -348 -45 45 -583 105 552 46 -380 387 83 -150 42 -41 -309 -257 164 -223 -189 464 -157 -482
4817d82M25o0n25P58J15o35j5J072q54k78K54M19o24K73N73o86M50K48m78k94
$$ -482 -57 -117 -642 116 231 -404 -419 653 -201 -479 -225 194 -430 -157 416 -270 180 428 -50 -344
4837c44L75M34p56J51N91o11J13N42m00m80M63M21o65n5R5l15N27K29j38o34P52
$$ -344 31 465 -291 -140 451 -160 -47 495 95 -385 78 499 -166 -221 -126 -441 86 315 177 -457 295
4858B95K15o11m6L99m81K6L72k40k83P01J5o46K7K88J06M0p0p4k88O87l13n40
$$ 295 510 -101 -147 252 -229 -203 169 -71 -354 347 362 -284 -257 31 137 177 107 33 -255 432 119 -421
4880d21J83P16o42l13N04J68k83J84J74m32m4P66n44j85M78l21J03l8K90o52M07
$$ -421 -238 478 -164 -477 27 195 -88 96 270 -162 -206 560 16 -169 309 -12 91 53 343 -309 98
4901I8L39m87l59O72J88n01k26O41n01j55Q03l44n02L95K33l03K45l08n00L94
$$ 98 437 -50 -409 263 451 -50 -276 365 -136 -291 512 168 -334 61 294 -9 236 -72 -572 -178
4921a78N19m91l76R22q3q82M09L93j08j70kj52l02M58K56m69KL26m12p5P07m89
$$ -178 341 -150 -526 396 313 -569 -160 233 125 -45 -47 -199 -501 -43 213 -256 -254 72 -340 -415 292 -197
4943a97m6N10r1o77L06M40m52j15M36j12r1R2j9k39J39K6K0j55L29j28m16O96
$$ -197 -243 267 176 -501 -195 245 -207 -322 114 2 -89 3 -16 -255 -116 -90 -70 -225 104 -24 -440 256
4965B56K4n96j39Q55o34m5M20J63l88K25R7p89O42K54o44k20O99K04m69R8j14
$$ 256 280 -316 -455 400 -234 -279 141 304 -84 141 238 -551 91 345 -299 -519 180 384 -85 13 -101
4986a01q3P9N44k62o69O13J74k88k01n2K89J24K22m03k16L75J53q26M49K34r3
$$ -101 -184 -105 439 177 -492 121 295 7 -194 -246 43 167 389 -14 -230 145 298 -528 -79 155 62
5007F2j9j28l4l54P03K01o75K29M82o70K75m8J28l58N42j88n98L55K73l71J60
$$ 62 43 -85 -119 -473 230 431 -244 -15 467 -203 72 24 152 -206 336 148 -450 -95 178 -193 -33
5028c3N85m15k6nJ00l10O9J91J7l92J71J58M6j40L33o88L53O12p38q8Q05o87l23
$$ -33 552 137 111 106 206 -104 -35 156 173 -219 -48 110 156 16 349 -339 14 626 -112 -200 605 -82 -405
5051d05j3P39m95K28J67l10j12L98j6p40N73k28k78N99K36n49l93O52K43n32K62
$$ -405 -418 321 -174 54 221 -89 -201 197 181 -559 14 -214 -492 107 343 -206 -599 53 296 -236 26
5072B6J25l31l5L30k32k61Q81l18k02J37K0l60K65J83o53K10Q94l48q23M81L22
$$ 26 151 -180 -215 115 -117 -378 503 185 -17 120 140 -220 45 228 -425 -215 679 331 -492 -11 311
5093C11n00j4J75l31P3O13j87p34Q88j96l6o04L82p5J02M57l03m72M99L57n82
$$ 311 -189 -203 -28 -359 -286 327 140 -594 294 98 62 -542 -160 -235 -133 324 21 -451 48 405 -177
5114a77j57N94M4n55O99l96k28K64L57n97n43O07M86n05K00j20j20O23P4j055
$$ -177 -334 260 304 -251 448 52 -176 88 445 -152 -695 -88 398 -107 93 -27 -147 476 550 -505
5134e05K84P35o00n1L48k78J43J01Kl67J82O55n89Q2r0K13m18Q6M33o45R7Q93
$$ -505 -221 514 -86 -137 211 -67 76 177 179 -188 -6 649 60 142 52 265 -153 -67 366 -279 -182 711
5156G11l40j050P00L30p17J18O72l60j50N16m81k17N08Q7l55k59M13k70k16O18
$$ 711 371 -679 21 351 -366 -248 424 64 -86 430 -51 -268 240 327 -28 -287 126 -144 -360 258
5176B58l52k27O74k1p45K32O31l25k34N11l06n53Q50j17p78K56L95m1j00O4k28
$$ 258 -94 -321 353 332 -413 -181 450 125 -109 402 96 -457 393 276 -502 -246 149 108 8 72 -156
5197a56j67M50J85n88J26O90l43m70O11k44k40L83m3l32J90Q1k70j70M10J7l83
$$ -156 -323 127 312 -276 -150 540 197 -273 338 94 -146 237 194 -138 52 133 -137 -307 103 120 -263
5218b63N47k18k66j6M98k62k89M52o9l65j20N15m55N01K52l51l15R77m90m14J27
$$ -263 284 66 -200 -216 282 20 -269 183 114 -251 -371 144 -311 190 442 91 -224 753 263 -151 -24
5239b4J89m69J02L40k68j11M81K68q30J51M50l61J72M29p80J72N76l68p00M22
$$ -24 165 -304 -202 138 -130 -241 240 508 -322 -171 279 -82 90 519 -261 -89 487 119 -581 -159
5259a59M84k39j28K89l41K06K35k42o66P81J58n05R9j72L14q0J25r3j78L94K3
$$ -159 325 86 -42 247 -94 112 347 105 -561 220 378 -127 -28 -200 114 34 159 66 -112 282 305
5280C05n51q6O26r7n1k66M29n54L14K17l68m10J284m44l99j54N78k48j41M04o12
$$ 305 -246 -332 294 197 146 -120 309 -245 69 286 -82 -492 792 348 -51 -205 373 125 -16 388 -224
5301b24J0M16j75l25P6K64k66J67M20m49k78M79J24o44M5Q14l53J21j84m12L46
$$ -224 -214 202 27 -298 -222 42 -224 -57 363 -86 -364 115 239 -405 -360 454 101 222 38 -374 -28
5322b8J51Q1o87L50L55k53j82N80m41k89N67%n88O11J62q52K46K64q3l6N49n85
$$ -28 123 204 -483 -133 222 -31 -213 367 -74 -363 204 204 -384 227 389 -463 -217 47 -36 -72 477 -108
5344a08j9L89j07m53N1N74j34l93m1K65k30O07k89m72j4Q26j69q23N07J65l15
$$ -108 -127 262 155 -298 -247 327 193 -200 -241 24 -206 401 112 -360 -374 452 283 -540 -33 132 -183
5365a83Q1L01o25K72N18p4m84L40j1m23J47K24k51o4M65j18m30K52M16m31L03
$$ -183 -102 199 -426 -154 364 290 -194 146 135 -288 -141 83 -168 -232 233 115 -315 -63 353 -78 225
5386B25p7k48p5N71l01o33Q15k1n37L43K0j12o9M07m24l20N68L66o30J46K66l03
$$ 225 148 -100 -175 396 95 -538 277 256 -281 62 82 -30 -99 308 -116 -436 132 498 -132 14 280 -23
5408b3J4K91m45R6L89k95J0n3K80l97r3O66n46m06P24J80o69k32Q48m28N0K29
$$ -23 -9 282 -163 -67 322 27 37 -16 264 -133 -226 440 -106 -512 212 392 -277 -509 339 -89 -39 190
5430A90r7l70N64J40p69L24N07o84k1L95l65K9L03J25o30L96J72k85K21J20k23
$$ 190 93 -277 287 427 -342 -18 489 -195 -216 179 -186 -157 146 271 -359 37 209 -76 145 265 42
5451D2r5M03j76m27M1M56l25k71N76l6k70J98K6n16K53N23o74K44K10J4j66Kl3
$$ 42 -53 350 174 -253 -212 244 -81 -352 224 188 -82 116 142 -374 -121 402 -272 -28 182 196 30 32 -1
5474aO8j33M58k57n88L94J83o36L05K95J64m04j36J37N7R8L75p20J44N73l91q
$$ -1 67 -66 392 135 -453 -59 124 -512 -207 88 252 -152 -288 -151 -94 4 379 -341 -197 376 -15 -23
5496b3J05j08l34N60j16l72L02L11k44l05K43j06j13L85p0l81p8O45o09J94J92
$$ -23 82 -26 -360 200 84 -288 14 325 81 -224 19 -87 -200 185 115 -266 -344 301 -308 -114 78
5517G8j3l41M00K8o22N24K64k98l03M20P1l32L05J8o74M09N10l90j90M11o7k44
$$ 78 65 -276 124 152 -470 54 318 20 -283 137 208 -124 181 199 -475 -66 444 54 -136 275 208 -36
5539c6L10j05k25p3M68m59M0N03l51l32j0M41j7j91K26n13J64N40j50l96K03K40
$$ -36 274 169 -56 -129 339 -120 -80 423 72 -260 -270 171 154 -37 189 -324 -160 380 230 -166 37 277
5561B77k27j68N96n93o5L05o4l23K03M91l97l46J15K36j7M52m21m73M73N12m64
$$ 277 50 -118 478 -115 -180 125 61 -262 -59 432 35 -311 -196 40 23 475 54 -419 54 566 102
5582A02l30M86k73k54M00l46l07Q81J53n10k52K02K9l35K35J56m75P93m02j82
$$ 102 -228 258 -15 -269 131 -215 -522 359 512 2 -250 -48 -19 -354 -119 37 -438 355 -47 -229
5602b29L9L51o0o41N53O7l65K15J92l15l63N73p2o04O45j09l2N7N5n52M56L84
$$ -229 -190 161 101 -540 13 80 -285 -70 122 -193 -556 17 -55 -659 -14 -123 -155 -98 -43 -595 -139 245
5624B45m35k92N57O1k57J44N5j42j05K72o4l12J27N10m85k40N76m16n5N20j65
$$ 245 -190 -482 75 136 -121 23 78 -64 -169 103 39 -273 -146 364 -121 -361 215 -201 -256 264 99
5645I9m68M49K65n99L39K00j24k74K84K0m02J55J96j23q0M33k78l32O72l99j42
$$ 99 -369 80 345 -254 85 285 161 -113 171 191 -211 -56 140 17 -63 370 92 -240 432 33 -109
5666a09L33L51j101K56Q52l96k82L18j17n22M69O79p86L0O45n32j09M6J03k29
$$ -109 224 575 -526 -270 582 186 -96 222 105 -417 52 731 -55 -25 620 88 -21 25 128 -101
5686a01P14p06k10O0N54j89p77N23N51p86L95N7k91L61K03m16j23J41J7J38J59
$$ -101 613 -93 -303 -243 311 122 -655 -132 419 -367 28 85 -206 155 358 -58 -181 -40 -23 115 274
5707B74k58k49K20M97r79P8O58J09o21K01N29j036M07M23n68K43K59K01l67J5
$$ 274 16 -233 -13 484 -495 -417 241 350 -271 -70 459 -577 -170 253 -315 -72 187 388 21 36
5727C6J99m90j4O46o44k47N45M7l68J97J35j35j57K03K13k73N53j74n99K58L20
$$ 36 235 -255 -269 377 -267 -514 31 78 -290 -93 42 -93 -250 -47 166 -107 446 272 -327 -69 251
5748B51m76R6M3j05l01J006l38n93M44J30k41j73M83l08j25K81k40k3L12K0n41
$$ 251 -225 -129 -86 -191 -492 514 176 -417 27 157 -84 -257 226 -82 -207 74 -166 -189 123 143 -398
5769c98K62M72l64l14O69k11m62J74M99j68m25L31L33m31R9n3k50P1N79m45RL11
$$ -398 -136 336 -28 -342 327 116 -346 -172 327 159 -266 65 398 -33 66 13 -237 -166 413 -32 -23 288
5791B88K7n10K27J09k77n8P99l75k80K30K65p78M2O09m14J83J11k64J7m1L18p83
$$ 288 315 -195 32 141 -136 -194 605 230 -50 180 445 -333 -291 318 -96 87 198 -66 -49 -90 228 -555
5813e55M63L90n38K20M99o20k73O33J22n38J84L04p46M82J13j6k75J24J28l44
$$ -555 -92 298 -240 -20 479 -141 -414 219 341 -197 -13 291 -455 27 140 124 -151 -27 101 -243
5833b43L25K51k26k08J41j79j62L96J29m92L06K46l22k22J69j0k29K67L73q01
$$ -243 82 333 107 -101 40 -139 -301 95 224 -268 38 284 -38 -260 -91 -101 -330 -63 310 -491
5853d91L83N44p81P6N26k48j38L86p1l75P3L33n89K00J34M7l68O77k90j25r3M44
$$ -491 -108 436 -345 -269 257 9 -129 257 186 -189 -116 217 -372 -172 -38 9 -359 318 28 -97 -190 254
5875B54n57j31O62k63k03K20K03m83Q8P03n44m52O44M8k92K9J93j96J21l3k12
$$ 254 -303 -434 228 -35 -238 -18 185 -298 -210 493 -51 -503 141 189 -103 -74 119 -77 44 11 -201
5896b01j15N86k84m97O16j97n7J82K63m01l53Q09n3n35K60L53m77k3N64n77M4
$$ -201 -316 270 -14 -511 105 -92 -149 33 296 -105 -458 351 298 -237 23 376 -101 -124 440 -137 -93
5917i3J80J96p10M24J77l77j3P54k84l88K22o0j65K70L4m81M1R24n74kK52k83
$$ -93 87 283 -427 -3 174 -203 -216 538 254 -134 88 28 -137 133 167 -314 -273 651 77 75 327 44
5939D4l41L97K1l63L29L49k55l03K62L6k65J25K42l08k22N07m53j04J39J06k56
$$ 44 -297 100 121 -242 87 436 181 -122 140 176 -89 36 278 -30 -252 255 -198 -302 -163 -57 -313
5960c13M84K52k09l36J74N9m87P90j13l88O7K80j60j80J72N4j96K19J31n03N29
$$ -313 171 423 214 -122 52 111 -376 414 301 -87 -20 260 100 -80 92 146 -50 169 300 -203 326
5981C26N3o30J29K82k48k35N20o4m98L85J83o88o3O91P7m56L34M71q57K01M67
$$ 326 379 -251 -122 160 -88 -323 197 133 -365 20 203 -485 -548 143 220 -236 98 569 -288 -87 380
6002C80n06k83Q78m07m43M30J53m58K25K4j83J25M88m04l44L74R2l23K60K35m54
$$ 380 -126 -409 469 62 -381 49 202 -256 -31 -7 -190 -65 423 19 -325 49 141 -182 78 313 -141
6023a41j83M88M0o71L04J45l88J67O28m33L3K99J9n96K40J47l42K91N22m52L18
$$ -141 -324 164 204 -467 -163 -18 -406 -239 389 -44 -11 288 307 -289 -49 98 -244 47 569 117 435
6044D35j05J1p49N70J84k76j47M95l91j23J62n2k08M22J77m50j79J72J6J07J86
$$ 435 330 341 -408 162 346 70 -77 418 27 -96 66 14 -194 228 405 -45 -224 -52 -36 71 257
6065B57k59k57J39O25n99o2O00k24n94O17j17k70MM68k33m04N10k12j65J98Q4
$$ 257 -2 -259 -120 505 -94 -156 444 220 -374 243 126 -144 -140 328 95 -309 201 -11 -176 22 106
6086A06l54M70L22r07J56M55k29k54J36J91n44O17L32p46J61K40R3o11L56M9j71
$$ 106 -248 222 544 -363 -207 248 19 -235 -99 92 -452 165 497 -249 -88 152 245 -366 -10 39 -132
6107a32K44J78p08O0N71k97j32MM17l58K64K5o25o4M31J00j12k7L36r2l0J38o53
$$ -132 112 290 -418 -358 213 -84 -216 -212 205 -153 111 136 -489 -553 -122 -22 -134 -161 175 83 53 191 -462
6130d62J77N59m17m4J45K78l29R5qk46J05L71R9p28O92J16n98J86N3r1m22P94
$$ -462 -285 274 -143 -187 -42 236 -93 2 -6 -252 -147 224 323 -405 287 403 -195 -9 44 -47 -469 325
6152C25j84k33K4M88m54j95K04kK1N66n93n11M43M71q35l8Q04k8n52O47m07m11
$$ 325 141 -92 -68 420 -34 -229 -25 -27 -6 560 -33 -544 -101 370 -465 -503 301 273 -279 368 -39 -450
6174d50L02J22o7q2O01l22o4J51k01J0qL27m83r6N49k92l03L30j42j50L65K69
$$ -450 -148 -26 -93 -175 426 104 40 191 -10 0 -8 319 -164 -260 289 -3 -306 24 -118 -268 97 366
6196C66o62J76N33o8o03J26L60l12K12J07m46k0P49m66l24N68r7n01N00J04l85
$$ 366 -296 -120 413 345 -258 -132 228 -84 128 235 -211 -231 518 52 -272 296 199 -302 198 302 -83
6217h3L91J28o91k10O90j39m38M81L60n39j30J85j64l70O05Q0l08K38J93j15o3
$$ -83 308 436 -255 -465 225 86 -352 129 489 -50 -180 5 -159 -529 76 156 -152 86 279 164 101
6238A01K05o77k03M64L33m26Q5M81l65k0LK11n23N94l63j77K06L45l82J83k12
$$ 101 306 -371 -574 -110 223 -203 -118 363 -2 -22 -19 192 -331 263 -100 -277 -71 274 -108 75 -137
6259a37mL6K52m48j24K97N06k54l98J58K33j32L13Q2p86N69K71p01r3N21%j3m47
$$ -137 -141 -105 147 -301 -425 -128 378 124 -274 -116 117 -15 298 380 -406 163 434 -267 -360 161 161 148 -299
6282b99K98l68L25L01n04r7Q52j11p09L06j26P8k89O56l46l8L51k71m44O08k18
$$ -299 -1 -369 -44 257 -247 -344 508 397 -312 -6 -132 -54 -343 313 -33 -71 280 9 -435 173 -45
6303d5N7j37L93l00L46n0Mm97K63N83j006M73M03l88k16M76L4r31O83k5j82pM91
$$ -45 12 -125 268 -32 314 264 268 -229 34 617 -389 84 487 99 -117 359 393 -538 145 120 -62 -69 422
6326D22n42k08O89o6j85j01O07o35k45L49l57j8M42q9q4J56J70l15j55K33j01
$$ 422 -120 -328 361 295 110 9 616 -19 -264 85 -272 -290 152 63 -21 135 305 -10 -165 68 -33
6347c3k78M73P4m75K21O29q49J44L36n70N8J27M10n05M59J90n06J31M88l66o56
$$ -33 -311 162 236 -239 -18 611 -238 -94 242 -328 -270 -143 267 -238 221 411 -95 36 524 158 -498
6368d98M70L01l67K33J71n33j61N25j31j47N03qm82L02k72j10L9K45k38l00Q74
$$ -498 -28 273 -94 139 310 -223 -384 141 10 -137 366 358 -124 178 -94 -204 -165 80 -158 -458 416
6389D16j5n74K42K8k94J38L08j18o14N12L16l00m91P46m89j32P33l89m19N97k95
$$ 416 401 -173 69 97 -197 -59 249 131 -483 29 345 45 -446 300 -189 -321 412 23 -396 201 -94
6410i4k04J39M39l94l01M35J69o77O51K28n52l44P69j99k04K2J76m08N44j92m28
$$ -94 -298 -159 280 -114 -415 20 189 -488 163 391 -161 -505 264 65 -139 -117 59 -349 195 3 -425
6431d25L36K91k58j36N96O8p57J66L63m54J58O09m53m11O96j48l31k40K87j18
$$ -425 -89 202 -56 -192 404 472 -285 -119 244 -210 -52 557 104 -307 389 241 -90 -330 -43 -161
6451a61K83M34l97l60L74j64m07K67M2K13j06L72l96k82K90j05LJ10J69k21J02
$$ -161 122 556 159 -201 173 9 -398 -131 -89 124 18 390 -6 -288 2 -103 -100 10 179 -42 60
6472F0M94o17m5L47m6k80m2K05M2l52M34q5m55O95J17o81L25L2j30k42R7o5J33
$$ 60 554 -63 -108 239 193 -87 -129 76 118 -234 200 115 -340 355 472 -209 116 148 18 -224 -127 -192 -59
6495e9M25k08o44M27M83n22m2K93l14p5K63K47m35N0K27k44J62J00j29q5K91j04
$$ -59 366 158 -486 -59 424 -98 -140 153 -161 -236 27 274 -161 -111 116 -128 34 134 5 -80 211 107
6517A07l68K08J82n73M6N27K38m26J34J96m71J5K87m55p7L91L31l31J92k10k74
$$ 107 -261 -53 129 -444 -398 129 367 -59 75 271 -200 -185 102 -353 -430 -39 292 -39 153 -57 -331
6538c31K03L37n68K0P37k35n32J47L46k72k17N95k14j50J87K3l01n5M50m03M15
$$ -331 -128 209 -359 -339 398 163 -369 -222 124 -148 -365 230 16 -134 53 76 -225 -280 170 -233 182
6559A82k14M3J28N1J88m92K3N57o14J04M89m28Q2j0N4m11L19P1J5k45O12l91k15
$$ 182 -32 11 139 190 378 -114 -91 466 -148 -44 445 17 99 89 143 -268 51 122 137 -108 504 113 -102
6582a02J53J07k67L08K51o75k09N69j4k71L86j59m50L20K88l75J96L91o38j90
$$ -102 51 158 -109 199 450 -225 -434 135 121 -150 236 77 -373 -53 235 -140 56 447 -191 -381
6602c81L62O3l26N58J21n66j44M18J0o86N65K74k76L81J08r21K06L14j79o1M26
$$ -381 -19 44 -282 276 397 -169 -313 105 115 -571 -6 268 -8 373 481 -440 -234 80 -99 -160 266
6623B66Q4l04N0J44j54k07K16K62o21M00R1k36M7o6j87J07L31o30J04L00K6k98
$$ 266 350 46 96 240 86 -121 95 357 -264 136 227 -9 38 -28 -215 -108 223 -407 -303 -3 23 -275
6645b75M3N79n92k27N16j94j14N38n9k36j77K03k21R0J57J42j80L12j78l64j3
$$ -275 -232 347 -245 -472 44 -150 -264 274 215 -21 -198 5 -216 -126 31 173 -7 305 127 -237 -250
6666b50L54k97j24K83J78m10N24N3p20K72M97n31L56n3N9k93K15R1m56J60O91
$$ -250 104 -193 -317 -34 144 -266 258 311 -409 -137 360 -171 185 132 191 -102 113 204 -252 -92 599
6687E99l69m85L30k15P2J17J37k04j71K18L18q10M24K45m11N62j40n33J58N72
$$ 599 230 -255 75 -140 -68 49 186 -18 -189 29 347 -463 -39 206 -205 357 217 -316 -158 414
6707D14m99n74Q17k27m15M06J09l5J35K13j99j66L21j13m58J51J83J38l75N48
$$ 414 -85 -659 158 -69 -484 -78 31 -4 131 344 145 -21 300 187 -271 -120 63 201 -174 374
6727C74m98l17P00k48k34L18N06m84j67J43j81k31M89k29k11J00O93m02k72K38
$$ 374 -124 -441 259 11 -223 95 601 117 -50 93 -88 -319 170 -59 -270 -170 523 121 -151 87
6747H7k09j27K60K10m01K33L94k69k53M24l70j53K02P8j64J84Pm81m5N87J7m92
$$ 87 -122 -249 11 221 -180 53 447 178 -75 349 -21 -174 28 106 -58 126 133 -348 -393 194 211 -281
6769b81M30j25j05J56J60m82N8J0J75k63J90K35j90j39J94k72k69P97n27J13q
$$ -281 149 24 -81 75 235 -247 -189 -179 -4 -267 -77 158 -32 -171 23 -249 -518 279 -248 -135 -143
6790a43K11m84K53L99n79j64Q20j85k93j39L18K18m85L15p7N1K19J36r64Q06P2
$$ -143 68 -416 -163 236 -343 -507 313 128 -165 -304 14 232 -253 62 -15 36 255 391 -573 233 305
6811C05l99l4K56j62k54N20j4n20L52M38o16N8O4P8j75K98j03n37O05J66p55M94
$$ 305 -94 -128 128 -34 -288 232 218 -302 50 488 -128 -70 -6 72 -103 195 92 -445 160 326 -429 65
6833F5O1R2m46N77k34l77N51J68q94L07K87L0m44M31k96j30O29k4l64r9P70n42
$$ 65 126 218 -228 349 115 -262 289 457 -437 -130 157 187 -257 174 -122 -252 377 353 -11 -110 660 118
6855A18m58N41j32lM8J14m85L25K82m58p1J88K7j71K17J06m93L01L33l63k94M36
$$ 118 -340 201 69 66 114 228 -257 68 350 -108 -179 9 36 -135 82 188 -305 -4 329 -34 -328 108
6877A08J90l87j10L80o7l14L18m72k53J014j08m85o6M88l84J61j73l78M14p3L99
$$ 108 298 -89 -199 181 114 -200 118 -354 -607 407 299 -186 -252 236 -148 13 -160 -538 -124 -197 202
6898B02n61N4O21k45j75J41m29M94J49m9p16L21O37n94l22M54p0j54M48l4m52
$$ 202 -359 -305 316 71 -104 37 -392 102 251 202 -514 -193 444 -150 -472 -18 -88 -242 206 172 -280
6919b80K77L73k05k62r0K09k89K00K76k75n8K61l14j24P16m8l63j76K48l05L72
$$ -280 -3 370 165 -97 -187 22 -267 -67 209 -66 -124 137 -177 -301 415 367 4 -172 76 -229 143
6940A43J91n39l03N54J66l27K57j46j33p4M60l66j02RK48j64jK33l76L87K64m43
$$ 143 334 -205 -508 46 212 -115 142 -4 -137 -211 249 -117 -219 -210 38 -126 -127 106 -270 117 381 -62
6962f2J31K68l74k49o0M40k60j5N34l40KQ0K87q25O55J17m16k30N71l56O6J92
$$ -62 69 337 -37 -286 -346 94 -166 -181 353 13 15 95 382 -443 212 329 -87 -317 254 -102 -36 156
6984A56j14n66P06nk84n9L78j87j07K34j6j98J41K68o45K67M54n22p0L06p8l15
$$ 156 42 -524 182 177 -107 -166 212 25 -82 152 136 -62 79 347 -298 -31 423 -99 -169 137 59 -256
7006b56J22K82m68L01R9k47j62M83L2n54N52J79n29j18M39J4n64M16q7RK4J64
$$ -256 -134 148 -320 -19 80 -167 -329 154 186 -368 184 363 -166 -284 155 169 -395 21 -66 -57 -33 131
7028A31m24o2L47q3j72K73K17l82K42K12l68k00O00k86n23P24o4m6l63M04l58
$$ 131 -293 -355 -8 -91 -263 10 227 -155 87 299 -69 -269 331 45 -478 246 182 136 -227 177 -181
7049a81p0M18k08k14L39K57p50J74M68l33l21L32J18k21J40M10p40L36K41j32
$$ -181 -251 167 -41 -255 84 341 -409 -235 233 -100 -421 -89 29 -192 -52 358 -382 -46 195 63
7069F3l92L29J35o94Q70J03n90K12J26j28j47J43J22j68j21N44l84k6J57k20j79
$$ 63 -329 0 135 -559 311 414 -176 36 162 34 -113 30 152 -16 -137 407 23 -3 154 -66 -245
7090b45L03n4l66N25K9m16J02K77K13n08Q4J54j32P8M71m58o8q5L2M8K70o1l32
$$ -245 58 4 -362 163 192 -224 -122 155 368 -140 -56 98 -34 44 515 57 -11 -96 -64 -16 254 193 -139
7113a39K30K86l33P0Q3k9m86N50n8o93M77J42l19J41K03q6j86K32K51p61M94J7
$$ -139 91 377 44 114 197 168 -318 232 174 -519 -42 100 -219 -78 125 39 -147 85 336 -425 69 86
7135H6k32j14N31k26o7L00O8p56L48L63k53l14O96m17n54P16J79l94J2J22m03
$$ 86 -146 -260 271 45 -22 278 346 -410 -62 301 48 -266 430 13 -541 175 354 -40 -28 94 -309
7156c09N2L89j06M7K23k76n26N85j11N0k83M84k57l12O38l23k61M61J53o31K46
$$ -309 -257 132 26 73 296 20 -506 79 -32 18 -265 219 -38 -350 288 -35 -296 165 318 -313 -67
7177f7Q0J06l30L42J05m23o2L75l67l59Q04l05k08L17J5l3L9J30l93L6L66P0q75
$$ -67 13 119 -211 131 236 -187 -249 126 -241 -600 204 -101 -309 8 23 -10 29 159 -234 -198 168 238 -637
7200f37M25N58l21J18O7m44J4P08m34n14L53O6j10k8J67j02j08M94p8n32N15K07
$$ -637 -212 346 25 143 210 -234 -220 488 54 -460 -107 -41 -151 -179 -12 -114 -222 272 194 -338 177 384
7222C84j72n56P41l62m06Q62l34l59K17J95m71J11K12Kp0Mq9l08O48L04p90l1
$$ 384 212 -344 397 35 -371 491 157 -202 15 210 -261 -150 62 64 -6 -2 -91 -399 249 553 -237 -268
7244b68L59K7n70L80J07n42K49N08k26k07K19J7j09l5L07m12L72L4m87L09M40
$$ -268 91 118 -452 -72 35 -507 -258 250 24 -183 36 53 -56 -91 216 -196 176 210 -277 32 472
7265D72k17n39L49m5k44J19M41p68L35M59n95j45M41j44pJ29J46j86%Q4No14O50
$$ 472 255 -284 65 20 -224 -105 336 -432 -97 362 -233 -378 63 -81 -88 41 187 1 1 85 90 -524 126
7288A26K08o15J25%j96K13M73j43m62N64mn96K53K6k31L02J61l84l55N73j5l76
$$ 126 334 -281 -156 -156 -352 -139 334 191 -271 293 289 -307 -54 -28 -259 43 204 -180 -535 38 23 -353
7310c53O6K44PK8p0J3j64J00N62q11L24L52p11K41K94j86k73P74j93m46J16L19
$$ -353 -287 -43 -36 -8 -78 -65 -229 -129 433 -378 -54 298 -413 -172 122 -64 -337 437 244 -202 -86 233
7332B33j30k74K30K66l52j82J37k83N48nl6k83L83j77n44N96J43o44K99K44k52
$$ 233 103 -171 59 325 -27 -209 -72 -355 193 188 152 -131 252 75 -469 127 270 -374 -75 169 -83
7353h3k60N31L13p92L24r2l34J04K99p2l62R47n63k44M34J82q34N48K43r8l19
$$ -83 -343 188 501 -291 33 -59 -393 -289 10 -62 -424 523 -40 -284 150 332 -502 46 289 191 -128
7374a28J33K54k43j14K56k25j74M44l91K8M67J16o09P3L32k6k10M88m54j35N08
$$ -128 5 259 16 -98 158 -67 -241 203 -188 -160 307 423 -186 -113 219 193 -17 471 17 -118 390
7395C90o3n59J12M04l35m08L53k1k30M85J40l31P8M16o93j95P54p2m00J12J85
$$ 390 327 -232 -120 284 -51 -459 -106 -127 -357 128 268 -63 15 431 -262 -457 297 225 -175 -63 122
7416A22m92K91L02n16J30K89r7m03N46m23O9L11J85o25J48L96q5l80M11j31k05
$$ 122 -370 -79 223 -293 -163 126 29 -374 172 -251 -182 129 314 -311 -163 233 148 -232 179 48 -157
7437a57n1K66j83l06N96m23J61K64R2n82N22M36p36J55K67l54l28O47L60r98Q3
$$ -157 -208 58 -125 -431 165 -258 -97 167 259 -323 199 635 -101 54 321 -33 -361 286 646 -352 -269
7458b69L39J20l66q9j6K03M31j77n28M48K70n56j76M83r9k95O15l80L5r0N92l33
$$ -269 70 190 -176 -265 -281 -78 353 176 -352 96 366 -190 -366 117 18 -277 338 -42 -7 -97 495 162
7480A62m91O19k48j2J75J33n83K64Q4l38K37K14j23l11K55N02o90J48M13j58m49
$$ 162 -329 290 42 30 205 338 -245 19 103 -235 2 216 93 -218 37 539 -151 -3 410 252 -197
7501a97N38n89J39N56j87m89J79K31p7j73J93j19n03P12j98l91J25N62k30m35
$$ -197 341 -248 -109 447 260 -229 -50 181 104 -69 124 5 -498 214 16 -375 -250 312 82 -353
7521c53O25k48o0K72J01n59P0O45o61l24N66n8j46K58k4l11J31L70l08l75M45
$$ -353 272 24 -36 236 337 -222 -152 493 -168 -492 74 16 -130 128 104 -207 -76 294 -14 -389 56
7542E6J78l42J59j1j91J16L76n23k05M08K31n73O16K45r32L04L96n73q0O20J41
$$ 56 234 -108 51 40 -151 -35 341 -182 -387 21 252 -321 295 540 -392 -88 308 -265 -345 275 416
7563D16p15L55M8j66m2M25k44m60O11J74r30L97O20p08J75L22J02p71R27m78k87
$$ 416 -299 56 104 -62 -104 321 77 -383 228 402 -528 -131 489 -219 -44 278 380 -391 536 58 -229
7584b29Q7L50o4m28L41j18l24L93K84l60J9J80m2m49L74J22m37O32J35p65J87
$$ -229 -142 208 144 -284 57 -61 -385 8 292 -68 -49 131 89 -360 14 136 -301 331 466 -299 -112
7605a12O03n21j23K45j62k49O19R5n60J43M10n56j22N12m0l73P8L11o03N42O3
$$ -112 491 -30 -153 92 -70 -319 300 395 -165 -22 388 -168 -290 222 182 -191 -113 198 -405 137 200
7626B00l77k9Q57k45m52j65L52k77K12K58n73J86L50k25o19M46N23p16J18K94
$$ 200 -177 -206 651 406 -46 -211 141 -136 76 334 -239 -53 297 72 -547 -101 422 -294 -176 118
7646A18j55k11P59k75q52N27J15P2n61M50l45k9O27j35m68K95N50n21k85M36k47
$$ 118 -37 -248 511 236 -616 -89 26 98 -463 -13 -358 -387 240 105 -363 -68 482 -39 -324 112 -135
7667a35l56N23Lj05k43O87p70L16R9J5k64L57j0m21M55K53o91J98N68l98k73N1
$$ -135 -491 32 35 -70 -313 374 -396 -80 19 34 -230 127 117 -304 151 404 -287 -89 479 81 -192 -141
7689a41M29m34M63k9n34L5L70k06k92K71J50l78K89M7m05J85M52k14l50K55L82
$$ -141 288 -146 317 288 -246 -211 159 -47 -339 -68 82 -296 -7 40 -365 -180 272 58 -292 -37 345
7710C45n31K59J72m60m9N60o4m20J93J03k27nM57m24l81P19j45m99N94K11q96
$$ 345 -186 73 245 -215 -264 296 232 -188 5 108 -119 -124 333 -91 -472 247 102 -397 197 408 -488
7731d88N65L17k80m31N37p8o12Q44j58l78J89L48p56J60N02k97j22L27Q2p13L38
$$ -488 77 394 114 -317 220 142 -470 374 216 -162 27 375 -381 -221 281 -16 -138 189 271 -442 -104
7752a04M04k64l32M34r4m16N47N5m97K64K73k95q7M07q3l27K79r5o5j18M91n38
$$ -104 300 36 -296 138 44 -372 175 230 -267 -3 270 -25 -112 295 212 -115 164 69 4 -114 377 -161
7774a61j39P66m76k14K67o2m2J67K91k47j96J14J23m86m9M02l06M59K22p3o94
$$ -161 -300 466 -10 -224 43 -19 -61 106 397 150 -46 68 191 -295 -344 58 -248 211 433 360 -334
7795c34N36J1m66J78J74l13J98K15l35j24L35j60l38O59k59j55J70L38k84m64
$$ -334 202 213 -253 -75 99 -214 -16 199 -136 -260 75 -85 -423 236 -23 -178 -8 330 46 -418
7815d18M09K08m24M41ol69m5N05m09k42O64j30l56o9N88n54Q4J77j45k68N35K47
$$ -418 -9 199 -225 216 210 -159 -204 301 -108 -350 314 184 -172 -241 347 -207 -123 54 -91 -359 176 423
7837D23l92k77N53m74j52J12J11k56O36J23n63L28P6q0n14O91n01K7M37n4n79
$$ 423 31 -246 307 -167 -319 -207 -96 -352 284 407 -156 172 248 168 -346 345 -156 -129 308 254 -325
7858c25J19P21p58l7M25J69n18K83q7k68K69J89m81q0K16M89n78L41N4k89J83
$$ -325 -206 515 -243 -280 145 314 -204 79 -8 -276 -7 182 -299 -379 -163 326 -252 89 143 -146 37
7879C7J96n40q7N69J25l96m5K58l65N05j94k08l39N36k1J22J91m26k62J34K71
$$ 37 233 -307 -394 175 300 -96 -141 117 -248 257 63 -145 -484 52 31 153 344 -82 -344 -210 61
7900F1l58%N26P6p67L85J55l82R6N16l45j7M65n51k70J99O34n06l00O60k34k14
$$ 61 -297 -297 229 305 -462 -77 78 -304 -208 308 -37 -54 411 -140 -410 -211 423 -83 -383 277 43 -171
7922a71K36o6k80L47M81q70J20K38K51o12L90m12P9K61K17m91M5M65k80J30j06
$$ -171 65 -1 -281 66 547 -323 -203 35 286 -326 64 -348 -269 -8 209 -282 -237 228 -52 78 -28
7943b8nj41j2N25q19K22M56k91l29L26J16k38O02l02j25k16M01r8l66M33K1j67
$$ -28 -33 -174 -186 339 -480 -258 198 -93 -422 -96 20 -218 384 82 -43 -259 142 44 -322 111 132 -35
7965c5JP1j60J3K48j17n36P55R8l80J16O1k58l58M23j87K10M84k52m10J89J02
$$ -35 -34 37 -123 -110 138 21 -515 240 338 -42 74 135 -123 -481 -58 -245 -35 449 197 -213 -24 78
7987G8k73J47J50j24P9K46q0m19j32P59m35M3J23k38k40O42q7p38N66K49l82m49
$$ 78 -195 -48 102 -22 57 303 223 -196 -328 431 -4 39 162 -76 -316 326 239 -499 67 316 -66 -515
8009e15O86J00l67J55J38l36m7N70l76k80L61o2k42N54m89R3J35J63l86j17P87
$$ -515 171 271 -96 59 197 -139 -186 384 8 -272 89 27 -215 339 -150 -57 78 241 -145 -262 525
8030E25j89n55K70K45n57K93L90k51k87L21M01r37L68j15Q2j04L87j71m15N02
$$ 525 336 -219 51 296 -261 32 422 171 -116 205 606 -331 37 -78 4 -100 287 116 -299 203
8050B03j87m89L74M15j55j67K27j24k55P64o88j74K58L70k43k11L11m04J0N61
$$ 203 16 -473 -99 316 161 -6 221 97 -158 606 -82 -256 2 372 129 -82 229 -175 -165 396
8070C96n74j55L71O07n06n85M15P3l16L39K6k20L62p5l64J51K71Ok27K91k93k61
$$ 396 -178 -333 38 645 139 -446 -31 42 -274 65 91 -129 233 158 -206 -55 216 222 -5 286 -7 -268
8092b68L43O76p25n30O96k27j16p2L97n05O58j67m79j85Q03l55n22P15k0l46N27
$$ -268 75 751 26 -504 192 -35 -151 -223 174 -331 327 160 -319 -504 299 -56 -578 137 117 -229 298
8113B98j13l66j28N28r4j69j4M12j92J59j12l36L7M09P6p78L59J70l33r7N99k64
$$ 298 185 -181 -309 219 125 -44 -58 354 162 321 209 -127 -90 319 395 -383 -24 146 -187 -284 315 51
8135E1l28P47m58n07O98K15m85j52M85k60m19O40k72n5L55jo95K51M10k37k20
$$ 51 -277 470 12 -495 203 418 -67 -219 266 6 -413 227 -45 -100 255 254 -441 -190 220 -17 -237
8156b37L38N1n49N00K82n64J37L30j57l28K88O0m66N15j18n41M97O61p56l03P06
$$ -237 101 152 -397 103 385 -179 -42 288 131 -197 91 151 -315 200 82 -459 38 699 -57 -360 346
8177C46k07m84J87N83o51q3N39j05l55K84j84k03K19J61
$$ 346 139 -345 -158 425 -226 -309 230 125 -230 54 -130 -333 -114 47
8191D7
$$ Imaginary data points
##PAGE= N=2
##DATA TABLE= (X++(I..I)), XYDATA
0@%%%pJ5qQj6K4l2M0m8N6p2Q8j05J29j55J82k14K52k95L42l95M55n22N95o78P70
$$ 0 0 0 0 -7 8 0 8 -8 16 -16 24 -24 32 -40 48 -57 72 -83 99 -115 137 -158 184 -211 244 -278 317 -361 409
29D09q70R80j104J239j387J550j727J920k133K370k628K911l225L570l951M377
$$ 409 -461 519 -585 654 -733 817 -910 1010 -1123 1247 -1381 1530 -1695 1875 -2076 2301
45B301m853N388n997O697p506Q455r588J0970j2700J4937j7959K2295k9085M1317
$$ 2301 -2552 2836 -3161 3536 -3970 4485 -5103 5867 -6833 8104 -9855 12440 -16645 24672
59B4672p0238K59815K57276l96170r5021J33328J49672n7473j13131p5275J34501
$$ 24672 -45566 214249 471525 75355 -19666 113662 263334 205861 92730 17455 151956
70A51956J35191q7835j89214M1616J39973K2584q0852p0409k3617R9891O9347
$$ 151956 287147 199312 10098 51714 191687 214271 133419 63010 39393 139284 208631
81B08631j30012j31783J28817J45777q4073j32785J3077P1028N6301j031q9723
$$ 208631 78619 -53164 75653 221430 137357 4572 17649 88677 144978 143947 54224
92E4224n0432P9636J8781j01612m661J15359L3603n1302m5641n1158J4993J22323
$$ 54224 3792 83428 102209 597 -4064 111295 144898 93596 47955 -3203 11790 134113
104A34113K3247j36912m2031J13004L4200q4304o0590J689P3538J04137k8082
$$ 134113 157360 20448 -21583 91421 125621 41317 -19273 -17584 55954 160091 132009
115A32009j39142j1558J01076o149p0876L96J8902J3487M3011l1105j05231L1767
$$ 132009 -7133 -18691 82385 76236 5360 5756 24658 38145 81156 50051 -55180 -23413
127b3413J37456r352j23857l4786M5232M0784K8930l6615o9899M1886Q0941n5851
$$ -23413 114043 104691 -19166 -53952 -8720 32064 60994 24379 -45520 -3634 77307 21456
139B1456q9731L5179O3232J3287J8723k4881p5411K0328P7111m4215p2570O8157
$$ 21456 -68275 -33096 30136 43423 62146 37265 -38146 -17818 59293 15078 -57492 10665
151A0665Q2588k8849n0510k0786k104N5404M4677o4499m2770P3152K6192o7859
$$ 10665 93253 64404 13894 -6892 -8996 46408 91085 26586 -16184 56968 83160 15301
163A5301p250M9242k567J4J7179m7371k7374P4081K9982p1748j5948N2192k887
$$ 15301 8051 57293 54726 54740 71919 24548 -2826 71255 101237 29489 13541 65733 62846
176F2846l4525j4481j2508L6583P6205l4070j11950R412P8852j8619l9772L0059
$$ 62846 28321 13840 1332 37915 114120 80050 -31900 -22488 56364 37745 -2027 28032
188B8032J5900j1369J4116l2468p1463K6504P6265j0819l5899J7167m827k4784
$$ 28032 43932 32563 46679 14211 -57252 -30748 45517 34698 -1201 15966 11139 -13645
200a3645J5191r901l1414M4687M8394n6108m1662M8130Q475l7343K1354J9753
$$ -13645 1546 -8355 -39769 4918 53312 -2796 -44458 3672 12147 -25196 -3842 15911
212A5911m1150n759L4825r051J015L9276k4008n6152J6414K3513k9325J0245L7848
$$ 15911 -25239 -30998 3827 -5224 -4209 35067 11059 -45093 -28679 -5166 -34491 -24246 13602
225A3602k0363m862M2708k8463p2421K0322N3214q963K754J6964m6411l7167L7217
$$ 13602 -6761 -11623 31085 2622 -69799 -49477 3737 -5226 -2472 14492 -31919 -69086 -31869
238c1869J4767k1865K7410K2109l4385p127J4397l4217r386N5722m645n8245J8853
$$ -31869 -17102 -38967 -11557 10552 -23833 -30960 -16563 -50780 -60166 -4444 -9089 -67334 -48481
251d8481M2969k5222j1451K8576j4193j5922L5197m660m8001J1821L3632j3306
$$ -48481 -5512 -30734 -42185 -13609 -27802 -43724 -8527 -13187 -61188 -49367 -15735 -29041
263b9041K359K0755l6164k6651M4483J7520j7865L4381K0329o8037l6694M2399
$$ -29041 -26682 -5927 -42091 -68742 -24259 -6739 -24604 9777 30106 -37931 -74625 -32226
275c2226J1656j5169K3950R078k0039K1075J3160m8356q047M9069K40k8996J3195
$$ -32226 -20570 -35739 -11789 -2711 -22750 -1675 11485 -36871 -44918 4151 4391 -24605 -11410
288a1410l821k8449K7076K5994m0705k692O0111n152n6156N145K6303j89J5584
$$ -11410 -15231 -43680 -16604 9390 -31315 -34007 26104 20952 -35204 -30059 -3756 -3945 11639
301A1639m241n6932q679N7836P005k5733K7830J5302l1221k37Q480l6855J473
$$ 11639 7398 -49534 -58213 -377 6628 -19105 8725 24027 -7194 -7431 1049 -35806 -34333
314c4333N8073n271m4776J7946J9870l1580j300L0602n589M489K8322k7212m1646
$$ -34333 23740 18469 -26307 -8361 11509 -20071 -21371 9231 3642 8131 36453 9241 -32405
327c2405K1526J5573l0265J5761L7671k5526k1349L2431L048k2193K4203P625
$$ -32405 -10879 4694 -25571 -9810 27861 2335 -19014 13417 16465 -5728 18475 26100
339B6100m7528o581L4436p357r754K6755o299k5360K4022Q386m1486N228M6540
$$ 26100 -21428 -28009 6427 -930 -10684 16071 9772 -15588 8434 16820 -24666 -19438 27102
352B7102l933j9361O580k7875l3206M0931L3420l4312l011M6726k502l7000j0075
$$ 27102 23169 3808 10388 -17487 -50693 -9762 23658 -10654 -13665 33061 30559 -6441 -16516
365a6516j0845K918M8901P519o1679q070N4679j503l3126Q066O116l471K8512
$$ -16516 -27361 -24443 24458 31977 -29702 -37772 16907 15404 -17722 -9656 -3540 -7011 21501
378B1501N62n5145n41N4199n488l8107Q453P531j1850K2293J7076k6019M734K5290
$$ 21501 22063 -33082 -33623 20576 15088 -23019 -14566 -7035 -18885 3408 20484 -5535 -801 24489
392B4489l4985l5699L5286K2922k2587J0949J9842k4375p768J7000k2493j3288
$$ 24489 -10496 -46195 -10909 12013 -10574 375 20217 -4158 -11926 5074 -17419 -30707
404c0707M9031J7737m2524p703J8792j4060n213J8996j0869j200M1329q469n7984
$$ -30707 18324 36061 -6463 -14166 4626 -9434 -14647 4349 -6520 -7720 33609 25140 -32844
417c2844O530M9139n651k1371N322j2159l025L7008J47m2250J0922L5675k2728
$$ -32844 -26314 22825 17174 -4197 1125 -11034 -14059 22949 23096 -19154 -8232 27443 4715
430D715k4178J8111J711n141K7946J045l5929Q417K2323l1126j3844M0953J0940
$$ 4715 -19463 -1352 359 -4782 23164 24209 -11720 -3303 19020 -12106 -25950 15003 25943
443B5943k1928O445k654k8337J4248K9824j6672o449K9921j1932l5833J6094J9399
$$ 25943 4015 10460 7806 -20531 -6283 23541 6869 420 30341 18409 -17424 -1330 18069
456A8069j8448L416J7859j8785k540L4731r827l4321K0553K3954k4867j0928J1822
$$ 18069 -379 3037 20896 2111 -429 34302 24475 -9846 10707 34661 9794 -1134 10688
469A0688j3430M349L6959r290l4026J8280J8307l0242n728K8950k794o177J4871
$$ 10688 -2742 1607 38566 29276 -4750 13530 31837 1595 -4133 24817 22023 15846 30717
482C0717k4270l6161K6985L4303j8290m639K0755j2678j2372J6107j5722l1144
$$ 30717 6447 -29714 -2729 31574 13284 8645 29400 16722 4350 20457 4735 -26409
494b6409K8346L0735k6809j4602K0987m712r006J8489o375k1137K4293J5384l8782
$$ -26409 1937 32672 5863 -8739 12248 7536 -1470 17019 10644 -10493 13800 29184 -9598
507i598r503L5548O56k1597M878l977r496L0780J6427l5017l015L7605j4635m4394
$$ -9598 -19101 16447 17103 -4494 384 -3593 -13089 17691 34118 -899 -3914 33691 19056 -25338
521b5338N135K1864O943J4198m668l3345J1879L9811k4321m1643K4880L4708r394
$$ -25338 -20203 1661 8604 22802 18134 -15211 -3332 36479 12158 -29485 -4605 30103 20709
534B0709j3439j4850k5262K0634M2738k1544l8014K8193L1494k0280j8410k939
$$ 20709 7270 -7580 -32842 -12208 30530 8986 -29028 -835 30659 10379 -8031 -10970
546a0970p452J8815K1449l6969l2503M2299L1937l1597j5342J6661N34K976O885
$$ -10970 -18422 393 21842 -15127 -47630 -5331 26606 -4991 -20333 -3672 -3138 -162 6723
559F723k8021j4467M6728J8291m8095k0714K5949J0767K260Q070j4708j675L6988
$$ 6723 -21298 -35765 10963 29254 -18841 -39555 -13606 -2839 -579 7491 -7217 -8892 28096
572B8096n929n7520j825M7362L019k1374L707P77L775K5162q827m3135J3523M8649
$$ 28096 22167 -35353 -37178 10184 13203 -8171 -4464 -3687 88 25250 16423 -26712 -13189 35460
586C5460j1165l7914n64R094Q058J9896j1365l6203J9103L9732k3072l0854K4525
$$ 35460 24295 -13619 -14183 -5089 2969 22865 11500 -24703 -5600 34132 11060 -19794 4731
599D731J9022j6047o781j0042j7811K3196L2705k4472k6739K6011J6984j7615
$$ 4731 23753 7706 925 -9117 -26928 -3732 28973 4501 -22238 3773 20757 3142
611C142o731o034r885K5929K4550l7117l0245L3139J7462k4786j165J7080k935
$$ 3142 -3589 -9623 -19508 6421 30971 -6146 -36391 -3252 14210 -10576 -11741 5339 2404
624B404M779N743k9959j2859L7565J0670l3718o256J7080K223R960P639l0235
$$ 2404 7183 12926 -17033 -29892 7673 18343 -15375 -21631 -4551 -2328 7632 15271 -14964
637a4964j0441L7800K611m2070J789L2534l458j0497L854j2028m972K1679o193
$$ -14964 -25405 12395 15006 -27064 -25275 7259 3801 -6696 -2842 -14870 -19842 1837 -4356
650d356k6970K0399L0594j8683k1090L589q309j149K8582j924l2603J1069K7277
$$ -4356 -31326 -10927 19667 984 -20106 -16517 -24826 -25975 2607 683 -31920 -20851 6426
663F426j8215j8677J5184J735q080J4063k204k0815J2492J9095k0413j1928J8872
$$ 6426 -11789 -30466 -15282 -13547 -21627 -7564 -9768 -30583 -18091 1004 -19409 -31337 -12465
676a2465j572q778J6379k464k3842J7016K5791k4909k1953K1893P969j2660J0021
$$ -12465 -14037 -22815 -6436 -8900 -32742 -15726 10065 -14844 -36797 -14904 -6935 -19595 -9574
689i574O580j5893M313J1001j8262k708K7290L38j7923P972J896j8059J0578J6647
$$ -9574 -2994 -18887 -14574 -3573 -21835 -24543 2747 3085 -14838 -6866 -4970 -23029 -12451 4196
703D196k3760p817L5212N714l0398q24J4720m629L192O377j6569j321K5618p083
$$ 4196 -19564 -27381 7831 13545 -16853 -17677 -2957 -7586 -4394 1983 -14586 -15907 9711 2628
717B628k5548J2813J4495j3407L580J3882j7968n598L2202j339l5026J985K1643
$$ 2628 -22920 -10107 4388 -9019 -5439 8443 -9525 -15123 17079 15740 -19286 -17301 4342
730D342p062p423P067j743Q644J9293j7866k5863K0630J7978k4866n830K1542
$$ 4342 -2720 -10143 -3076 -4819 3825 23118 5252 -20611 19 17997 -6869 -12699 8843
743H843p054j0947J6937k116k1106J5665K1288j9477j3179J4842K533p518J593
$$ 8843 1789 -9158 7779 5663 -15443 222 21510 2033 -11146 3696 6229 -1289 304
756C04j1276p054K8525R077l5354n003L4068K041k1274M070Q84j2674J1485Q348
$$ 304 -10972 -18026 10499 19576 -15778 -20781 13287 15328 -5946 -1876 -992 -13666 -2181 6167
770F167k2981k315K8073k039k2569N582J0937J6R114m329k7646O678L0291j6275
$$ 6167 -16814 -19129 8944 6905 -15664 -10082 855 871 9985 5656 -21990 -15312 14979 -1296
784a296l1033J6810K3688o722O93N008j6157l98J8333j1632k0802J5690J5135
$$ -1296 -32329 -15519 8169 1447 2140 7148 -9009 -9407 8926 -2706 -23508 -7818 7317
797G317j2398l531L553p346J3458J9477k4488k6226K8216K2604k4557j2405J1250
$$ 7317 -5081 -8612 -5059 -12405 1053 20530 -3958 -30184 -1968 20636 -3921 -16326 -5076
810e076l984k10J4003j0430j5166K2030J6066j8743q419Q636l983l28O600j6228
$$ -5076 -9060 -9270 4733 -5697 -20863 1167 17233 -1510 -9929 -1293 -5276 -5604 996 -15232
824a5232n160L5070P224m1016o473L4444N750j5426R24l081m498J4483L19k3383
$$ -15232 -20392 14678 21902 -19114 -25587 8857 14607 -819 105 -2976 -7474 7009 7328 -16055
838a6055N024K4848n374j1293Q843j425l435J8247l609l2958O998L5931q208k8225
$$ -16055 -11031 13817 8443 -2850 5993 4568 1133 19380 15771 -17187 -10189 25742 17534 -10691
852a0691N947J5654J375M319o999j9525J1747K4495j2905j8100J2824M542j1963
$$ -10691 -4744 10910 12285 16604 9605 -9920 1827 26322 13417 -4683 8141 12683 720
865G20O458M57j5590J4154K6373k0462k8118J8979J8750j3845q479J015l299J1358
$$ 720 7178 7635 -7955 6199 32572 12110 -16008 2971 21721 7876 -603 412 -2887 8471
879H471J0625k1068j2467K5124P947k0386j29J0506p564L590J0941j8817j1875
$$ 8471 19096 -1972 -14439 10685 18632 -1754 -1883 8623 1059 4649 15590 -3227 -15102
892a5102K6335P112k7865l373K0384J409k055L157j3723n442K0362L28k3065O449
$$ -15102 11233 18345 -9520 -12893 7491 8900 6845 10002 -3721 -9163 11199 11527 -11538 -5089
906e089J7592j0576m889J0889q157q069J9661K598k4545L529K0550q687j1643
$$ -5089 12503 1927 -2962 7927 -230 -8299 11362 13960 -10585 -7056 13494 4807 -6836
919f836Q321j603m462J2301j499j7084R967J5262j5204p221J5874m787j2052J4212
$$ -6836 1485 -118 -4580 7721 6222 -10862 -895 14367 -837 -8058 7816 3029 -9023 5189
933E189M176j9876M428K0268j1683j4209J1706M491n725Q397o23j4383P707J2191
$$ 5189 9365 -10511 -6083 14185 2502 -11707 -1 4490 -1235 7162 6539 -7844 -137 12054
947A2054j5698o120J7657l173j2717J4158P272j9491J556J8865q978j2933J1499
$$ 12054 -3644 -9764 7893 4720 -7997 6161 13433 -6058 -4502 14363 5385 -7548 3951
960C951L798r225O909J007j4798O515J6506j0356r085J4961q89j1812J1357L776
$$ 3951 7749 -1476 5433 6440 -8358 -1843 14663 4307 -4778 10183 9294 -2518 8839 12615
974A2615k0570K323K0451j0112j5124J5182Q188j0938K291K093r182P555J1534
$$ 12615 -7955 -5632 14819 4707 -10417 4765 12953 2015 4306 6399 -2783 4772 16306
987A6306j6944j0832J9803L119j6829M676Q101j1209N638J6499j4033j4588J7397
$$ 16306 -638 -11470 8333 11452 -5377 -701 7400 -3809 1829 18328 4295 -10293 7104
1000G104P092j9129k479R122l170L737O703j4534m346K2940J684k2415L309J2563
$$ 7104 14196 -4933 -7412 1710 -1460 2277 8980 -5554 -9900 13040 14724 -7691 -4382 8181
1014H181r914k485R734j1403q435K0203N691k1038K021J6394m361o535L160p171
$$ 8181 -1733 -4218 5516 -5887 -14322 5881 11572 -9466 -7445 8949 4588 -1947 1213 -5958
1028e958k282J5807n205k0926J0898K0287j1302r608J0634k162n929J2942k332
$$ -5958 -8240 7567 2362 -18564 -7666 12621 1319 -8289 2345 183 -5746 7196 4864
1041D864k0102P407J9187j1977j3859R506N037K57P600p604j5188J5909J7028
$$ 4864 -15238 -7831 11356 -621 -14480 -4974 63 320 7920 316 -14872 1037 18065
1054A8065k1022j4586J6052M884j0250N428J109j0154J1477J3927j6632j1081
$$ 18065 -2957 -17543 -1491 3393 -6857 -1429 -320 -10474 1003 14930 -1702 -12783
1066a2783J6415L215j3189J621R73o379J1366Q815j9225n652K3609J657j8646
$$ -12783 3632 6847 -6342 -4721 -3748 -10127 1239 10054 -9171 -14823 8786 10443 -8203
1079h203M520P481r616K619Q267j3094n255J9296M03j6913M544J0830m349J991
$$ -8203 -3683 3798 -5818 -3199 5068 -8026 -13281 6015 6418 -10495 -5951 4879 530 2521
1093B521K341j4945oK1884n351k3532Q075J7299p435m600P225n920j024J3130
$$ 2521 4862 -10083 -10089 11795 6444 -17088 -9013 8286 851 -3749 3476 -2444 -3468 9662
1107I662o384j7152J0194J3247j2854n694Q930k197O1J1531q901j5794J5431J3960
$$ 9662 3278 -13874 -3680 9567 -3287 -8981 -51 -2248 -2187 9344 443 -15351 80 14040
1121A4040j7803q435J3641p53p617P874j506j0007J0722Q104j5974l232J5593
$$ 14040 -3763 -12198 1443 690 -6927 947 -559 -10566 156 8260 -7714 -10946 4647
1134D647k452r359P290k971r556J2970Q449j9151m923J9063l73j1633O694K730
$$ 4647 2195 -7164 126 -2845 -12401 569 9018 -10133 -15056 4007 3634 -7999 -1305 1425
1148A425r055O376N907j3878k29J5792o947j2507J1545O616j0459L225N862j2417
$$ 1425 -7630 -1254 4653 -9225 -9454 6338 -609 -13116 -1571 5045 -5414 -2189 3673 -8744
1162h744J665J6570p801j4801J1858P749j3373oQ868o174l88J0313p783r275J5091
$$ -8744 -7079 9491 1690 -13111 -1253 6496 -6877 -6883 1985 -4189 -4577 5736 -2047 -11322 3769
1177C769N247j7395M59J0642o831k537J1510o401j1004J3267P524j4132N23J0556
$$ 3769 9016 -8379 -7920 2722 -4109 -6646 4864 -1537 -12541 726 8250 -5882 -5359 5197
1191E197p365m638J1043l806r823R597M016j3016M290J3788r386o416J2696j828
$$ 5197 -2168 -6806 4237 431 -9392 205 4221 -8795 -4505 9283 -103 -6519 6177 4349
1205D349j1525P865N294j2424K087J2037q849o125J3473P95j0864N994M916j0985
$$ 4349 -7176 689 5983 -6441 -4354 7683 -1166 -7291 6182 6977 -3887 2107 7023 -3962
1219c962L702J0959j1587q551J3255J900j0898O235N890j1237L555J2867r638
$$ -3962 -260 10699 -888 -9439 3816 5716 -5182 1053 6943 -4294 -739 12128 2490
1232B490j0075J0963J761j1010M701M859r101L551J1917j0767r324J4606L420
$$ 2490 -7585 3378 5139 -5871 -1170 3689 -5412 -1861 10056 -711 -10035 4571 7991
1245G991j2315M269N612j0622J352J1379r490r746J3760M870j0673M511O798r098
$$ 7991 -4324 -55 5557 -5065 -3713 7666 -1824 -11570 2190 7060 -3613 898 7696 -1402
1259a402j9R209r533q341J4624L285j4132L311J0843o843j648Q696p697o727J3802
$$ -1402 -1421 7788 -1745 -10086 4538 7823 -6309 -2998 7845 1002 -646 8050 353 -6374 7428
1274G428K465j5239K903J0253q270m636Q196l270k934J3517j134j7465N909J4805
$$ 7428 9893 -5346 -2443 7810 -460 -5096 3100 -170 -3104 10413 9279 -8186 -2277 12528
1288A2528r856j0060O869K11j904R847l456j5020R252J5235j1275r899J0420J846
$$ 12528 2672 -7388 -519 -308 -2212 7635 4179 -10841 -1589 13646 2371 -7528 2892 4738
1302D738n758M362l659j2015J1191J4841j3694j0977J4223O087o505J785l829
$$ 4738 -1020 3342 -317 -12332 -1141 13700 6 -10971 3252 9339 2834 4619 790
1315G90j0742R956J3006j3693r518J4982L960r550K830K160p686P673R425j4080
$$ 790 -9952 4 13010 -683 -10201 4781 8741 -809 2021 4181 -3505 4168 13593 -487
1329d87o812J5550J454j3765J763N765m769N737Q344j2538n473J5624mj5277K978
$$ -487 -7299 8251 9705 -4060 -2297 3468 -1301 4436 12780 242 -5231 10393 10389 -4888 -1910
1344a910Q025o424N96N891q377q69J6167l821j8507N313J4429m925n335J418p000
$$ -1910 6115 -309 287 6178 -2199 -3068 13099 9278 -9229 -3916 10513 5588 253 1671 -5329
1359e329J757J5207n352j8381Q765J5305p275n632M839n108j295J1767m906j6047
$$ -5329 -3572 11635 6283 -12098 -3333 11972 4697 -935 3904 -1204 -2499 9268 4362 -11685
1373a1685Q847J5296q363q197M934j441J455J0321p365j5359J1514J4701j1730
$$ -11685 -2838 12458 4095 -4102 832 -609 846 11167 3802 -11557 -43 14658 2928
1386B928q667P409j642l930J0164j541j0787Q728R429j2237o946J0041p05n426
$$ 2928 -5739 1670 28 -3902 6262 4721 -6066 2662 12091 -146 -7092 2949 2244 -3182
1400c182N871k210q251J1137Q273j6993o459J5984J028r775M300K872p090M786
$$ -3182 2689 479 -7772 3365 11638 -5355 -11814 4170 5198 -4577 -277 2595 -4495 291
1414B91M599j2889j227J4186k623r874P349L797p706M790M445j4344k582J7253
$$ 291 4890 -7999 -9226 4960 2337 -7537 -188 3609 -4097 693 5138 -9206 -11788 5465
1428E465K64j3620L500N238n393L538M557j0630j149J5929j840j2887L850M787
$$ 5465 5729 -7891 -4391 847 -4546 -1008 3549 -7081 -8230 7699 5859 -7028 -3178 1609
1442A609o578L045L861j0556J108J8149l043j6925L588R809m761j182L571p870
$$ 1609 -4969 -1924 1937 -8619 -7511 10638 7595 -9330 -5742 4067 -694 -1876 1695 -6175
1456f175r7J4018l449j4803N278Q908n406J453M959q963r84J3475m884j6771P001
$$ -6175 -6272 7746 4297 -10506 -5228 3680 -1726 -273 4686 -4277 -5261 8214 3330 -13441 -6440
1471f440J1699p214k435P656m595k521R866l172j1910O299O915q486L37P921o708
$$ -6440 5259 -1955 -4390 3266 -1329 -3850 6016 2844 -9066 -2767 4148 -4338 -4001 3920 -2788
1486b788l707J0683l470j1191R929J1138j2113n597R994r10o621L276k074m471
$$ -2788 -6495 4188 718 -10473 -544 10594 -1519 -7116 2878 1968 -4653 -1377 -3451 -7922
1500g922J0671N484j3517j638J2784k359p062M052k643p058J2266P598j8056o564
$$ -7922 2749 8233 -5284 -6922 5862 3503 -3559 493 -2150 -9208 3058 10656 -7400 -13964
1514a3964J7514N112j0217k373r57J676J2213N63j9271k917J7336m99j1399L497
$$ -13964 3550 8662 -1555 -3928 -4885 -3209 9004 9567 -9704 -12621 4715 4216 -7183 -3686
1528c686M317k788P448K673j5753k545J6060m00j3219K218O892j626L309p19j1612
$$ -3686 631 -2157 5291 7964 -7789 -10334 5726 5326 -7893 -5675 1217 -409 2900 2181 -9431
1543i431L023J5472n738j2712Q684P223q762q55M536o965k63J0879n460r719J1861
$$ -9431 -6408 9064 3326 -9386 -702 6521 -2241 -3096 1440 -5525 -5788 5091 -369 -10088 1773
1558A773Q690j0536n637M064j905L712O634r452q478J4197O903j4947l355J0360
$$ 1773 10463 -73 -5710 -1646 -3551 161 6795 -2657 -11135 3062 9965 -4982 -8337 2023
1572B023o37j015O134n954q271J0465M740j5048k638J3748K237l705J405n337
$$ 2023 1386 371 6505 551 -7720 2745 7485 -7563 -10201 3547 5784 2079 3484 -1853
1586a853l386J2093J925j6301o6J4747k116o567M497j890o025Q178L635j2112
$$ -1853 -5239 6854 8779 -7522 -7588 7159 5043 -1524 2973 1083 -4942 3236 6871 -5241
1600e241O33J4337j570q767J722n36k869O816q96j1717O192J6744o668j3356N897
$$ -5241 -4608 9729 8159 -608 1114 578 -2291 4525 3629 -8088 -1896 14848 8180 -5176 721
1615G21M538n504L180K902q092K024J0026p011r155P928N753m682J238Q84o605
$$ 721 5259 -245 2935 5837 -2255 -231 9795 2784 -6371 1557 7310 2628 3866 4750 -1855
1630a855N486Q745j2645r603J4244P260j1946k431O865j047J214M172q713o723
$$ -1855 3631 12376 -269 -9872 4372 11632 -314 -2745 4120 3073 4287 8459 -254 -6977
1644f977J2445L841j0862R4O837k997j85L021r399l576J6594L751j5484p65J0544
$$ -6977 5468 9309 -1553 -1459 5378 2381 2196 5217 -4182 -7758 8836 12587 -2897 -3662 6882
1659F882l543n314K571l498j380J1439N56j1937J621R089m860l954M847l547l052
$$ 6882 3339 -1975 596 -2902 -4282 7157 7713 -4224 -2603 6486 1626 -2328 2519 -1028 -4080
1674d080R563o96j2036N008J1703q680r416P692M294k752L052j278p492O165O248
$$ -4080 5483 4787 -7249 -2241 9462 782 -8634 -942 3352 600 3652 2374 -5118 1047 7295
1689G295j1349o273J1542M305m893K209j757p488O803Q357j1968p230J3934N767
$$ 7295 -4054 -10327 1215 5520 627 2836 1079 -6409 394 8751 -3217 -10447 3487 9254
1703I254j0277k645J122j598N967N012j0279l295J2626J567r711L49K103n502
$$ 9254 -1023 -3668 -2546 -4144 1823 6835 -3444 -6739 5887 7454 -2257 -1908 195 -5307
1717e307N051P210r452n438J2989L455j1310l45M931k974J271M634n810j395R230
$$ -5307 -256 6954 -2498 -7936 5053 8508 -2802 -3147 1784 -1190 81 4715 -1095 -2490 6740
1732F740l373j1388M710Q186m851R91O498n335m281Q087l051j1839N653J1010
$$ 6740 3367 -8021 -3311 4875 24 1015 7513 2178 -2103 5984 2933 -8906 -3253 7757
1746G757m719m138M316j260j087M739n066p507J0413Q989j1605o700Q159O08l137
$$ 7757 3038 -1100 3216 1956 869 5608 542 -6965 3448 12437 832 -5868 2291 2899 -238
1761b38M320l618q058R731J0542r830q904O984K697l283J24m303k900J1150O906
$$ -238 4082 464 -7594 2137 12679 2849 -6055 929 3626 343 467 -3836 -6736 4414 11320
1776A1320j3994n076J1512P45p557J936J315k794O183M229j3284n681J1969L882
$$ 11320 -2674 -7750 3762 4507 -3050 -1114 201 -2593 3590 7819 -5465 -11146 823 4705
1790D705n748J167Q63k909M638J576j0618m59J1837k623r654N698N509n250L19
$$ 4705 -1043 124 987 -1922 2716 4292 -6326 -6785 5052 2429 -7225 -1527 3982 -1268 -949
1805i49L825n926q51Q657l443r181O243O794n475k152J561m733K394Q928n780
$$ -949 2876 -3050 -3901 4756 1313 -7868 -1625 5169 -306 -2458 -897 -5630 -3236 5692 -88
1820h8p011J0185O123j2742o105O982J836L98M325o204o300J0320O384j1348n510
$$ -88 -7099 3086 9209 -3533 -9638 -2656 -820 -422 3903 -2301 -8601 1719 8103 -3245 -8755
1835h755O952K515J792K078q939o389J2807O942j3242n211R701K230k412K553
$$ -8755 -1803 712 2504 4582 -4357 -10746 2061 9003 -4239 -9450 251 2481 69 2622
1849B622l230m764Q585L212j2857l063J0804L770k495J262n308m515Q694L415
$$ 2622 -608 -5372 3213 6425 -6432 -9495 1309 5079 2584 3846 -1462 -5977 2717 6132
1863F132j1179K82J2397j573q316K161J070m450L518L361m736L246P764o986r138
$$ 6132 -5047 -4765 7632 6059 -2257 -96 974 -3476 42 3403 -1333 1913 9677 2691 -6447
1878f447O331M682m574P98N38n171M480Q330p904q772R378N954q706k200M568
$$ -6447 -116 4566 -8 790 1328 -3843 637 8967 1063 -7709 1669 7623 -1083 -3283 1285
1893A285k14K108K290r078n349J0612M394q403L99N548j377P6J943r072o003J2447
$$ 1285 1071 3179 5469 -3609 -8958 1654 6048 -2355 -1956 3592 2215 2291 4234 -4838 -10841 1606
1909A606O173q867j672N735l069k886L336k900j153Q726M35r869Q78O343m443
$$ 1606 7779 -1088 -2760 2975 -94 -2980 356 -2544 -3697 5029 5464 -4405 -3527 2816 -1627
1924a627k722N312k672l476Q052K409r451J01P967l958m598L317p08k841N718
$$ -1627 -4349 963 -1709 -5185 2867 5276 -4175 -4074 3893 -65 -4663 -1346 -2054 -4895 823
1939H23J797o878K306N185o965l877P601P69l692M662Kq604J150P093l608l624
$$ 823 2620 -4258 -1952 3233 -3732 -7609 -8 761 -2931 1731 1733 -6871 -5721 1372 -2236 -5860
1955e860O866J588n544J941K18n388L058O233n602l448P357J98o673K894L498
$$ -5860 1006 2594 -2950 -1009 -791 -6179 -3121 3112 -2490 -5938 1419 1617 -5056 -2162 1336
1970A336m373J852N311o411l803Q163J932p267R07K955m266J246M892l512j014
$$ 1336 -3037 -1185 4126 -2285 -6088 2075 4007 -3260 -2353 602 -3664 -2418 2474 -1038 -2052
1985b052Q307j867r619J893N245m742K87O035k270k647N348k716q004M834P347
$$ -2052 6255 4388 -5231 -3338 1907 -2835 -2548 3487 1217 -1430 3918 1202 -6802 -1968 5379
2000E379m716j901M318j715l050L709k953m998O852N417p914k579Q201p08m942
$$ 5379 663 -1238 3080 1365 -1685 2024 -929 -5927 925 6342 -1572 -4151 4050 3342 -1600
2015a600K857j74n612L832M270n321p74P246j918n871K708M8k836N347M104o984
$$ -1600 1257 1083 -4529 -697 3573 -1748 -2522 4724 2806 -3065 -357 -309 -3145 2202 6306 -678
2031f78j502N854m346p026O121N172l460Q36K902n054j607M369l050m129P054
$$ -678 -2180 3674 -672 -7698 -1577 3595 135 971 3873 -1181 -2788 1581 -1469 -5598 1456
2046A456L298o244l78K744m078R6O819l275n928O144L818o771j058M563k524k082
$$ 1456 4754 -1490 -1868 876 -3202 -3106 3713 438 -5490 654 4472 -2299 -3357 1206 -1318 -3400
2062c400L917k882l157P315L906o919q04L174m410j618O082j396m046N860L324
$$ -3400 517 -2365 -5522 1793 5699 -1220 -2024 1150 -3260 -4878 1204 -192 -4238 1622 4946
2077D946p289k183M148k083L65O155j135o109L365J421o758J496O481k313k925
$$ 4946 -2343 -4526 -378 -2461 -2096 4059 2924 -3185 180 1601 -5157 -3661 2820 507 -2418
2092b418N048j344n239M742L328o174l09M878l336k492N351M77m744K969K096
$$ -2418 2630 1286 -3953 789 4117 -2057 -2366 2512 -824 -3316 2035 2512 -2232 737 2833
2107B833n198M05N525l398k673O202Q06o300J57J420m003L427P823m013n803M133
$$ 2833 -2365 -1960 3565 167 -2506 3696 4502 -1798 -1641 -221 -4224 -797 7026 3013 -2790 1343
2123A343J732n077Q29K702j957J982M152o211m934P772K783o897N64L967k153
$$ 1343 3075 -2002 -1173 1529 -428 1554 5706 -505 -5439 2333 5116 -1781 -1217 2750 597
2138E97N77L640n001l470O291J492o822N86L689k172J397N463l480n450L409m3
$$ 597 1174 4814 -187 -3657 2634 4126 -2696 -2110 1579 -593 804 6267 2787 -2663 746 703
2154G03n268M191O195m528k948M153j622m750L376K135k196L996K101p780k048
$$ 703 -4565 -374 5821 1293 -1655 2498 876 -3874 -498 1637 -559 3437 5538 -2242 -4290
2169d290O742j247n779L821K887k569K000J917o748j458P682N06o572J062K184
$$ -4290 2452 1205 -4574 -753 2134 -435 1565 3482 -3266 -4724 2958 3464 -3108 -2046 138
2184A38j837L253K202p200p45P244j700o161M291N210m017r13J018m937m36N959
$$ 138 -1699 1554 3756 -3444 -4189 3055 1355 -4806 -515 4695 678 -235 783 -4154 -4590 1369
2200A369l15m294N067K946n911j286K402l167J61O588j096n553L144K215n925
$$ 1369 1054 -3240 1827 4773 -1138 -2424 -22 -3189 -3028 3560 2464 -3089 55 2270 -3655
2215c655l86N344l58j333L245k254m423L962L315o280n17N038j819k177M049l94
$$ -3655 -4041 1303 945 -388 2857 603 -3820 142 3457 -2823 -3340 1698 -121 -2298 1751 1357
2231A357l617M225K336p296j441N996j53k352K499l93l091K904J156o829J492
$$ 1357 -2260 1965 4301 -2995 -4436 1560 1407 -945 1554 1161 -1930 974 2130 -4699 -3207
2246c207Q934q98n830M47j63j714L971Q70o522K137Q960l138q482K030M079l06
$$ -3207 5727 4829 -1001 -554 -717 -2431 1540 2410 -4112 -1975 6985 3847 -4635 -2605 1474 1168
2262A168J390j345n227K455P293l924o856M240M164l146k07Rl498L875O832n273
$$ 1168 2558 1213 -4014 -1559 5734 1810 -5046 -806 3358 212 5 14 -3484 391 7223 1950
2278A950p865M872L874m402q54L326PJ869J953o279m411O802L393n750P78L900
$$ 1950 -5915 -1043 2831 -1571 -2425 901 908 2777 4730 -1549 -5960 842 4235 -1515 -737 3163
2294C163k699k013K321k455k493O555K522o650q10M848j446j811J244k456j262
$$ 3163 464 -1549 772 -1683 -4176 2379 4901 -1749 -2559 2289 843 -968 276 -2180 -3442
2309c442N587L74o968J867O849k705l929J730j482j830M889J870n599O01N252
$$ -3442 2145 2519 -4449 -2582 4267 1562 -2367 -637 -2119 -3949 940 2810 -2789 -2188 3064
2324C064l319n090K875J618N82M385r31p484Q50O059l609m459M686K327j403J935
$$ 3064 -255 -5345 -2470 -852 -270 4115 3184 -4300 -3450 2609 -1000 -5459 -773 1554 151 2086
2340B086j293n914K316P361l564m940L593K601k316M82j280l187M193M987n344
$$ 2086 793 -5121 -2805 4556 992 -3948 -355 2246 -70 412 -868 -4055 138 5125 -219
2355b19n151O258L250l588o95L54l713K083M849m352k806O767J880n606j377J450
$$ -219 -5370 888 4138 550 -145 209 -3504 -1421 3428 -924 -3730 3037 4917 -689 -2066 -616
2371f16j077K085L076l979j796O119r09p860J142N838p76r82K389k494k113M416
$$ -616 -1693 392 3468 -511 -2307 3812 2903 -4957 -3815 2023 1247 265 2654 160 -1953 2463
2387B463n07n737K448M962k616k189J782j528M77N265k762p042L495O449m014
$$ 2463 1956 -3781 -1333 3629 1013 -1176 606 -922 -445 4820 2058 -4984 -1489 4960 946
2402I46l793L727R16j689K177j640n397M069N665k606l208K096j343j888L321
$$ 946 -2847 880 1796 107 2284 644 -4753 -684 4981 2375 -833 1263 -80 -1968 1353
2417A353r40m392M331N584n225m800L550J292j735K403K74m232K190L693m378
$$ 1353 413 -3979 352 5936 711 -4089 -539 753 -982 1421 1695 -2537 -347 3346 -1032
2432a032k757L969K93k218K759q50l592L745M762n821l983N887N92n106J336K893
$$ -1032 -3789 180 473 -1745 1014 164 -3428 317 5079 -742 -4725 1162 1754 -3352 -2016 877
2448H77q72J455J590n123j854N008J85l306K560K263l227k3J250m233j76P076
$$ 877 5 1460 3050 -2073 -3927 1081 1266 -2040 520 2783 -444 -467 783 -3450 -3626 3450
2464C450j30o001K147L558k924j532J611j800N99M025k037m973L871M113m235
$$ 3450 3320 -2681 -534 3024 100 -1432 179 -1621 -1022 3003 966 -4007 -136 3977 -258
2479b58p90K005j811j028M932j655n294L893M339n001l226L622J304L89K593k407
$$ -258 -1048 957 -854 -1882 3050 1395 -3899 -6 4333 -668 -3894 -272 1032 1421 4014 1607
2495A607m412L505K023n150r51N867j15j968K290j888m280L360M046m577r99M880
$$ 1607 -2805 700 2723 -2427 -3378 2489 2374 406 2696 808 -3472 -112 3934 -643 -1642 3238
2511C238Jl887J164k74k155L248J826m420o4N302j906l346K555Q30m044J806K654
$$ 3238 3239 -648 516 242 -1913 1335 3161 -1259 -1323 3979 2073 -1273 1282 2112 -1932 -126 2528
2528B528m273J3N384q80m348J474J391k300J645J559k937K76M166l201m287L348
$$ 2528 -1745 -1732 3652 2772 -1576 -102 1289 -1011 634 2193 -744 -468 3698 497 -3790 -442
2544d42K775l319J451L042l421j537L481j374m041L830K971l558o63K362k305
$$ -442 2333 -986 465 3507 86 -1451 2030 656 -3385 445 3416 -142 -805 1557 -748
2559g48J89L275k717k685M851J218n312N00M081j833j838K130j455k509L715K572
$$ -748 -559 2716 -1 -2686 2165 3383 -1929 -1429 2652 819 -1019 1111 -344 -2853 862 3434
2575C434m419k38L502j592k305J346j354p57N031O66o010L60M663k393l029L308
$$ 3434 -985 -1223 2279 687 -1618 -272 -1626 -2383 2648 3314 -2696 -2336 2327 -66 -3095 213
2591B13Q11k342K610N16m555L86L721j745j978K886L50k617L031O24l948J166
$$ 213 1024 -1318 1292 1808 -2747 -2361 1360 -385 -2363 523 873 -1744 1287 1911 -2037 -871
2607h71L916l534l544M157J485k766J380K226l254r1K845k352j727M108R98l522
$$ -871 3045 -489 -4033 124 1609 -1157 223 2449 -805 -896 1949 -403 -2130 1978 2976 -546
2623e46J50Q83k799J742L869k950k354N000L36n443O5L374j589J36K748k733k022
$$ -546 -396 487 -2312 -570 3299 349 -2005 2995 3331 -2112 -2047 1327 -262 -126 2622 -111 -2133
2640b133M104j02m394J610K995j864o9K061k639j679M709k89n666J180M454j498
$$ -2133 1971 1869 -2525 -915 2080 216 147 2208 -431 -2110 2599 2310 -3356 -2176 2278 780
2656G80j220K401j047j642K634j061m579K263M072j497j384J856j963j718L777
$$ 780 -440 1961 914 -728 1906 845 -3734 -1471 2601 1104 -280 1576 -387 -2105 1672
2671A672m67m581K874M840l315l418K464J61j737K289M27l499K060K849l384j992
$$ 1672 1205 -3376 -502 4338 1023 -2395 69 230 -1507 782 1209 -2290 -230 2619 -765 -2757
2687b757L755p1k576K131l15l154K297L779m308k417M666O45l902O80J794j076
$$ -2757 998 927 -1649 482 167 -2987 -690 3089 -1219 -3636 1030 1675 -2227 -1547 247 -829
2703h29J198J397m446j134M955m75l654K391K410k764J087J559m562j284O194
$$ -829 369 1766 -2680 -3814 1141 666 -2988 -597 1813 -951 136 1695 -2867 -4151 2043
2718B043J88m794P89K855j555J06O64k460L00M849r49m891K022K706k337k43J724
$$ 2043 2231 -2563 -1774 1081 -474 -368 296 -2164 -1864 2985 2036 -2855 -833 1873 -464 -707 1017
2735A017k879j002N034l54m516K224L010k114j797J394j532q4L939j182m014K824
$$ 1017 -1862 -2864 2170 1816 -2700 -476 2534 420 -1377 17 -1515 -1599 2340 1158 -2856 -32
2751c2K321l645j018L683q40j428K929r59l911K341K869l338j232L326K12k144
$$ -32 2289 -1356 -2374 1309 469 -959 1970 1011 -2900 -559 2310 -1028 -2260 1066 1278 -866
2767h66J835n16k694L134K166m456q73M043p86k393K349L55k875K248K124l903
$$ -866 969 453 -2241 893 3059 -1397 -2270 1773 987 -1406 943 1298 -1577 671 2795 -1108
2783a108o33M548n37l409J107O08j755J917J488l325L44M411k211l853K222J705
$$ -1108 -1741 2807 2270 -1139 -32 576 -1179 738 2226 -1099 -755 3656 1445 -2408 -186 1519
2799A519k589J045K320k887o22L328j202l520K452J944k307J008J142k765K12
$$ 1519 -1070 -25 2295 -592 -1214 2114 912 -2608 -156 1788 -519 489 1631 -1134 -922
2814i22L110j542l497L038K159l339L02K769j875j303K843k88l452J997J332k406
$$ -922 2188 646 -2851 187 2346 -993 -691 2078 203 -1100 1743 1455 -1997 0 1332 -1074
2830a074J156K465l179j380L435m20l047K953J983l717k8K674k575j436L428j01
$$ -1074 82 2547 -632 -2012 1423 1003 -2044 909 2892 -825 -853 1821 -754 -2190 1238 1137
2846A137k625J854J247k915M19K646k071j218L357m70m077K463K043k995l18K819
$$ 1137 -1488 366 1613 -1302 -883 1763 -308 -1526 1831 1361 -2716 -253 1790 -1205 -1523 1296
2862A296j467j616L288o03k905K479J552l261o86K923j390j355L118m06k502K047
$$ 1296 -171 -1787 1501 898 -2007 472 2024 -1237 -1923 1000 -390 -1745 1373 967 -1535 512
2878E12J762l509n32L114p78j832K407j52l042K073K233l345l52L010m00k143
$$ 512 2274 -1235 -1767 1347 569 -1263 1144 992 -2050 23 2256 -1089 -1441 1569 1169 -974
2894i74J589K25k329J882J871l495n75L642l06k808K000Q04k343J186J619l444
$$ -974 615 840 -1489 393 2264 -1231 -1806 1836 1530 -1278 722 1526 -817 369 1988 -1456
2910a456m47M308p55l121J681J306k299J303J369k859K50L833k199l124J987K005
$$ -1456 -1903 2405 1650 -1471 210 1516 -783 520 1889 -970 -720 3113 914 -2210 -223 1782
2926A782k631R22J696k496J80L227j778l280K887J625k777L06J413j835o09L237
$$ 1782 -849 73 1769 -727 -547 2680 902 -2378 509 2134 -643 -337 1076 -759 -1368 1869
2942A869j456l037L236J451l242J36K228j347n65J745j621k318L273J855l876
$$ 1869 413 -2624 612 2063 -1179 -1043 1185 -162 -727 1018 -603 -2921 352 2207 -1669
2957a669k9L051r41j627J356r54j457K952J016l930m4L659j151k173J665Lj566
$$ -1669 -1698 1353 412 -1215 141 -813 -2270 682 1698 -2232 -2276 1383 232 -1941 -276 -273 -1839
2974a839K866P08m032j55M103j337k604J427O65j243J881M45l464Q12M081k388
$$ -1839 1027 1735 -2297 -2452 1651 314 -2290 -863 -198 -1441 440 885 -2579 -1767 2314 -74
2990g4k520K329J094k168J045Q90l216J060L631k461k657L351J277k583K10Q97
$$ -74 -2594 -265 829 -1339 -294 596 -2620 -1560 2071 -390 -3047 304 1581 -1002 -792 105
3006A05k075Q71K972k782k333L505J422l344O35J200j318O07K302k428k030L621
$$ 105 -1970 -1099 1873 -909 -3242 263 1685 -1659 -1024 176 -1142 -535 1767 -661 -2691 930
3022I30Q86l321q2K421j480K76K165k335j368L470P12l912N82K422j063o04J616
$$ 930 1816 -1505 -1587 834 -646 -370 1795 -540 -1908 1562 2274 -1638 -1056 1366 303 -301 1315
3039A315j614j074L542L93m487R59L385j885j613J832n77j265L020m60l375J522
$$ 1315 -299 -1373 2169 2562 -1925 -966 2419 534 -1079 753 176 -1089 1931 1471 -1904 -382
3055c82L256k212j333J569l82j347K268Q5l504J574K981k058k258K204P58j495
$$ -382 2874 662 -671 898 516 -831 1437 1522 -1982 -408 2573 515 -1743 461 1219 -276
3071b76J521l08k846J748K789l184j902L403L17k313J163R09k210J500J972k872
$$ -276 1245 937 -1909 -161 2628 -556 -2458 945 1262 -1051 112 1021 -1189 311 2283 -589
3087e89j837L283Q90k941Q34P75j421J037K124l199j360L861K01l200J133J667
$$ -589 -2426 857 1747 -1194 -360 415 -1006 31 2155 -1044 -2404 1457 1658 -1542 -409 1258
3103A258k063N26J862k476j669L487N97l006O41J761j476L23J287k369r16L499
$$ 1258 -805 -279 1583 -893 -2562 925 1522 -1484 -843 918 -558 -235 1052 -1317 -2233 1266
3119A266n10l427J512K515k036m49K190j778j175L167k06l118J215K403j913j007
$$ 1266 756 -2671 -1159 1356 -680 -1129 1061 -717 -1892 1275 1069 -2049 -834 1569 -344 -1351
3135a351J874j017n03K640o95k983J751K987k772j592K392O5j526J841n25k636
$$ -1351 523 -494 -997 1643 948 -2035 -284 2703 -69 -1661 731 796 -730 1111 586 -2050
3151b050K172L036l039j529K645K23j204R71j065k049K841K139l585j504L594
$$ -2050 122 3158 119 -1410 1235 1458 254 1225 160 -1889 952 3091 -494 -1998 1596
3166A596N19k287R10Nj518J805J351l160p43L455K6k682J207K25j163J298J339
$$ 1596 2115 -172 738 743 -775 1030 2381 -779 -1522 1933 1959 -723 484 709 -454 844 2183
3183B183l066q45M085o46l210J412J405j399L62J073k285K63L068j461k660J849
$$ 2183 -883 -1728 2357 1711 -1499 -87 1318 -81 281 1354 -931 -668 2400 939 -1721 128
3199A28J628j813k14O93j688O00L037j735k950K326K457k768r77J494r87J22J894
$$ 128 1756 -57 -271 422 -1266 -666 2371 636 -2314 12 2469 -299 -1276 218 -769 -647 1247
3216A247j671j994K545J972l211m73K186j063l97J705j207k311K746K321l630
$$ 1247 -424 -2418 127 2099 -1112 -1585 601 -462 -859 846 -361 -2672 74 2395 -1235
3231a235j199K645j75j039J266p90j344K267R92l191l31L120n76j826J393m10
$$ -1235 -2434 211 36 -1003 263 -527 -1871 396 1388 -1803 -2134 986 410 -1416 -23 -433
3247d33j253K129J374l571k59L337l34k572J215O53j187J257P01k677O97K957
$$ -433 -1686 443 1817 -1754 -2013 1324 990 -1582 -367 286 -901 356 1057 -1620 -923 2034
3263B034j248l003K034J321j793N57P41j903O44L191k006l256K559J956j952m54
$$ 2034 786 -2217 -183 1138 -655 -98 643 -1260 -616 2575 569 -2687 -128 1828 -124 -578
3279e78R02p96N06J878k536j526K997J468k969r4J432o85o1J920j744j863K596
$$ -578 324 -472 34 1912 -624 -2150 847 2315 -654 -748 684 -1 -62 1858 114 -1749 847
3296H47J382k442o74J922o23l93J400j418j098K636N96l132M73K048j115j463
$$ 847 2229 -213 -887 1035 412 19 1419 1 -1097 1539 2135 -997 -524 1524 409 -1054
3312a054K007l29j570J809Q40k408Q1K200j496r80J565j26j438J376K17k311J405
$$ -1054 953 624 -946 863 1703 -705 -624 1576 80 -900 665 539 -899 477 694 -1617 -212
3329b12K002j944j735K357M98k163J532Qj964Q95K136j690j322J904L63j391R69
$$ -212 1790 -154 -1889 468 966 -1197 335 343 -1621 -726 1410 -280 -1602 302 665 -726 243
3346B43L96k178J183J860k123j547K921L17k380O24J310j592M24J497j229j397
$$ 243 639 -1539 -356 1504 -619 -2166 755 1072 -1308 -684 626 -966 -542 955 -274 -1671
3362a671K294L00k042N42O91r77L22J492j936m98K453J33l092J251K148k026l74
$$ -1671 623 923 -1119 -577 114 -863 -541 951 -985 -1483 970 1103 -1989 -738 1410 -616 -990
3379i90J432p07p82J537j25j680P24J832j604l28J288q92p36J611m9k551J781
$$ -990 442 -265 -1047 490 365 -1315 -591 1241 -363 -691 597 -295 -1031 580 531 -2020 -239
3396b39K116j969j027K044M6j779J302N5j288J108J563k325k26K083p86j714J742
$$ -239 1877 -92 -1119 925 971 -808 494 549 -739 369 1932 -393 -619 1464 678 -1036 706
3413G06M64j918R58J561k032p30K177j78j992J483L63j525J063J416j963l91J775
$$ 706 1170 -748 210 1771 -261 -991 1186 1008 -984 499 862 -663 400 1816 -147 -538 1237
3430A237o46j876J743L34j739P97J300j602p70K660p50j874J341J155j741L19
$$ 1237 591 -1285 458 792 -947 -150 1150 -452 -1222 1438 688 -1186 155 1310 -431 -112
3446a12Q33j087n51J844l45j775J147J130j663J34J362j148n72K376q53k200J405
$$ -112 721 -366 -917 927 582 -1193 -46 1084 -579 -445 917 -231 -803 1573 720 -1480 -75
3463g5J441j631n75J354r69J06J749j166j343J283R56j655n58J570j019J6J909
$$ -75 1366 -265 -840 514 -455 -349 1400 234 -1109 174 1130 -525 -1083 487 -532 -516 1393
3480A393p75k137J595J066j669r24J641l14n65J010n26j264J506J038k401J8K073
$$ 1393 618 -1519 76 1142 -527 -1451 190 -124 -689 321 -205 -1469 37 1075 -1326 -1308 765
3497G65q45j320J422J54j524J126P42j548j54K230o20j427P25O61q98O93L58j471
$$ 765 -80 -1400 22 176 -1348 -222 520 -1028 -1182 1048 428 -999 -274 387 -511 182 540 -931
3515i31M72K000j107k089J883Q29j980O78Q65o76p0J726j466j170J533N27j537
$$ -931 -459 1541 434 -1655 228 1057 -923 -245 620 -56 -126 1600 134 -1036 497 1024 -513
3532e13N48J115j377M38J547j446j709K122L09j796Q49P92q98n48J677p91j235
$$ -513 35 1150 -227 211 1758 312 -1397 725 1034 -762 87 879 -19 -567 1110 319 -916
3549i16J137Q75j556L70J235j300k97J534p48j885J847J128j826J80J535j461
$$ -916 221 1096 -460 -90 1145 -155 -452 1082 334 -1551 296 1424 -402 -222 1313 -148
3565a48m42J485l58j451J157J177j860M8J471j105q36J679k86j196J446J93j816
$$ -148 -590 895 537 -914 243 1420 -440 -392 1079 -26 -862 817 531 -665 781 974 -842
3582h42M41J764j149j390J744r4j052P28M24j513N02J607j180j282J741K35j454
$$ -842 -401 1363 214 -1176 568 474 -578 150 574 -939 -437 1170 -10 -1292 449 684 -770
3599g70J123M9k041R29J806j230j280K123M1j517L35O32j303L12J450r20o14J745
$$ -770 353 402 -1639 -710 1096 -134 -1414 709 750 -767 -432 200 -1103 -791 659 -261 -875 870
3617H70k85j842R21J133j543j91J488p11o24J516m81j526J054J344j432m47J314
$$ 870 585 -1257 -336 797 -746 -937 551 -160 -784 732 251 -1275 -221 1123 -309 -756 558
3634E58R4j064J079k49j569J551P26k068K51J909m39j049L63K23j064O50J085
$$ 558 652 -412 667 418 -1151 400 1126 -942 -691 1218 779 -270 93 316 -748 -98 987
3651I87j788M9K312j121j455R75N00r05P77J62j042K30J796j088j563J414M90
$$ 987 -801 -752 1560 439 -1016 -41 459 -446 331 493 -549 -319 1477 389 -1174 240 730
3668G30j225NJ264q88k10J566j219j127J464O70j492K78R60p93j95J273j227j043
$$ 730 -495 -490 774 -114 -324 1242 23 -1104 360 1030 -462 -184 776 -17 -212 1061 -166 -1209
3686a209J540P24j523N76J383j710p62J533l22j050J398N93j414j0J326r06q64
$$ -1209 331 1055 -468 108 1491 -219 -981 552 230 -820 578 1171 -243 -253 1073 167 -697
3703f97J212k19q20P44Q86j907L43J218p91j066J510k32p56J252K17j755J3J445
$$ -697 515 296 -524 220 1106 -801 -458 760 -31 -1097 413 181 -575 677 894 -861 -848 597
3721E97o15p95J188j06r08J229K82j986L70J870j035j274J330L82q65P74l70j375
$$ 597 -18 -813 375 269 -639 590 872 -1114 -744 1126 91 -1183 147 529 -336 438 68 -1307
3739a307O03K025j599r45J366P19j373K81K51q95O27R29j052j230J789Q55j457
$$ -1307 -704 1321 -278 -1223 143 862 -511 -230 21 -874 -247 682 -370 -1600 189 1044 -413
3756d13k50N82k73J65R38j054r78J999O3j904J70J654p15p96J066l10n68J388
$$ -413 -663 -81 -354 -189 749 -305 -1283 716 779 -1125 -955 699 -16 -812 254 -56 -624 764
3774G64k39j863P11J649j068o07J160P6j045O09k0j367J119J579j655p54J606
$$ 764 525 -1338 -627 1022 -46 -653 507 583 -462 147 127 -1240 -121 1458 -197 -951 655
3791F55l14p44O88j1j387J120J142j205p37J447K7j173M85M44j025P37R90j260
$$ 655 341 -403 285 274 -1113 7 1149 -56 -793 654 681 -492 -7 437 -588 149 1139 -121
3809a21m82J247k45p54N35R18j604M11J493j228q24R20j17o96Q97N46j472O66
$$ -121 -603 644 399 -355 180 1098 -506 -95 1398 170 -654 266 149 -547 350 896 -576 90
3827I0J101j207j032J455L21r48M10P28j346P27M40j303m87J924k27j378O63R20
$$ 90 1191 -16 -1048 407 728 -220 190 918 -428 299 739 -564 -1051 873 646 -732 -69 851
3845H51j179K57P53j368j50J384q9r34O9Q77l51n65P36j043J93J362j60j667R33
$$ 851 -328 -71 682 -686 -836 548 459 -475 -406 471 120 -445 291 -752 -559 803 643 -1024 -91
3864i1J032j306n88J186l25n69J353l34j311P62P14j201k49J015L32o81R35j68
$$ -91 941 -365 -953 233 -92 -661 692 358 -953 -191 523 -678 -927 88 420 -261 674 506
3882E06j747J022Q09j390n5J446m39o12R64l08j206R09P60j141k59J055O0j135
$$ 506 -1241 -219 590 -800 -855 591 152 -460 504 196 -1010 -101 659 -482 -741 314 374 -761
3900g61P34J19r03P56O60j014k90J208j82q91J039k20j043M85J298j242j41R71
$$ -761 -27 92 -811 -55 605 -409 -699 509 327 -564 475 255 -788 -303 995 -247 -388 583
3918E83l03p74P31J82j343J153O07r80m27J367l75j259J048J83p51N31Q83q51
$$ 583 280 -494 237 419 -924 229 836 -144 -571 796 421 -838 210 393 -358 173 1056 205
3936B05o61J687q01j322Q48P79p62M64mn91j10J560r40j639J626Q59j413J04K97
$$ 205 -456 1231 430 -892 -44 735 -27 437 433 -158 -268 1292 352 -1287 339 1198 -215 -111 186
3955A86q1j08P95o69p96R72J244j552n93J170n42p4M75o70o10J325P16j480o14
$$ 186 105 -3 792 123 -673 299 1543 -9 -602 568 26 -48 427 -243 -853 472 1188 -292 -906
3974i06J537k70p97O74k67l77R83N23j841m5J409o35m00O95j29j001J236K07j156
$$ -906 631 361 -436 238 -29 -406 577 1100 -741 -786 623 -12 -412 283 154 -847 389 596 -560
3993e60k32J452k00j282J002M37r42N34R7r04j25J108n03q72J165K44j203K92
$$ -560 -792 660 460 -822 180 617 -325 209 306 -598 -723 385 -118 -990 175 419 -784 -492
4011d92Q41r27O5J128r29o34J566p1j193K00K98j96J2J020r24o99J304K94j542
$$ -492 349 -578 -513 615 -314 -948 618 547 -646 -446 -148 -344 -332 688 -236 -935 369 663 -879
4030h79l5J216m34k33Q22l76j156J416K37j447L76R66p3l13N53o96n95R55O61
$$ -879 -914 302 -132 -365 457 81 -1075 341 578 -869 -493 473 400 87 640 -56 -651 304 965
4049I65j887N00J379q54m27R47n87m86J169j41j120K31J470q28o77K50J70l25
$$ 965 -922 -422 957 103 -324 623 36 -450 719 578 -542 -311 1159 331 -346 -96 74 -251
4067b51O46j88o46L59J311j087j154J575q4j149M90P11j123L52J317j040j003
$$ -251 395 207 -439 -80 1231 144 -1010 565 481 -668 -178 533 -590 -238 1079 39 -964
4084i64J287L37j027R5P56q04M83Q64j074m60J092L19j586L52O76M3m45P50j040
$$ -964 323 660 -367 -272 484 -320 163 1027 -47 -507 585 904 -682 -330 346 389 -56 694 -346
4103c46j67J049J45j107J96P81m34m18O20o88k57J317l20q89O24P19j040l07O23
$$ -346 -513 536 681 -426 -230 551 117 -301 319 -369 -626 691 371 -518 106 825 -215 -522 101
4122A01n91j8J068J70j328L36R02j301J59P41l77p40J356k00j169M01J047j196
$$ 101 -490 -508 560 730 -598 -262 640 -661 -502 239 -138 -878 478 278 -891 -490 557 -639
4140f39j24R20j4o36L93J48p55J71J014r03j84J159o70k76O53k5q84M75O11q15
$$ -639 -763 157 143 -493 -100 48 -707 -536 478 -425 -609 550 -120 -396 257 232 -652 -177 434 -381
4160c81l40J328j1j161L49M04q36P09L53p67O9R65j18j111M83L36j072M49P89
$$ -381 -721 607 596 -565 -216 188 -648 61 414 -353 -284 681 563 -548 -65 271 -801 -352 437
4179D37o47j10J166o03j158R40K92m01p2P31m44l49N89j90p63L93P04q79K56P15
$$ 437 -210 -320 846 243 -915 25 317 -84 -156 575 131 -218 371 181 -582 -189 515 -364 -108 607
4199F07o33N6O49k39j063O40P18r47J03Q45k30r61R76k26r14O88N58p83o2R35
$$ 607 -26 30 679 440 -623 17 735 -212 -109 736 506 -455 521 295 -619 69 627 -156 -218 717
4219G17o45o85J095J46j118O27J52m83j67R56k75r86Q18L44q79K66M98m76l34
$$ 717 72 -613 482 628 -490 137 289 -194 -361 595 320 -666 152 496 -383 -117 381 -95 -429
4238d29R21p38n56R78N20j265N24N28p58k33Q41l51p43P86L37o47M54L81j114
$$ -429 492 -246 -802 176 696 -569 -45 483 -275 -508 333 -18 -761 25 362 -285 169 550 -564
4257e64j25J037l05r49J036O8n51p0J063j053l60R73n9n97L18N02o17J4O17j192
$$ -564 -689 348 43 -906 130 198 -353 -423 640 -413 -773 200 141 -456 -138 364 -253 -239 378 -814
4277h14O9J238j03j284J238K33j114M59J94q92J56J001N8p07J11M29m71n3N91
$$ -814 -745 493 390 -894 344 577 -537 -78 116 -776 -620 381 439 -268 -157 272 -199 -252 339
4296C39n22j53R64j43p70M06M97j260J8R45o39K38N74q6r40N89L16n92j28P47
$$ 339 -183 -336 628 485 -285 121 618 -642 -624 321 -318 -80 494 408 -532 57 373 -219 -347 400
4316D00l14j14L83p5p59N20O50r56L55N94n52m24P38k1p74K58P37j041j41J134
$$ 400 86 -28 355 280 -479 41 691 -265 90 684 132 -292 446 425 -349 -91 646 -395 -536 598
4336E98m69m93O13L3p29P40L89p18j74J103p34o92Q74N4l98L3O92q22J06P57l96
$$ 598 129 -364 249 282 -447 293 682 -36 -210 893 159 -533 341 395 -3 30 722 -100 6 763 367
4357C67j036R75j86o1n6M78q16k05J112o36j022Q23P41p35j36P73q05J56N03K
$$ 367 -669 306 120 59 3 481 -335 -540 572 -64 -1086 -263 478 -257 -393 380 -425 -269 234 236
4377B36o55J83Q56q94K50K7j75l88R05p7j064Q05M35n76J2M75m30l30N25j41p97
$$ 236 -419 -236 620 -274 -24 3 -172 -560 345 268 -796 9 444 -132 -120 355 -75 -405 120 -21 -818
4398h18P51Q23j371L50O51m60m00N90m9o75P63L98q90j16J125r38k46J027j46
$$ -818 -67 756 -615 -265 386 -74 -474 116 67 -608 155 553 -337 -453 672 -266 -512 515 369
4417C69q02N70K02r97J77P12q1o38P78l98l25O54K5o17R5P32j99q51P04J56q17
$$ 369 -433 137 339 -658 -481 231 150 -488 290 -108 -433 221 246 -371 -276 456 257 -594 110 266 -551
4438e51L02N50p75J40R58l87n36L40K98n26J44N92j126J96Q76j25o06N74J33p25
$$ -551 -249 301 -474 -334 624 237 -299 41 339 -187 -43 549 -577 -381 495 370 -236 338 471 -254
4458b54M47L46q83R1J061l44q04N69J66j144N83N86o24L33Q23q73m37L75J39l67
$$ -254 193 539 -344 -253 808 464 -340 229 395 -749 -166 420 -204 129 952 79 -358 17 156 -211
4478b11L83M66p88J30L04l82l47P58m7o36J12N38k07l88O32n48k52P52L97j269
$$ -211 172 638 -150 -20 284 -98 -445 313 266 -370 -258 280 73 -315 317 -231 -483 269 666 -603
4498f03K54Q65m18n45N26k10m35P35P1m25J5R69n38p16M66j6n18N82N19j297L62
$$ -603 -349 516 98 -447 79 -131 -566 169 240 -185 -170 799 261 -455 11 -5 -523 59 578 -719 -357
4519c57P72m81k17K75K21n19Q73l59p02K30P76m40q00P56m7k94M49k9o68K50O54
$$ -357 415 -66 -283 -8 213 -306 567 208 -494 -264 512 72 -728 28 -19 -313 136 107 -561 -311 343
4540C43p16m85P27K98n22K32O49r51M10L06k76n30Q40J42p93L57M20p71K70P45
$$ 343 -373 -858 -131 167 -355 -123 526 -425 -15 291 15 -515 325 467 -326 31 451 -320 -50 695
4560F95p19m03Q94o5p71K32K72j18k06R06n39n91P70j67n53L03P03n93m98M11
$$ 695 -24 -427 467 402 -369 -137 135 17 -189 717 178 -413 357 190 -363 -60 643 50 -448 -37
4580c7P2j20M80J14j004L56M47m60l12Q57m19l50P94l70o60M00R58r19j91N52
$$ -37 35 -85 395 509 -495 -139 308 -152 -464 393 -26 -376 418 48 -612 -212 746 -173 -364 188
$$ [...]
8191A83
##END NTUPLES=NMR FID
##END=
