##TITLE=1H_TG-2263
 CDCl3, 8 sc, 
 19.11.2019
##JCAMPDX= 6.0         $$ Bruker NMR JCAMP-DX V2.0
##DATA TYPE= NMR FID
##DATA CLASS= NTUPLES
##ORIGIN= UXNMR, Bruker Analytische Messtechnik GmbH
##OWNER= root
$$ XWIN-NMR		Version 3.5
$$ Tue Nov 19 14:36:38 2019 Russian Standard Time (UT+4h)  she@DPX200
##.OBSERVE FREQUENCY= 200.1315
##.OBSERVE NUCLEUS= ^1H
##.DELAY= (6, 6)
##.ACQUISITION MODE= SIMULTANEOUS
##.ACQUISITION SCHEME= undefined
##.AVERAGES= 8
##.DIGITISER RES= 18
##SPECTROMETER/DATA SYSTEM= spect
##.PULSE SEQUENCE= zg30
##.SOLVENT NAME= CDCl3
##.SHIFT REFERENCE= (INTERNAL, CDCl3, 0, 15.7039)
##AUDIT TRAIL= $$ (NUMBER, WHEN, WHO, WHERE, WHAT)
$$ ##TITLE= Audit trail, XWIN-NMR		Version 3.5
$$ ##JCAMPDX= 5.01
$$ ##ORIGIN= Bruker BioSpin GmbH
$$ ##OWNER= she
$$ F:/spectra/data/she/nmr/H-F/1/audita.txt
$$ ##AUDIT TRAIL=  $$ (NUMBER, WHEN, WHO, WHERE, WHAT)
(   1,<2019-11-19 14:35:41.18 +0400>,<she>,<DPX200>,
      <created by zg, POWCHK disabled, PULCHK disabled
       configuration hash MD5:
       00 E9 B6 7A A2 85 ED C7 34 08 36 98 17 FE 4E 26
       data hash MD5: 16K
       3B BF 5B E3 07 31 5F D6 42 EC D8 CF 1B 39 FE D5>)
$$ ##END=
$$ 
$$ hash MD5
$$ 2F FD CE 83 CA D3 86 F5 DB 04 3F D7 94 51 B6 98
##$RELAX= 
##$RELAX= 
##$RELAX= 
##$RELAX= 
##$RELAX= 
##$RELAX= 
$$ Bruker specific parameters
$$ --------------------------
##$DU= <F:/spectra>
##$EXPNO= 1
##$NAME= <H-F>
##$PROCNO= 1
##$TYPE= <nmr>
##$USER= <she>
##$AMP= (0..31)
100 100 100 100 100 100 100 100 100 100 100 100 100 100 100 100 100 100 
100 100 100 100 100 100 100 100 100 100 100 100 100 100 
##$AQSEQ= 0
##$AQ_mod= 1
##$AUNM= <au_zg>
##$AUTOPOS= <>
##$BF1= 200.13
##$BF2= 200.13
##$BF3= 200.13
##$BF4= 200.13
##$BF5= 200.13
##$BF6= 200.13
##$BF7= 200.13
##$BF8= 200.13
##$BYTORDA= 1
##$CFDGTYP= 0
##$CFRGTYP= 5
##$CHEMSTR= <none>
##$CNST= (0..31)
1 1 145 1 1 1 1 1 1 1 1 1 1 1 1 1 1 1 1 1 1 1 1 1 1 1 1 1 1 1 1 1 
##$CPDPRG= <>
##$CPDPRG1= <>
##$CPDPRG2= <>
##$CPDPRG3= <>
##$CPDPRG4= <mlev>
##$CPDPRG5= <mlev>
##$CPDPRG6= <mlev>
##$CPDPRG7= <mlev>
##$CPDPRG8= <mlev>
##$CPDPRGB= <>
##$CPDPRGT= <>
##$D= (0..31)
0 1.2 0 0 0 0 0 0 0 0.06 0 0.03 0 0 0 0 0.0002 0 0 0 0 0 0 0 0 0 0 0 0 
0 0 0 
##$DATE= 1574159740
##$DBL= (0..7)
120 120 120 120 120 120 120 120 
##$DBP= (0..7)
150 150 150 150 150 150 150 150 
##$DBP07= 0
##$DBPNAM0= <>
##$DBPNAM1= <>
##$DBPNAM2= <>
##$DBPNAM3= <>
##$DBPNAM4= <>
##$DBPNAM5= <>
##$DBPNAM6= <>
##$DBPNAM7= <>
##$DBPOAL= (0..7)
0.5 0.5 0.5 0.5 0.5 0.5 0.5 0.5 
##$DBPOFFS= (0..7)
0 0 0 0 0 0 0 0 
##$DE= 6
##$DECBNUC= <off>
##$DECIM= 24
##$DECNUC= <off>
##$DECSTAT= 4
##$DIGMOD= 1
##$DIGTYP= 9
##$DL= (0..7)
0 120 120 120 120 120 120 120 
##$DP= (0..7)
150 150 150 150 150 150 150 150 
##$DP07= 0
##$DPNAME0= <>
##$DPNAME1= <>
##$DPNAME2= <>
##$DPNAME3= <>
##$DPNAME4= <>
##$DPNAME5= <>
##$DPNAME6= <>
##$DPNAME7= <>
##$DPOAL= (0..7)
0.5 0.5 0.5 0.5 0.5 0.5 0.5 0.5 
##$DPOFFS= (0..7)
0 0 0 0 0 0 0 0 
##$DQDMODE= 0
##$DR= 18
##$DS= 0
##$DSLIST= <SSSSSSSSSSSSSSS>
$$ [...]
##$SUBNAM2= <"">
##$SUBNAM3= <"">
##$SUBNAM4= <"">
##$SUBNAM5= <"">
##$SUBNAM6= <"">
##$SUBNAM7= <"">
##$SUBNAM8= <"">
##$SUBNAM9= <"">
##$SW= 24.9337058887773
##$SWIBOX= (0..15)
0 0 2 0 0 0 0 0 0 0 0 0 0 0 0 0 
##$SW_h= 4990.01996007984
##$TD= 16384
##$TD0= 1
##$TE= 0
##$TE2= 300
##$TE3= 300
##$TEG= 300
##$TL= (0..7)
0 120 120 120 120 120 120 120 
##$TP= (0..7)
150 150 150 150 150 150 150 150 
##$TP07= 0
##$TPNAME0= <>
##$TPNAME1= <>
##$TPNAME2= <>
##$TPNAME3= <>
##$TPNAME4= <>
##$TPNAME5= <>
##$TPNAME6= <>
##$TPNAME7= <>
##$TPOAL= (0..7)
0.5 0.5 0.5 0.5 0.5 0.5 0.5 0.5 
##$TPOFFS= (0..7)
0 0 0 0 0 0 0 0 
##$TUNHIN= 0
##$TUNHOUT= 0
##$TUNXOUT= 0
##$USERA1= <user>
##$USERA2= <user>
##$USERA3= <user>
##$USERA4= <user>
##$USERA5= <user>
##$V9= 5
##$VALIST= <valist>
##$VCLIST= <CCCCCCCCCCCCCCC>
##$VD= 0
##$VDLIST= <DDDDDDDDDDDDDDD>
##$VPLIST= <PPPPPPPPPPPPPPP>
##$VTLIST= <TTTTTTTTTTTTTTT>
##$WBST= 1024
##$WBSW= 4
##$XGAIN= (0..3)
0 0 0 0 
##$XL= 0
##$YL= 0
##$YMAX_a= 473490
##$YMIN_a= -273616
##$ZGOPTNS= <>
##$ZL1= 120
##$ZL2= 120
##$ZL3= 120
##$ZL4= 120
##$ABSF1= 10
##$ABSF2= 0
##$ABSG= 5
##$ABSL= 3
##$ALPHA= 0
##$AQORDER= 0
##$ASSFAC= 0
##$ASSFACI= 0
##$ASSFACX= 0
##$ASSWID= 0
##$AUNMP= <proc_1d>
##$AZFE= 0.1
##$AZFW= 0.1
##$BCFW= 1
##$BC_mod= 2
##$BYTORDP= 1
##$COROFFS= 0
##$CY= 11.3945322036743
##$DATMOD= 1
##$DC= 2
##$DFILT= <>
##$DTYPP= 0
##$F1P= 16.9975609425685
##$F2P= -3.02152046262296
##$FCOR= 0.5
##$FTSIZE= 0
##$FT_mod= 4
##$GAMMA= 1
##$GB= 0.15
##$INTBC= 1
##$INTSCL= 1
##$ISEN= 128
##$LB= 0.24
##$LEV0= 0
##$LPBIN= 0
##$MAXI= 10000
##$MC2= 0
##$MEAN= 0
##$ME_mod= 0
##$MI= 1.114404
##$NCOEF= 0
##$NC_proc= 0
##$NLEV= 6
##$NOISF1= 3.799351
##$NOISF2= 2.8
##$NSP= 1
##$NTH_PI= 0
##$NZP= 0
##$OFFSET= 15.70392
##$PC= 1
##$PHC0= -9793.47
##$PHC1= 24.60086
##$PH_mod= 1
##$PKNL= yes
##$PPARMOD= 0
##$PSCAL= 0
##$PSIGN= 0
##$REVERSE= no
##$SF= 200.130013532006
##$SI= 16384
##$SIGF1= 3
##$SIGF2= 2
##$SINO= 400
##$SIOLD= 16384
##$SREGLST= <1H.CDCl3>
##$SSB= 0
##$STSI= 0
##$STSR= 0
##$SW_p= 3612.71676300578
##$SYMM= 0
##$S_DEV= 0
##$TDeff= 0
##$TDoff= 0
##$TI= <>
##$TILT= no
##$TM1= 0
##$TM2= 0
##$TOPLEV= 0
##$USERP1= <user>
##$USERP2= <user>
##$USERP3= <user>
##$USERP4= <user>
##$USERP5= <user>
##$WDW= 1
##$XDIM= 8192
##$YMAX_p= 0
##$YMIN_p= 0
$$ End of Bruker specific parameters
$$ ---------------------------------
##NTUPLES= NMR FID
##VAR_NAME=  TIME,          FID/REAL,        FID/IMAG
##SYMBOL=    X,             R,               I
##VAR_TYPE=  INDEPENDENT,   DEPENDENT,       DEPENDENT
##VAR_FORM=  AFFN,          ASDF,            ASDF
##VAR_DIM=   8192,          8192,            8192
##UNITS=     SECONDS,       ARBITRARY UNITS, ARBITRARY UNITS
##FACTOR=    0.0002004,     1,               1
##FIRST=     0,             0,               0
##LAST=      1.6414764,     0,               0
##MIN=       0,             -273616,         0
##MAX=       1.6414764,     473490,          0
$$ Real data points
##PAGE= N=1
##DATA TABLE= (X++(R..R)), XYDATA
$$ [...]
30 320 -358 403 -452 506 -564 630 -701 780 -864 959 -1063 1174 -1302 1442 -1595 1770 -1966
47 -1966 2189 -2442 2738 -3083 3495 -4001 4630 -5443 6542 -8112 10563 -14951 25266 -103666
61 -103666 38739 187834 -111785 -272702 -199171 -1378 41241 -109505 -273616 -136479
71 -136479 85881 35294 -187106 -202754 -58480 43776 31069 -57598 -122041 -22181 78616
82 78616 -17616 -127682 -24209 97592 62441 -7802 -22355 -17588 36479 84925 46640 32764
94 32764 109622 92748 -30981 -36410 74280 117402 89938 45598 -12644 9831 120401 111581
106 111581 -17593 -20769 96038 123671 52105 -23448 -73578 -22375 108415 109049 -22770 -50648
118 -50648 31895 45723 5090 -15539 -36316 -1824 87004 49298 -104851 -116467 26164 93673
130 93673 47442 -20686 -70628 -30729 79843 67498 -61819 -63517 58518 87038 20069 -29921
142 -29921 -51599 -9406 93150 98703 1879 -485 65882 32988 -26088 11131 59123 60286
154 60286 58158 19593 -28104 20454 81448 31974 -4355 62000 75341 -1732 -27317 3622
166 3622 26065 54213 44777 -32833 -33447 66930 65364 -44522 -54568 38401 85966 59040 -20582
179 -20582 -102380 -51343 89930 92422 -25981 -40641 33338 42586 13335 875 -8217 32273
191 32273 96297 51083 -45431 -20354 58038 51447 32096 53848 50433 43234 64533 38189 -3699
204 -3699 42768 90881 51830 35712 70115 41950 -4165 36731 88046 84877 75335 38676 -20214
217 -20214 13316 102248 82176 7233 17737 52946 42963 38967 25856 -9541 29541 108469
229 108469 74924 -11939 -8690 24080 20491 36064 47599 12249 20034 69042 38451 -23822
241 -23822 3698 56632 63202 66704 39974 -33553 -24416 72868 91061 27281 14545 35773 40776
254 40776 61714 55762 -2254 6823 90757 90332 14617 1608 28124 31850 52639 66927 35131
267 35131 33588 66535 27154 -26704 23892 82830 50385 15176 20038 9671 10762 31947 13429
280 13429 6384 66681 71058 -23619 -51624 22024 54071 22804 -7933 -26185 4264 74635
292 74635 44953 -71972 -65646 64967 102915 19215 -53271 -60846 -1799 77802 52302 -49765
304 -49765 -37896 62412 58720 -25371 -42107 2173 50387 76632 21950 -65819 -35480 60626
316 60626 49446 -18093 -6455 33900 39141 35533 4868 -38629 -3962 64784 43613 -6505
328 -6505 7761 13712 -14228 4445 39797 30058 26961 33042 -9357 -28498 29297 51447 5720
341 5720 -2466 21409 13053 13098 24659 -3886 -9312 54336 69118 2073 -24999 1569 14517
354 14517 30219 40497 460 -12149 50496 58157 -22351 -41718 26272 72571 66758 18079
366 18079 -53793 -44139 60360 85469 -7285 -40939 22963 60526 41983 2755 -37641 -9431
378 -9431 77127 70016 -31347 -48306 24864 44696 11791 -682 2003 26114 57977 14624
390 14624 -59207 -22347 65794 51870 -10514 -16908 -4124 2075 18290 7124 -14579 27383
402 27383 58923 -6052 -53952 -2544 36534 7121 -14149 -12628 -1764 30642 22697 -50816
414 -50816 -55989 38589 69150 -3347 -46202 -30437 -8855 15035 9867 -36626 -31068 33441 24338
427 24338 -47608 -47255 7841 25430 16126 -7222 -49468 -40820 19528 15991 -36515 -24776 18766
440 18766 12512 -2833 -7354 -31495 -26244 25943 30433 -14010 -15967 -2273 -23197 -17756 18452
453 18452 14402 -48 16100 4842 -27600 -6151 23083 -1241 -10715 12743 580 -21114
465 -21114 -2500 2620 -11412 14533 30839 -10218 -26937 4156 1661 -21421 -6743 2041 -7978
478 -7978 8745 5855 -44838 -43954 24228 40751 -83 -20905 -27944 -27653 5863 14674 -31393 -31878
492 -31878 26123 25747 -25803 -30909 -6421 6515 23146 13822 -29937 -22674 25732 7645 -40737
505 -40737 -17269 28934 23994 5443 -10329 -28086 -2451 39126 12599 -29990 -2594 19604
517 19604 -18685 -34984 -3736 14425 18954 12143 -28400 -41201 12103 26925 -32634 -47947
529 -47947 1664 18763 -7670 -33159 -54730 -34638 28737 29463 -40904 -53224 -651 4530 -30702
542 -30702 -39538 -29927 -7641 21469 -7497 -70166 -49504 26187 28020 -19551 -29865 -19859 -8686
555 -8686 10623 -5985 -47774 -23128 34370 18687 -27907 -22351 -4004 994 16883 12373 -19010
568 -19010 -8643 18263 -11852 -41096 -5451 24204 10749 2097 -8543 -29486 -9463 24420
580 24420 -2141 -32596 -4273 12723 -14360 -26447 -20974 -20457 3008 21258 -18883 -45342 -3444
593 -3444 17568 -19540 -33881 -12508 -991 7687 -806 -47022 -50991 19902 49945 -2100 -33962
606 -33962 -13486 5282 15383 7317 -27408 -20967 41203 45124 -22482 -36709 14804 40648 31199
619 31199 12087 -12122 1215 47709 32154 -29828 -19871 44041 52657 15576 -7923 -13668 10767
632 10767 50793 31837 -21610 -6062 40408 19038 -21555 -11445 11846 21769 25940 -2797
644 -2797 -34038 -381 40208 7179 -29115 -4779 18273 7855 -4477 -23557 -32051 12609
656 12609 45176 2131 -33838 -2448 19036 -792 -8843 -5082 -1603 22077 25301 -22483 -36357
669 -36357 16697 40900 9732 -5775 -1151 1976 20669 23601 -15965 -22743 27625 38740 -4532
682 -4532 -17709 -542 7883 20531 22722 -8249 -14891 19039 14357 -24773 -18806 13237 15386
695 15386 7725 -826 -26780 -20984 22233 19272 -22617 -17999 12104 3640 -12577 -12108 -15858 -2690
709 -2690 25348 9400 -27683 -9250 22208 3914 -12438 3985 11076 10771 18052 -2179 -23644
722 -23644 11760 46600 18971 -5610 12476 21341 14716 20048 13843 4368 29348 39906 2448
735 2448 -8368 27483 35130 16499 20770 22206 10952 20985 23561 -5900 -4934 34382 33383 2875
749 2875 2744 10641 3779 12727 18096 -2265 126 24055 5780 -22981 -2112 20896 6029 -1751
763 -1751 2753 -8663 -3379 15479 343 -19436 6586 23470 -4014 -15936 -3015 -3367 1945
776 1945 16580 2238 -12094 12027 18873 -13476 -14586 15716 16031 2383 2840 -7456 -12526 15658
790 15658 23467 -6156 -6689 19068 11844 -7061 -3255 -4263 -4635 17601 15666 -18990 -14400 18593
804 18593 8961 -14601 -4405 5441 2682 7283 -4620 -29697 -10098 26567 8620 -23331 -11678
817 -11678 4306 242 2020 -3373 -16819 4818 27907 -4755 -35687 -6434 20565 7679 -1829
830 -1829 -2330 -4434 14222 25226 -8561 -25314 15111 35632 6708 -11104 -4187 3470 20932
843 20932 27294 -4145 -14392 25826 36300 -3974 -15650 10078 22382 21252 10417 -15707
855 -15707 -10685 31124 31124 -11419 -11734 22514 25005 7603 -4011 -14662 -456 33342 21099 -23593
869 -23593 -14673 25164 21009 -3954 -4819 2040 13516 26606 2152 -31017 -5430 35124 17723
882 17723 -12664 -4398 9956 15388 19442 207 -19294 10388 41176 9930 -22472 -2945 19376
895 19376 17441 12640 -1753 -9359 19372 35456 -1705 -21677 13233 31611 11479 -2049 -6797
908 -6797 -6999 17256 27385 -6029 -16850 20058 29849 -911 -11611 -2787 2836 15563 13782
921 13782 -16994 -17830 18990 20261 -11864 -10836 8911 8132 6444 1351 -19136 -13703 19727 14614
935 14614 -18978 -14340 9482 5422 -1383 -1354 -10612 -2146 21350 5348 -26610 -11615 15226 4332
949 4332 -8294 -2274 -5195 -1274 14624 1785 -20000 -145 22828 2705 -14289 -5413 -2957
962 -2957 -6 11143 -397 -16714 5990 23238 -3197 -15930 4429 9185 1269 4416 -2988
975 -2988 -13746 5452 18369 -5574 -11673 12179 13283 -2117 773 481 -5177 10226 15876 -9758
989 -9758 -12350 14201 11085 -7612 1780 10534 2538 8123 10410 -8195 -7060 15997 8386 -10296
1003 -10296 1626 11007 -685 2147 8716 -3127 224 19035 5984 -14378 738 13266 -1757
1016 -1757 -3527 6038 -1366 -853 12741 1785 -11891 7179 16402 -4078 -7393 5112 -1452 -4114
1030 -4114 6733 -2500 -12408 8239 14896 -9317 -11559 7310 3813 -4655 1451 -5449 -13565 3119
1044 3119 6519 -15340 -11627 8754 1051 -11756 -3844 -5345 -11838 1348 1477 -21655 -15722 7185
1058 7185 -3227 -20663 -9935 -3274 -8171 -1370 -5345 -23048 -12067 8520 -8605 -26678 -9330
1071 -9330 873 -10510 -10238 -9461 -17110 -3741 11302 -12138 -28939 -3910 9466 -9207 -16094
1084 -16094 -10480 -10137 2069 8842 -15201 -23669 6395 14281 -11461 -16202 -3190 -2241 879 2533
1098 2533 -15790 -17986 12238 14507 -15514 -17899 3224 5763 1353 -1994 -16624 -12969 14615
1111 14615 9885 -21597 -16494 9385 6107 -6069 -5065 -8827 -4480 12739 1781 -24937 -10825
1124 -10825 16224 4094 -14691 -8435 -1389 3402 11655 -3559 -22974 -1513 22888 968 -19481
1137 -19481 -4635 6487 3933 4894 -5544 -15385 6799 22919 -4955 -22436 1790 15633 4018
1150 4018 -3297 -11266 -12730 11396 20905 -12142 -26258 4896 17929 -1561 -11757 -11816 -9177 8531
1164 8531 10630 -19986 -26432 6167 12090 -13502 -19058 -8578 -4350 2801 -1855 -27439 -24317 8574
1178 8574 7174 -22998 -22798 -5528 -4749 -4721 -7718 -22966 -17457 7388 -1091 -27406 -17940 2259
1192 2259 -5205 -13118 -10815 -15106 -8016 7284 -8112 -29820 -9373 13031 -3831 -20504 -13999
1205 -13999 -8552 -2542 5373 -10869 -25577 -2274 14483 -10536 -25063 -8555 596 -1935 -2804
1218 -2804 -16188 -23076 2086 13197 -15996 -27273 -3791 4545 -4821 -8364 -16914 -20178 2308
1231 2308 10840 -15593 -23846 -2714 711 -9283 -5338 -6833 -13538 -37 5551 -15173 -17126 4482
1245 4482 2853 -9947 -2676 206 -8009 37 6147 -8587 -7776 9808 3146 -10716 1072 6183
1259 6183 -5959 -1394 9289 281 -965 9383 -2017 -12816 6349 15038 -2622 -6407 2585
1272 2585 -1249 1546 10786 -2410 -13887 5190 14390 -5104 -10007 317 -1892 -702 7204 -4399
1286 -4399 -15909 1528 8977 -9759 -10397 4062 617 -4489 516 -8980 -16893 1546 8528 -9085
1300 -9085 -9610 2492 -5196 -10106 3032 -109 -11592 -3653 1050 -9970 -5084 4889 -9923 -15648
1314 -15648 5250 8244 -8848 -9920 -4631 -7835 1522 8342 -12100 -19048 3797 6985 -13573
1327 -13573 -13243 -1405 -861 2597 976 -19462 -19066 9341 9936 -16443 -17198 -1891 -1599 -2211 -3349
1342 -3349 -16709 -13301 11552 8448 -16579 -13782 713 -4558 -6199 657 -5588 -7692 5360 -275
1356 -275 -15082 -1702 13240 -394 -8845 2142 599 -3379 5440 2813 -6610 6408 14913 -3320
1370 -3320 -7935 9960 10758 2177 7321 5430 -1614 9592 14705 -5944 -7932 16512 20266 5498
1384 5498 2259 -293 -1569 16338 22936 -1874 -9705 11523 16334 3677 2544 1879 706 16622
1398 16622 21683 -4446 -12015 12029 18463 3665 443 1331 524 13452 15434 -8880 -10388 18324
1412 18324 22684 1411 -5010 -1365 473 13025 15454 -5418 -7508 15180 12131 -7510 -1877
1425 -1877 11461 7213 6025 6114 -4613 -192 14543 2905 -13132 4315 19486 4182 -6664
1438 -6664 -1418 79 6594 14637 -515 -13953 5636 16537 -5329 -13794 2754 10264 7842
1451 7842 3952 -11615 -14438 12254 21769 -5291 -16214 2212 8277 2887 143 -10279 -11593
1464 -11593 13589 21600 -4833 -16284 609 6368 2894 5522 -2092 -8476 6756 12085 -7558
1477 -7558 -9684 9607 10391 2454 5247 -419 -8849 6179 16535 122 -5091 7360 5665 -410
1491 -410 7108 4942 -3835 7450 16031 1603 -2227 8055 2322 -3932 11270 15563 1525 880
1505 880 4403 -2375 5179 20260 8092 -7057 5735 15176 3217 -1117 2778 2221 12277 20818
1519 20818 449 -13762 8468 22925 6277 -2917 3593 5912 11816 14698 -4541 -12813 13945
1532 13945 27360 6179 -6961 107 3742 10918 17885 2902 -6828 9487 15229 -2125 -2363
1545 -2363 10617 6999 3681 11477 5444 -3790 4664 8122 -909 6275 16028 1526 -7103 6234
1559 6234 8291 -1055 3311 7028 1554 8176 10551 -9417 -12406 13095 18950 -1092 -7462 -2915
1573 -2915 -124 9708 11226 -8126 -10634 11550 13085 -7337 -8978 -709 -217 6972 10799 -6457
1587 -6457 -12585 3888 5735 -7016 -1282 6998 -952 -1568 3019 -6932 -10161 5864 7976 -3198
1601 -3198 233 1698 -9447 -4627 10486 3237 -7388 2296 3676 -4209 1370 4715 -6183 -3715
1615 -3715 12166 6879 -4828 -1299 -952 -3389 9930 15671 -2736 -9173 4086 4846 744 7209
1629 7209 4603 -3089 8217 14503 -5012 -11774 6558 14639 8780 4868 -3980 -7070 11027 18063
1643 18063 -4881 -11518 10650 18502 5471 -2471 -7557 -4568 16396 22077 -3731 -13772 6400
1656 6400 12576 1128 845 3363 2514 10130 8270 -9182 -6219 15283 11830 -4432 1247 8467
1670 8467 293 -726 3120 -1407 4009 15607 3540 -11215 1288 10881 -1698 -4824 5363
1683 5363 6708 5348 3322 -11275 -14110 11547 20455 -4382 -14810 -1698 4590 2780 1344 -9099
1697 -9099 -11098 8362 12355 -10989 -17579 -2226 2707 1363 1860 -8220 -14677 135 5336 -11023
1711 -11023 -12395 2529 1596 -5022 -3803 -11762 -16731 1171 12094 -3462 -12751 -6267 -6581 -5061
1725 -5061 2528 -4167 -13502 3 8546 -6225 -12196 -2447 -2982 -3860 5222 1110 -10531 -4785 1883
1740 1883 -6677 -4159 7659 722 -8916 -2259 106 -6089 42 4580 -4363 -873 6532 -7170
1754 -7170 -17102 532 11864 1447 -4791 -5040 -6681 1767 8238 -8114 -16654 4514 15422 -1064
1768 -1064 -12681 -10798 -5895 7369 14239 -4919 -16873 469 9398 -4836 -8955 738 1901
1781 1901 2202 3549 -7430 -11930 3988 9500 -3141 -3415 3710 -3805 -5944 4036 1565 -4623 2941
1796 2941 4221 -5283 -2167 2341 -8293 -7267 10791 10804 -5423 -9653 -7267 -6266 4363 8085
1810 8085 -8257 -11761 4424 3461 -10774 -8825 -1895 -3350 1373 2800 -11989 -15392 588 2102
1824 2102 -8504 -5183 -1777 -8066 -5859 -1073 -10456 -11231 2986 2782 -8725 -7649 -7006 -13748 -4513
1839 -4513 8979 -1030 -12260 -5905 -3139 -7028 -1207 -536 -9578 -3106 7043 -3878 -14501 -5259
1853 -5259 -32 -3149 2806 3503 -8919 -8259 1410 -3867 -7443 2983 2865 -7596 -3839 1403 -7703
1868 -7703 -7803 3460 2890 -1323 -277 -8343 -13972 2897 12786 -4058 -13780 -1825 3679 -444
1882 -444 -2834 -9151 -8541 10914 15901 -8160 -19347 -2386 7491 3011 706 -2989 -3106 8295
1896 8295 7296 -12250 -10518 12844 14424 -1405 -4542 -922 674 7181 7053 -4881 -250 14697
1910 14697 5478 -9337 -1155 10315 6634 3522 3168 -1762 3185 9146 -3482 -10396 9936 20589
1924 20589 2625 -9804 -4963 1437 8670 10773 -3920 -9979 7485 12192 -6452 -11484 1896
1937 1896 8057 7627 4279 -8942 -12033 5845 11116 -5936 -8491 4531 5593 -357 -2068 -8577
1951 -8577 -7825 9430 12420 -5902 -11336 -894 893 474 4199 -1548 -7426 2717 4925 -8912
1965 -8912 -7851 6146 5671 -1141 47 -3652 -7829 1012 2809 -7472 -2482 10351 2486 -9783
1979 -9783 -6167 -1883 -1121 5012 2208 -8992 -3754 7120 -3347 -13717 -875 9530 3378 -3784
1993 -3784 -8639 -10292 4240 13364 -3310 -14801 1456 12150 -183 -8545 -6983 -878 11737
2006 11737 13602 -6985 -15856 3806 14039 952 -4180 2735 5613 7103 3868 -8837 -6379
2019 -6379 15473 17916 -1125 -4726 5123 4906 3405 5978 1856 2839 12601 8038 -5541 -135 11111
2034 11111 5386 1191 7836 6808 1832 4050 947 -2059 9550 16529 636 -7803 3448 7105
2048 7105 3061 5541 5215 1123 7134 7855 -5719 -7024 9201 12044 2259 1965 1586 -2415 3571
2063 3571 7655 -1630 -1945 10484 8834 -2144 -1644 807 -1822 5941 12297 1009 -6033 2254 3410
2078 3410 -440 4895 5923 -1555 1123 6608 -2638 -6390 4996 6909 175 2753 2411 -5039 -1781
2093 -1781 6444 1002 -1687 6284 3466 -5974 -1996 2233 -2706 652 8125 2513 -3163 491 -3052
2108 -3052 -6904 4765 11745 -424 -5583 843 810 -187 3480 -630 -4067 6889 10728 -4202 -8515
2123 -8515 3050 7150 4305 4033 -1817 -4535 5412 8222 -3683 -3016 11506 10405 -977 -2859
2137 -2859 -2086 383 10331 10847 -2150 -2066 9058 4459 -4759 1831 8395 5610 6264 3787 -4164 641
2153 641 10662 4025 -3522 7015 11369 1687 -2032 839 1035 7519 13319 2301 -5998 4220
2167 4220 9191 -266 -239 7071 5939 5056 5498 -2900 -4597 9521 13205 793 -1514 5329 2376
2182 2376 862 4500 467 -18 10868 10407 -4090 -5194 2947 3218 3324 7392 2103 -3194 3855
2197 3855 4205 -5440 -1881 8405 4695 -811 1048 -2728 -4344 5446 6738 -3969 -3397 4732 852
2212 852 -4718 -987 -893 -142 6850 4137 -9995 -7483 4404 1722 -3868 130 1304 -2194 252
2227 252 -3679 -10893 -1596 11115 2602 -9594 -5225 -453 -2095 -857 -2650 -6543 1440 7719 -6120
2242 -6120 -14690 -2286 5834 -688 -3058 -2545 -5278 -456 2128 -7776 -9495 5429 7494 -6337
2256 -6337 -9363 -3418 -1056 2952 3891 -5715 -7009 4462 2336 -10046 -5525 6203 4619 574
2270 574 -954 -6004 -4274 5441 3083 -6056 363 9023 1131 -5689 -2380 -910 1420 8797 3487
2285 3487 -6537 -1160 6487 -727 -3640 4382 4231 -68 2401 -725 -6053 1882 8389 679 -2689
2300 -2689 3332 811 -3553 1125 1996 -2613 2971 6988 -3259 -7541 820 1878 -862 3396 3422
2315 3422 -3896 -1823 1869 -4936 -4664 5472 4178 -3388 -2158 -1498 -5760 -80 4292 -3228 -4555
2330 -4555 3792 1071 -8246 -4495 620 -1178 520 1030 -7164 -6970 2517 -692 -8083 -1809 3800
2345 3800 -3298 -6897 -5657 -7540 -3251 5375 -1173 -11476 -4939 1169 -6272 -9064 -2718 -1333 -1043
2360 -1043 -227 -8121 -13528 -2750 2811 -6751 -8098 497 -938 -6154 -5390 -6668 -5772 3406 3942 -9518
2376 -9518 -10290 862 250 -5513 -2422 -171 -1897 1370 -2065 -10727 -4043 8957 2701 -6961 -2899
2391 -2899 1203 -1632 -495 -435 -4406 2414 9656 -615 -11009 -2771 4599 1679 1620 1006 -3671 -432
2407 -432 4217 -3983 -8090 3536 8374 -536 -3020 -904 -2736 -126 5206 -1075 -5148 3184 4143
2422 4143 -4364 -3486 2572 1041 2041 4351 -3073 -6781 2502 4520 -3392 -604 6565 1740 -2586
2437 -2586 -425 -3008 -2386 7610 6800 -4445 -3713 3611 703 -2294 938 -534 -81 6628 2112 -9848
2453 -9848 -5363 6889 3679 -2726 -861 -1938 -2622 2520 -694 -8853 -1904 8142 1101 -8015 -5449
2468 -5449 -2623 -704 3852 -24 -9641 -4077 4614 -3365 -10074 -2063 2946 -147 -870 -4841 -9447
2483 -9447 -2752 4805 -2779 -7299 1288 2204 -5373 -5643 -3495 -4077 2409 5622 -5009 -8913 1755
2498 1755 3016 -5557 -3892 1293 92 49 -244 -7559 -5600 6376 5062 -6142 -4689 1281 -1176
2513 -1176 -1691 -366 -4570 -2348 7213 2654 -10405 -6660 3093 2218 89 462 -3681 -3375 3860 -348
2529 -348 -8407 -1334 7134 2317 -2578 -1234 -3550 -1946 6278 3409 -4908 266 6643 -65 -4526
2544 -4526 1202 2807 2556 6449 2241 -4960 1357 8043 1146 -1102 5528 4826 160 2250 1441 -1775
2560 -1775 5871 10536 231 -3974 3882 4502 114 2360 3700 1263 6033 5726 -4934 -5081 6770
2575 6770 7196 -401 725 2212 -298 2519 3135 -4618 -2150 9078 5585 -5419 -3216 2114 1598
2590 1598 3240 3238 -3866 -1801 6393 1180 -7275 72 6549 2085 40 581 -3834 -1751 5550 2063
2606 2063 -4425 2071 6055 -1874 -4070 735 -304 1282 5423 -183 -5640 1153 4136 -3897 -3051
2621 -3051 4916 2611 -1918 -162 -2499 -4243 3067 5226 -3548 -3005 4305 903 -3676 -190 522
2636 522 -659 4558 3131 -6152 -3930 5919 3326 -2083 2151 2804 -732 1714 2819 -3121 950
2651 950 9784 4709 -2056 1464 2990 443 4690 6079 313 2992 9420 2616 -3098 3747 7647
2666 7647 3573 4292 5687 430 2223 7930 2982 -260 7516 8495 250 793 4599 2213 4271 8005
2682 8005 2354 -1385 6422 6702 -2023 46 7562 5150 3106 3499 -1106 -1476 7781 7120 -2348 515
2698 515 7802 3421 -887 1319 728 2401 9382 5932 -5230 -1798 7473 3406 -1364 2003 3081
2713 3081 2241 5408 1367 -5586 1261 9331 2287 -3927 855 2032 -500 2543 1321 -3437 2597
2728 2597 7487 -2239 -7260 1107 4322 -201 790 -192 -3653 654 3517 -4692 -6047 4906 5203
2743 5203 -3161 -3550 -1073 -1957 1662 3450 -3630 -4499 5419 3646 -5833 -3724 2679 2131 2259 1488
2759 1488 -5041 -3203 6751 4183 -5412 -882 5519 2238 -858 96 -2845 358 8865 3883 -6103
2774 -6103 -1280 5876 1473 -1400 840 320 1800 6062 -136 -7946 563 8585 1835 -2963 985
2789 985 919 213 3099 -1008 -5004 3546 8426 -1071 -5845 1400 3112 1077 2594 -280 -3110 3582
2805 3582 6172 -3674 -4607 5575 6136 62 0 -258 -1272 5123 6168 -2616 -1787 7578 5135 -3069
2821 -3069 -1188 2422 2553 5486 4333 -3764 -1826 7677 3537 -4030 142 4938 2326 1598 528
2836 528 -4424 -105 8125 2125 -5930 -126 4655 -634 -1958 -296 -1691 893 5620 -1961 -8394
2851 -8394 146 5742 -1574 -3839 -34 -1128 -682 1991 -3432 -6207 3007 5611 -3820 -5892 241
2866 241 -416 -1045 1588 -1738 -4235 3085 3287 -6548 -5349 2766 1574 -2378 -512 -2346 -4177 1784
2882 1784 1610 -6626 -3872 4130 -316 -6033 -2638 -1618 -2882 851 -131 -7421 -3724 3397 -2474
2897 -2474 -7824 -1572 1089 -2311 -1529 -2604 -7489 -2189 4348 -2616 -7776 -496 2206 -3475 -3116
2912 -3116 -1518 -3562 500 4571 -3177 -7592 1241 4122 -2350 -2080 1221 -543 1240 3830 -3428
2927 -3428 -4882 4756 5929 -2994 -2494 2184 630 419 2689 -1941 -2706 5580 4073 -5224 -2603 4560
2943 4560 1678 -983 906 -1953 -2522 3824 1192 -6504 -1442 6055 422 -4338 -1436 -1819 -1233 2462
2959 2462 -1007 -6911 -712 5353 -2463 -7156 -776 1367 -787 366 -2782 -7066 -3 5524 -3150
2974 -3150 -7436 348 2336 -2095 -2007 -3321 -4958 1758 4868 -4567 -8038 777 1627 -4007 -2818 -2133
2990 -2133 -3787 319 1597 -6786 -7641 1555 1460 -5830 -4373 -1702 -4167 -2212 -678 -7229 -6017 2034
3006 2034 -468 -8614 -4975 -257 -3557 -4038 -2080 -5889 -4912 1744 -2581 -9821 -3694 2478 -2536
3021 -2536 -5116 -2883 -4498 -2483 2824 -2290 -8689 -1075 4693 -2597 -5873 -1802 -619 128 2892
3036 2892 -2486 -7264 623 5629 -2416 -5928 211 1022 331 1944 -2445 -5829 2225 6361 -2761
3051 -2761 -5594 1322 1727 -1110 409 -1298 -3595 2386 4166 -4120 -4634 3372 2212 -2166 28
3066 28 176 -2282 1662 2841 -4164 -2919 5147 1954 -4187 -418 2288 -428 1224 1716 -2903 -328
3082 -328 5796 614 -5503 719 4998 660 408 886 -2428 722 6366 -51 -5948 1423 5683 19
3098 19 -2207 -154 -1766 777 4960 -1486 -6528 1107 4819 -2231 -3306 256 -1840 -899 2478 -2729
3114 -2729 -6727 1059 4019 -3264 -4061 229 -1375 -2158 801 -2474 -5051 1099 1999 -4916 -3741 1893
3130 1893 -1152 -3658 411 -936 -3792 1021 1521 -5075 -2174 4219 77 -4321 -31 361 -1894
3145 -1894 1449 425 -4804 -286 5787 -882 -5846 258 2607 -372 262 -271 -4159 892 6064
3160 6064 -975 -5784 967 4037 -349 -128 -260 -2731 1852 5693 -1427 -4873 2979 4739 -1145
3175 -1145 -653 2069 -149 1604 4953 -792 -2632 4984 5133 -1477 591 4449 1359 1504 4408 745
3191 745 102 5939 4096 -2416 1588 7162 2392 -515 3594 2828 2026 4991 1833 -2934 3193 7909
3207 7909 970 -2400 2621 3542 2098 4015 869 -2852 3433 7595 -372 -4088 2733 3936 536
3222 536 1886 395 -2536 2955 6063 -1059 -3981 2875 2723 -583 1338 432 -2720 1757 4966 -2095
3238 -2095 -3442 3031 2553 -1857 599 1462 -2064 763 2914 -2201 -2378 3448 1271 -3903 74 2204
3254 2204 -1668 -713 1631 -2604 -1989 3471 -63 -5821 -674 3440 -1374 -2974 -669 -2518 -488
3269 -488 3127 -1739 -6624 263 4844 -1833 -4186 -795 -1073 608 3683 -2295 -6726 1453 6231
3284 6231 -1195 -4383 387 1400 1959 3048 -1881 -4576 3926 6743 -1515 -3225 2889 2499 582
3299 582 2705 121 -1741 4052 5167 -1895 -2006 4877 2780 -658 2102 2406 -73 2794 2962 -1856
3315 -1856 803 6576 1009 -3484 1967 3817 296 1029 1571 -1200 1710 6283 74 -4900 2164
3330 2164 5540 908 352 556 -1457 2469 6181 -555 -4534 3008 5843 337 -948 785 -506
3345 -506 2035 5488 -617 -4397 2625 5163 -792 -1255 1202 -266 1454 4289 -1237 -4531 2500
3360 2500 4143 -2000 -1856 1574 -1008 -1492 1652 -1406 -3462 1887 1886 -3907 -2807 1414 -1310 -2499
3376 -2499 654 -1738 -3273 1320 -303 -5646 -2278 3675 -779 -4339 -716 -419 -1681 675 -497
3391 -497 -5131 -205 5083 -813 -5409 -214 2053 337 1411 -801 -4357 925 5803 -1263 -5133
3406 -5133 1470 3746 -408 -398 -535 -2869 2029 5339 -1693 -4560 2212 2862 -1887 -1245 824 -1289
3422 -1289 1410 3228 -2548 -4225 2596 2080 -3440 -837 2600 -1126 -1400 1127 -1702 -1910 3068 1032
3438 1032 -3932 -267 3604 -1051 -1917 1784 444 176 2985 638 -3886 1777 5608 214 -1773
3453 -1773 2527 2031 701 2993 759 -2139 2928 5650 -429 -2048 2521 2052 796 2995 1552
3468 1552 -2231 1527 4507 -1043 -2771 2255 1911 -380 1625 337 -3417 728 4068 -1542 -2947
3483 -2947 1417 328 -2534 281 158 -2917 493 2884 -2588 -3682 1558 332 -3063 255 953
3498 953 -2133 -175 1226 -3581 -2090 3569 584 -3986 -152 1980 -1438 -878 140 -2282 -426
3513 -426 4371 -614 -5873 -648 3325 -294 -2038 -754 -2159 104 2869 -2294 -6352 417 4035
3528 4035 -1852 -4626 -1686 -1375 -560 1766 -2980 -5983 624 2421 -4209 -4842 -253 -301 -1375 2
3544 2 -3069 -4951 601 1857 -3898 -2656 2581 -216 -3240 -437 -364 -1625 1717 1730 -2889 -730 3942
3561 3942 236 -2962 1699 2800 31 1347 1055 -2421 1115 5581 844 -2741 2106 3332 -327
3576 -327 1086 1745 -754 1455 5346 447 -3501 1200 3208 456 1471 1899 -1542 395 3991 -288
3592 -288 -3786 1233 3483 50 244 489 -2089 378 4464 -43 -3345 1580 3289 -1223 -1310 883
3608 883 -479 1227 4019 -534 -3335 2880 3392 -1710 -805 3028 1237 197 1272 -1544 -1446 4342
3624 4342 3274 -3231 -1384 3779 542 -1984 298 -14 147 3470 155 -5938 -1406 4499 297
3639 297 -3475 -548 722 -745 636 -1889 -5071 245 4165 -2057 -5320 -472 1195 -1589 -712
3654 -712 -1021 -3177 527 2331 -3871 -4529 1988 2304 -2598 -1719 127 -2078 -250 1317 -2260 -1902
3670 -1902 3490 1385 -3823 -1266 2105 -494 -163 2113 -712 -908 2706 318 -3194 1217 3774
3685 3774 -473 -688 2051 -644 -1171 2659 1596 -1852 1633 3342 -1531 -843 2480 854 -409 3255
3701 3255 1280 -2334 805 3546 38 439 3381 880 -82 3019 1772 -1953 2338 5339 927
3716 927 -640 2351 1078 299 3639 2303 -664 3108 5028 -406 -1497 2797 3031 1361 2933 1517
3732 1517 -904 2834 4350 -1103 -982 4613 3530 -897 414 1056 31 2665 2983 -1996 -897 4370
3748 4370 1325 -3603 -143 2841 811 717 -6 -3071 -757 4123 -299 -4243 889 3271 -1251 -2625
3764 -2625 -934 -1507 952 3059 -1878 -4827 1311 2996 -2950 -3210 1181 370 94 361 -2803 -3480
3780 -3480 2314 2901 -3206 -2395 2100 309 -2091 -289 -922 -1147 2701 1318 -4103 -2323 2764 166
3796 166 -1647 1140 1001 -870 830 466 -2562 615 4395 481 -1985 1615 1428 -1237 1433 1983
3812 1983 -870 1178 4110 331 -1870 2634 2771 231 2377 2905 -869 566 4165 1100 -1073
3827 -1073 3232 3496 -71 1483 2212 -533 1684 5357 1578 -1783 1850 2922 -370 937 2662
3842 2662 679 2594 4299 -1205 -2803 3039 4141 -322 280 2559 575 902 2261 -1607 -1555 5116
3858 5116 4398 -2354 -1505 2551 1428 717 1798 -801 -287 4344 2106 -4047 -485 4962 1768 -649
3874 -649 695 -635 -314 2971 962 -2989 1243 4417 -499 -3337 329 1543 103 1477 32
3889 32 -2730 1197 2691 -2849 -3575 2321 2549 -1888 -1371 -978 -2016 552 1508 -2922 -2660 2878 930
3906 930 -3990 -1686 313 -680 772 1301 -3194 -2551 2729 1280 -3051 -51 2063 -761 -205 1098
3922 1098 -1491 -1010 3804 2161 -1955 156 1421 -1303 348 2613 -146 -387 3136 1576 -2308
3937 -2308 113 2413 59 922 2653 -498 -1745 2241 1348 -1848 919 2911 -397 -562 1388 -617
3953 -617 -6 3453 1399 -2575 865 2855 -1391 -1516 2452 2131 210 1954 -236 -2276 2252 4343
3969 4343 -482 -1236 3403 2413 -81 685 -27 -18 4981 4548 -1810 -1902 4065 3152 -680 869 1924 1489
3987 1489 3564 1887 -3068 -638 5416 2646 -2086 475 1705 -104 916 899 -1847 479 3896
4002 3896 -742 -4530 -98 2378 -604 -791 739 -1484 -924 691 -2802 -3869 2092 2373 -2913 -2916
4018 -2916 81 -1201 -1475 603 -1637 -2266 2285 1153 -4584 -2734 2046 419 -1056 348 -1129
4033 -1129 -1960 1354 1004 -3255 -992 2649 -283 -2403 -257 -982 -1680 1956 1701 -2726 -1772 1531
4049 1531 -994 -2308 830 20 -1937 1266 70 -3961 -1870 1932 -334 -1820 368 -821 -2875
4064 -2875 -356 4 -3270 -1257 2201 -731 -3513 -714 -36 -1807 16 607 -2469 -416 2161 -2384
4080 -2384 -3616 1374 2597 -1120 -843 350 -1252 755 2677 -1299 -2063 3425 2760 -2516 -2089 1149
4096 1149 932 1833 2328 -1982 -1534 3328 1680 -3600 -1105 3459 1394 -84 -253 -2206 -959 3173
4112 3173 1079 -3688 -719 2708 -955 -2772 -92 -431 -268 1679 -989 -4558 -519 2464 -2083
4127 -2083 -3051 1326 824 -2100 -1510 -1992 -2513 1503 2102 -3039 -3088 1612 -115 -2889 -1081 292 -912
4144 -912 975 354 -4681 -3388 2649 861 -3049 -929 417 -1719 -1013 -260 -3358 -2219 2325 -245
4160 -245 -4332 -1726 -24 -2364 -1251 580 -3230 -3262 309 -1440 -4632 -1311 44 -2508 -1942 -895
4176 -895 -3980 -3782 358 -1037 -3426 -1042 -291 -3876 -2872 -402 -2380 -2294 824 -861 -4028 -962
4192 -962 494 -3043 -2310 816 -674 -1419 328 -1704 -3025 1461 2456 -2265 -2169 1932 636 -1525
4208 -1525 -3 -472 -1274 2501 2358 -3685 -2837 2626 1623 -1155 73 69 -640 1806 828 -3879 -740
4225 -740 4562 1215 -2707 -649 420 -819 823 942 -1956 63 3231 -1006 -3903 312 2000
4240 2000 -647 76 660 -1396 -288 1832 -1738 -2273 2614 1804 -2894 -1868 1366 -230 -333 1008
4256 1008 -1467 -1969 2160 570 -3949 -1081 2889 716 -1267 -447 -2432 -2276 2020 469 -3661 -1148
4272 -1148 2619 -916 -3051 -1015 -1045 -1625 1298 183 -3925 -1900 1173 -1570 -2568 240 -739 -2487
4288 -2487 107 -270 -3990 -1567 1393 -1816 -2503 53 -1412 -3205 -132 395 -2818 -1123 767 -2318
4304 -2318 -3059 344 -585 -2481 310 384 -2844 -1400 777 -2222 -2373 1989 1188 -2282 -569 -145 -2213
4321 -2213 -141 1432 -1464 -1636 2339 983 -2853 -680 1403 -48 856 1562 -2048 -1820 3008 2012
4337 2012 -1781 430 2717 806 358 1209 -1173 -257 4358 2539 -2104 27 2765 23 376 2452
4353 2452 222 397 2988 1298 -2313 641 3277 462 180 2310 159 -611 1674 1393 -662 1940
4369 1940 3182 -750 -597 2332 617 -794 2025 1555 -762 1087 2122 -1384 -376 3253 1561
4384 1561 -1044 965 519 -1387 963 2138 -877 -321 2864 753 -2085 362 862 -939 1190 2132
4400 2132 -1682 -2305 1652 499 -2061 480 1106 -926 413 1187 -2725 -2336 1822 621 -2429 -845
4416 -845 -412 -2297 -109 777 -2342 -1901 1925 -697 -3662 -1213 699 -1668 -195 451 -2602 -2172
4432 -2172 920 -744 -3034 804 2512 -1278 -1371 363 -1217 -939 2191 119 -1954 1686 2393 -1781
4448 -1781 -1251 2044 1265 787 1908 -282 -1836 2150 3005 -986 -221 3639 1629 -246 1359 646
4464 646 -156 3260 2600 -1742 -282 3206 1148 -635 1422 1379 328 2312 1619 -2009 46 3862
4480 3862 1217 -1316 1426 1588 -741 900 1414 -1070 1082 3786 342 -1979 1488 1949 -596 745
4496 745 1953 -206 612 2515 -372 -1666 2644 2862 -714 314 1768 -180 403 2741 -115 -560
4512 -560 2734 2104 -1969 -571 2026 401 682 1900 -884 -2011 1876 1306 -2413 -322 2246 182
4528 182 -978 80 -1613 -1985 1841 903 -2714 -1002 1207 -1323 -2353 200 -904 -1567 1364 69
4544 69 -3468 -910 1727 -1022 -2050 115 80 -1620 467 -305 -2487 714 3040 -1127 -2296 950
4560 950 852 -1183 688 685 -1102 1090 2337 -2183 -2382 2443 2179 -843 344 944 -626 540 1639
4577 1639 -1569 -1371 2996 1870 -2498 -600 1204 -431 873 1403 -1514 -1307 2268 261 -2784 -34
4593 -34 2225 -147 -447 563 -1311 -497 2333 780 -2322 850 2518 -964 -823 1455 693 661 2668
4610 2668 848 -1619 1219 2865 -447 -207 2686 1500 107 1911 239 -894 2392 3556 -368
4625 -368 -162 2649 1271 -318 1709 1015 -536 2078 2685 -1544 -1105 2619 1108 -613 866 292
4641 292 -1153 649 1281 -2207 -1202 2321 361 -2106 -492 -325 -1602 188 1029 -2279 -1256 1654
4657 1654 -641 -3145 -316 863 -1022 -71 270 -2500 -1576 1629 -794 -2616 466 1161 -1531 -1079
4673 -1079 -251 -1648 -462 2094 -561 -2889 401 1457 -1997 -1257 729 -524 -567 697 -1797 -2837
4689 -2837 902 1645 -1876 -1296 490 -1056 -1760 248 -1294 -2313 1140 898 -3191 -2388 669 -685
4705 -685 -1663 101 -751 -1558 658 216 -2886 -1474 1729 -334 -2085 133 -437 -1381 1585 857 -2400
4722 -2400 -442 2346 -537 -2293 362 1027 -46 1289 666 -1833 -160 2631 -502 -1666 1336
4737 1336 1519 -591 195 384 -1507 683 2932 -539 -1877 1371 1336 -1159 -256 812 -879 751
4753 751 1809 -1251 -2183 1480 1394 -1775 -473 812 -692 -507 1439 -1198 -1913 1929 1042 -2288 -1343
4770 -1343 677 -260 -265 873 -1004 -1379 1706 -12 -3376 -878 1880 -67 -1153 238 -1231 -1466
4786 -1466 1551 -171 -3109 -558 2128 -631 -2423 -627 -634 -484 1168 -857 -3187 -186 1838 -1558
4802 -1558 -3246 83 16 -1222 -381 -1518 -3473 212 1518 -2151 -2730 480 -266 -2407 -1221 -918
4818 -918 -1732 339 828 -3243 -2723 1090 447 -2475 -1246 98 -1105 -516 -585 -2817 -1616 2183 522
4835 522 -2937 -828 656 -779 -582 132 -1664 -299 2324 -263 -3201 222 2450 -43 -751 300
4851 300 -335 389 2100 -225 -2017 1610 2939 -354 -1144 428 -46 497 2044 -262 -2067 1889
4867 1889 2838 -1050 -1136 1435 1134 323 1545 -303 -1244 2036 2636 -1127 -1081 2190 1122 -233 608
4884 608 -20 -649 2278 1901 -2004 -1115 2693 1033 -1179 93 683 211 1143 529 -2322 -445 3056
4901 3056 805 -2082 -154 817 -350 625 -31 -1846 336 3031 -726 -3263 -269 1572 -191 -493
4917 -493 -575 -1466 563 2183 -1459 -3343 570 2071 -1239 -1226 -175 -871 111 1041 -1856 -2630 881
4934 881 1197 -2422 -2108 525 -127 -400 124 -2085 -1953 1219 527 -3020 -1274 1738 -265 -1654 -698
4951 -698 -1314 -1292 1505 411 -2630 -354 1881 -474 -1821 222 183 -65 1354 -274 -2174 599 2655
4968 2655 -202 -1657 730 1057 -333 1052 202 -1573 1352 2947 73 -1517 1233 1418 -100 1033
4984 1033 909 -572 962 2772 -591 -1519 1644 1979 -53 675 716 -723 581 2150 -20 -784 1955
5001 1955 1718 -376 412 1139 -252 1131 2103 -865 -966 2261 1641 -1439 -95 1852 341 225 1130
5018 1130 -539 -68 2747 1175 -1864 257 2281 462 -223 747 -45 581 2510 221 -2237 641
5034 641 2933 199 -1039 655 317 426 1382 -320 -1952 971 2303 -797 -1917 425 393 -501 290
5051 290 -482 -1911 792 1350 -2118 -2455 1216 579 -1400 -511 -355 -1206 427 303 -1951 -1207 1636
5068 1636 -1 -2095 -345 254 -888 -22 492 -1634 -785 1635 -191 -2495 143 1290 -443 -186
5084 -186 324 -881 -444 2234 223 -1514 771 1817 -535 -153 1038 -262 345 2170 303 -1518
5100 -1518 1167 2009 -84 -232 1153 -169 578 2019 135 -1372 1409 2523 -200 -124 1250 261
5116 261 133 1789 7 -1242 1862 2276 -836 -858 1538 945 366 1241 9 -438 2223 1974 -1361
5133 -1361 -298 2431 1400 -253 616 279 264 2095 1782 -1464 8 2996 1346 -1332 441 1326
5149 1326 742 1490 263 -1717 821 3135 2 -2094 817 1739 381 -117 -176 -1117 1030 2305 -1076
5166 -1076 -2617 516 1387 -807 -971 -301 -543 253 821 -1988 -2111 1184 1045 -1777 -1600 -89 -409
5183 -409 -521 450 -1771 -1569 1366 480 -2218 -1026 741 -381 -784 310 -1182 -1266 1067 338 -2136
5200 -2136 -839 1542 -588 -984 7 -840 -1176 872 163 -2276 -664 1219 -427 -1185 259 -518 -933
5217 -933 1073 -194 -2398 -405 1406 -426 -1621 -310 -265 -438 610 -692 -2229 151 2036 -969
5233 -969 -2013 -248 221 -254 -112 -771 -1440 1078 2102 -1389 -1966 901 1499 -517 -671 -297 -538 1313
5251 1313 1062 -1718 -1442 2340 1618 -1281 -683 639 406 747 18 -1661 -341 2736 996 -2472 -264
5268 -264 1894 604 -334 -660 -1081 308 1917 -376 -2796 221 1997 -662 -1934 -388 -226 163
5284 163 464 -1345 -2264 671 1340 -1653 -2179 283 390 -556 -544 -1590 -1841 677 1003 -2145 -1828 1132
5302 1132 -232 -1544 -685 -532 -1218 329 241 -2306 -1441 906 -359 -1921 -446 -248 -889 -227 -112
5319 -112 -2390 -1218 1075 -750 -2186 -715 -39 -1479 -510 -64 -1899 -1117 570 -769 -2303 -592
5335 -592 109 -1267 -758 -835 -1987 -899 1081 -888 -2825 -488 747 -1009 -618 -792 -1617 -446 1200
5352 1200 -1243 -2570 292 1524 -1297 -1412 3 -359 201 886 -1465 -1866 1368 1883 -1475 -1600 653
5369 653 590 55 73 -1027 -849 2011 1236 -2274 -985 1869 1054 -761 -236 -207 -104 1629 364 -1969
5387 -1969 -253 2588 476 -1683 -189 714 296 769 -356 -1897 710 1966 -840 -2025 670 1257
5403 1257 -225 -306 -38 -608 872 1475 -1576 -1923 1280 1198 -1094 -776 332 163 367 645 -1320 -1236
5421 -1236 1141 819 -1221 -345 869 -377 -219 582 -724 -974 1115 420 -1550 -516 612 -756
5437 -756 -484 397 -999 -1298 972 745 -1463 -904 400 -1004 -484 298 -1273 -1619 866 190 -1968
5454 -1968 -993 519 -517 -658 -139 -1236 -889 1115 -215 -2467 -901 1391 -327 -1306 -453 -386 -405
5471 -405 907 -696 -2423 239 1766 -766 -1923 128 662 -272 -39 -961 -1372 1430 1808 -1236 -2131
5488 -2131 1135 1509 -675 -276 -490 71 1415 1155 -1801 -823 2200 1382 -1036 -542 797 737 869 151
5506 151 -1453 154 2422 847 -1814 190 1663 772 207 325 -705 611 1986 195 -1252 938
5522 938 1968 -200 -226 741 416 231 1120 100 -1016 1245 1502 -726 -171 1163 513 -293 708 135
5540 135 -995 1096 1364 -968 -360 956 -256 -686 738 210 -979 650 1468 -618 -494 812 161
5557 161 -315 843 -484 -1165 827 1314 -1225 -1296 992 463 -440 -51 -794 -905 1244 905 -1684 -1266
5575 -1266 1400 762 -1118 -472 182 -191 961 334 -1801 -701 1965 -154 -2020 -56 882 128 -97
5592 -97 -553 -1444 421 1877 -634 -2116 733 1859 -439 -1106 -178 18 1098 1301 -1446 -1644 1806
5609 1806 1984 -1045 -1374 894 999 673 550 -1170 -472 2232 1528 -1566 -348 1896 1000 -147 199
5626 199 35 546 2097 808 -1608 209 2310 376 -323 734 991 372 1130 703 -1034 783 1853
5643 1853 -160 -627 1220 1209 254 624 790 -384 867 1610 -520 -617 1199 1102 -367 351 726 -85
5661 -85 873 1080 -140 -491 1531 1047 -670 124 344 -85 1112 1717 -638 -1022 1707 1413 -612 -136
5679 -136 633 116 796 1068 -1104 -1338 1983 1292 -1304 -823 577 -50 -9 -94 -1219 -818 1683 689 -2159
5698 -2159 -847 860 86 -607 -84 -1040 -263 1339 -463 -2318 38 1897 -480 -1535 -82 -240
5714 -240 230 804 -930 -1666 688 1781 -1216 -2132 509 1034 77 179 -772 -539 1569 1332 -1861 -1405
5732 -1405 1548 1304 -559 -978 -387 164 1382 511 -1951 -860 1811 1196 -1392 -653 638 464 823
5749 823 185 -1376 41 2248 324 -1153 170 1357 -212 -64 986 -572 11 1484 -9 -1020
5765 -1020 1032 1124 -313 279 763 -283 126 1679 -28 -1246 969 1228 -120 89 1103 68 98
5782 98 1283 60 -835 840 1455 -504 -439 896 13 154 860 -470 -1168 1153 1613 -839 -815 703
5800 703 319 120 391 -1076 -1438 1179 1219 -1571 -959 849 67 -661 15 -769 -858 1353 579 -2070 -1389
5819 -1389 1076 314 -1076 -500 -88 -333 666 -441 -1708 -248 1534 -628 -1963 -148 353 -456 -595
5836 -595 -401 -1170 176 1094 -1392 -1994 273 1140 -958 -1172 -393 -567 279 268 -1677 -1593 1320 654 -1766
5855 -1766 -1500 383 -64 34 317 -1348 -975 1272 441 -1743 -727 869 -57 -505 548 -915 -652
5872 -652 984 295 -988 -103 1094 -468 -444 377 -302 -417 1040 355 -1122 238 837 -174 -466 1070
5890 1070 481 22 691 443 -890 328 1483 -230 -303 1028 557 -482 541 678 -756 676 1477
5907 1477 -605 -886 706 891 -110 425 212 -892 658 1158 -1239 -1104 1232 1112 -310 -594 -133
5924 -133 -304 912 1404 -1347 -1217 1463 1147 -1407 -540 335 79 671 94 -1445 -872 1634 409 -1934
5942 -1934 -333 1136 -43 -485 -296 -1002 -160 1350 -220 -2059 286 1244 -592 -1370 -145 -429 -189
5959 -189 587 -1488 -1865 347 1285 -1568 -1812 202 -34 -852 -402 -1198 -1060 1116 480 -2296 -1629 919
5977 919 417 -1165 -757 -707 -729 794 210 -1822 -946 1612 586 -1006 -401 22 -551 552 457 -1509
5995 -1509 -327 1370 144 -954 -29 435 -229 549 477 -1179 -472 1359 -65 -804 318 678 -438
6012 -438 139 235 -806 108 1437 -30 -1195 935 1009 -314 -333 433 -339 470 1343 -367 -1388 978
6030 978 1435 -466 -496 320 -63 439 805 -870 -893 1360 1598 -1136 -823 560 638 204 146 -886 -493
6049 -493 1576 1272 -1546 -1002 1397 1096 -277 -56 -423 -221 1224 226 -1655 -248 1807 -23 -1403
6066 -1403 -273 -171 -200 641 -189 -1438 -15 1205 -530 -1698 264 447 -379 -213 -639 -1352 -88
6083 -88 947 -1047 -1514 615 425 -1321 -1022 -349 -630 438 505 -1339 -1294 956 431 -1490 -673 397
6101 397 -194 136 209 -1369 -794 1274 168 -1625 -581 521 -457 -447 100 -538 -342 1108 109 -1168
6119 -1168 -349 743 -476 41 633 -431 -234 1005 309 -905 223 1272 -283 -339 422 -208 -409
6136 -409 842 170 -623 548 1101 -598 -659 782 372 -25 638 38 -634 533 1055 -346 -778 1299
6154 1299 738 116 615 332 -276 1197 1076 -983 -566 1330 1215 -368 102 458 195 852 1060 -757
6172 -757 -170 1410 1069 -652 273 757 -332 271 543 -208 198 1727 -56 -1347 197 1105 -226
6189 -226 -89 283 -464 173 1074 -545 -1499 794 1170 -700 -312 536 -272 -228 101 -596 -1180 959 578
6208 578 -1496 -1138 993 7 -157 88 -557 -872 550 482 -1085 -693 878 221 -717 -106 -302 -792 569
6227 569 521 -1008 -708 638 -411 -830 244 -304 -668 693 433 -1260 -560 1189 -61 -766 381
6244 381 51 -824 322 538 -859 9 1264 -50 -853 54 200 -12 534 804 -469 147 1181 -207
6262 -207 -890 901 754 -23 387 426 -523 244 1416 -294 -775 1072 1275 -39 39 603 206 842 1420
6281 1420 -119 -506 1266 1135 -206 -199 1085 695 573 906 -173 -577 1467 1247 -606 -137 876 314
6299 314 228 587 -175 199 1547 624 -1259 -26 1383 172 -473 670 231 17 999 221 -1344 -61
6317 -61 1389 -151 -703 148 -37 -477 171 -96 -1142 328 1085 -742 -1250 485 161 -482 315 -142
6335 -142 -813 194 566 -823 -1068 892 324 -841 -241 -190 -719 437 638 -938 -1051 562 158 -922
6353 -922 -496 228 -474 177 464 -1266 -959 599 309 -1160 -400 128 -443 -179 202 -738 -637 1036 240
6372 240 -1361 -468 639 -148 -121 47 -393 -512 754 -173 -1307 13 1438 -217 -562 563 -129 -119
6390 -119 749 110 -819 802 1220 -375 -814 351 375 105 478 109 -276 729 746 -915 -251 1151 774
6409 774 -259 162 454 -179 1121 1022 -641 -125 1218 836 -669 119 823 178 769 319 -712 -10
6427 -10 1630 67 -664 350 778 -290 -107 173 -208 418 1162 9 -1221 491 759 -339 -390 183
6445 183 -51 37 907 -714 -1208 409 758 -742 -372 400 -355 -368 59 -474 -674 416 922 -1436 -737
6464 -737 335 -163 -192 -49 -412 -971 425 347 -1679 -439 720 -542 -603 -198 -296 -756 32 -47 -1381
6483 -1381 -511 684 -391 -1337 -106 -380 -587 294 -435 -1209 -503 675 -236 -1332 59 310 -247 -257
6501 -257 -396 -1281 41 778 -432 -1064 223 398 -301 -60 -369 -321 328 767 -667 -1245 468 505 -396
6520 -396 -260 205 -192 548 975 -880 -436 1112 929 -627 -268 779 155 252 604 -417 92 1379
6538 1379 804 -936 -26 1060 280 195 270 9 -77 872 275 -953 381 1100 -120 -601 315 179 324
6557 324 1093 161 -841 312 1253 -523 -700 587 293 -133 469 120 -898 181 936 -647 -433 587
6575 587 77 -324 270 -15 -955 151 946 -803 -631 383 19 -648 32 166 -695 513 667 -820
6593 -820 -937 488 -305 -723 -101 18 -980 -47 41 -985 -721 533 -377 -1189 -575 -168 -609 45 142 -1037
6613 -1037 -659 512 -102 -1292 -367 304 -269 -625 87 -754 -476 590 -136 -1019 -101 742 -722 -636 -87
6632 -87 -398 -70 919 125 -858 686 837 -514 -486 446 -6 -51 449 -228 -501 431 1011 -293 -575 614
6652 614 508 -106 445 53 -123 907 741 -737 -367 922 420 -11 805 167 -98 823 715 -510 -259
6671 -259 1258 331 -678 506 553 76 340 508 -500 114 1124 277 -572 338 745 -38 751 238 -248
6690 -248 77 915 202 -457 319 715 -317 110 433 -466 473 1038 -374 -660 401 801 -577 150 303
6709 303 -10 -30 374 -417 -727 664 446 -551 -379 677 -171 -30 99 -582 -339 802 334 -1271 -547
6728 -547 637 99 -703 215 -203 -427 477 -400 -1058 63 1173 -88 -928 -258 17 111 432 -329 -811
6747 -811 131 886 -614 -883 319 336 -222 339 -266 -483 560 845 -718 -693 713 832 -506 -89 56
6766 56 42 719 773 -745 -664 941 593 -600 -83 550 12 16 220 -443 -256 1413 377 -813 71 717
6786 717 241 184 172 -37 -80 1236 308 -760 435 1132 144 63 663 -21 224 829 -44 -640 552 1203
6806 1203 -261 -324 530 188 284 1000 118 -463 707 1259 -214 -569 447 598 159 549 20 -558 639
6825 639 868 -345 -406 463 368 -220 76 28 -752 466 476 -848 -487 913 261 -647 -361 -131 -351 252
6845 252 68 -1134 -587 1048 261 -975 -319 249 -352 -136 -28 -872 -200 795 -141 -988 -443 402 -206
6864 -206 -386 -155 -604 168 598 -368 -1169 145 815 -201 -375 134 -13 -146 346 -248 -600 629 555
6883 555 -811 -557 532 -148 -31 200 -239 -448 576 648 -640 -327 672 65 -163 -58 234 -362 413
6902 413 359 -637 312 1034 95 -332 379 168 145 906 734 -431 -83 948 70 65 554 373 -201 483 657
6923 657 -168 293 991 -144 12 602 500 -365 392 815 -572 352 1100 -42 -349 616 460 -85 221
6942 221 214 -180 118 390 -476 -324 743 436 -382 146 340 -226 151 440 -662 -650 773 712 -962 -122
6962 -122 788 -54 -152 106 -392 -518 568 136 -1172 -222 702 -145 -636 -2 -154 -240 234 -11 -940 214
6982 214 691 -623 -606 609 -53 -441 0 -452 -614 185 945 -648 -704 418 448 -557 -89 -175 -597 165
7002 165 374 -615 -993 634 77 -969 33 43 -312 -113 263 -774 -470 740 246 -690 -119 392 -71
7021 -71 14 433 -344 54 858 -106 -481 234 525 -377 76 429 -372 -167 631 6 -471 355 782 -282
7041 -282 -31 388 -126 -96 1153 363 -272 419 1001 5 -307 228 -296 93 595 304 -697 68 718 -125
7061 -125 165 556 287 -137 363 111 -493 574 1081 -487 -636 458 459 -279 30 -139 -381 455 450 -709
7081 -709 -547 711 344 -456 -46 -99 -286 217 391 -759 -236 938 303 -684 -250 142 -356 390 -246
7100 -246 -820 -194 657 -538 -1111 227 241 -394 -292 -149 -561 33 319 -555 -1269 277 618 -801 -758
7119 -758 -13 -142 24 256 -327 -642 261 159 -733 -441 158 -272 -406 156 -631 -497 176 554 -909 -462
7139 -462 590 -123 -79 -44 -364 -527 680 312 -596 -403 522 -133 -82 92 -566 -337 660 223 -673 -49
7159 -49 762 19 -39 447 65 -469 504 267 -601 -183 731 -43 -401 179 410 -268 593 256 -588 154 732
7180 732 -74 -504 555 586 -230 56 256 -29 648 890 -445 -559 1113 595 -74 -184 -104 -68 127 445
7200 445 -304 -305 936 465 -581 -12 351 28 232 44 -631 -210 728 143 -901 -197 605 -257 -200 496
7220 496 -387 -227 224 62 -572 103 359 -471 -630 264 83 -285 367 -376 -743 124 530 -807 -574 462
7240 462 -66 -777 -107 363 -739 225 174 -767 -761 626 -139 -794 31 191 -284 91 -158 -591 -450 503
7260 503 -253 -796 -125 37 -628 -107 255 -435 -326 485 -39 -381 269 147 -490 -135 595 -364 -333 622
7280 622 -26 -658 291 346 -244 -153 423 110 -180 596 -4 -428 203 675 -318 29 534 -171 94 732 -129
7301 -129 -426 467 1049 -420 -36 576 299 255 405 -273 -310 677 601 -309 35 930 619 -22 292 -228 -1
7322 -1 950 540 -607 -300 790 77 -278 -106 54 -144 507 155 -610 -184 1176 49 -713 473 389
7341 389 -293 48 163 -539 64 744 -287 -530 398 679 -316 -291 90 -523 241 472 -546 -343 661
7360 661 118 -711 -231 181 -223 -267 304 -802 -635 356 84 -874 -516 297 -461 -227 113 -449 -502 359
7380 359 -51 -873 -237 79 -223 -99 166 -444 -872 70 344 -476 -101 256 -130 -328 295 -186 -389 434
7400 434 279 -275 -185 581 62 158 395 -183 -180 321 117 -772 -179 564 195 -267 279 39 -257 563 151
7421 151 -392 229 754 -13 -409 733 568 187 196 238 -415 433 618 -515 -392 512 465 -100 58 350 -85
7442 -85 516 685 -463 -239 1134 709 -385 147 295 38 377 554 127 -70 566 68 -193 267 637
7461 637 -18 211 618 -129 -133 641 38 -594 374 577 -299 -378 549 -425 -175 261 -174 -640 224 358 -584
7482 -584 -226 482 -46 -226 354 -13 -814 -27 245 -717 -401 270 -390 -590 -63 -58 -900 96 373 -565 -520
7503 -520 246 -318 -463 165 -368 -451 79 339 -515 -51 685 87 -707 3 294 -407 416 867 -399 -405 558
7524 558 -103 -483 308 222 -191 377 257 -409 20 685 -113 -228 209 811 -204 -285 180 6 269 668
7544 668 -319 -625 1023 336 -227 -132 251 301 139 663 -194 -300 808 753 -409 -259 859 366 195 326
7564 326 111 59 992 181 -564 -21 839 337 160 127 200 265 570 599 -612 2 762 -278 -773 165 321
7585 321 125 229 -45 -498 250 568 -414 -474 271 317 -116 -141 6 -493 278 770 -844 -588 363 300 -669
7606 -669 -330 80 -173 -3 -55 -518 -748 493 -255 -667 -109 133 -299 -25 290 -418 -423 254 144 -485 -251
7627 -251 166 -165 -110 26 -477 -186 580 -105 -675 -295 253 40 -165 345 -179 -472 406 295 -788 -157
7647 -157 616 -251 -557 194 -206 149 653 27 -718 15 776 -304 -341 141 52 56 -3 -88 -494 212 824 -234
7669 -234 -386 609 323 -114 -81 -221 -243 670 363 -717 -426 588 629 -321 -48 -124 182 542 521 -561 15
7690 15 828 180 -602 430 451 -6 368 362 -255 73 879 102 -341 165 544 -58 177 274 2 -135 752
7711 752 144 -587 723 674 -239 278 763 -50 -82 385 321 -319 317 296 -248 -113 367 33 -47 252 -215
7732 -215 -663 -69 240 -356 -164 84 -251 -340 268 209 -520 -69 299 -567 -248 255 -207 -351 68 56 -646
7753 -646 122 321 -556 -460 393 -128 -205 -6 -30 -210 192 198 -541 -55 387 -261 -523 522 38 -446 -17
7774 -17 235 -463 119 761 -266 -753 216 181 -457 -57 200 -284 -93 137 -525 -448 435 20 -526 -269 326
7795 326 -174 135 -60 -357 -222 645 845 -632 -270 364 39 -317 90 72 59 946 180 -713 -75 848
7815 848 223 -162 201 -5 -49 787 187 -526 466 888 96 -253 347 197 -33 348 328 -347 438 339 -354
7836 -354 -345 334 500 -419 304 209 -173 276 597 -230 -301 272 101 -234 350 50 -385 154 332 -342 -577
7857 -577 308 126 -705 108 51 -409 -99 449 -603 -313 573 83 -636 -87 184 -349 152 50 -287 -441
7877 -441 454 287 -565 -264 231 55 -172 98 -610 -180 500 -291 -831 101 310 -271 -488 -105 -250 -345
7897 -345 242 -390 -658 97 216 -638 -702 172 -60 -219 -99 -454 -693 -34 747 -843 -563 218 237 -187
7917 -187 49 -196 -303 430 335 -478 -235 754 -115 -350 326 -1 -180 747 345 -202 -203 768 273 -433 302
7938 302 245 155 169 250 -358 120 679 87 -281 322 464 15 177 311 -340 67 296 10 -163 386 281
7959 281 -502 -160 -12 88 44 577 -216 -623 526 604 -396 -219 361 -106 55 293 48 -143 480 201
7979 201 -504 -65 452 -111 -160 419 -49 2 671 358 -537 -281 503 276 -113 173 -193 42 374 225 -634
8000 -634 -22 691 -125 -400 180 -215 -317 148 -101 -640 -238 313 -208 -583 -134 -258 -659 -336 -252 -626
8020 -626 -373 182 -268 -533 446 191 -245 -211 -85 -471 -236 236 -462 -597 736 47 -693 -44 257 -101
8040 -101 -109 225 -657 -239 378 133 -490 69 681 -14 -122 385 -223 31 532 63 -497 240 596 -124 -34
8061 -34 492 176 184 566 186 -547 345 337 -28 -463 231 -115 89 528 -53 -361 156 630 -538 -49 339
8082 339 130 -108 61 -35 -361 197 339 -302 -261 621 75 -410 495 440 -135 138 595 -282 -95 577 198
8103 198 -534 219 -126 -319 311 353 -458 -201 552 -228 -475 -360 248 -117 -239 37 -820 -88 529 -149
8123 -149 -597 12 370 -219 -659 -126 -539 -171 549 -115 -803 25 557 -283 -564 -32 -129 -32 246 -473 -599
8144 -599 257 374 -545 -113 161 -77 -210 369 -336 -495 284 396 -541 -199 261 -52 -187 -19 -118 -370
8164 -370 491 80 -545 -382 350 158 -471 108 -66 82 670 240 -459 -35 688 -178 -336 -125 65 -154
8184 -154 160 150 -630 177 547 236 -403
8191d03
$$ Imaginary data points
##PAGE= N=2
##DATA TABLE= (X++(I..I)), XYDATA
0 0 0 0 0 -7 8 0 8 -8 16 -16 24 -24 32 -40 49 -57 72 -82 98 -114 137 -157 182 -211 243 -276 315 -359 408
29 408 -459 518 -582 650 -730 813 -904 1007 -1117 1241 -1375 1521 -1686 1866 -2066 2290
45 2290 -2541 2822 -3146 3520 -3952 4463 -5080 5842 -6802 8069 -9815 12392 -16584 24600
59 24600 -45470 213205 473490 60187 -61690 85078 291122 257489 95160 -29590 125939
70 125939 311944 219501 -24337 -3046 180009 246190 158930 57683 14847 107419 187704
81 187704 90899 -19891 86688 203334 129913 25873 34910 72385 114483 143794 99480
92 99480 60060 112599 104703 3359 15645 146138 174791 102730 55952 39192 74421 165377
104 165377 151299 28243 29897 155662 165742 61292 5214 18250 89894 188437 162098
115 162098 18662 -5481 99534 117279 51906 33069 40980 64126 112965 68424 -61587
126 -61587 -46093 111415 152474 49306 -28989 -37178 14352 98072 71587 -53810 -49243 80043
138 80043 93948 -5839 -46295 -19194 35153 106804 90545 -16475 -26644 54925 42458 -14511
150 -14511 30085 90263 73369 48146 28600 7104 56136 119597 73978 24202 82165 104344
162 104344 29267 12057 73380 100979 100518 84849 28192 31238 121614 120005 11052 8006 112005
175 112005 135265 65184 -6165 -35834 34327 154151 129733 -9932 -26514 66637 76270 23546
187 23546 12938 22059 45329 79842 31147 -55679 -18869 75489 63644 14810 28481 31934
199 31934 12326 24165 15200 -15813 24947 75123 31868 -3550 32893 26857 -10583 32180
211 32180 85694 60450 24054 3986 -21743 17937 98921 72337 -14543 -858 54382 42444
223 42444 23344 24010 8813 36005 92064 48217 -44720 -29651 32939 31524 25561 33422 3273
236 3273 -3185 35453 12651 -46130 -14335 45904 31910 626 -22742 -64493 -43633 49645
248 49645 56120 -29603 -48102 -7225 919 67 -4398 -44243 -35549 38708 32194 -52027 -59030 -4123
262 -4123 9119 10239 18462 -11400 -24510 6659 -11744 -53268 -3222 57772 13817 -37033 -19868
275 -19868 -7988 -7700 12835 6574 -8473 27972 29222 -53721 -69919 18884 51279 -2483 -34941
288 -34941 -27956 1440 45072 12533 -84073 -62898 65895 80223 -35837 -96198 -57019 14247
300 14247 64396 22657 -73142 -57042 45950 37566 -56534 -60004 8383 41728 31284 -24874
312 -24874 -85948 -41170 59411 42548 -40027 -28181 25835 20542 -3517 -21506 -41681 -5092
324 -5092 56863 28239 -35909 -20436 8428 -10786 790 37052 20016 -3821 755 -20569
336 -20569 -32650 21402 44130 -10168 -26617 8036 6775 -5897 5873 -7244 -15848 30707
348 30707 36852 -34784 -58142 -8779 14228 10758 10606 -19592 -34101 16630 25020 -48223 -59525
361 -59525 19949 52188 8594 -44358 -80116 -48052 46912 57336 -44647 -76725 3078 37408
373 37408 -6609 -46883 -57407 -22208 42877 24140 -75300 -82244 9283 30928 -21617 -37227
385 -37227 -20664 -5129 7009 -28136 -82612 -38946 47124 20752 -59146 -57817 -19545 -11398
397 -11398 -5047 -10585 -30219 -6021 18233 -38527 -79904 -17611 28818 -11408 -40459 -23827
409 -23827 -8251 5864 -3198 -55751 -52164 36923 53432 -35991 -76873 -31831 3008 10670 173
422 173 -35807 -32269 23670 15505 -54603 -48573 18825 26677 -8734 -32060 -51611 -34391 21654
435 21654 19048 -38370 -30318 18700 7530 -24553 -23875 -28293 -21337 20633 20425 -31621 -37651 -7241
449 -7241 -13966 -13779 19530 15187 -12869 -4369 -3850 -29327 -10604 23569 969 -18780 6199 4406
463 4406 -18166 98 16450 1181 11224 25155 -11576 -30597 7078 14482 -11894 -1137
475 -1137 15517 794 2819 5498 -28822 -24967 37996 44684 -16557 -40304 -25074 -14393 8822
488 8822 15265 -25482 -31034 21081 18698 -39002 -41288 -1234 8029 3583 -9201 -42372 -35469 12483
502 12483 1875 -45748 -21386 28480 12642 -21810 -27601 -26735 -4605 28826 2451 -42486 -15459
515 -15459 18347 -13311 -29381 10558 29798 14489 361 -24358 -28031 20799 36572 -21016
527 -21016 -35780 20788 35927 -4358 -25906 -22017 3088 47811 37439 -35143 -45506 16103
539 16103 24529 -20055 -25537 -1292 13447 21731 -6368 -54445 -27189 46513 36695 -29419 -38209
552 -38209 -9880 1034 7634 -5331 -35089 -11971 40386 19977 -34289 -22326 12486 14404
564 14404 15081 10649 -15081 -8670 22939 4652 -20545 17556 50586 24842 3964 5173 -1317
577 -1317 16275 46854 23495 -9523 18325 42471 12743 -1088 18288 25412 35171 43576 9062
590 9062 -16379 24794 49096 7417 -10836 18551 30242 21669 10267 -17248 -13968 47938 65051
603 65051 -1698 -37194 -1932 23722 19308 6824 -15514 -8322 41083 39437 -27764 -36382 27049
616 27049 49163 17448 -6410 -15512 717 37524 24815 -29461 -14211 52997 52026 -1240 -17999
629 -17999 -1608 24334 49697 27717 -22130 -5951 44584 25747 -18232 -740 32523 31849
641 31849 20380 -1087 -21283 10225 46896 11605 -29547 -1979 26637 6433 -12616 -17060
653 -17060 -14567 18415 39215 -8412 -47331 -10722 17774 -8750 -22716 -10072 -5050 3684 3373
666 3373 -33921 -41556 13071 34270 -9593 -30907 -12677 -3195 5129 7240 -21660 -24446 23427
679 23427 33748 -13970 -25663 8537 21099 20274 18196 -5190 -10484 23395 26154 -10175 -2481
692 -2481 36680 34049 12632 6305 -3554 4569 41338 37149 -7798 -5556 30423 22257 -1679 3985
706 3985 10810 16522 32679 16530 -19738 -3295 31302 12979 -12151 5521 16578 5968 4947
719 4947 -5120 -19256 10855 40417 6960 -25092 -2404 14794 1736 1538 2578 -5180 10077
732 10077 20820 -11051 -21126 18503 29126 1093 -1261 8366 -1171 2982 10885 -8491 -7764
745 -7764 28281 26865 -10428 -11395 7902 4360 5240 11682 -4643 -8346 13378 2071 -26060 -5386
759 -5386 21262 1456 -15690 -6897 -9977 -10421 5403 -5530 -26862 -5995 11301 -17879 -33190
772 -33190 -11856 -5030 -8393 -117 -10327 -26548 -7393 3522 -25062 -28058 5363 6592 -16329
785 -16329 -15635 -13083 -14393 7190 15673 -13681 -17664 10481 6606 -16132 -8549 2389 1461 14900
799 14900 14418 -15057 -11481 23937 17590 -11031 -893 16885 8824 5190 1050 -13777 3404
812 3404 35479 15970 -20773 -6262 18310 9886 3399 2548 -6307 6233 23946 -4915 -32990
825 -32990 -354 30548 9233 -9802 -4204 -1229 7726 14324 -12834 -27146 11750 31321 -4869
838 -4869 -25382 -5274 7622 14382 15096 -10455 -19673 16899 27699 -14226 -24472 10488 23004
851 23004 9299 -2777 -15564 -7243 28951 27378 -16304 -16992 21855 22394 -5583 -12661 -8583 4644
865 4644 28273 14367 -26924 -16502 26962 19994 -13985 -12383 2845 7599 9995 -9579 -33498
878 -33498 -6759 32135 9452 -27827 -15119 7235 5174 -498 -13313 -26205 -885 24689
890 24689 -7584 -40443 -13641 15068 4432 -9111 -15081 -17370 4143 16964 -17491 -35707
902 -35707 1631 21203 -8283 -24410 -16137 -8505 7199 13961 -15951 -27311 8407 18196 -17572
915 -17572 -28282 -7619 1448 3685 171 -22528 -22155 13518 14796 -21604 -21525 5067 3439 -9005
929 -9005 -11560 -21138 -15148 13807 8409 -26728 -21532 7601 3740 -11549 -9653 -10830 -7438 9176
943 9176 -3229 -32227 -15800 15483 2597 -17042 -7953 -3199 -4144 6116 -2634 -22471 -5242
956 -5242 18008 -3051 -23993 -8958 2419 -197 5568 -937 -15536 1698 18603 -7132 -23000
969 -23000 1472 11034 -3961 -4345 -4512 -11820 3134 16031 -6169 -16156 8494 11300 -9818 -8931
983 -8931 -1302 -5739 2641 8392 -13055 -17025 10003 9924 -13293 -6874 7207 -2533 -5284 -60 -13610
998 -13610 -14425 7527 3101 -17723 -8441 6157 -6406 -10148 -310 -8494 -10872 4500 -4621 -26191
1012 -26191 -11326 6105 -9633 -16897 -3831 -6946 -12198 -1178 -7624 -21994 -6872 4689 -16279
1025 -16279 -22837 -6392 -7872 -15354 -5636 -8579 -19048 -3895 4838 -18777 -23833 -1203 -1816 -16468
1039 -16468 -11012 -10063 -17002 -4390 2542 -17093 -17012 5414 -658 -18470 -9875 -3816 -11966 -4469
1053 -4469 -490 -18697 -15625 8526 234 -20621 -9187 3634 -4838 -4783 -4631 -17312 -9843 10039
1067 10039 -4590 -24155 -5872 8788 -5816 -10728 -4003 -8095 -1520 10068 -9394 -25814 -699
1080 -699 15312 -7230 -16701 -3997 343 4043 7852 -10478 -18906 9678 18418 -10507 -16926 3646
1094 3646 6789 1931 3147 -7629 -9139 16560 18902 -12083 -14463 12403 14506 1342 -1927 -6997
1108 -6997 -3616 18533 14405 -16474 -10835 18928 14092 -5854 -4189 -487 668 11818 3387 -19782
1122 -19782 -7089 20638 6786 -17651 -7602 5287 3760 3817 -6583 -21595 -2898 19623 -3224
1135 -3224 -26801 -7664 8647 -521 -5471 -9183 -15074 1554 14876 -11443 -28408 -1232 14733
1148 14733 -3690 -14291 -12252 -9094 7873 13868 -15622 -27777 5287 19953 -6508 -18437
1160 -18437 -8261 -1653 7922 7694 -17327 -21684 11153 17737 -12246 -18647 50 4327 2768 -1593
1174 -1593 -18880 -15008 15539 13394 -20045 -19665 5322 5697 -3714 -5536 -13655 -9637 11288 4119
1188 4119 -22385 -13033 11257 3058 -11506 -5758 -4059 -1773 8512 -2687 -21701 -2119 21183
1201 21183 1699 -18142 -5692 5961 6608 9044 -2097 -13838 6887 23531 -1089 -16652
1213 -16652 5233 17927 8421 4045 -1629 -4865 15489 25064 -2785 -14189 13081 23551 5814
1226 5814 -154 523 411 17023 23164 -2427 -11898 12791 19118 2905 2953 6810 1010 8298 14516
1241 14516 -3357 -7217 14669 15488 -2802 1480 9267 1033 3361 11307 -642 -3929 13462 9340
1255 9340 -6766 2499 12643 567 972 13225 5339 -938 8679 3478 -6794 9597 19568 390
1269 390 -6008 8009 8081 4685 11586 3407 -7598 9107 19154 -1115 -8361 7076 8631 3659
1283 3659 9091 1253 -8971 6260 15647 -3183 -7808 9406 7350 -3875 145 -2280 -8981 5880
1297 5880 14063 -4985 -10079 5590 1637 -7054 3791 4521 -8702 -2809 6317 -4193 -3672 7401
1311 7401 -2457 -9778 9198 13392 -6570 -8287 4037 3083 6386 11401 -4316 -11058 11881 17728
1325 17728 -3828 -4286 12682 12903 7942 7078 -5186 -3774 22301 22975 -5628 -6139 15386 16441
1339 16441 8162 8113 1505 3889 23845 20295 -6141 -3674 16999 13425 5501 12043 9373 4013
1353 4013 14093 12630 -1680 8302 23580 8810 -3675 9377 12556 5118 10641 12159 1992
1366 1992 10101 19209 2886 -3728 15254 18566 4408 6119 9905 2948 9756 16016 -386 -2870
1380 -2870 21004 23557 2119 -2309 4179 5744 16233 20430 -2290 -10416 13217 20163 2187
1393 2187 -639 5395 5214 13649 16223 -6306 -13313 13005 19926 -1182 -5842 1775 2394 8372 9758
1408 9758 -9679 -10887 16450 18611 -8396 -14677 -1550 2373 7606 8260 -9372 -12526 9363 9298
1422 9298 -12024 -7303 10010 4162 -3303 -1207 -6382 -4671 8606 1700 -13874 1193 17439
1435 17439 -222 -13571 -2456 4383 4728 8691 -2550 -14167 3517 16486 -4328 -13886 6662
1448 6662 15001 4441 -2210 -8187 -7527 14559 21164 -7207 -18206 5192 14269 1998 -2016 -4559
1462 -4559 -3058 15308 20375 -7514 -18312 4614 13707 3774 2372 -242 -5613 6228 12801 -4930
1476 -4930 -8545 11968 13759 -659 -552 218 -5372 6455 16397 -20 -8481 6469 8506 -1300
1490 -1300 3996 6180 -2045 4692 13475 -112 -7148 5874 5231 -2642 8632 13519 -2587 -5644
1504 -5644 3845 1380 3462 15296 4509 -11836 793 13018 -333 -6940 2406 4249 7150
1517 7150 11496 -5084 -17092 4839 19975 -194 -12526 -899 4498 4046 3484 -8770 -14179
1530 -14179 9819 20707 -5287 -19547 -5126 3790 4596 5767 -5723 -15213 440 8662 -8755
1543 -8755 -11282 4325 2931 -6227 -442 -2698 -12177 -4438 2821 -5746 -3883 5175 -6668 -16239
1557 -16239 -1809 4245 -7250 -5391 1159 -4484 -3730 -422 -13596 -15295 8770 13278 -11084 -17335
1571 -17335 -4784 743 3406 3667 -11781 -15116 6810 8753 -13136 -14603 813 2026 2222 3696
1585 3696 -9611 -15516 2379 7553 -7718 -4865 5790 -1786 -7070 -561 -4949 -8537 5619 8527
1599 8527 -6127 -6310 545 -6571 -4513 9713 3005 -9890 -2074 4232 -4525 -2290 3750 -4799
1613 -4799 -4747 9864 4860 -9774 -5077 1480 -894 6384 10399 -6983 -13958 2592 7061 -1180
1627 -1180 2332 2781 -4968 1597 8517 -7558 -13987 6509 14665 1145 -5189 -6909 -7294 6936
1641 6936 12527 -8618 -16071 7564 14696 -4723 -13119 -8855 -2820 10612 12030 -13156 -22238 1370
1655 1370 10303 -5618 -9162 -2342 -3583 -1647 -2107 -14912 -12706 7777 4720 -15255 -11490 41
1669 41 -7342 -10829 -4122 -5686 -4920 2517 -6748 -20769 -8033 4652 -7472 -13432 -1517 139
1683 139 -6848 -8377 -14828 -14755 7071 13167 -13368 -23892 -4064 4412 -3002 -5916 -10262 -10935 4321
1698 4321 7447 -14683 -20151 326 6952 -1807 -4403 -9369 -13619 -210 6677 -9180 -12518 3762
1712 3762 3419 -8141 -7299 -7445 -9696 4107 12664 -5517 -16719 -5607 -770 -2643 2427 -1656
1726 -1656 -10553 -311 9165 -5746 -13612 -160 3382 -1696 3275 1353 -10029 -4810 6084 -1528
1740 -1528 -2757 7834 2505 -9598 -1749 4883 -1473 1382 6876 -1202 -2833 5421 -2727 -11353
1754 -11353 5475 17052 1998 -7840 -2740 -666 3667 8104 -4359 -12184 7013 16791 -3622
1767 -3622 -16276 -5508 3421 9259 10190 -7332 -18085 136 11115 -4870 -11305 1459 3358
1780 3358 -2035 -1828 -8094 -11090 3684 9093 -6399 -9836 127 -3956 -8095 1670 1515 -7024 -1686
1795 -1686 2201 -6840 -6313 1642 -4366 -6047 9167 7659 -11042 -13061 -2985 654 5598 7738
1809 7738 -6623 -10915 5450 7138 -8580 -6368 4536 2932 1553 2611 -7962 -10484 6160
1822 6160 8982 -4142 -3634 3615 -2305 -2739 3345 -2367 -5335 7255 7196 -7203 -6913 -305 -2954
1837 -2954 2423 12762 2283 -11232 -3314 4439 -239 1949 4693 -2873 -178 9290 660 -10225
1851 -10225 1079 10159 4622 4770 6176 -3726 -3856 8053 6005 -118 8114 9965 -1093 696
1865 696 8862 2372 441 11854 11295 2149 2864 667 -2250 11223 19917 1753 -9024 5824
1879 5824 13228 5205 1205 923 1981 15014 16422 -6919 -15743 5852 17598 6620 495 249
1893 249 443 7692 7467 -8401 -6381 15952 15378 -5307 -8321 1906 4009 6147 5387 -3598 -1441
1908 -1441 11575 4562 -10789 -1192 12732 5999 -1490 192 -1457 1263 7124 -1180 -7253 9684
1922 9684 18125 -2586 -14798 -2747 7425 8993 6656 -4758 -10020 6109 11907 -6771 -11546
1935 -11546 5718 11201 3781 -2086 -9356 -9540 6968 11638 -6123 -10368 4876 6315 -4170 -5421
1949 -5421 -5724 -3392 9169 10088 -9095 -14068 1261 5404 158 1569 -1416 -6542 1459 5597 -6035
1964 -6035 -5709 9150 8700 -2425 -2585 -1136 -3169 4033 8241 -1459 146 12195 5318 -8657 -1948
1979 -1948 7503 6334 7740 6151 -3474 99 11556 3853 -6307 6025 16703 5980 -3130 -2447
1993 -2447 265 10802 17171 669 -11000 5918 17270 2342 -7022 366 8244 13746 11441
2006 11441 -6595 -12801 8331 19043 2475 -5373 4501 7387 4093 1127 -5371 -1678 16392
2019 16392 16227 -5168 -9346 4715 6474 2215 4074 2425 1055 7939 5015 -7426 -2270 11205
2033 11205 5544 -2269 3987 4763 -1490 -370 1337 -1201 6336 11184 -3988 -12177 1320 8424
2047 8424 617 42 1680 -2443 -335 2085 -7627 -8194 7671 9734 -4279 -6650 -2432 -4130 -824
2062 -824 4016 -3885 -6554 4983 4031 -9003 -8045 -358 -1242 1865 6403 -4358 -11624 -1249 3524
2077 3524 -2358 -75 2561 -4438 -4281 2825 -3213 -7231 3580 6892 -2445 -2718 482 -4865 -2323
2092 -2323 6505 2225 -3644 3270 2368 -6967 -2839 4904 630 405 6606 1445 -6185 -1486 -59
2107 -59 -3097 5602 10714 -2255 -8287 617 3405 -429 2452 1306 -3067 4334 7971 -5855 -10087
2122 -10087 4612 8940 1134 -1225 -2927 -4518 3680 7608 -3404 -4815 9096 7265 -6552 -6832
2136 -6832 -436 2467 7442 6761 -6015 -7155 5359 3172 -6670 -516 7366 2171 -1172 -1290 -6180
2151 -6180 -2274 7232 1658 -7309 1640 6824 -4265 -8444 -1114 1181 2624 5340 -4306 -12677 -828
2166 -828 6107 -4054 -6095 2365 1041 -3473 -2846 -6966 -8022 4374 7192 -7406 -10757 -1238 -1746
2181 -1746 -5590 -1790 -2874 -5121 2239 1900 -12096 -12165 -326 1496 -3045 -906 -4398 -10168 -3927
2196 -3927 -694 -8884 -6683 3848 -382 -8940 -6594 -5440 -7098 -248 2074 -9260 -10170 63
2210 63 -2389 -9159 -4870 -1443 -3034 492 -2550 -13654 -10472 3438 1305 -7291 -3784 -708 -5171
2225 -5171 -4807 -4537 -8503 -1289 9228 -709 -13841 -7403 1512 -934 -2309 -2202 -4696 80 5258
2240 5258 -6303 -13777 466 9339 -35 -5259 -2544 -2799 -486 2564 -4544 -6728 6608 7955
2254 7955 -6923 -10068 547 4045 3220 2605 -5098 -6728 3992 4115 -8017 -4058 8898 5653
2268 5653 -3457 -3679 -4145 -2666 5887 4116 -5760 -1028 7731 -538 -8526 -2428 2210 2283 5378 1202
2284 1202 -8669 -3633 6197 199 -5196 2448 3556 -3148 -2356 -1715 -4833 740 6866 -1333 -7494
2299 -7494 -415 -205 -5362 -1443 1349 -3564 -1333 2514 -6370 -10608 -922 2693 -2874 -1785 -710
2314 -710 -7492 -6419 -791 -4978 -6703 2465 1697 -8116 -7185 -3122 -5796 -2988 2347 -4826 -8215 149
2330 149 -764 -10353 -6220 1799 -855 -2707 -1655 -6900 -6561 2591 1175 -7367 -2193 4559 -3407 -7671
2346 -7671 -2876 -1634 611 6168 255 -9803 -3056 5334 -1787 -5527 2299 4124 224 170 -3963
2361 -3963 -7324 2827 8815 -1495 -5414 4105 3769 -3674 -2002 735 294 6021 5443 -6614 -7066
2376 -7066 5792 6240 -1903 412 4159 1539 1256 700 -4864 854 12101 5586 -6459 -1753 5882
2391 5882 2414 1200 3305 849 3883 9655 204 -8610 1464 10627 5278 1556 2472 -606 1020
2406 1020 6145 337 -4027 6689 11078 -513 -4579 1100 1294 1949 5737 805 -4371 3178 5588
2421 5588 -3536 -3629 4225 3070 -384 1337 -3003 -6660 2229 5468 -3160 -2821 4861 -256 -6102 -2515
2437 -2515 -1069 -1337 4706 4285 -7602 -6773 2964 1363 -3723 -396 688 -985 2818 177 -9487
2452 -9487 -4252 8624 4749 -4977 -2948 -10 -1282 1675 682 -5620 -240 9073 1083 -9299 -3814
2467 -3814 3032 2474 3628 161 -7133 -2526 6778 117 -7661 888 6671 728 -2692 -2730 -4968 738
2483 738 7317 406 -6214 2127 4376 -3994 -4347 1069 1131 3981 6221 -3253 -7032 3628 7127 -2677
2499 -2677 -2127 5593 3552 796 1378 -2116 -121 10038 8651 -3775 -2742 6317 4592 1595 4065
2514 4065 2243 2474 9428 5813 -6431 -1365 10525 8243 2357 2911 1148 460 6740 5135 -2722
2529 -2722 2758 11603 4865 -2908 512 2047 2484 7852 5445 -3317 -4 8087 1277 -3940 3050
2544 3050 5955 3287 4097 1472 -4356 1375 8866 2059 -2216 4274 4342 -1646 668 2793 -86 4558
2560 4558 8646 -1258 -5971 3065 5552 -330 708 3817 808 2191 2618 -5164 -4812 7306 7663
2575 7663 -2550 -2678 1554 -778 88 1973 -3603 -2344 6984 3935 -8133 -5460 3497 2202 562
2590 562 115 -4785 -3687 3753 422 -7862 -1407 6533 74 -4737 -2159 -3039 -2238 4329 1961 -5363
2606 -5363 -589 4588 -2804 -5535 1619 2570 596 3311 276 -5244 1595 6287 -1456 -1950 6348
2621 6348 4251 -2321 362 1487 -292 4870 7372 -1233 -2158 5852 3893 -1912 1959 4465 1902
2636 1902 4363 4155 -3615 -1702 7981 6205 -1735 1422 4256 -64 1489 3711 -695 1393 8788
2651 8788 3845 -5095 -336 3841 1010 2876 5291 -436 -172 6211 1328 -5130 1946 7237 1059
2666 1059 -334 2419 -885 -845 5145 1831 -2949 3173 4850 -3287 -3565 2384 1032 180 3466 -989
2682 -989 -5232 1967 3566 -5117 -3979 4070 1771 -3902 -2832 -4017 -4432 2588 2501 -7099 -5834 2577
2698 2577 -1242 -7404 -3862 -1654 -1848 1840 -1042 -10764 -7187 3465 -304 -7306 -3293 -374 -2853
2713 -2853 -1646 -3372 -8496 -2500 6074 -1551 -9440 -3226 1171 -2475 -1232 -892 -4421 -933 3819
2728 3819 -3831 -9401 470 5173 -1380 -3279 -1432 -3813 -1155 2414 -3893 -5606 4339 4562 -5417
2743 -5417 -5928 -458 -558 -20 1977 -3964 -5730 3265 2778 -7026 -4797 3549 2074 -1375 -1381 -5254 -3722
2760 -3722 5216 3269 -6890 -3326 4869 1047 -4424 -1767 -1344 10 6014 1536 -8109 -3051 6046
2775 6046 1629 -3949 181 1362 614 3219 -898 -7175 850 8973 1157 -5945 -717 1636 -991
2790 -991 911 -688 -4363 2047 6838 -3585 -8374 326 3886 -952 -1421 -1714 -4467 592 3514
2805 3514 -5517 -7463 3102 3540 -5073 -5215 -2118 -2659 719 2258 -5546 -6414 3275 1260 -7719 -4909
2821 -4909 1432 -60 -218 -395 -6745 -5180 4015 1239 -7923 -3269 3687 -866 -3746 -2627 -4646
2836 -4646 -1642 5020 -395 -9135 -3313 3487 -2466 -5685 -1633 -1853 -1320 1396 -4277 -10141 -1488
2851 -1488 4812 -3835 -7299 -2140 -1921 -3807 -1702 -4236 -7501 458 3318 -6898 -9319 -1170 -239
2866 -239 -3418 -1511 -2904 -5652 -394 1276 -7508 -6585 3095 1845 -4400 -2707 -1580 -3407 687
2881 687 1986 -4861 -3560 5106 990 -5921 -1736 2361 10 1130 1364 -4391 -2231 5372 701
2896 701 -5741 783 4757 -345 -1844 -295 -3601 27 5994 -272 -6535 764 4790 -1896 -3310
2911 -3310 345 -589 710 3891 -3081 -7344 1528 5485 -2517 -3865 932 -97 -967 1648 -3162
2926 -3162 -4915 4097 5293 -4240 -4487 2131 981 -949 1280 -1173 -2655 3653 3162 -5886 -3807
2941 -3807 4825 2219 -2963 -390 -850 -2240 2345 1475 -5652 -1565 6010 81 -6693 -1875 248
2956 248 -1533 696 -823 -6366 -1995 4438 -3201 -8657 -1106 2290 -2074 -2459 -3481 -6245 -767
2971 -767 4280 -3818 -9052 -384 2739 -3728 -3915 -2240 -3347 860 3933 -4977 -7987 1440 4178
2986 4178 -3213 -3339 604 -931 1047 2468 -3790 -4570 4583 5101 -3345 -2723 2138 316 576 2498
3002 2498 -1485 -1965 5597 3731 -4711 -1688 5191 1615 -570 1770 -521 -622 4647 1879 -4943
3017 -4943 300 7196 1611 -3205 621 982 807 4758 999 -5413 958 8054 522 -4564 1859
3032 1859 4397 2579 3305 252 -4022 3199 8930 414 -3777 3723 5810 2272 2649 886 -1667
3047 -1667 5119 9235 -156 -4131 4454 6374 1063 1823 2589 64 3978 6211 -1343 -2732 5954
3062 5954 5418 -1140 473 2484 -80 1624 3562 -2121 -2046 5679 3208 -4337 -541 3964 672 -245
3078 -245 1490 -1982 -919 4701 968 -5682 362 5575 91 -2242 247 -1139 68 4795 293
3093 293 -5907 969 6879 -242 -3396 608 478 1122 4328 -824 -5159 2000 6609 -731 -3277 1872
3109 1872 1467 286 2707 -394 -4298 2728 6444 -1571 -3619 2376 1474 -910 1986 353 -2944
3124 -2944 2069 4309 -2600 -2260 3994 1899 -2422 1418 1978 -1383 1581 2995 -2245 -674 6157
3139 6157 2102 -3216 1390 3956 643 2067 2749 -1297 1532 7337 1731 -3934 2999 7070 2023
3154 2023 1057 2644 394 3208 7728 1726 -3874 3866 7698 1496 242 2379 1346 3466 7052
3169 7052 475 -3483 4240 7324 -235 -757 3438 1650 1740 4017 178 -2580 4082 5268 -2037 -1038
3185 -1038 4315 1582 -773 2689 597 -1452 3658 2889 -3527 -151 5770 891 -3259 1323 2469
3200 2469 -292 1522 409 -3805 978 5970 -1013 -5271 1217 3122 -347 466 -789 -3996 1331
3215 1331 5238 -2484 -6705 1237 3445 -1826 -1860 -1098 -3405 264 3430 -3266 -6285 922 2444 -3057
3231 -3057 -2303 -1148 -3509 -677 2581 -3658 -6001 1290 1777 -3943 -2571 343 -2728 -1451 1734
3246 1734 -2255 -3819 2118 1051 -4346 -982 2500 -1506 -1893 1218 -851 -2039 3100 1009 -4722
3261 -4722 -42 4916 -300 -3046 747 490 509 3380 -338 -4875 1805 6595 -624 -4382 942 2233
3277 2233 1470 2875 -1176 -5081 2274 7270 -620 -4941 1361 3506 1333 1262 -949 -3370 3479 6693
3293 6693 -1853 -4334 3297 3589 -328 1361 888 -1208 2907 5036 -1874 -2860 4348 3438 -2019 578
3309 578 2557 -144 1181 2528 -1781 -433 5110 937 -4805 416 4056 -605 -1467 1034 -1471
3324 -1471 -70 3736 -1171 -6426 106 4535 -1486 -3954 -1567 -2209 -725 2558 -2898 -7206 131
3339 131 4217 -3345 -5305 -1350 -1265 -945 1541 -3029 -7224 -168 3246 -3008 -4979 -565 -980 -1150
3355 -1150 1179 -2548 -5664 833 3453 -3252 -4088 760 -438 -2344 931 -572 -3265 1104 2517
3370 2517 -3731 -3144 2274 319 -2950 573 -155 -2609 354 908 -4406 -1929 3953 -224 -4981 -827
3386 -827 1209 -1150 -504 -105 -3735 -530 4627 -1235 -5918 20 3497 264 -477 -717 -3232 989
3402 989 5320 -798 -5201 1742 5429 -538 -1327 354 -185 2281 5118 -782 -4017 3004 4884 -1107
3418 -1107 -931 2804 1347 1722 3558 -756 -3017 3721 4415 -2176 -974 3579 827 -1423 1381 468
3434 468 -941 3116 1446 -3892 -869 3672 -683 -3105 875 1017 -1263 712 -339 -4333 -5
3449 -5 4392 -1416 -4458 790 1239 -1157 141 -133 -3079 922 3445 -2484 -4455 1369 1960 -822
3465 -822 959 407 -3367 -31 3713 -1715 -3742 2210 2465 -1097 73 69 -2706 -156 3480 -1279
3481 -1279 -4294 904 697 -3156 -630 249 -2845 -930 1750 -3003 -4832 558 422 -3531 -1659 157
3497 157 -3360 -2646 -60 -3125 -2905 1868 188 -5220 -2124 1721 -1636 -3030 59 -1545 -1045 2527
3513 2527 -691 -5785 -344 4733 255 -2860 188 163 674 3041 -883 -4166 2542 6341 -681 -3760
3529 -3760 1412 2478 1928 3341 -54 -2538 2891 5298 -1292 -2746 3612 3723 571 1346 174 -1907
3545 -1907 2578 4422 -1440 -1312 4257 2100 -2422 424 2293 390 1938 2505 -1367 -547 4066 993
3561 993 -2920 1371 4262 58 209 1421 -914 1240 5323 1204 -3058 2034 4688 74 248 2372
3577 2372 457 1509 4443 283 -3434 1563 4777 821 470 2069 -860 -227 3537 202 -3909
3592 -3909 1466 4416 -599 -1628 172 -1559 -632 3475 -136 -4544 356 2633 -2256 -3245 264
3607 264 -856 -863 1032 -2286 -4834 622 2574 -3326 -3165 1580 -229 -2496 -952 -1338 -1969 2464 1600
3624 1600 -4477 -2785 3115 881 -3084 -19 1136 111 1726 -105 -4585 -531 5511 1389 -3747
3639 -3747 76 2659 496 228 -498 -2588 1914 5366 -815 -4870 1363 3895 -257 -609 726 -1070
3655 -1070 1087 3065 -1918 -3149 3468 4328 -1792 -1372 1602 -8 312 2273 -274 -975 3856 2229
3671 2229 -3309 -328 3887 1690 352 2766 962 -550 2841 2096 -1507 2016 5303 911 -583
3686 -583 2649 1866 136 3463 3146 -633 2007 4553 233 -713 3822 2527 69 2415 2406 -1661 647
3703 647 4436 908 -395 2607 1089 -1330 1376 1484 -1757 720 4215 -310 -2816 694 741 -1110
3719 -1110 1429 935 -2285 292 2414 -2301 -3860 1327 2057 -1402 -234 -467 -2756 -180 1848 -2611
3735 -2611 -3240 2373 1574 -3677 -2462 563 -704 190 609 -3325 -2986 2399 -67 -5334 -1333 2678
3751 2678 -395 -2303 -1317 -3205 -1417 2627 -419 -4545 -128 3139 -1803 -3993 -799 -88 217 1763
3767 1763 -2163 -4690 1153 3811 -2346 -3016 2217 1894 -807 -631 -1595 -1617 2961 3832 -2510 -2047 3308
3784 3308 1762 -1607 630 1587 261 2428 2001 -2779 -1162 4821 2246 -1458 1521 2673 -403
3799 -403 1037 1596 -1219 800 4747 1307 -2581 684 2321 -637 964 2614 -61 274 3141 88
3815 88 -2836 1719 3203 -417 464 1870 -1085 -648 3215 922 -1805 1864 2268 -1674 -662 1628
3831 1628 -921 -30 3375 402 -3484 307 2352 -1480 -1019 1442 189 -606 1405 -2124 -4174 1386
3847 1386 3128 -2077 -2917 462 -952 -1736 -285 -2533 -3168 2368 1888 -4839 -4142 704 258 -2199
3863 -2199 -1177 -2220 -2451 1311 -181 -5369 -2350 3308 129 -4119 -2116 -1052 -1448 607 -294 -3723
3879 -3723 -758 2688 -1846 -4844 -236 1900 -795 -562 -381 -2935 -269 2084 -2598 -3487 2658 2584
3895 2584 -2826 -2367 -576 -1238 335 1533 -2542 -3006 1974 1169 -4057 -2214 1517 -146 -282 -58
3911 -58 -3098 -3189 2408 1452 -3780 -1172 1650 -750 -2143 -26 -1098 -1177 2647 1415 -3388 -1576 1551
3928 1551 -940 -186 2541 -232 -1687 1957 1406 -2570 -165 2919 545 -86 2330 -315 -1785 2028
3944 2028 2196 -1573 383 3205 -303 -1366 1752 392 -704 2093 1027 -3154 -210 2210 -1533
3959 -1533 -2690 1587 1612 -1896 -908 -1596 -3172 465 2453 -2714 -3840 885 424 -3378 -2450 -1337
3975 -1337 -1869 1296 1222 -4867 -5034 1423 1193 -3766 -2505 166 -866 -629 -698 -4565 -2562 3165 833
3992 833 -4742 -2609 743 -1217 -1364 -805 -2453 -1497 2189 -1437 -5603 -725 2365 -1215 -2806 -914
4008 -914 -2134 -2400 -452 -2622 -3769 1048 1606 -4180 -4657 -348 -1171 -2834 -920 -1800 -3112 -159
4024 -159 -97 -5500 -3863 1415 -78 -3207 -1568 -1848 -2941 -125 152 -3983 -1977 2064 -918 -3919
4040 -3919 -692 -42 -1376 1024 1250 -2561 -1961 1781 55 -1814 1056 1180 -853 662 1126 -2442
4056 -2442 -943 3299 1321 -1734 624 700 -1903 109 1714 -1484 -377 3007 -233 -3581 -306
4071 -306 1085 -1224 -70 948 -1764 -1257 1660 -1799 -3837 1353 3036 -2131 -2514 -127 -1291 -593
4087 -593 1391 -1711 -3120 1717 2025 -4169 -2925 1935 1380 290 426 -2557 -2610 2531 1804 -3726 -1514
4104 -1514 3966 1294 -2039 -1275 -1127 -1121 2342 1053 -3715 -1329 2764 -586 -3418 -199 759 -715
4120 -715 367 -1394 -4285 -585 2625 -2124 -3856 578 66 -3416 -2744 -1529 -2108 246 1117 -3955
4136 -3955 -4511 454 -315 -4101 -2170 119 -1575 -1136 -663 -4474 -3373 2616 1079 -3615 -1830 514
4152 514 -1656 -1952 -287 -1982 -1288 2984 498 -3925 -1130 1672 -620 -196 1507 -871 -1913 1861
4168 1861 1171 -2629 486 2950 -263 -797 748 -930 -902 2681 1900 -1416 563 1854 -1295 -1254 1969
4185 1969 593 -556 2529 1237 -2280 403 3014 -776 -621 2883 1503 -1010 848 438 -1013
4200 -1013 2765 3696 -914 -1337 3084 2043 -1062 861 1537 125 2721 2508 -2307 -1246 4347 3185
4216 3185 -776 221 1718 637 1801 1788 -1999 406 5033 1830 -2991 -290 2274 638 1011 1635
4232 1635 -1088 -424 2870 52 -3346 991 3098 -628 -773 828 -1134 -947 1255 -1087 -2413 1737
4248 1737 2194 -3437 -2445 1825 353 -1448 30 -1058 -2100 1207 785 -3447 -1220 3122 799 -2401
4264 -2401 -1443 -1022 -1176 2132 1337 -2967 -678 3234 -22 -3144 -285 707 -329 1476 1144 -3056
4280 -3056 -936 2845 96 -1251 1524 1261 -1284 585 1032 -1653 -155 3330 601 -1536 1572
4295 1572 1260 -1091 1389 3031 -365 -4 2881 391 -1174 2212 2427 -221 1466 2664 -698 -54
4311 -54 3117 1053 -85 3734 3268 -1340 147 2555 390 1315 3525 1201 -163 3288 2541 -1280
4327 -1280 380 3531 1717 1128 2254 -141 -679 3861 3566 -827 800 3784 1471 121 1872 554
4343 554 633 4394 2636 -2164 -265 3673 1007 317 2583 1284 87 2378 1230 -1974 814 3807
4359 3807 797 -923 1598 595 -1118 1284 1692 -690 783 2224 -1333 -2315 1548 609 -1704 556
4375 556 1019 -1768 -811 1020 -1869 -1912 1755 499 -2791 -1066 -10 -2098 -612 1310 -1703 -1919
4391 -1919 1153 -106 -3272 -667 976 -699 153 1285 -2137 -2701 1347 991 -2047 152 1435 -1019
4407 -1019 -419 1359 -1529 -1690 2715 1886 -2295 -460 1679 -279 663 2106 -430 -1090 2778 1585
4423 1585 -2149 -278 2582 592 205 1343 -793 -904 2580 1375 -1495 942 3048 -306 -1385
4438 -1385 1131 440 -147 2403 1041 -1556 1160 2599 -1212 -1286 2694 1964 321 1125 266 -1023 2272
4455 2272 3359 -991 -378 3725 1971 -1275 1008 1353 618 2571 2569 -1743 -979 3482 1729 -1274 1319
4472 1319 1811 -53 1422 949 -1744 -251 3541 1072 -2097 269 1392 -1370 -641 934 -1113 -431
4488 -431 2050 -933 -3500 -236 1012 -1972 -1306 348 -1399 -1541 669 -1521 -3261 850 1433 -2619
4504 -2619 -2238 235 -1296 -1264 887 -897 -2527 602 1026 -3055 -1872 1512 102 -1291 478 -1311
4520 -1311 -2225 972 1580 -2408 -795 2195 65 -1767 171 -582 -1224 1876 1570 -2826 -1417 1926
4536 1926 -162 -1958 243 349 -1211 926 155 -3184 -756 2224 -354 -2446 456 511 -1886 -465
4552 -465 56 -1960 -111 2205 -1801 -3651 435 1443 -1290 -339 800 -889 367 1174 -1616 -2142
4568 -2142 2748 2530 -1350 -347 1230 -196 448 1820 -578 -610 3112 1993 -2055 -746 2580 837
4584 837 358 1573 -627 -562 2767 1292 -2319 317 2999 284 -1086 448 -526 -478 1953 726 -2689
4601 -2689 -372 2025 -1189 -2135 937 372 -798 560 -596 -3177 -497 1686 -1595 -1882 1272 329
4617 329 -2145 -579 -521 -2198 388 1740 -1637 -2450 968 32 -2037 84 437 -1445 282 1197 -2510
4634 -2510 -2421 1774 1139 -1880 -731 200 -1874 -390 579 -2207 -1829 1915 319 -3201 -1191 163
4650 163 -1498 -636 598 -2780 -2493 901 -537 -3752 -939 775 -1353 -1508 -446 -2689 -2152 992
4666 992 -543 -3127 -497 813 -2243 -2190 -371 -946 -1180 1114 -852 -3455 31 1870 -1452 -1737
4682 -1737 762 242 -853 450 -567 -2090 1278 2640 -1451 -1582 1352 107 -1073 781 332 -350
4698 -350 1879 1804 -1910 -1571 2252 868 -1204 693 631 -568 849 969 -1988 -674 2759 731 -2040
4715 -2040 -219 572 -605 578 1015 -1725 -643 2556 -303 -2581 801 1652 -429 191 541 -1418
4731 -1418 -521 2236 -22 -2028 1042 1914 -905 -538 660 -613 62 2585 -58 -2421 767 1655
4747 1655 -1199 -671 1179 -549 -160 1373 -841 -2125 1449 1801 -1282 -1201 1077 -366 -957 772
4763 772 -939 -1853 1309 1261 -2783 -1453 901 -386 -1194 -67 -1092 -1803 427 69 -3277 -1029 2185
4780 2185 -13 -2280 -169 -713 -1632 643 -7 -2825 -597 2291 -894 -2905 -401 336 -597 623
4796 623 -429 -2491 37 2409 -987 -2666 1066 1649 -702 -230 144 -1128 906 2697 -763 -2085
4812 -2085 1725 1898 -1222 -399 942 -145 1077 1868 -1489 -1380 2852 2272 -1431 -220 2403 306
4828 306 334 1150 -720 -248 2901 1419 -1738 281 2800 694 98 1110 83 544 2990 806 -2594
4845 -2594 864 3665 902 -980 1022 857 627 2028 571 -1340 1519 3541 -320 -1360 1136
4860 1136 1457 741 1580 492 -1504 1543 3025 -1029 -1741 1797 1991 104 458 -154 -803 1516 2420
4877 2420 -1247 -1569 1709 1210 -1531 -455 146 -568 1120 1455 -2297 -1858 2133 1048 -2209 -850
4893 -850 671 -269 -51 -229 -2483 -977 2543 116 -3281 -987 1114 -558 -573 -271 -1681 -222 2022
4910 2022 -1003 -3636 -225 2526 -321 -1353 -361 -421 596 1461 -1390 -2879 1321 2704 -1347 -1758
4926 -1758 344 398 461 1324 -726 -1532 1704 2102 -1443 -1644 1721 1370 -179 498 -265 -785 2195 1922
4944 1922 -1407 -320 2573 1110 -1118 36 622 9 1799 1617 -1494 -154 3262 755 -1286 775
4960 775 1942 311 1171 852 -1300 1020 3194 509 -1201 1402 1965 -163 324 1087 -720 1197
4976 1197 2844 169 -1769 1417 1995 146 682 1028 -486 914 2308 -304 -1295 1881 2572 -367
4992 -367 -116 1334 -102 749 2313 -68 -1392 1541 1997 -1149 -876 759 -148 157 1165 -696 -1530
5009 -1530 1561 1173 -2291 -916 1250 9 -1105 -149 -1104 -952 1341 327 -2902 -1108 1383 -648
5025 -648 -2093 -405 -69 -330 856 -482 -2990 -615 2131 -764 -2453 -229 646 -192 -23 -642 -1830
5042 -1830 525 2211 -1185 -2507 323 1137 -401 54 225 -1059 979 1777 -1778 -1962 1474 1546 -980
5059 -980 -550 674 -299 684 904 -1382 -927 1509 939 -1863 -251 1424 -16 -61 738 -743 -839 1839
5077 1839 485 -1644 550 2275 -25 -604 707 -388 -56 1771 605 -1373 785 2325 -10
5092 -10 -560 1218 299 57 1813 476 -1457 720 2356 226 -366 1586 920 255 1523 414 -1278
5109 -1278 1312 2437 -301 -956 964 279 4 1188 -71 -1320 1109 1812 -1075 -1830 1118 810
5125 810 -808 -161 -841 -1359 910 789 -2077 -1939 1412 175 -1906 -1209 -505 -893 201 -98 -2381
5142 -2381 -1614 1723 87 -2945 -1301 261 -501 -617 -778 -2123 -460 1409 -782 -3602 -440 1227
5158 1227 -772 -1662 -1214 -1161 146 1154 -1397 -2808 228 1189 -1823 -1927 -169 -221 -766 220 -1642
5175 -1642 -2424 833 886 -2190 -2098 310 -272 -1198 -28 -1158 -1589 910 406 -2309 -1371 936 -376
5192 -376 -1506 -449 -453 -1168 394 355 -2362 -704 1574 -170 -1727 114 -72 -788 804 420 -1791
5209 -1791 -352 2056 243 -1386 470 841 -112 720 625 -1826 -173 2429 -233 -1580 584 1020
5225 1020 10 272 -110 -1095 290 2207 -528 -2102 509 1604 -567 -429 -417 -993 454 1859 -1469
5242 -1469 -2274 1148 1963 -1310 -1577 95 -27 411 260 -1981 -1508 2020 1523 -2384 -1506 1009 244
5259 244 -120 -351 -1559 -511 1711 -155 -2919 -966 2121 30 -1425 -1100 -614 -11 1356 -638
5275 -638 -2767 151 2081 -615 -2564 -414 117 28 79 -1301 -2122 602 1478 -1796 -2936 414 1003
5292 1003 -922 -848 -924 -1181 627 748 -2062 -2285 985 737 -1479 -687 -169 -856 -88 437 -1868 -1246
5310 -1246 1165 254 -1593 -581 617 -487 124 566 -1056 -589 1690 555 -1415 373 1463 -276
5326 -276 -34 683 -649 -172 2031 475 -1269 281 1707 109 205 468 -405 343 2027 703 -1698
5343 -1698 727 2441 203 -565 39 124 614 1624 -176 -1489 1037 2515 -389 -979 797 1048 635
5360 635 1047 -464 -773 1436 2363 -945 -1254 1381 1630 103 -52 104 -56 1999 1472 -1522 -597 2488
5378 2488 1681 -984 -4 781 688 1793 541 -1531 382 2810 493 -1743 109 1436 520 125 -122
5395 -122 -1047 515 2151 -520 -2223 927 1685 -499 -935 9 280 856 1033 -1339 -1465 1447 1390 -1165
5413 -1165 -1180 816 227 134 345 -876 -1195 1282 973 -1645 -740 1082 -31 -361 -11 -563 -816 998
5431 998 924 -1217 -754 1135 92 -792 683 -602 -849 1181 1126 -1364 -317 1167 239 -116 536 -50
5449 -50 -890 1317 1274 -1043 -655 1660 83 -548 643 177 24 1809 987 -1308 -188 2428 865
5466 865 -725 490 940 759 878 337 -1040 842 2748 196 -1483 1036 2015 142 -18 133 148
5483 148 1830 2301 -1045 -1114 1983 2439 -171 -830 481 631 1361 1373 -1085 -465 3037 1911 -1238 -631
5501 -631 1461 1101 431 698 -813 316 2481 634 -1533 -203 2098 471 40 500 86 -100 1479
5518 1479 88 -1297 870 1996 -215 -1094 780 391 -220 712 163 -1068 535 1089 -1179 -1196 1057
5535 1057 363 -1035 361 132 -1254 373 893 -1038 -1131 806 -80 -955 299 389 -706 444 868
5552 868 -1194 -1164 668 386 -512 106 -435 -1052 820 1440 -1094 -1376 1031 898 -347 -356 -50 -569 741
5571 741 808 -1335 -1164 1669 1180 -1225 -234 920 173 530 318 -1212 -177 1993 549 -1763 -96
5588 -96 1671 441 -129 133 -179 876 1694 -311 -1595 1180 2203 -184 -999 399 754 855 942 -718
5606 -718 -998 1999 2263 -1220 -1114 1359 1736 79 72 -513 130 2251 1145 -1574 -526 2077 1121 -222
5624 -222 -42 572 393 1445 376 -1370 -12 2532 606 -1259 422 759 84 406 517 -727 330
5641 330 1418 -275 -1795 512 906 -556 -525 27 -875 18 1203 -823 -1641 811 731 -999 -732 339
5659 339 -713 -293 534 -1087 -1460 710 363 -1530 -903 359 -182 -241 463 -1499 -1815 716 951 -1378
5677 -1378 -1007 325 -181 59 379 -1479 -1319 1270 912 -1866 -1416 602 367 -382 -97 -1274 -886 1604
5695 1604 402 -2480 -1059 1587 349 -1011 -503 -505 -560 1139 -228 -1983 191 2000 -571 -1829
5711 -1829 102 730 180 332 -576 -1249 732 1868 -1147 -1966 1056 1873 -436 -490 -244 -325 1397 1474
5729 1474 -1555 -1128 2029 1678 -1044 -697 793 454 1121 665 -1524 -569 2302 1382 -1219 -476 1241
5746 1241 632 735 299 -1159 -170 1848 519 -1464 134 1246 -151 -451 730 12 -28 1076 134
5763 134 -1427 214 738 -900 -755 889 -89 -786 287 -106 -1229 473 959 -724 -924 697 -188
5780 -188 -986 344 -281 -1104 74 886 -1351 -1240 505 344 -656 457 -736 -1676 375 1007 -1287
5797 -1287 -1439 527 157 -834 -215 -686 -1303 484 823 -1619 -1711 679 35 -1022 -682 -339 -620 469
5815 469 100 -2103 -1684 1068 564 -1621 -698 41 -495 70 -150 -1589 -355 1260 -386 -1866 53
5832 53 1050 -468 -250 41 -745 67 906 -814 -1757 1112 1929 -701 -875 556 269 406 762 -578
5850 -578 -651 1784 1265 -1290 -789 1429 791 168 565 -348 -408 1383 1030 -1383 -258 1555 772 -423
5868 -423 178 223 -90 1274 1034 -931 -238 1316 212 -791 798 683 -560 621 417 -1003 -397
5885 -397 1321 151 -371 1055 826 -487 427 384 -591 258 1271 -323 -716 745 633 -389 278 482
5903 482 -829 -165 1497 -607 -1110 466 1008 -578 -536 -294 -629 603 861 -1001 -1538 1059 865 -1447
5921 -1447 -1385 32 -141 314 602 -1605 -1552 1178 729 -2071 -1562 491 413 -331 -379 -1680 -1183 1286 227
5940 227 -2157 -1044 1015 -121 -1013 -535 -713 -246 1011 -278 -1626 -113 1562 -433 -1248 440
5956 440 540 70 550 -807 -1131 928 1618 -1302 -1828 903 960 -491 -498 -356 19 989 734 -1064 -1095
5975 -1095 1598 1390 -588 -131 449 85 1091 645 -1307 -652 1867 1065 -964 -173 758 258 856 724
5993 724 -671 -222 1873 839 -1244 328 934 439 527 406 -727 -329 1570 436 -774 841 1564
6010 1564 -83 -236 285 312 39 1436 260 -1119 662 1146 -396 -474 734 141 -28 896 -642 -1451
6028 -1451 614 1478 -556 -1003 76 431 -204 236 -529 -1077 1108 1217 -1573 -1415 471 841 -401
6045 -401 -211 -516 -656 941 478 -1806 -1158 1469 1212 -934 -870 -599 -551 626 223 -1597 -557 1644
6063 1644 80 -1816 -697 562 30 249 9 -1153 -176 1189 -584 -1477 610 1027 -506 -571 58
6080 58 -587 167 953 -719 -1216 961 1161 -1061 -491 980 291 370 599 -718 -1132 1372 927 -1429
6098 -1429 -113 1391 420 119 443 -84 -243 1640 690 -712 83 1455 481 -188 528 170 -90 1237
6116 1237 690 -745 246 1754 673 0 971 622 -135 1174 1028 -433 480 1752 0 -434 938
6133 938 627 -142 916 529 -237 360 1227 -130 -502 977 930 48 202 318 -550 417 1375 -315 -783
6152 -783 882 830 -832 -490 362 -190 390 791 -807 -953 1138 501 -693 76 540 17 24 119 -841 -486
6172 -486 1453 377 -1594 -240 653 -316 -233 79 -723 -190 836 -460 -1617 -375 1047 -33 -591
6189 -591 201 -448 -495 371 -372 -1367 191 934 -911 -1025 734 177 -541 -11 -299 -797 663 775 -1462
6208 -1462 -994 789 352 -391 60 -515 -737 438 658 -1042 -311 902 349 -962 71 271 -75 712
6226 712 902 -545 -293 962 342 -671 547 795 51 661 839 -502 -266 1147 362 -467 506 571
6244 571 1 368 732 -189 213 1590 92 -397 380 720 -72 510 661 -336 -118 919 214 -732 708
6263 708 1069 -379 131 471 43 20 933 -101 -649 700 611 -574 -704 489 130 52 785 -595 -864
6282 -864 1302 1201 -1069 -582 799 298 -437 86 -467 -578 1096 873 -1405 -1136 725 347 -601 -125
6300 -125 -382 -703 506 231 -1472 -489 849 53 -1052 -28 -309 -700 -86 -385 -1585 -401 692
6317 692 -530 -1375 -338 -142 -980 -161 -524 -1140 -280 698 -1051 -1560 378 125 -1150 -567 -113 -782
6335 -782 -470 601 -718 -1252 374 225 -801 -796 306 -290 6 903 -761 -1014 903 307 -782 -133
6353 -133 747 -182 -105 268 -547 -995 1053 946 -738 -268 936 107 -202 624 -60 -32 1139 708 -843
6372 -843 -11 862 98 -552 424 231 -153 841 486 -1177 457 1483 244 -472 364 597 -22 523 18
6391 18 -540 502 1072 -710 -825 496 461 -189 155 -62 -387 487 1110 -806 -946 1225 628 -722 -442
6410 -442 138 -210 442 474 -693 -836 1125 307 -1123 -499 430 -47 -198 205 -839 -390 786 -69 -1454
6429 -1454 -148 502 -447 -683 -156 -747 -278 464 -522 -1649 -175 465 -937 -1037 130 -590 -411 161
6447 161 -812 -1419 -92 671 -848 -667 134 -395 -916 -134 -523 -829 511 563 -607 -1001 401 -15 -564
6466 -564 158 -392 -851 96 230 -1155 -611 1158 269 -713 55 256 -151 137 391 -813 -359 871 -11
6485 -11 -605 -19 525 -88 368 293 -823 124 1123 138 -642 373 1075 -40 51 364 -47 491 1148 -231
6505 -231 -758 713 1251 -150 -49 622 265 314 849 -312 -1010 1209 1118 -797 -532 517 127 248 518
6524 518 -290 -63 1138 599 -727 -619 465 141 -141 394 -136 -273 780 344 -657 29 952 326
6542 326 -598 55 108 -245 598 200 -893 239 1075 -118 -890 207 -73 -225 320 98 -973 -180 674
6561 674 -690 -1187 126 358 -219 90 -375 -935 32 664 -556 -875 212 19 -743 -405 -253 -635 -117
6580 -117 362 -540 -995 367 491 -483 -186 -62 -593 137 830 -620 -775 440 671 -529 -75 124 -415
6599 -415 72 738 -399 -860 856 573 -470 -84 671 -122 60 414 -115 -361 1161 457 -761 -49
6617 -49 1105 219 -113 311 177 -87 1025 272 -501 542 1024 441 -323 219 427 434 916 487 -655 552
6637 552 1389 52 -149 814 665 166 690 380 -379 825 1141 -135 -536 850 341 -139 367 417 61
6656 61 589 906 -405 -359 837 449 -357 272 356 -272 258 593 -450 -321 1116 453 -581 251 604
6675 604 -382 -86 376 -333 -426 875 -56 -867 318 373 -373 -268 -37 -559 -114 523 -444 -937 24 404
6695 404 -436 -520 193 -216 51 508 -430 -1091 193 731 -710 -611 295 -97 -264 207 -338 -778 582 958
6715 958 -719 -549 430 180 -302 195 -380 -486 628 477 -1209 -599 1020 257 -584 -70 107 -88 704
6734 704 242 -807 -160 1198 -113 -852 -111 184 91 221 -189 -401 357 1040 -406 -935 496 1058 -218
6753 -218 134 646 -31 526 754 -413 -547 843 1115 -436 -560 438 247 736 525 -352 -465 1109 965
6772 965 -914 62 1195 458 225 131 -192 56 1174 600 -850 119 1057 146 -195 17 36 -174 768
6791 768 1 -1120 -107 959 -190 -496 -27 78 -438 255 -61 -849 322 862 -267 -755 51 47 -366
6810 -366 -178 -215 -792 -32 728 -540 -999 285 269 -627 -256 -125 -567 276 425 -879 -705 655 181
6829 181 -796 -126 -87 -724 443 419 -741 -988 643 416 -896 -446 29 -248 -42 293 -823 -692 511
6848 511 326 -1042 -504 591 -424 -346 -368 -583 -120 581 -93 -1232 141 640 -151 -503 -166 -272 49
6867 49 705 -302 -903 600 895 -602 -566 635 310 179 684 53 -246 715 841 -693 -440 855 498
6886 498 41 133 120 -71 733 617 -400 -162 1150 424 -362 475 181 -182 305 517 -650 -54 940 189
6906 189 -416 23 392 -187 129 426 -549 74 688 99 -632 370 413 -200 118 286 -351 -297 533 -238
6926 -238 -740 103 373 -456 51 283 -463 -188 500 -152 -988 -26 502 -545 -236 384 -384 -258 183 -142
6946 -142 -688 409 323 -877 -532 231 -396 -359 56 -554 -713 215 198 -905 -672 354 -128 -395 -221 -534
6966 -534 -729 150 -90 -1059 -275 402 -398 -992 -42 -10 -123 -26 -338 -927 -73 493 -623 -642 175 14 -13
6987 -13 -194 -170 -431 333 612 -576 -507 687 614 -664 -17 327 52 445 464 -282 -354 1044 505 -740
7007 -740 -106 301 233 558 381 -88 -2 921 577 -540 -15 713 -104 91 672 -254 24 573 296 -786
7027 -786 102 1069 -353 125 472 -59 -388 313 260 -395 182 758 110 -555 460 -82 -218 548 255 -685
7047 -685 -246 725 -107 -594 358 174 -201 494 -43 -766 -32 452 -478 -769 311 427 -581 -20 -63 -521
7067 -521 88 517 -914 -924 -73 414 -744 -222 -251 -444 453 -302 -1122 -565 553 235 -1018 -468 -38
7086 -38 -399 -10 4 -1188 -713 674 -253 -1327 -334 582 -21 -239 -263 -609 -60 671 -387 -610 16 621
7106 621 -321 -552 84 -336 -143 691 -329 -509 397 359 -573 -441 280 110 -293 490 -359 -648 377 831
7126 831 -493 -284 658 215 -120 408 -31 -290 564 367 -602 -348 831 474 -187 212 326 -485 430
7145 430 599 -597 75 716 106 -97 549 77 -373 682 904 -502 -100 614 485 -350 448 468 -32
7164 -32 447 303 -281 -348 722 100 -400 454 262 -364 374 430 -84 -60 741 259 -671 403 528 -269 56
7185 56 118 -274 264 503 -589 -753 655 655 -712 -481 375 -17 -150 344 -527 -649 403 194 -1145 -530
7205 -530 609 31 -116 -163 -464 -455 634 141 -1103 -205 301 -188 -377 274 -278 -576 307 47 -617 -286
7225 -286 607 -634 -599 235 48 -623 -131 111 -783 -12 260 -644 -895 499 272 -527 -37 199 -258 139
7245 139 407 -361 -307 655 233 -1015 -8 610 -104 124 641 -358 -251 731 204 -401 168 506 -135 2
7265 2 601 -242 -111 607 122 -392 251 778 -315 -125 323 -308 -266 662 368 -264 287 767 -122 -8 597
7286 597 -110 -261 611 343 -651 699 782 -316 -149 684 303 -58 342 97 -203 679 848 -505 -449 561
7306 561 397 -67 119 -1 -125 514 604 -525 -396 536 123 -428 -15 -53 -160 297 347 -709 -392 748
7326 748 96 -955 -99 177 -271 125 -112 -662 -366 457 -16 -1070 -147 145 -791 -161 0 -428 -347 492
7346 492 -235 -722 219 644 -467 -924 75 -102 -114 406 -349 -434 508 752 -623 -430 196 68 -256 175
7366 175 68 -133 521 266 -723 -355 626 28 -171 273 42 -77 348 429 -582 -321 379 -301 -428 273
7386 273 73 -586 600 586 -323 -303 624 -232 -216 392 40 -368 691 679 -376 139 401 96 -386 226
7406 226 212 258 864 895 -372 165 1127 336 -380 913 580 78 312 399 25 414 898 -65 -413 375 872
7427 872 64 -226 8 90 283 674 -156 -474 910 496 -667 -159 356 -115 -79 254 -452 -230 846 -14
7447 -14 -1144 -227 732 -335 46 25 -262 -452 101 165 -726 -389 464 -450 -470 123 -176 -386 290 -46 -499
7468 -499 97 453 -398 -457 218 -188 -393 15 -139 -551 103 163 -391 -390 677 183 -567 47 312 -187 -87
7489 -87 487 -481 -627 503 274 -710 -101 111 -375 65 437 -786 -550 371 -54 -324 230 257 -494 201
7509 201 439 -525 -120 692 307 -387 170 383 135 180 225 -189 -107 827 189 -519 -7 478 10 95 626
7530 626 -79 -34 799 317 -415 468 842 -72 -589 260 319 -57 570 -243 -434 503 364 -305 -543 564
7550 564 340 -115 108 209 -365 434 348 -801 -549 650 158 -651 221 -484 -18 362 104 -750 -171 755
7570 755 245 -507 -58 278 -149 46 -278 -810 -88 582 -235 -470 218 659 -164 -144 -126 -709 -181 634 -391
7591 -391 -568 364 261 -520 -190 309 -222 -83 -82 -630 -651 285 293 -521 -391 388 -342 -164 -5 -373 -519 423
7613 423 419 -738 -288 411 -222 -206 83 -427 -195 303 -21 -628 45 486 147 -327 119 -388 -599 479
7633 479 389 -508 -234 779 -135 -340 -84 -267 -136 817 268 -329 124 792 -12 -250 347 423 -5 209
7653 209 312 -412 114 963 -64 -441 248 492 -12 388 183 -127 583 538 -353 -276 910 442 -248 -119
7673 -119 144 5 514 672 -532 -521 534 762 -344 -286 331 -58 272 245 -469 -254 885 299 -463 -248
7693 -248 684 -323 53 467 -144 -269 442 342 -549 269 590 -231 -452 337 -483 -445 567 -20 -837 8
7713 8 248 -604 -212 329 -275 -557 -84 36 -469 -9 562 -634 -493 589 24 -162 61 6 -306 53
7733 53 128 -668 -509 313 -64 -186 390 133 -663 116 389 -874 -320 357 -136 -660 100 -211 -390 69
7753 69 606 -477 -538 527 350 -537 -72 -14 -275 107 276 -357 -400 533 78 -57 30 327 -150 -3 146
7774 146 -184 37 598 106 -491 599 637 13 4 452 -141 26 852 -290 -574 359 661 -417 -225 612
7794 612 316 -221 64 -345 -175 711 397 -840 -4 592 120 -182 73 -19 -117 237 95 -912 -184 809
7814 809 -43 -596 151 -81 -238 199 259 -398 74 846 -250 -550 354 157 -520 199 244 -334 -235 429 -176
7835 -176 -546 361 243 -113 -102 165 -425 175 231 -444 -364 636 14 -573 -318 254 -641 -105 37 -46 -287
7856 -287 244 119 -914 -488 20 -309 -149 -111 -836 -209 483 -29 -936 -543 190 -189 -322 108 -503 -655
7876 -655 452 91 -824 -212 627 271 -581 -39 -207 -398 620 19 -625 -43 721 -191 -372 49 -79
7895 -79 -192 405 27 -562 368 774 -281 -422 584 285 -251 17 87 -88 287 602 -257 -529 477 483
7915 483 -370 39 -8 -109 355 361 -678 -477 740 360 -322 -97 531 -124 335 115 -339 -137 853 446
7935 446 -586 93 418 -178 264 444 -66 59 802 312 -313 109 499 -54 49 382 -50 -38 633 30
7955 30 -421 225 585 -361 -341 -2 -338 -330 -28 -76 -801 62 146 -583 -244 163 -484 -199 -64 -78 -432 144
7977 144 96 -729 -485 164 -265 -474 1 -7 -683 -23 362 -690 -446 783 123 -245 185 204 -372 163 198
7998 198 -549 -332 600 137 -638 129 249 -183 236 246 -327 -213 288 219 -677 111 340 -480 239 358 -401
8019 -401 -60 432 -28 -446 260 288 -396 -32 154 -208 -4 265 -348 -402 148 770 -659 -70 101 73 -35
8040 -35 130 -414 -211 365 209 -528 -113 561 152 -201 266 303 266 438 242 -364 301 743 128 -1 472
8061 472 323 331 506 235 -134 107 1014 -271 -258 315 330 25 -153 -16 -170 62 614 -190 -447 377 239
8082 239 -412 159 -207 -452 -175 170 -554 -548 316 207 -526 -194 -195 -276 -404 217 -550 -369 185 -107 -773 -196
8104 -196 26 -371 -240 114 -476 -424 397 16 -517 -268 212 -291 -127 320 -345 -229 318 -100 -720 -229
8124 -229 382 -234 -409 -122 -89 -152 566 -130 -847 200 486 -231 -420 412 84 -16 335 -164 -681 194
8144 194 543 -573 -608 209 197 -203 172 -54 -186 363 593 -597 -463 803 452 -102 263 193 -69 523
8164 523 453 -366 -380 866 312 -442 78 -58 77 437 297 -296 223 885 61 -412 265 314 -211 312 263
8185 263 -288 51 456 277 -467 362
8191C62
##END NTUPLES=NMR FID
##END=
