##TITLE=1H_TG-2263-2
 CDCl3, 8 sc, 
 21.11.2019
##JCAMPDX= 6.0         $$ Bruker NMR JCAMP-DX V2.0
##DATA TYPE= NMR FID
##DATA CLASS= NTUPLES
##ORIGIN= UXNMR, Bruker Analytische Messtechnik GmbH
##OWNER= root
$$ XWIN-NMR		Version 3.5
$$ Thu Nov 21 14:10:17 2019 Russian Standard Time (UT+4h)  she@DPX200
##.OBSERVE FREQUENCY= 200.1315
##.OBSERVE NUCLEUS= ^1H
##.DELAY= (6, 6)
##.ACQUISITION MODE= SIMULTANEOUS
##.ACQUISITION SCHEME= undefined
##.AVERAGES= 8
##.DIGITISER RES= 18
##SPECTROMETER/DATA SYSTEM= spect
##.PULSE SEQUENCE= zg30
##.SOLVENT NAME= CDCl3
##.SHIFT REFERENCE= (INTERNAL, CDCl3, 0, 15.7039)
##AUDIT TRAIL= $$ (NUMBER, WHEN, WHO, WHERE, WHAT)
$$ ##TITLE= Audit trail, XWIN-NMR		Version 3.5
$$ ##JCAMPDX= 5.01
$$ ##ORIGIN= Bruker BioSpin GmbH
$$ ##OWNER= she
$$ F:/spectra/data/she/nmr/H-F/1/audita.txt
$$ ##AUDIT TRAIL=  $$ (NUMBER, WHEN, WHO, WHERE, WHAT)
(   1,<2019-11-21 14:08:45.09 +0400>,<she>,<DPX200>,
      <created by zg, POWCHK disabled, PULCHK disabled
       configuration hash MD5:
       00 E9 B6 7A A2 85 ED C7 34 08 36 98 17 FE 4E 26
       data hash MD5: 16K
       F8 37 B5 93 29 81 9E 73 C0 CE B6 26 EC 14 4B C4>)
$$ ##END=
$$ 
$$ hash MD5
$$ 61 BD B5 99 83 40 AE 94 BA AE 4A 0F 1E C4 52 52
##$RELAX= 
##$RELAX= 
##$RELAX= 
##$RELAX= 
##$RELAX= 
##$RELAX= 
$$ Bruker specific parameters
$$ --------------------------
##$DU= <F:/spectra>
##$EXPNO= 1
##$NAME= <H-F>
##$PROCNO= 1
##$TYPE= <nmr>
##$USER= <she>
##$AMP= (0..31)
100 100 100 100 100 100 100 100 100 100 100 100 100 100 100 100 100 100 
100 100 100 100 100 100 100 100 100 100 100 100 100 100 
##$AQSEQ= 0
##$AQ_mod= 1
##$AUNM= <au_zg>
##$AUTOPOS= <>
##$BF1= 200.13
##$BF2= 200.13
##$BF3= 200.13
##$BF4= 200.13
##$BF5= 200.13
##$BF6= 200.13
##$BF7= 200.13
##$BF8= 200.13
##$BYTORDA= 1
##$CFDGTYP= 0
##$CFRGTYP= 5
##$CHEMSTR= <none>
##$CNST= (0..31)
1 1 145 1 1 1 1 1 1 1 1 1 1 1 1 1 1 1 1 1 1 1 1 1 1 1 1 1 1 1 1 1 
##$CPDPRG= <>
##$CPDPRG1= <>
##$CPDPRG2= <>
##$CPDPRG3= <>
##$CPDPRG4= <mlev>
##$CPDPRG5= <mlev>
##$CPDPRG6= <mlev>
##$CPDPRG7= <mlev>
##$CPDPRG8= <mlev>
##$CPDPRGB= <>
##$CPDPRGT= <>
##$D= (0..31)
0 1.2 0 0 0 0 0 0 0 0.06 0 0.03 0 0 0 0 0.0002 0 0 0 0 0 0 0 0 0 0 0 0 
0 0 0 
##$DATE= 1574330924
##$DBL= (0..7)
120 120 120 120 120 120 120 120 
##$DBP= (0..7)
150 150 150 150 150 150 150 150 
##$DBP07= 0
##$DBPNAM0= <>
##$DBPNAM1= <>
##$DBPNAM2= <>
##$DBPNAM3= <>
##$DBPNAM4= <>
##$DBPNAM5= <>
##$DBPNAM6= <>
##$DBPNAM7= <>
##$DBPOAL= (0..7)
0.5 0.5 0.5 0.5 0.5 0.5 0.5 0.5 
##$DBPOFFS= (0..7)
0 0 0 0 0 0 0 0 
##$DE= 6
##$DECBNUC= <off>
##$DECIM= 24
##$DECNUC= <off>
##$DECSTAT= 4
##$DIGMOD= 1
##$DIGTYP= 9
##$DL= (0..7)
0 120 120 120 120 120 120 120 
##$DP= (0..7)
150 150 150 150 150 150 150 150 
##$DP07= 0
##$DPNAME0= <>
##$DPNAME1= <>
##$DPNAME2= <>
##$DPNAME3= <>
##$DPNAME4= <>
##$DPNAME5= <>
##$DPNAME6= <>
##$DPNAME7= <>
##$DPOAL= (0..7)
0.5 0.5 0.5 0.5 0.5 0.5 0.5 0.5 
##$DPOFFS= (0..7)
0 0 0 0 0 0 0 0 
##$DQDMODE= 0
##$DR= 18
##$DS= 0
##$DSLIST= <SSSSSSSSSSSSSSS>
$$ [...]
##$SUBNAM2= <"">
##$SUBNAM3= <"">
##$SUBNAM4= <"">
##$SUBNAM5= <"">
##$SUBNAM6= <"">
##$SUBNAM7= <"">
##$SUBNAM8= <"">
##$SUBNAM9= <"">
##$SW= 24.9337058887773
##$SWIBOX= (0..15)
0 0 2 0 0 0 0 0 0 0 0 0 0 0 0 0 
##$SW_h= 4990.01996007984
##$TD= 16384
##$TD0= 1
##$TE= 0
##$TE2= 300
##$TE3= 300
##$TEG= 300
##$TL= (0..7)
0 120 120 120 120 120 120 120 
##$TP= (0..7)
150 150 150 150 150 150 150 150 
##$TP07= 0
##$TPNAME0= <>
##$TPNAME1= <>
##$TPNAME2= <>
##$TPNAME3= <>
##$TPNAME4= <>
##$TPNAME5= <>
##$TPNAME6= <>
##$TPNAME7= <>
##$TPOAL= (0..7)
0.5 0.5 0.5 0.5 0.5 0.5 0.5 0.5 
##$TPOFFS= (0..7)
0 0 0 0 0 0 0 0 
##$TUNHIN= 0
##$TUNHOUT= 0
##$TUNXOUT= 0
##$USERA1= <user>
##$USERA2= <user>
##$USERA3= <user>
##$USERA4= <user>
##$USERA5= <user>
##$V9= 5
##$VALIST= <valist>
##$VCLIST= <CCCCCCCCCCCCCCC>
##$VD= 0
##$VDLIST= <DDDDDDDDDDDDDDD>
##$VPLIST= <PPPPPPPPPPPPPPP>
##$VTLIST= <TTTTTTTTTTTTTTT>
##$WBST= 1024
##$WBSW= 4
##$XGAIN= (0..3)
0 0 0 0 
##$XL= 0
##$YL= 0
##$YMAX_a= 294759
##$YMIN_a= -381798
##$ZGOPTNS= <>
##$ZL1= 120
##$ZL2= 120
##$ZL3= 120
##$ZL4= 120
##$ABSF1= 10
##$ABSF2= 0
##$ABSG= 5
##$ABSL= 3
##$ALPHA= 0
##$AQORDER= 0
##$ASSFAC= 0
##$ASSFACI= 0
##$ASSFACX= 0
##$ASSWID= 0
##$AUNMP= <proc_1d>
##$AZFE= 0.1
##$AZFW= 0.1
##$BCFW= 1
##$BC_mod= 2
##$BYTORDP= 1
##$COROFFS= 0
##$CY= 11.3945322036743
##$DATMOD= 1
##$DC= 2
##$DFILT= <>
##$DTYPP= 0
##$F1P= 16.9975609425685
##$F2P= -3.02152046262296
##$FCOR= 0.5
##$FTSIZE= 0
##$FT_mod= 4
##$GAMMA= 1
##$GB= 0.15
##$INTBC= 1
##$INTSCL= 1
##$ISEN= 128
##$LB= 0.24
##$LEV0= 0
##$LPBIN= 0
##$MAXI= 10000
##$MC2= 0
##$MEAN= 0
##$ME_mod= 0
##$MI= 1.114404
##$NCOEF= 0
##$NC_proc= 0
##$NLEV= 6
##$NOISF1= 3.799351
##$NOISF2= 2.8
##$NSP= 1
##$NTH_PI= 0
##$NZP= 0
##$OFFSET= 15.70392
##$PC= 1
##$PHC0= -9945.802
##$PHC1= 17.00086
##$PH_mod= 1
##$PKNL= yes
##$PPARMOD= 0
##$PSCAL= 0
##$PSIGN= 0
##$REVERSE= no
##$SF= 200.130013532006
##$SI= 16384
##$SIGF1= 3
##$SIGF2= 2
##$SINO= 400
##$SIOLD= 16384
##$SREGLST= <1H.CDCl3>
##$SSB= 0
##$STSI= 0
##$STSR= 0
##$SW_p= 3612.71676300578
##$SYMM= 0
##$S_DEV= 0
##$TDeff= 0
##$TDoff= 0
##$TI= <>
##$TILT= no
##$TM1= 0
##$TM2= 0
##$TOPLEV= 0
##$USERP1= <user>
##$USERP2= <user>
##$USERP3= <user>
##$USERP4= <user>
##$USERP5= <user>
##$WDW= 1
##$XDIM= 8192
##$YMAX_p= 0
##$YMIN_p= 0
$$ End of Bruker specific parameters
$$ ---------------------------------
##NTUPLES= NMR FID
##VAR_NAME=  TIME,          FID/REAL,        FID/IMAG
##SYMBOL=    X,             R,               I
##VAR_TYPE=  INDEPENDENT,   DEPENDENT,       DEPENDENT
##VAR_FORM=  AFFN,          ASDF,            ASDF
##VAR_DIM=   8192,          8192,            8192
##UNITS=     SECONDS,       ARBITRARY UNITS, ARBITRARY UNITS
##FACTOR=    0.0002004,     1,               1
##FIRST=     0,             0,               0
##LAST=      1.6414764,     0,               0
##MIN=       0,             -381798,         0
##MAX=       1.6414764,     294759,          0
$$ Real data points
##PAGE= N=1
##DATA TABLE= (X++(R..R)), XYDATA
$$ plain form
0 0 0 0 0 0 6 -1 8 -8 8 -9 16 -24 24 -32 40 -48 56 -66 81 -96 112 -129 152 -173 201 -230 262 -295 336
29 336 -382 430 -481 541 -605 676 -752 838 -930 1032 -1145 1268 -1402 1554 -1721 1905
45 1905 -2114 2347 -2615 2921 -3275 3694 -4196 4808 -5581 6583 -7950 9934 -13086 18895
59 18895 -33224 142747 126744 -138676 50906 282400 294759 52982 -42954 96184 277676
70 277676 202628 3795 -46032 115523 212090 121513 -26604 -26240 81791 132190 37664 -49355
82 -49355 -7619 77834 47284 -47415 -68455 -8019 23941 -5358 -44984 -39535 -22028 -49196
94 -49196 -96741 -67327 19582 27776 -71690 -137817 -77844 25329 36262 -55969 -123574 -60257
106 -60257 48232 37498 -79038 -124361 -28501 80953 71340 -33896 -93313 -27609 65912
$$ packed form
0@%%%%OpRj6J6j7K5m0M8n6P2q8J04j22J47j77K08k41K81l25L74m31M92n57O31
29C36p18Q12r11J022j146J281j428J590j768J962k177K413k670K956l275L626
45A905m019M461m962N536o196O969p890R004j0389J2164j4533J7884k3020L1981
59A8895n2119J75971j6003k65420J89582K31494J2359k41777r5936J39138J81492
70B77676p5048j98833m9827J61555R6567r0577j48117L64J08031N0399r4526q7019
82d9355M1736Q5453l0550r4699k1040O0436L1960k9299l9626N449J7507k7168
94d9196m7545K9414Q6909Q194r9466o6127N9973J03173J0933r2231o7605O3317
106f0257J08489j0734j16536m5323R5860J09454r613j05236n9417O5704R3521
$$ plain form
117 65912 52136 -34787 -50904 24079 76989 39959 -38304 -60051 12024 94130 70080 -37041
129 -37041 -84779 -17933 69608 68161 -20311 -87501 -46759 41913 42039 -48549 -97671 -43485 32514
142 32514 31720 -46094 -111678 -86205 -12400 97 -52558 -77327 -46599 -25985 -48979 -80215
154 -80215 -77364 -37887 -11083 -35676 -74444 -70654 -43631 -39396 -42948 -32064 -28421 -45077 -57328
167 -57328 -42441 -10404 1744 -33585 -70289 -37580 26442 16141 -64874 -96183 -25668 58928
179 58928 47902 -53672 -114612 -46558 54919 40346 -61034 -92976 -21295 34146 -11182
190 -11182 -92659 -90288 1037 50984 -19886 -108444 -90575 -11446 7280 -47931 -89959 -64885
202 -64885 -9994 -4041 -59146 -94605 -63245 -21193 -22273 -40187 -45267 -50959 -58713 -49520 -22065
$$ packed form
117F5912j3776q6923j6117P4983N2910l7030p8263k1747P2075Q2106k4050j07121
129c7041m7738O6846Q7541j447q8472o7190M0742Q8672J26r0588m9122N4186P5999
142C2514p94p7814o5584K5473P3805J2497n2655k4769L0728K0614k2994l1236
154h0215K851L9477K6804k4593l8768L790K7023M235l552J0884L643j6656j2251
167e7328J4887L2037J2148l5329l6704L2709O4022j0301q1015l1309P0515Q4596
179E8928j1026j01574o0940O8054J01477j4573j01380l1942P1681N5441m5328
190a1182q1477K371R1325M9947p0870q8558J7869P9129J8726n5211m2028K5074
202f4885N4891N953n5105l5459L1360M2052j080j7914n080n692p754R193K7455
$$ plain form
215 -22065 -2632 -21605 -69614 -81363 -20974 32509 14 -62283 -53354 11673 32584 -23958
227 -23958 -81511 -49964 40859 62357 -19526 -79671 -28561 47719 35588 -38697 -65181 -2566
239 -2566 64028 32534 -64569 -89136 -4729 64394 29459 -47900 -67383 -20687 21425 5954
251 5954 -38378 -43141 -11222 -3290 -26217 -35973 -26189 -23052 -24809 -20493 -16441 -18748 -29560 -41012
265 -41012 -30446 145 5464 -28289 -48354 -27045 -1744 -6604 -25926 -24494 7779 32041 -194
278 -194 -55855 -49906 18334 57192 20728 -34627 -39913 9640 52149 29209 -27082 -32450 22474
291 22474 59416 34064 -16736 -35224 1637 53454 51840 -4495 -36286 -2915 42078 41645 3581
304 3581 -21024 2638 43208 32942 -25528 -44090 10984 62588 40769 -24825 -51310 -5522
$$ packed form
215b2065J9433j8973m8009j1749O0389N3483l2495o2297Q929O5027K0911n6542
227b3958n7553L1547R0823K1498q1883o0145N1110P6280j2131p4285k6484O2615
239b566O6594l1494r7103k4567Q4407O9123l4935p7359j9483M6696M2112j5471
251E954m4332m763L1919P932k2927r756R784L137j757M316M052k307j0812j1452
265d1012J0566L0591N319l3753k0065K1309K5301m860j9322J432L2273K4262l2235
278a94n5661N949O8240L8858l6464n5355n286M9553M2509k2940n6291n368N4924
291B2474L6942k5352n0800j8488L6861N1817j614n6335l1791L3371M4993m33l8064
304C581k4605K3662M0570j0266n8470j8562N5074N1604k1819o5594k6485M5788
$$ plain form
316 -5522 52519 39791 -24739 -40085 13188 47491 13900 -32958 -31699 9829 38079 19623
328 19623 -12593 -10120 11426 6277 -10493 3224 28243 21267 -10834 -24778 231 34075 27972
341 27972 -13843 -22787 21327 44070 3374 -36071 -8759 47069 49601 -11879 -55977 -12239
353 -12239 61983 52670 -29175 -54048 19206 78639 34150 -56575 -68770 20945 93254 44897
365 44897 -55531 -62499 23547 69168 17898 -44167 -27873 38523 57381 -2188 -52179 -15915
377 -15915 48003 42496 -14991 -35009 1807 36837 25584 -12290 -20789 13089 35272 10170
389 10170 -19637 -11161 12255 17751 9800 4323 5158 5346 -3321 -9918 9583 36492 24253 -15934
403 -15934 -26437 4625 30744 20908 -8165 -15561 15321 41545 18196 -23147 -19575 22008 42416
$$ packed form
316e522N8041j2728o4530j5346N3273L4303l3591m6858J259M1528K8250j8456
328A9623l2216K473K1546n149j6770J3717K5019o976l2101j3944K5009L3844o103
341B7972m1815q944M4114K2743m0696l9445K7312N5828K532o1480m4098M3738
353a2239P4222r313q1845k4873P3254N9433m4489r0725j2195Q9715P2309m8357
365D4897j00428o968Q6046M5621n1270o2065J6294O6396J8858n9569m9991L6264
377a5915O3918n507n7487k0018L6816L5030j1253l7874q499L3878K2183k5102
389A0170k9807Q476K3416N496p951n477Q35J88q667o597J9501K6909j2239m0187
403a5934j0503L1062K6119r836k9073p396L0882K6224k3349m1343L572M1583K0408
$$ plain form
416 42416 21267 -10253 -13452 16414 37868 16667 -14365 -2277 35864 43388 11014 -19252
428 -19252 -8756 34675 57004 21206 -27261 -20177 28600 51793 25892 -10178 -12211 21412
440 21412 43089 15369 -22960 -13663 26895 38327 9814 -17010 -12903 12050 21045 362 -13661
453 -13661 5309 22997 3917 -23223 -19814 3548 15622 5091 -13014 -14687 550 3560 -10536
466 -10536 -9536 8597 8869 -13123 -22379 -4634 15905 11505 -16523 -27341 4074 33570 9706
479 9706 -33991 -27461 20949 43068 10095 -34859 -32714 13553 37290 3083 -30700 -8435 30131
492 30131 22034 -20757 -37250 -5589 32099 22333 -25458 -41637 -4242 24169 1078 -32672
504 -32672 -28179 913 12608 -8347 -34048 -28190 -2543 249 -20355 -25060 -11674 -11821 -25077
$$ packed form
416D2416k1149l1520l199K9866K1454k1201l1032J2088L8141P524l2374l0266
428a9252J0496M3431K2329l5798m8467P084M8777K3193k5901l6070k033L3623
440B1412K1677k7720l8329R297M0558J1432k8513k6824M107K4953Q995k0683j4023
453a3661J8970J7688j9080k7140L409K3362J2074j0531j8105j673J5237L010j4096
466a0536J000J8133K72k1992r256J7745K0539m400k8028j0818L1415K9496k3864
479I706m3697O530M8410K2119l2973m4954K145M6267K3737l4207l3783K2265L8566
492C0131q097m2791j6493L1661L7688r766m7791j6179L7395K8411k3091l3750
504c2672M493K9092J1695k0955k5701N858K5647K792k0604m705J3386j47j3256
$$ plain form
517 -25077 -25323 -7645 5498 -5022 -30835 -35728 -6221 13945 -6490 -30684 -17304 10953 10679
530 10679 -15645 -29187 -4702 30359 24807 -15558 -27268 8846 33782 11621 -18511 -10656
542 -10656 26113 43171 14792 -23133 -14721 28821 43255 13438 -13153 -5426 17617 25394 9179
555 9179 -9070 -1899 17412 14400 -5844 -9998 3822 11274 5221 -6265 -12259 -6569 -662 -7861
569 -7861 -15049 -5376 4711 -1946 -12362 -13881 -10631 -7246 -5500 -7694 -6266 1286 -2345 -17623
583 -17623 -17805 2938 16864 7996 -9994 -15747 1289 22618 16455 -9599 -12603 14679 31409
596 31409 16434 -6935 -8871 15993 38668 26409 -5587 -8267 21859 36714 16562 -6747
608 -6747 -892 26001 35917 8496 -20764 -3547 37733 40409 1393 -23525 -5824 23727 24511
$$ packed form
517b5077k46J7678J3143j0520k5813m893K9507K0166k0435k4194J3380K8257k74
530A0679k6324j3542K4485L5061n552m0365j1710L6114K4936k2161l0132P855
542a0656L6769J7058k8379l7925Q412M3542J4434k9817k6591P727K3043P777j6215
555I179j8249P171J9311l012k0244m154J3820P452o053j1486n994N690N907p199
569g861p188R673J0087o657j0416j519L250L385J746k194J428P552l631j5278
583a7623j82K0743J3926q868j7990n753J7036K1329o163k6054l004K7282J6730
596C1409j4975k3369j936K4864K2675j2259l1996k680L0126J4855k0152k3309
608f747N855K6893R916k7421k9260J7217M1280K676l9016k4918J7701K9551P84
$$ plain form
621 24511 -4566 -20709 2474 28593 14620 -16741 -17323 7309 18308 4987 -10763 -5947 12294
634 12294 13277 -9030 -16099 9274 26860 9665 -13105 -7437 17087 27654 11374 -8272 1259
647 1259 26743 24653 -2510 -7499 20425 39609 24366 -3540 -6644 21803 42121 20410 -12151
660 -12151 -2599 34611 40140 5963 -19604 -3529 31918 38727 5301 -21573 -3512 26280 19601
673 19601 -9726 -16594 3518 18322 6618 -18067 -21062 4266 18983 -47 -21657 -14506 4403
686 4403 6720 -7215 -18407 -11247 6232 8205 -9120 -16055 -1136 10179 4772 -2949 -2067 3403
700 3403 5887 959 -4012 5628 20423 16707 302 -3120 8966 18060 15738 6343 2205 12584
714 12584 22656 13103 -3119 257 15224 17655 7247 -1674 113 10290 13683 692 -10484
$$ packed form
621B4511k9077j6143K3183K6119j3973l1361n82K4632J0999j3321j5750M816J8241
634A2294R83k2307p069K5373J7586j7195k2770N668K4524J0567j6280j9646R531
647A259K5484k090k7163m989K7924J9184j5243k7906l104K8447K0318k1711l2561
660a2151R552L7210N529l4177k5567J6075L5447O809l3426k6874J8061K9792o679
673A9601k9327o868K0112J4804j1704k4685k995K5328J4717j9030k1610P151J8909
686D403K317j3935j1192P160J7479J973j7325o935J4919J1315n407p721Q82N470
700C403K484m928m971R640J4795l716j6405l422J2086R094k322r395m138J0379
714A2584J0072r553j6222L376J4967K431j0408q921J787J0177L393j2991j1176
$$ plain form
727 -10484 -2052 8528 1111 -14221 -17869 -7959 3872 2731 -14960 -26136 -15312 -2974 -9406
740 -9406 -22284 -23239 -15757 -10563 -14595 -25262 -25961 -12679 -6423 -17142 -25282 -19247 -12774 -14023 -18219
755 -18219 -19442 -13316 -4649 -7150 -19166 -19968 -8473 -2998 -6992 -9683 -7700 -4387 -2699 -6674 -10590
770 -10590 -3712 3487 -3301 -12395 -6670 4235 4575 -2423 -7854 -5521 2621 2958 -9527 -15495 -3162
785 -3162 7150 1150 -9497 -11234 -5215 207 -3044 -12478 -11197 928 1537 -12255 -18054 -8387
799 -8387 480 -835 -8873 -14226 -7916 1761 -1393 -12170 -10400 -7 1120 -5504 -8808 -6197 -119
814 -119 3411 -1715 -6517 376 6957 181 -7463 -2498 6669 7813 1004 -6778 -4725 7301 10277
829 10277 -1449 -6950 3334 9864 2028 -7011 -6434 2512 8895 1790 -11443 -9877 4366 6234
$$ packed form
727a0484Q432J0580p417j5332l648R910J1831j141j7691j1176J0824J2338o432
740i406j2878r55P482N194m032j0667o99J3282O256j0719q140O035O473j249m196
755a8219j223O126Q667k501j2016q02J1495N475l994k691J983L313J688l975l916
770a0590O878P199o788r094N725J0905L40o998n431K333Q142L37j2485n968J2333
785c162J0312o000j0647j737O019N422l251r434J281J2125O09j3792n799R667
799h387Q867j315q038n353O310R677l154j0777J770J0393J127o624l304K611O078
814a19L530n126m802O893O581o776p644M965R167J144o809p782K053J2026K976
829A0277j1726n501J0284O530p836r039N77Q946O383p105j3233J566J4243J868
$$ plain form
843 6234 -6329 -12359 -4458 4873 3445 -8823 -18160 -9419 4604 982 -13102 -14299 -3389 1926
857 1926 -2800 -10280 -11752 -3136 3200 -5304 -15694 -9739 3284 4375 -4107 -9872 -6465 2803 4832
872 4832 -5754 -11582 423 11450 4193 -8039 -7859 1864 8005 3165 -7143 -5794 8049 11214
886 11214 -2788 -10191 328 10604 6209 -6299 -12159 -2667 10500 6159 -10222 -11268 4659
899 4659 10332 -2078 -14127 -11102 2347 8192 -4149 -18284 -10358 7440 5897 -10594 -15768
912 -15768 -4117 6407 1890 -13506 -18423 -1870 12156 1116 -16917 -13460 3437 7968 -3638
925 -3638 -14457 -8148 9030 11774 -6298 -16777 -2353 12543 5936 -8927 -10279 3057 13514
938 13514 6620 -9379 -8252 10141 15572 -386 -11700 -3003 11225 12755 526 -9157 -161
$$ packed form
843F234j2563o030P901R331j428j2268r337Q741J4023l622j4084j197J0910N315
857A926m726p480j472Q616O336q504j0390N955J3023J091q482n765L407R268K029
872D832j0586n828J2005J1027p257j2232J80R723O141m840j0308J349J3843L165
886A1214j4002p403J0519J0276m395j2508n860R492J3167m341j6381j046J5927
899D659N673j2410j2049L025J3449N845j2341j4135P926J7798j543j6491n174
912a5768J1651J0524m517j5396m917J6553J4026j1040j8033L457J6897M531j1606
925c638j0819O309J7178K744j8072j0479J4424J4896o607j4863j352J3336J0457
938A3514o894j5999J127J8393N431j5958j1314Q697J4228J530j2229r683Q996
$$ plain form
951 -161 15379 11805 -6035 -8798 7025 16007 6971 -6878 -7579 6990 16404 4902 -10229 -3130
965 -3130 14356 13771 -1886 -9106 633 13680 12473 -3787 -11451 3285 16873 7441 -8252 -5558
979 -5558 9220 14649 4089 -9055 -5853 10986 15057 -1194 -11182 512 13346 9115 -3520
992 -3520 -7449 2831 14058 8573 -7826 -8569 7890 14303 2375 -8332 -3869 8048 12035 1720
1006 1720 -8809 -1094 14032 11419 -4404 -8108 3395 11399 6715 -3694 -5439 6300 14711
1019 14711 5162 -7352 -2110 10999 11486 969 -5797 -781 10083 11819 -118 -6984 3449
1032 3449 13174 6527 -4110 -2839 6184 10753 5074 -4759 -3653 8009 10614 -686 -6314 1930
1046 1930 9751 7435 -592 -4660 1417 10430 7168 -4633 -4855 6073 9436 2375 -2458 824 7619
$$ packed form
951a61J5540l574j7840k763J5823Q982r036j3849p01J4569R414j1502j5131P099
965c130J7486n85j5657p220R739J3047j207j6260p664J4736J3588r432j5693K694
979e558J4778N429j0560j3144L202J6839M071j6251r988J1694J2834m231j2635
992c520l929J0280J1227n485j6399p43J6459O413j1928j0707M463J1917L987j0315
1006A720j0529P715J5126k613j5823l704J1503Q004m684j0409j745J1739Q411
1019A4711r549j2514N242J3109M87j0517o766N016J0864J736j1937o866J0433
1032C449R725o647j0637J271R023M569n679r833J106J1662K605j1300n628Q244
1046A930P821k316q027m068O077R013l262j1801k22J0928L363p061m833L282O795
$$ plain form
1061 7619 9834 2502 -4273 2180 11633 7996 -1406 -855 7040 10911 7672 1083 70 8684 13846
1076 13846 6072 -1131 4339 11561 9618 3791 1821 5534 11148 9640 1256 645 10315 12840 4149
1091 4149 -857 3470 8477 7936 2777 -1803 2279 9461 6636 -1618 -761 6061 5932 798 -1896 -318
1107 -318 3890 4773 -1312 -5286 1227 7267 1912 -4636 -2564 2841 4316 1230 -3659 -3391 3490 5228
1123 5228 -1908 -4695 1627 5431 1846 -1812 -1610 2392 6217 2400 -5115 -3307 5680 6123 -1690
1138 -1690 -4382 106 4611 4472 -1069 -5490 -756 5636 1061 -6619 -4510 1690 1304 -3478 -6343
1153 -6343 -4795 573 1800 -5821 -10622 -4207 1613 -2657 -8960 -9597 -5859 -1565 -2408 -8804 -10587
1168 -10587 -3119 317 -6042 -10309 -6696 -2165 -1875 -5628 -9655 -6707 1528 1212 -7672 -9153 -818
$$ packed form
1061G619K215p332o775O453R453l637r402N51P895L871l239o589j013Q614N162
1076A3846p774p203N470P222j943n827j970L713N614j508q384o11R670K525q691
1091D149n006M327N007n41n159m580M082P182k825q254Q57O822j29n134k694J578
1107c18M208Q83o085l974O513O040n355o548K072N405J475l086m889K68O881J738
1123E228p136k787O322L804l585l658K02M002L825l817p515J808Q987M43p813
1138a690k692M488M505j39n541m421M734O392m575p680K109O200l86m782k865
1153f343J548N368J227p621m801O415N820m270o303o37L738M294q43o396j783
1168a0587P468L436o359m267L613M531K90l753m027K948Q235l16q884j481Q335
$$ plain form
1183 -818 4244 428 -5611 -7254 -828 6322 2420 -6908 -5152 4754 6201 -911 -4334 -317 6026
1198 6026 6564 -1235 -6715 813 9603 4210 -5862 -5199 3411 7859 3319 -5189 -6405 3595 9269
1213 9269 -182 -9822 -5133 4303 4230 -3048 -7906 -3466 5333 3989 -7861 -11130 597 7578 -566
1228 -566 -10043 -8338 1117 6202 -616 -11048 -7896 5297 6979 -4518 -9640 -2003 5665 3570
1242 3570 -4767 -8450 -425 7820 1677 -8864 -5035 6819 7529 -2353 -8577 -4066 5789 7345 -3601
1257 -3601 -11137 -2533 7528 2781 -7581 -7896 117 4942 169 -9542 -10179 700 4792 -5581
1271 -5581 -13200 -6517 2455 805 -8167 -13537 -7651 2986 1762 -10495 -14507 -4985 1339 -3185
1285 -3185 -9742 -10537 -4986 393 -2574 -9941 -8286 294 904 -6115 -8846 -5045 -517 383 -3622 -7558
$$ packed form
1183h18N062l816o039j643O426P150l902r328J756R906J447p112l423M017O343
1198F026N38p799n480P528Q790n393j0072O63Q610M448m540q508j216J0000N674
1213I269r451r640M689R436p3p278m858M440Q799j344j1850l269J1727O981q144
1228e66r477J705R455N085o818j0432L152J3193J682j1497n122P637P668k095
1242C570q337l683Q025Q245o143j0541L829J1854P10r882o224M511R855J556j0946
1257c601p536Q604J0061m747j0362l15Q013M825m773r711o37J0879M092j0373
1271e581p619O683Q972j650q972n370N886J0637j224j2257m012R522O324m524
1285c185o557p95N551N379k967p367J655Q580O10p019k731L801M528R00m005l936
$$ plain form
1301 -7558 -2977 3793 1233 -5681 -5533 -472 1927 1219 -1831 -4290 -1290 2539 -433 -4400 -1215
1316 -1215 2950 1077 -2537 -3752 -1786 2505 2925 -3904 -7782 -1210 4462 349 -5821 -5806 -816 3787
1332 3787 1827 -6438 -8358 242 4845 -1722 -7618 -4369 1704 2896 -2270 -7531 -3108 6656 5738
1347 5738 -5712 -8919 506 7504 4052 -3427 -5271 1610 8680 4379 -4598 -2491 6954 8249 1734
1362 1734 -1462 1731 6084 6153 643 -2009 4954 10431 4070 -3259 663 8270 8197 2130 -2643 -233
1378 -233 6484 6618 -1230 -3110 4827 7608 571 -4615 -1206 4747 5593 -545 -6356 -1567 7060 3899
1394 3899 -6582 -7281 1848 6493 2042 -4720 -5985 489 5368 242 -6213 -2471 3715 1363 -3658
1409 -3658 -3099 995 3838 2371 -2489 -3520 2314 4891 -31 -2569 877 3236 2116 1014 305
$$ packed form
1301g558M581O770k560o914J48N061K399p08l050k459L000L829k972l967L185
1316a215M165j873l614j215J966M291M20o829l878O572N672m113o170J5M990M603
1332C787j960q265j920Q600M603o567n896L249O073J192n166n261M423R764r18
1347E738j1450l207R425O998l452p479j844O881P070m301q977K107R445J295o515
1362A734l196L193M353O9n510k652O963N477o361p329L922P607p3o067m773K410
1378b33O717J34p848j880P937K781p037n186L409N953Q46o138n811M789Q627l161
1394C899j0481o99R129M645m451o762j265O474M879n126o455L742O186k352n021
1409c658N59M094K843j467m860j031N834K577m922k538L446K359j120j102p09
$$ plain form
1424 305 1172 3951 3435 340 1428 4656 2375 -1388 898 5043 5662 3347 -98 -1294 2972 6870
1440 6870 3496 -401 1946 4953 3643 1693 773 1025 3463 4897 1857 130 3450 5121 2615
1455 2615 1552 2407 2343 3328 4062 1399 -331 2934 5789 4660 3046 1127 -160 3150 7138 4746
1471 4746 62 898 3959 4326 3291 1719 1243 4197 6440 2609 -883 2465 5171 2642 571 1923
1487 1923 3616 3966 1976 -1554 -547 4832 5050 -369 -1538 2453 2851 84 -1271 -91 2564 2726
1503 2726 -2478 -5664 840 7101 1915 -6335 -4978 2426 5009 -593 -8030 -6535 4081 7530 -2954
1518 -2954 -10673 -3943 5147 3526 -4614 -7808 -1751 5391 1309 -9599 -9378 2928 7283 -2047 -9689
1533 -9689 -5849 2719 4430 -2889 -9309 -3871 4847 1734 -7434 -6749 1244 2924 -2658 -6276 -3543
$$ packed form
1424C05Q67K779n16l095J088L228k281l763K286M145O19k315l445j196M266L898
1440F870l374l897K347L007j310j950r20K52K438J434l040j727L320J671k506
1455B615j063Q55o4R85P34k663j730L265K855j129j614j919j287L310L988k392
1471D746m684Q36L061L67j035j572m76K954K243l831l492L348K706k529k071J352
1487A923J693L50j990l530J007N379K18n419j169L991L98k767j355J180K655J62
1503B726n204l186O504O261n186q250J357P404K583n602p437J495J0616L449j0484
1518b954p719O730R090j621q140l194O057P142m082j0908K21J2306M355r330p642
1533i689L840Q568J711p319o420N438Q718l113r168O85P993J680n582l618K733
$$ plain form
1548 -3543 2296 1963 -5762 -7830 1132 6498 -1650 -10121 -6674 2263 4888 -1447 -8062 -4445 4820
1563 4820 3729 -7168 -9198 709 6198 -111 -7866 -6935 1251 6011 -652 -9219 -5056 5159 5007
1578 5007 -4242 -8124 -3369 2930 3805 -1927 -6450 -2667 3059 1137 -2973 -1773 520 -225 -1357
1593 -1357 -1558 -1258 632 1588 -790 -1577 514 313 -1710 7 2474 937 -539 460 1024 579 108
1610 108 -1094 -537 3419 4496 50 -2359 390 2564 2238 1939 783 -536 605 1251 681 1724
1626 1724 2582 -442 -2032 1936 4118 394 -2971 -1319 2150 3242 -326 -5360 -3165 4381 4440 -3537
1642 -3537 -5953 366 4186 -90 -6521 -6562 1778 7369 75 -10534 -7452 3738 5369 -2862 -7952
1657 -7952 -3805 3268 3550 -4386 -8565 -1467 4984 151 -6429 -3876 2080 2217 -2202 -4765 -1222
$$ packed form
1548c543N839l33p725k068Q962N366q148q471L447Q937K625o335o615L617R265
1563D820j091j0897k030R907N489o309p755R31Q186M760o663q567M163J0215j52
1578E007r249l882M755O299Q75n732m523L783N726j922m110J200K293p45j132
1593a357k01L00J890R56k378p87K091k01k023J717K467j537j476R99N64m45m71
1610A08j202N57L956J077m446k409K749K174l26k99j156j319J141O46n70J043
1626A724Q58l024j590L968K182l724l365J652L469J092l568n034K195P546N9p977
1642c537k416O319L820m276o431m1Q340N591p294j0609L082J1190J631q231n090
1657g952M147P073K82p936m179P098O451m833o580K553N956J37m419k563L543
$$ plain form
1672 -1222 4437 2262 -5514 -5790 2490 5185 -920 -4498 -1029 3461 2674 -2579 -4250 2239 7530
1687 7530 875 -7864 -4078 5798 6504 -1443 -6062 -1528 6618 6147 -4019 -8524 508 8539 3471
1702 3471 -4685 -4328 1655 4710 1002 -4148 -2273 4671 4699 -2595 -4229 1834 5056 1921 -1684 -1906
1718 -1906 1046 3512 1637 -898 1882 4859 1835 -1431 1404 4381 2716 240 467 3546 6210
1733 6210 3683 -2282 -1606 6041 8295 2674 -1151 1032 4386 4999 2297 -709 1683 6019 4239
1748 4239 -881 -477 3612 4290 2229 626 24 1492 2932 1113 -926 743 1860 -79 30 1873
1764 1873 383 -2097 -590 2210 2556 -140 -3995 -4243 1471 5448 663 -4871 -2128 2996 2496 -1868
1780 -1868 -3928 -841 4390 3933 -2945 -4992 1426 5009 473 -3492 -803 3580 4170 54 -3832
$$ packed form
1672a222N659k175p776k76Q280K695o105l578L469M490p87n253j671O489N291
1687G530o655q739L786R876P06p947m619M534Q146m71j0166m505R032Q031n068
1702C471q156L57N983L055l708n150J875O944K8p294j634O063L222l135l605k22
1718a906K952K466j875k535K780K977l024l266K835K977j665k476K27L079K664
1733F210k527n965O76P647K254n621l825K183L354O13k702l006K392M336j780
1748D239n120M04M089O78k061j603o02J468J440j819k039J669J117j939J09J843
1764A873j490k480J507K800L46k696l855k48N714L977m785n534K743N124n00m364
1780a868k060L087N231m57o878k047O418L583m536l965K689M383N90m116l886
$$ plain form
1795 -3832 -901 4795 3443 -2450 -2314 2257 2515 -587 -1048 1392 3158 854 -3865 -3698 3217 5547
1811 5547 -1782 -6630 -1415 4804 2491 -4641 -6936 -513 6648 2794 -7697 -8084 1939 5802 -1863
1826 -1863 -7840 -3938 3836 4758 -3639 -9587 -2817 7272 4753 -5494 -7419 -85 4899 2013 -3789
1841 -3789 -4403 1797 5441 462 -3899 -68 4462 2222 -1357 -411 2390 3125 615 -1574 1354 6118
1857 6118 4003 -2736 -2635 3432 5124 1074 -1831 75 3835 3943 -1673 -5178 223 6146 2800
1872 2800 -3895 -3836 1012 3479 728 -4241 -4931 206 3096 -1217 -5291 -3293 -218 32 -879 -2408
1888 -2408 -4027 -3371 -1605 -1575 -1837 -1860 -3370 -3658 -1062 -470 -3745 -4380 -997 771 -1351 -4371 -5171
1905 -5171 -1926 2220 139 -5612 -5003 780 1910 -2868 -5837 -3671 980 2623 -2060 -6708 -4109
$$ packed form
1795c832K931N696j352n893J36M571K58l102m61K440J766k304m719J67O915K330
1811E547p329m848N215O219k313p132k295O423P161l854j0491l87J0023L863p665
1826a863n977L902P774R22q397n948O770J0089k519j0247j925P334M984k886n802
1841c789o14O200L644m979m361L831M530k240l579R46K801P35k510k189K928M764
1857F118k115o739J01O067J692m050k905J906L760J08n616l505N401N923l346
1872B800o695N9M848K467k751m969o90N137K890m313m074J998L075K50r11j529
1888b408j619O56J766L0k62k3j510k88K596N92l275o35L383J768k122l020q00
1905e171L245M146k081n751O09N783J130m778k969K166M651J643m683m648K599
$$ plain form
1920 -4109 966 -349 -4430 -3742 -1032 -909 -2974 -4256 -2923 -166 -1129 -5934 -6215 -914 298 -4353
1936 -4353 -6338 -2584 598 -1208 -6039 -7658 -2372 2603 -1413 -8062 -5558 1938 1769 -5170 -8638
1951 -8638 -3358 4400 4035 -4833 -9233 -1486 6032 1857 -5722 -4944 1729 4628 602 -4690 -3004
1966 -3004 4172 5265 -1295 -3883 1289 4734 1622 -1890 -948 2913 4471 629 -2933 305 5327
1981 5327 3237 -1769 -868 3224 3108 -697 -2433 744 5469 4242 -2959 -5072 2112 6609 1705
1996 1705 -4002 -2103 3665 5341 392 -5294 -2602 5062 5708 -1323 -3755 1173 4670 2373 -1614
2011 -1614 -1875 2178 5085 1593 -2923 -344 4725 4122 425 -200 1412 2519 2196 1067 1324 3423
2027 3423 3254 -36 -371 3246 3701 419 -540 2077 4252 3238 -376 -2673 737 5011 2862 -2054
$$ packed form
1920d109N075j315m081O88K710J23k065j282J333K757r63m805k81N301J212m651
1936d353j985L754L182j806m831j619N286M975m016o649K504P496j69o939l468
1951h638N280P758l65q868m400P747P518m175p579P78O673K899m026n292J686
1966c004P176J093o560k588N172L445l112l512R42L861J558l842l562L238N022
1981E327k090n006R01M092j16l805j736L177M725j227p201k113P184M497m904
1996A705n707J899N768J676m949n686K692P664O46p031k432M928L497k297l987
2011a614k61M053K907l492m516K579N069o03l697o25J612J107l23j129K57K099
2027C423j69l290l35L617M55l282r59K617K175j014l614k297L410M274k149m916
$$ plain form
2043 -2054 -1814 1901 2626 346 -1429 -766 1897 2653 -871 -3414 -761 2149 661 -1200 -1019 -626
2059 -626 -237 408 -185 -1053 -372 -270 -868 309 808 -1497 -2445 877 3288 1075 -2261 -2955 62 3862
2077 3862 2922 -2008 -2440 2759 4286 -255 -3282 -309 3976 4384 490 -2690 449 5283 3464 -1887
2093 -1887 -1563 3295 4464 1153 -1234 112 3687 4312 432 -1604 2132 4531 841 -1747 1602
2108 1602 5178 3338 -1247 -2767 1831 6632 3636 -3075 -2227 5215 6570 -203 -4299 -3 6381
2123 6381 6374 -853 -4982 938 7752 4268 -3351 -2562 4620 7091 1827 -4093 -2597 4804 7236 421
2139 421 -4499 90 5671 3716 -1338 -1954 1484 3978 1624 -2582 -1507 3387 3597 -1297 -2469 1037
2155 1037 2564 166 -2278 -1405 1933 3259 -658 -4239 -1359 2517 775 -2873 -2067 1184 1959 -451
$$ packed form
2043b054K40L715P25k280j775O63K663P56l524k543K653K910j488j861J81L93
2059f26L89O45n93q68O81J02n98J177M99k305r48L322K411k213l336o94L017L800
2077C862r40m930m32N199J527m541l027K973M285M08l894l180L139M834j819n351
2093a887L24M858J169l311k387J346L575O25l880k036L736K399l690k588L349
2108A602L576j840m585j520M598M801k996o711Q48P442J355o773m096M296O384
2123F381pp227m129N920O814l484p619P89P182K471n264n920J496P401K432o815
2139D21m920M589N581j955n054o16L438K494k354m206J075M894K10m894j172L506
2155A037J527k398k444Q73L338J326l917l581K880L876j742l648Q06L251P75k410
$$ plain form
2171 -451 -3664 -2905 1589 2795 -1723 -4317 -1293 1565 547 -1776 -2649 -1271 1112 898 -2149 -2842
2187 -2842 -607 405 -448 -672 -1032 -2004 -1296 239 -25 -955 -1058 -1242 -705 302 -937 -2917 -998
2204 -998 1993 764 -2707 -3129 -858 1331 1093 -1872 -3263 49 2533 -451 -3948 -2266 1257 1633
2220 1633 -440 -2409 -1760 1150 1452 -1684 -2348 891 1716 -1274 -2629 -543 1771 1480 -1182 -2816
2236 -2816 -222 2835 473 -3261 -1339 2890 2440 -1798 -3561 -1015 2808 2434 -2367 -3787 1334
2251 1334 4351 -218 -4744 -2594 2503 3745 -444 -4632 -2780 2939 3285 -2266 -4205 172 3135
2266 3135 613 -2967 -3054 439 2780 32 -3795 -2142 2024 1468 -2113 -2340 158 1357 -58 -2283
2282 -2283 -2347 468 1816 -982 -2801 -384 1137 -1080 -2888 -1606 873 1530 -754 -3849 -2743 1046
$$ packed form
2171d51l213P59M494J206m518k594L024K858j018k323q73J378K383k14l047o93
2187b842K235J012q53k24l60r72P08J535k64r30j03j84N37J007j239j980J919
2204i98K991j229l471m22K271K189k38k965j391L312K484k984l497J682L523L76
2220A633k073j969O49K910L02l136o64L239Q25k990j355K086K314k91k662j634
2236b816K594L057k362l734J922M229m50m238j763K546L823l74m801j420N121
2251A334L017m569m526K150N097J242m189m188J852N719L46n551j939M377K963
2266C135k522l580q7L493K341k748l827J653M166n56l581k27K498J199j415k225
2282b283o4K815J348k798j819K417J521k217j808J282K479O57k284l095J106L789
$$ plain form
2298 1046 828 -3036 -3718 -503 1084 -558 -3131 -3741 -1251 1050 -1033 -4205 -3004 -158 -528 -2602
2314 -2602 -3002 -1991 -851 -791 -2603 -3675 -1678 -16 -1213 -2380 -1707 -1607 -1925 -1379 -912 -978 -849 -1028
2332 -1028 -1638 -837 421 -734 -1726 -54 1236 164 -1085 -1021 -280 1069 1638 107 -528 1153 1628
2349 1628 -9 -331 822 1295 1146 1072 300 237 1619 1677 597 689 1297 360 150 1598 1766 527 332
2368 332 776 1147 1535 700 -827 339 3147 2578 -483 -989 999 2223 1813 185 -635 1509 3493
2385 3493 1327 -1446 70 3274 3132 719 -568 508 2827 3276 466 -805 2226 4048 1640
2400 1640 -547 717 2700 2815 1267 -120 769 2976 2010 -940 -129 3165 3074 -141 -1577 128
2416 128 2490 2489 -555 -2405 641 3406 518 -3369 -1953 2018 2781 -236 -3169 -2207 1818 2520 -2001
$$ packed form
2298A046k18l864o82L215J587j642k573o10K490K301k083l172J201K846l70k074
2314b602m00J011J140O0j812j072J997J662j197j167O73J00l18N46M67o6J29j79
2332a028o10Q01J258j155r92J672J290j072j249O4P41J349N69j531o35J681M75
2349A628j637l22J153M73j49p4p72o3J382N8j080R2O08r37k10J448J68j239j95
2368C32M44L71L88q35j527J166K808n69l061n06J988J224m10j628q20K144J984
2385C493k166k773J516L204j42k413j287J076K319M49k810j271L031J822k408
2400A640k187J264J983J15j548j387Q89K207r66k950Q11L294r1l215j436J705
2416A28K362jl044j850L046K765k888l887J416L971P63l017k933R62M025P02m521
$$ plain form
2433 -2001 -4176 -253 3025 874 -2693 -3000 131 2721 1027 -3063 -2833 1447 2541 -846 -2346
2448 -2346 -230 1683 1245 -872 -2014 75 2812 1452 -1626 -873 1680 1420 -587 -1235 108 1867
2464 1867 1934 -635 -1955 429 2252 354 -1647 -499 1005 1013 -416 -1948 -1273 1359 1673 -1267 -2549
2481 -2549 -393 1048 170 -1251 -1813 -949 919 578 -1985 -2182 169 1146 -112 -1220 -1337 -463 1054
2498 1054 843 -1016 -922 1016 1178 -347 -844 -199 892 2143 1421 -687 -492 1571 1636 -16 -164 887
2516 887 1485 1643 567 -717 299 2119 1216 -720 -365 1049 935 41 -622 -566 799 1232 -1032 -2518
2534 -2518 -512 1386 -18 -1792 -1618 -516 251 -716 -2727 -2556 377 891 -2155 -3410 -1412 393
2550 393 -103 -1961 -2966 -1463 999 -280 -3605 -3107 452 1349 -967 -2694 -2080 75 981 -1282
$$ packed form
2433b001k175L923L278k151l567l07L131K590j694m090K30M280J094l387j500
2448b346K116J913m38k117j142K089K737j360l078P53K553k60k007o48J343J759
2464A867O7k569j320K384J823j898k001J148J504Qj429j532O75K632L14k940j282
2481b549K156J441q78j421n62Q64J868l41k563j97K351R77j258j108j17Q74J517
2498A054k11j859R4J938J62j525m97O45J091J251p22k108J95K063O5j652j48J051
2516H87N98J58j076j284J016J820r03j936L55J414j14q94o63N6J365M33k264j486
2534b518K006J898j404j774J74J102P67r67k011J71K933N14l046j255J998J805
2550C93m96j858j005J503K462j279l325M98L559Q97k316j727O14K155R06k263
$$ plain form
2566 -1282 -3217 -1101 1693 346 -2518 -2149 74 978 -80 -2110 -2287 191 1384 -1191 -2685 -523
2582 -523 1136 -233 -2114 -2262 -804 778 117 -2295 -1916 641 470 -2222 -2649 -690 659 86 -1581
2599 -1581 -2454 -649 1408 72 -2433 -1430 1002 885 -827 -1669 -765 1203 1697 -396 -1807 301
2615 301 2197 878 -635 46 1215 1663 1117 -288 -320 1814 2551 640 -321 945 1570 1146 815 515
2633 515 774 1797 1521 -257 -280 1209 1261 492 448 616 477 732 372 -678 -31 1191 598 -613 -329
2652 -329 361 224 362 64 -668 -63 993 174 -911 -60 836 563 203 -357 -614 472 1519 514
2670 514 -754 376 1402 688 -155 -179 206 1325 1733 76 -877 740 1679 451 -423 128 796 1148
2688 1148 585 -887 -794 1221 1509 -577 -1122 132 670 126 -608 -1120 -240 1089 114 -1934 -1287 683
$$ packed form
2566a282j935K116K794j347k864L69K223R04j058k030j77K478J193k575j494K162
2582e23J659j369j881j48J458J582o61k412L79K557j71k692m27J959J349n73j667
2599a581q73J805K057j336k505J003K432j17j712q42R04J968M94k093j411K108
2615C01J896j319j513O81J169M48n46j405l2K134P37j911r61J266O25m24l31l00
2633E15K59J023k76j778k3J489N2p69m4J68j39K55l60j050O47J222n93j211K84
2652c29O90j37J38k98p32O05J056q19j085Q51Q96k73l60n60k57J086J047j005
2670E14j268J130J026p14q43k4L85J119M08j657r53J617R39j228q74N51O68L52
2688A148n63j472R3K015K88k086n45J254N38n44p34n12Q80J329r75k048O47J970
$$ plain form
2706 683 395 -993 -1286 -659 224 522 -812 -1792 35 1572 -44 -1831 -969 622 954 293 -715
2723 -715 -424 1363 1628 -519 -1362 761 2078 1026 -148 -140 904 1993 1365 -475 -218 2050 2074 148
2741 148 -271 918 1789 1677 593 -501 524 2112 1255 -478 242 1785 1560 483 -113 39 1145
2758 1145 1837 520 -605 736 1920 998 -27 422 1105 1599 1492 125 -294 1477 2266 805 245
2775 245 1294 1879 1520 1014 533 845 2216 2145 493 265 1772 1998 1075 778 753 1041 1711 1233 -159
2794 -159 203 1709 1352 44 -274 112 280 552 72 -892 -173 870 -169 -1436 -1078 -307 -293 -534 -1068
2813 -1068 -1594 -774 46 -1146 -2135 -957 -73 -748 -1433 -1514 -1247 -364 -101 -1486 -1914 -272 299 -988
2831 -988 -1467 -634 -74 160 -315 -1465 -1068 670 636 -1089 -1192 168 429 -71 -742 -1029 -155 1034 110
$$ packed form
2706F83k88j388k93O27Q83K98j334r80J827J537j616j787Q62J591L32o61j008
2723g15K91J787K65k147q43K123J317j052j174QJ044J089o28j840K57K268K4j926
2741A48m19J189Q71j12j084j094J025J588q57j733P20J543k25j077n96J52J106
2758A145O92j317j125J341J184r22j025M49O83M94j07j367m19J771P89j461n60
2775B45J049N85l59n06m81L12J371p1j652k28J507K26r23k97k5K88O70m78j392
2794a59L62J506l57j308l18L86J68K72m80r64P19J043j039j267L58P71J4k41n34
2813a068n26Q20Q20j192r89J178Q84o75o85q1K67Q83K63j385m28J642N71j287
2831i88m79Q33N60K34m75j150L97J738l4j725j03J360K61n00o71k87Q74J189r24
$$ plain form
2850 110 -1723 -1148 481 181 -974 -1147 -711 -39 71 -1168 -2126 -742 508 -698 -2029 -1428 -450
2867 -450 -422 -900 -1880 -1729 -152 192 -1609 -2215 -553 398 -604 -1423 -1411 -613 341 -60 -1617 -1077 936
2886 936 946 -891 -1215 -109 617 625 -172 -988 113 1562 614 -1207 -471 1060 988 110 -591 -514 528
2905 528 1159 -243 -1407 -93 1094 -83 -1157 -941 -232 307 94 -1263 -1702 -95 453 -1215 -1861
2922 -1861 -778 -160 -490 -990 -1543 -1144 228 -3 -1730 -1692 -190 19 -923 -1200 -939 -176 488 -212 -1628
2941 -1628 -882 759 400 -791 -689 -54 400 513 -316 -1090 -8 1236 241 -1148 -584 553 489 71
2959 71 -665 -1020 96 844 -649 -1696 -485 600 -80 -998 -1336 -1034 -117 -36 -1556 -1900 -232 273
2977 273 -1181 -1806 -1050 -270 -15 -707 -1866 -1320 460 258 -1487 -1302 175 575 -91 -758 -759 296 1429
$$ packed form
2850A10j833N75J629l00j155j73M36O72J10j239r58J384J250j206j331O01R78
2867d50K8m78r80J51J577L44j801o06J662R51j002q19J2P98R54m01j557N40K013
2886I36J0j837l24J106P26Qp97q16J101J449r48j821P36J531p2q78p01P7J042
2905E28O31j402j164J314J187j177j074K16P09N39k13j357m39J607N48j668o46
2922a861J083O18l30n00n53L99J372k31j727L8J502K09r42k77K61P63O64p00j416
2941a628P46J641l59j191J02O35M54J13q29p74J082J244r95j389N64J137o4m18
2959G1p36l55J116P48j493j047J211J085o80r18l38L02R17Q1j520l44J668N05
2977B73j454o25P56P80K55o92j159N46J780k02j745J85J477M00o66o67jJ055J133
$$ plain form
2996 1429 448 -1087 0 1835 1375 -37 -122 780 1760 1735 230 -423 1401 2628 1266 -241 511
3013 511 1819 1822 921 -57 319 2018 2244 210 -496 1081 1935 934 48 -63 742 1612 990 -686 -386
3032 -386 1528 1427 -120 -455 344 1043 976 216 -553 389 1738 794 -710 2 1328 1195 518 172 237
3051 237 1169 1602 454 -415 914 1846 914 67 450 1013 1323 1240 177 -60 1245 1438 123 -266 603
3070 603 974 690 252 -261 -185 790 651 -617 -607 384 271 -395 -457 -599 -533 32 -262 -1245 -838 83 -271
3091 -271 -928 -733 -636 -577 -234 -488 -1218 -663 237 -189 -846 -494 -192 -203 46 -129 -713 -18 785 47 -549
3112 -549 94 563 372 260 31 -96 482 1041 77 -487 577 968 211 -36 71 302 746 726 -318 -366
3132 -366 862 860 -362 -495 318 576 349 0 -437 89 1102 447 -847 -290 935 706 -154 -238 66
$$ packed form
2996A429r81j535J087J835m60j412q5R02R80k5j505o53J824J227j362j507P52
3013E11J308Lr01r78L76J699K26k034p06J577Q54j001q86j11Q05Q70o22j676L00
3032c86J914j01j547l35P99O99o7p60p69R42J349r44j504P12J326j33o77l46O5
3051B37R32M33j148q69J329R32r32q47L83N63L10q3j063k37J305J93j315l89Q69
3070F03L71k84m38n13P6R75j39j268J0R91j13o66o2j42O6N65k94r83M07R21l54
3091b71o57J95R7N9L43k54p30N55R00m26o57L52L02j1K49j75n84O95Q03p38n96
3112e49O43M69j91j12k29j27N78N59r64n64J064L91p57k47J07K31M44k0j044m8
3132c66J228kj222j33Q13K58k27l49m37N26J013o55j294N57J225k29q60q4L04
$$ plain form
3151 66 702 1033 101 -723 486 1540 554 -327 326 977 999 626 67 137 1297 1397 -5 -217 1136
3170 1136 1425 558 207 338 710 1116 593 -463 66 1294 767 -454 -253 624 545 150 -392 -648 158
3189 158 795 -361 -1383 -245 570 -221 -869 -841 -472 -38 -86 -1054 -1238 3 130 -979 -1205 -378 -229
3208 -229 -482 -598 -896 -672 159 -225 -1152 -854 18 -289 -829 -573 -485 -488 -182 -482 -848 -396 8 -655 -955
3229 -955 -283 -289 -714 -521 -431 -751 -473 -285 -796 -806 -217 -519 -924 -481 -264 -902 -801 -291 -556 -697 -438
3250 -438 -563 -669 -95 -165 -770 -377 286 -129 -620 -264 90 26 151 -203 -364 434 998 33 -661 331 986
3271 986 434 3 -33 258 998 852 -324 -366 1067 1214 -27 -423 318 797 769 33 -681 88 1277 569
3291 569 -935 -506 671 586 -225 -639 -431 433 636 -435 -1210 40 957 -123 -1043 -412 296 432 -83
$$ packed form
3151F6O36L31r32q24J209J054r86q81O53O51K2l73n59P0J160J00j402k12J353
3170A136K89q67l51J31L72M06n23j056N29J228n27j221K01Q77p9l95n42k56Q06
3189A58O37j156j022J138Q15p91o48K8L69M34m8r68j84J241J27j109k26Q27J49
3208b29k53j16k98K24Q31l84r27K98Q72l07n40K56Q8lL06l00l66M52M04o63l00
3229i55O72om25J93R0l20K78J88n11j0N89l02m05M43K17o38J01N10k65j41K59
3250d38j25j06N74p0o05L93O63m15m91L56L54o4J25l54j61P98N64r65o94R92O55
3271I86n52m31l6K91P40j46j176m2J433J47j241l96P41M79k8p36p14P69J189p08
3291E69j504M29J177q5q11m14K08Q64K03j071p75J250R17j080r20O31P08J36n15
$$ plain form
3310 -83 -872 -573 768 750 -767 -979 487 929 48 -574 -370 412 1040 148 -1096 -287 1279 734 -719
3329 -719 -750 249 712 382 -570 -901 160 1006 -163 -1280 -517 450 32 -613 -858 -635 23 73 -984
3348 -984 -1307 -235 80 -894 -1046 -564 -432 -442 -526 -950 -821 -109 -357 -1027 -571 120 -194 -648 -389 -262
3368 -262 -202 125 -120 -504 112 621 26 -234 278 398 232 405 337 19 386 819 284 223 659 411 191
3389 191 623 543 -45 147 758 513 151 191 95 334 794 324 -524 -8 837 501 -277 -87 255 541 600
3410 600 -55 -544 360 1152 384 -423 234 993 850 445 55 302 1266 1341 122 -16 1303 1664 736 327
3430 327 760 1269 1430 770 31 700 1920 1292 -110 298 1464 1386 504 -84 214 1105 1315 -136 -1061
3449 -1061 240 1383 262 -985 -661 234 471 -294 -1489 -1268 271 470 -1263 -1753 -579 61 -626
$$ packed form
3310h3p89K99J341j8j517k12J466M42q81o22K04P82O28q92j244Q09J566n45j453
3329g19l1R99M63l30r52l31J061Q46j169j117P63R67m18o45k45K23O58N0j057
3348i84l23J072L15r74j52M82J32j0q4m24J29P12k48o70M56O91l14m54K59J27
3368b62O0L27k45l84O16N09n95k60N12J20j66J73o8l18L67M33n35o1M36k48k20
3389A91M32q0n88J92O11k45l62M0r6K39M60m70q48N16Q45l36p78J90L42K86N9
3410F00o55m89R04P92p68q07O57P59j43m05l90K47R64P5j219j38J319L61r28m09
3430C27M33N09J61o60p39O69J220o28j402M08J166p8q82n88K98Q91K10j451r25
3449a061J301J143j121j247L24Q95K37p65j195K21J539J99j733m90J174O40o87
$$ plain form
3466 -626 -1390 -1489 -692 80 -601 -1766 -1210 252 -138 -1320 -1271 -482 -120 -193 -808 -999 27 601 -475
3485 -475 -1057 -153 676 150 -480 -352 96 693 372 -594 -371 859 931 -375 -623 129 523 230 -210 -482
3505 -482 -24 754 150 -806 -389 497 114 -511 -405 -200 -20 111 -305 -682 -100 221 -386 -541 44 115
3525 115 -207 -112 46 -21 152 85 -194 268 789 343 -177 398 849 575 312 329 497 912 1000 298 61 996
3547 996 1245 410 246 745 793 669 523 201 267 836 576 -226 132 711 231 -264 -46 172 92 -97 -568
3568 -568 -621 143 265 -808 -1114 -254 150 -554 -1002 -742 -322 103 -447 -1467 -957 259 -31 -1112 -1130
3587 -1130 -150 89 -219 -851 -979 -120 568 -249 -1132 -378 492 88 -544 -425 -63 289 120 -622 -575 449
3607 449 452 -666 -814 119 312 -250 -607 -569 11 380 -408 -1347 -583 565 -108 -1177 -944 -142 108 -504
$$ packed form
3466f26p64r9P97P72o81j165N56J462l90j182M9P89L62p3o15j91J026N74j076
3485d75n82R04Q29n26o30J28M48N97l21r66K23J230P2j306k48P52L94k93m40k72
3505d82M58P78o04r56M17Q86l83o25J06K05J80J31m16l77N82L21o07j55N85P1
3525A15l22R5J58o7J73o7k79M62N21m46n20N75M51k74k63J7J68M15Q8p02k37R35
3547I96K49q35j64M99M8j24j46l22O6N69k60q02L58N79m80m95K18K18q0j89m71
3568e68n3P64J22j073l06Q60M04p04m48K60M20M25n50j020N10J216k90j081j8
3587a130R80K39l08o32j28Q59O88q17q83P54Q70m04o32J19L62L52j69p42M7J024
3607D49Lj118j48R33J93n62l57L8N80L69p88r39P64J148o73j069K33Q02K50o12
$$ plain form
3627 -504 -1244 -1095 62 412 -849 -1559 -349 486 -217 -987 -871 -209 368 -46 -971 -649 631 579 -631
3646 -631 -538 348 589 212 -196 -157 597 1005 190 -471 489 1260 563 -168 287 907 884 376 -167 143 1257
3667 1257 1147 -127 -303 885 1136 363 -261 75 768 1053 264 -661 24 1100 618 -440 -303 482
3685 482 587 220 -245 -201 492 672 -141 -490 315 761 117 -167 257 457 375 55 -258 237 904 452 -444
3706 -444 15 931 645 -100 -82 405 769 630 -189 -493 509 1074 37 -563 87 690 418 -142 -363 -27
3726 -27 658 346 -600 -543 416 335 -478 -507 -20 103 -44 -483 -667 24 358 -410 -1013 -170 418 -176 -829
3747 -829 -564 3 258 -106 -949 -664 494 491 -697 -842 166 585 63 -566 -598 78 777 152 -780 -375
3767 -375 741 489 -291 -231 225 470 296 -109 -312 570 952 97 -306 491 814 269 47 226 604 797
$$ packed form
3627e04p40J49J157L50j261p10J210Q35p03p70J16O62N77m14r25L22J280n2j210
3646f31R3Q86K41l77m08L9P54M08q15o61R60P71o97p31M55O20k3n08n43L10J114
3667A257j10j274j76J188K51p73o24L36O93K85p89r25O85J076m82j058J37P85
3685D82J05l67m65M4O93J80q13l49Q05M46o44k84M24K00q2l20l13M95O67m52q96
3706d44M59R16k86p45J8M87L64j39q19l04J002N65j037o00O50O03k72n60k21L36
3726b7O85l12r46N7R59q1q13k9M87J23j47m39j84O91L34p68o03Q43N88n94o53
3747h29K65N67K55l64q43K85J158lj188j45J008M19n22o29l2O76O99o25r32M05
3767c75J116k52p80O0M56K45j74m05k03Q82L82q55m03P97L23n45k22J79L78J93
$$ plain form
3787 797 490 -155 296 1222 882 -104 149 991 1037 566 149 224 917 1295 463 -179 665 1289 755 185 357
3808 357 755 857 596 90 95 926 881 39 -8 655 577 83 2 197 339 331 1 -474 151 597 -175 -709 -128
3831 -128 429 3 -529 -738 -263 241 71 -883 -867 173 240 -696 -1049 -407 51 2 -491 -1001 -464 375 -117
3852 -117 -1012 -695 116 31 -545 -708 -502 -65 72 -613 -949 -130 298 -560 -936 -312 -29 -328 -694 -831
3872 -831 -464 95 -207 -1109 -917 85 -38 -952 -1039 -535 -76 -212 -883 -1302 -547 186 -415 -1270 -872 -88
3892 -88 -213 -545 -856 -734 -90 183 -554 -916 -105 244 -276 -467 -59 1 -16 13 -154 -25 460 163 -254
3913 -254 113 624 229 -205 103 445 403 227 -69 -23 526 704 -156 -432 255 539 26 -264 -253 13 379
3934 379 90 -653 -419 289 126 -535 -390 -33 -59 -179 -390 -474 -117 73 -429 -672 14 283 -443 -691 -112
$$ packed form
3787G97l07o45M51R26l40r86K53Q42M6m71m17P5O93L78q32o42Q44O24n34n70J72
3808C57L98J02k61n06NQ31m5q42m7O63p8m94q1J95J42ql30m75O25M46p72n34N81
3831a28N57m26n32k09M75N04j70r54J6J040O7r36l53O42M58m9m93n10N37Q39m92
3852a17q95L17Q11q5n76j63K06M37J37o85l36Q19M28q58l76O24K83k99l66j37
3872h31L67N59l02r02J92J002j23r14q7N04M59j36o71m19P55P33o01q55L98P84
3892h8j25l32l11J22O44K73p37l62Q11L49n20j91M08O0j7K9j67J29M85k97m17
3913b54L67N11l95m34L08L42m2j76k96M6N49J78q60k76O87K84n13k90J1K66L66
3934C79k89p43K34P08j63o61J45L57k6j20k11q4L57J90n02k43O86K69p26k48N79
$$ plain form
3955 -112 220 105 -256 -465 -142 624 267 -695 -379 658 742 -71 -405 -94 478 750 -13 -627 46 977
3975 977 394 -559 -384 331 455 95 -375 -442 378 584 -405 -797 -96 355 -293 -677 -535 -172 -16 -332
3995 -332 -936 -642 127 -121 -1003 -844 -133 -37 -464 -800 -624 -46 279 -450 -1014 -218 486 -19 -643 -414
4015 -414 124 391 258 -307 -256 538 818 97 -211 462 747 567 307 218 419 826 656 89 273 732 637
4036 637 292 397 571 431 378 361 120 382 506 193 -24 485 433 15 -21 220 220 100 65 -104 23 406
4058 406 275 -272 105 479 219 -32 135 214 321 432 273 162 501 651 216 279 779 704 415 456 675
4079 675 736 766 583 369 767 1124 674 142 511 1074 816 426 315 460 920 846 63 -239 593 970 265
4100 265 -384 -28 447 485 24 -564 -384 432 273 -692 -733 36 164 -346 -624 -585 -154 219 -467 -1009 -321
$$ packed form
3955a12L32j15l61k09L23P66l57r62L16J037Q4q13l34L11N72K72p63o14O73R31
3975I77n83r53J75P15J24l60m70o7Q20K06r89l92P01M51o48l84J42L63J56l16
3995c32o04K94P69k48q82J59P11R6m27l36J76N78L25p29n64P96P04n05o24K29
4015d14N38K67j33n65N1P94K80p21l08O73K85j80k60q9K01M07j70n67J84M59r5
4036F37l45J05J74j40n3j7k41K62J24l13k17N09n2m18l6K41%j20l5j69J27L83
4058D06j31n47L77L74k60k51J67P9J07J11j59j11L39J50m35O3N00p5k89M1K19
4079F75O1L0j83k14L98L57m50n32L69N63k58l90j11J45M60p4p83l02Q32L77p05
4100B65o49L56M75L8m61n88J80Q16j59r65m1P69J28n10k78L9M31L73o86n42O88
$$ plain form
4121 -321 345 -267 -905 -528 97 149 -209 -672 -517 360 367 -576 -749 280 747 62 -540 -271 348 712 136
4142 136 -634 -147 807 678 -386 -498 310 733 386 -285 -469 243 865 55 -666 -111 535 325 -279 -311
4162 -311 -38 311 245 -387 -497 253 467 -242 -500 117 334 63 -196 -263 11 469 153 -396 -146 529 388
4183 388 -191 -188 151 384 523 165 -175 347 768 353 -170 186 438 404 373 176 34 399 605 205 1
4204 1 142 328 94 252 200 -20 51 331 90 -205 -17 -31 -94 -59 -48 -464 -290 70 -156 -533 -313 -154 -326
4227 -326 -256 -442 -578 -319 -33 -475 -741 -275 -110 -400 -576 -473 -329 -203 -260 -630 -663 41 -18 -642 -659 -108
4249 -108 -30 -291 -609 -641 -132 328 -211 -962 -481 316 60 -578 -625 -237 176 137 -619 -895 -21 549 -186
4270 -186 -873 -403 170 212 -350 -820 -459 418 328 -693 -805 165 499 -144 -615 -366 87 393 -52 -718
$$ packed form
4121c21O66o12o38L77O25N2l58m63J55Q77Pr43j73J029M67o85o02K69O19L64n76
4142A36p70M87R54j29j064j12Q08M23l47o71j84P12O22q10p21N55O46k10o04l2
4162c11K73L49o6o32j10P50K14p09k58O17K17k71k59o7K74M58l16n49K50O75j41
4183C88n79LL39K33J39l58l40N22M21m15n23L56K52l4l1j97j42L65K06m00k04
4204AJ41J86k34J58n2k20P1K80k41k95J88j4o3L5J1m16J74L60k26l77K20J59j72
4227c26P0j86j36K59K86m42k66M66J65k90j76J03J44J26n7l70l3P04n9o24j7N51
4249a08P8k61l18l2N09M60n39p51M81P97k56o38m7L88M13l9p56k76Q74N70p35
4270a86o87M70N73M2n62m70L61Q77r0j021j12R70L34o43m71K49M53L06m45o66
$$ plain form
4290 -718 -258 601 307 -555 -475 191 471 45 -286 -330 363 675 -59 -593 47 705 314 -274 -201 169 611
4311 611 421 -354 -280 586 812 -97 -456 83 567 455 92 -203 21 806 521 -262 -225 524 600 175 12
4332 12 35 267 655 223 -265 -30 507 254 -75 58 186 269 322 -3 -325 61 349 -8 -265 79 178 -12
4354 -12 -24 -185 -316 -8 145 -255 -464 -91 27 -214 -298 -268 -336 -74 -63 -397 -563 -33 112 -336 -380 -266
4376 -266 -192 8 -12 -506 -452 148 197 -418 -419 -82 109 176 -64 -477 -273 445 224 -474 -315 265 278 54 -216
4399 -216 -317 70 463 40 -574 -155 379 120 -324 -312 -141 226 140 -375 -641 97 467 -230 -578 -187 211
4420 211 61 -225 -438 -242 452 285 -615 -608 196 447 -79 -339 -30 311 602 47 -513 39 859 670 -236
4441 -236 -92 533 870 514 7 -38 788 1129 438 -168 344 1024 764 284 183 446 895 821 85 26 715
$$ packed form
4290g18M60Q59k94q62Q0O66K80m26l31m4O93L12p34n34O40O58l91n88P3L70M42
4311F11j90p75P4Q66K26r09l59N39M84j12l63k95K24P85k85p83L7P49P6m25j63
4332A2K3K32L88m32m88K35N37k53l29J33J28Q3N3l25l22L86K88l57k57L44R9j90
4354a2j2j61j31L08J53m00k09L73J18k41q4L0o8K62J1l34j66N30J45m48m4J14
4376b66P4K00k0m94N4O00M9o15jL37J91O7k40m13K04P18k21o98J59N80J3k24k70
4399b16j01L87L93m23o14M19N34k59m44J2J71L67q6n15k66P38L70o97l48L91L98
4420B11j50k86k13J96O94j67r00PQ04K51n26k60L09L41K91n55n60N52Q20j89r06
4441b36J44O25L37l56n07m5Q26L41o91o06N12O80k60m80j01K63M49p4p36n9O89
$$ plain form
4462 715 982 259 -50 238 507 587 249 -125 11 586 399 -400 -369 249 313 -127 -331 -352 -99 240 -189
4483 -189 -640 -296 187 -75 -548 -402 -246 -46 -7 -335 -615 -115 255 -184 -532 -260 -32 -36 -29 -256 -330 110
4505 110 326 -111 -363 59 220 47 -31 -136 -52 267 252 -245 -389 222 249 -94 -171 -139 -107 125 -13 -434
4527 -434 -362 156 94 -389 -420 -163 -139 -109 -243 -510 -223 179 -110 -619 -322 121 11 -184 -304 -331 117 226
4549 226 -66 -438 65 436 192 -216 -103 231 550 455 28 -58 558 775 184 -85 521 775 584 315 117
4570 117 315 832 724 -3 9 677 723 247 43 165 496 722 231 -398 72 711 326 -245 -220 135 308
4591 308 97 -279 -403 120 520 -163 -671 -251 234 17 -367 -383 -209 153 122 -527 -671 107 387 -125 -375
4612 -375 -108 181 210 -98 -448 -154 502 290 -341 -266 196 341 107 -200 -288 75 401 57 -481 -131 325
$$ packed form
4462G15K67p23l09K88K69Q0l38l74J36N75j87p99L1O18O4m40k04k1K53L39m29
4483a89m51L44M83k62m73J46J56K00L9l28k80N00L70m39l48K72K28mPk27p4M40
4505A10K16m37k52M22J61j73p8j05Q4L19j5m97j44O11K7l43p7L2L2K32j38m21
4527d34P2N18o2m83l1K57K4L0j34k67K87M02k89n09K97M43j10j95j20k7M48J09
4549B26k92l72N03L71k44m08J13L34L19r5m27q6O16K17n91k69O06K54j91k69j98
4570A17J98N17j08p27J2O68M6m76k04J22L31K26m91o29M70O39l85n71K5L55J73
4591C08k11l76j24N23M00o83n08M20M85k17l84j6J74L62l1o49j44P78K80n12k50
4612c75K67K89K9l08l50K94O56k12o31P5M62J45k34l07q8L63L26l44n38L50M56
$$ plain form
4633 325 132 -347 -387 -209 32 87 -344 -594 -184 174 -301 -679 -387 -113 -156 -281 -610 -664 -222 -94 -542
4654 -542 -666 -260 -137 -265 -524 -553 -335 -58 -22 -509 -470 50 71 -227 -267 -97 21 228 4 -321 -54 474
4676 474 346 -152 27 265 352 311 137 -40 334 646 329 -142 103 509 480 189 75 91 380 539 -16
4697 -16 -265 235 625 161 -185 -103 159 405 250 -246 -231 305 484 -164 -352 123 262 257 0 -277 -45 517
4719 517 347 -332 -189 372 476 -5 -168 -20 351 547 205 -335 111 595 342 -124 29 399 411 276
4739 276 -120 -185 350 643 1 -282 164 495 183 -107 -234 -29 385 197 -388 -431 248 284 -239 -446 -247
4760 -247 75 41 -288 -583 -409 211 17 -627 -577 -132 -12 -215 -479 -464 -194 129 -261 -734 -363 113 -32
4781 -32 -373 -407 -217 -40 78 -341 -525 41 307 -98 -388 -140 105 150 97 -216 -275 242 343 -172 -292 141
$$ packed form
4633C25j93m79m0J78K41N5m31k50M10L58m75l78K92K74m3j25l29n4M42J28m48
4654e42j24M06J23j28k59k9K18K77L6m87L9N20K1k98m0J70J18K07k24l25K67N28
4676D74j28m98J79K38Q7m1j74j77L74L12l17m71K45M06k9k91j14J6K89J59n55
4697a6k49N00L90m64l46Q2K62K46j55m96J5N36J79o48j88M75J39nk57k77K32N62
4719E17j70o79J43N61J04m81j63J48L71J96l42n40M46M84k53m66J53L70J2j35
4739B76l96o5N35K93o42k83M46L31l12k90j27K05M14j88n85m3O79L6n23k07J99
4760b47L22l4l29k95J74O20j94o44N0M45J20k03k64J5K70L23l90m73L71M76j45
4781c2l41l4J90J77J18m19j84N66K66m05k90K48K45M5n3l13n9N17J01n15j20M33
$$ plain form
4803 141 282 108 -59 -93 115 399 312 -171 -67 368 271 -70 -35 38 245 413 103 -291 -5 502 286 -135
4825 -135 -62 259 349 206 -92 -172 207 523 147 -264 105 462 287 109 -117 66 379 492 -45 -232 330
4846 330 611 185 -149 5 216 442 308 -138 -78 441 519 -100 -212 224 407 199 50 -138 55 468 208
4867 208 -343 -180 357 302 -68 -280 -157 171 250 -113 -461 -110 395 -18 -503 -352 37 84 -89 -514 -535
4888 -535 96 259 -302 -646 -206 47 -154 -456 -532 -229 158 -1 -571 -567 -6 97 -354 -486 -301 -22 76
4909 76 -181 -608 -362 238 17 -479 -322 50 73 -41 -268 -361 119 278 -73 -432 -92 294 82 -131 -158
4930 -158 -12 187 260 -174 -142 181 398 11 -275 15 169 175 53 -201 -117 360 255 -175 -189 149 336 65
4952 65 -85 -150 64 331 179 -299 -185 308 234 -93 -89 -36 116 292 49 -187 -3 380 111 -167 -43 210
$$ packed form
4803A41J41j74j67l4K08K84q7m83J04M35r7l41L5P3K07J68l10l94K86N07k16m21
4825a35P3L21R0j43k98q0L79L16l76m11L69L57j75j78k26J83L13J13n37j87N62
4846C30K81m26l34J54K11K26j34m46O0N19P8o19j12M36J83k08j49j88J93M13k60
4867B08n51J63N37n5l70k12J23L28P9l63l48L51N05m13m85J51L89M7j73m25k1
4888e35O31J63n61l44M40K53k01l02p6L03L87j59n70MN61J03m51j32J85K79R8
4909G6k57m27K46O00k21m96J57L72K3j14k27r3M80J59l51l59L40L86k12k13k7
4930a58J46J99P3m34L2L23K17l87k86K90J54Oj22k54Q4M77j05m30j4L38J87k71
4952F5j50o5K14K67j52m78J14M93p4l27MN3J52J76k43k36J84L83k69k78J24K53
$$ plain form
4974 210 262 126 36 -132 150 458 95 -188 85 403 210 46 -26 79 337 302 -80 -230 286 340 12 -129
4996 -129 -15 153 139 44 -299 -137 262 129 -320 -382 2 35 -46 -255 -398 -177 118 -142 -636 -422 -13 -45
5018 -45 -347 -465 -336 -49 100 -342 -699 -219 117 -172 -564 -386 -81 88 -99 -407 -381 92 176 -347 -451
5039 -451 28 125 2 -166 -255 -52 266 53 -321 -162 323 288 -193 -187 13 163 147 -114 -273 99 403 110
5061 110 -316 -123 168 128 12 -152 -179 162 296 -137 -420 -22 254 126 -181 -139 51 255 146 -193 -225
5082 -225 265 339 -47 -102 168 251 265 105 -58 124 474 387 33 72 341 417 264 230 166 227 510 362 69
5105 69 205 549 303 82 168 256 303 352 132 -51 204 535 150 -126 77 198 191 145 -41 -102 123 243 -41
5128 -41 -275 -47 87 -50 -155 -179 -203 41 71 -345 -448 -20 135 -148 -310 -194 -66 184 -17 -333 -267 209
$$ packed form
4974B10N2j36r0j68K82L08l63k83K73L18j93j64p2J05K58l5l82j50N16N4l28j41
4996a29J14J68j4r5l43J62L99j33m49o2L84L3q1k09j43K21K95k60m94K14M09l2
5018d5l02j18J29K87J49m42l57M80L36k89l92J78L05J69j87l08K6M73Q4n23j04
5039d51M79R7j23j68q9K03L18k13l74J59M85l5m81OK00J50j6k61j59L72L04k93
5061A10m26J93K91m0j16j64k7L41J34m33k83L98K76j28l07M2J90K04j09l39l2
5082b25M90P4l86n5K70Q3J4j60j63J82L50q7l54L9K69P6j53l4o4O1K83j48k93
5105F9J36L44k46k21Q6Q8M7M9k20j83K55L31l85k76K03J21pm6j86o1K25J20k84
5128d1k34K28J34j37j05k4k4K44L0m16j03M28J55k83j62J16J28K50k01l16O6M76
$$ plain form
5150 209 146 -177 -270 -42 128 16 -74 -294 -36 214 67 -329 -119 158 192 -138 -191 -111 121 180 -138 -383
5172 -383 7 284 -72 -351 -218 44 118 -27 -353 -272 182 238 -323 -418 -14 179 -97 -254 -284 -20 321 61
5194 61 -365 -167 277 247 -148 -211 38 229 218 -59 -229 124 529 160 -202 29 369 345 220 -26 86 445
5216 445 475 101 -101 292 450 234 118 145 286 440 375 34 49 397 375 26 0 225 241 107 80 -38 57
5239 57 276 80 -243 -149 157 -19 -105 -22 -80 14 76 -31 -291 -75 126 -61 -165 -125 -99 -80 131 -41 -235
5262 -235 -44 146 -7 -150 -94 -51 42 35 -42 -279 -22 193 19 -228 -31 24 20 18 -174 -197 53 82 -184 -312
5286 -312 -23 98 -83 -223 -221 -159 -1 -18 -396 -382 55 9 -359 -358 -169 27 -90 -229 -370 -139 179 -136 -539
5309 -539 -168 106 8 -210 -343 -173 116 210 -243 -376 105 383 -33 -265 -112 186 319 60 -198 -95 351
$$ packed form
5150B09o3l23r3K28J70j12r0k20K58K50j47l96K10K77L4l30n3Q0K32N9l18k45
5172c83L90K77l56k79J33K62P4j45l26Q1M54N6n61r5M04J93k76j57l0K64L41k60
5194F1m26J98M44l0l95o3K49J91j1k77j70L53M05l69l62K31L40k4j25k46J12L59
5216D45L0l74k02L93J58k16j16K7J41J54o5l41J5L48k2l49k6K25J6j34k7j18R5
5239E7K19j96l23R4L06j76q6Q3n8R4O2j07k60K16K01j87j04M0K6J9K11j72j94
5262b35J91J90j53j43N6M3R3pp7k37K57K15j74k47J97N5mkj92k3K50K9k66j28
5286c12K89J21j81j40KO2J58j7l78J4M37m6l68JJ89J96j17j39j41K31L18l15m03
5309e39L71K74r8k18j33J70K89R4m53j33M81K78m16k32J53K98J33k59k58J03M46
$$ plain form
5330 351 404 -86 -218 274 436 203 8 -41 212 482 232 -193 -21 389 375 -88 -79 210 304 276 -1 -158
5352 -158 133 450 134 -217 68 291 239 -14 -122 2 303 263 -214 -193 162 376 -18 -112 -69 179 281 101
5374 101 -226 -120 265 232 -227 -166 136 184 30 -107 -137 51 214 51 -331 -95 204 63 -93 -105 -69 46
5396 46 84 -86 -317 -99 76 -118 -268 -118 -153 -76 -116 -219 -334 -28 43 -220 -309 -146 -100 -155 -105 -281 -278 -50
5420 -50 22 -287 -376 -103 -79 -155 -272 -273 -189 -30 -94 -327 -266 -35 33 -213 -303 -175 31 182 -70 -381 -26 218
5444 218 68 -276 -238 37 206 100 -111 -268 28 293 39 -327 -62 315 224 -16 -103 -3 209 271 -169
5465 -169 -271 173 496 88 -221 -41 177 340 117 -174 -74 382 405 -122 -163 261 390 147 -159 -122 250
5486 250 416 131 -305 -15 435 387 -64 -124 151 359 234 -99 -228 215 428 38 -240 80 266 200 -96
$$ packed form
5330C51N3m90j32M92J62k33j95m9K53K70k50m25J72M10j4m63RK89R4k8k77j57
5352a58K91L17l16l51K85K23n2k53j08J24L01m0m77K1L55K14l94r4M3K48J02j80
5374A01l27J06L85l3m59O1L02M8j54j37l0J88J63j63l82K36K99j41j56j2L6J15
5396D6L8j70k31K18J75j94j50J50l5P7m0j03j15L06P1k63q9J63M6n5N0j76LK28
5420e0P2l09q9K73K4p6j17jQ4J59o4k33O1K31O8k46r0J28K06J51k52l11L55K44
5444B18j50l44L8K75J69j06k11j57K96K65k54l66K65L77r1k40q7J00K12O2m40
5465a69j02M44L23m08l09J80K18J63k23k91J00M56K3n27m1M24J29k43l06L7L72
5486B50J66k85m36K90M50m8m51o0K75K08j25l33j29M43K13l90k78L20J86o6k96
$$ plain form
5507 -96 -175 -5 312 253 -177 -237 227 324 -39 -193 -43 149 211 -7 -267 -106 256 154 -258 -198 100 133 -54
5530 -54 -153 -249 6 186 -118 -365 -105 119 -24 -193 -179 -173 -61 -16 -217 -256 87 85 -253 -314 -83 -78 -129 -35 -257
5555 -257 -215 -46 -49 -208 -219 6 37 -73 -54 -6 -115 -2 -4 -119 -133 34 -43 16 53 -8 -89 67 122 -74 -55 134
5581 134 107 103 113 52 10 229 186 -84 29 248 188 -28 27 164 199 241 80 -50 164 409 147 -143 70 251
5605 251 237 106 -11 50 249 315 -9 -74 261 323 122 -39 72 174 347 180 -126 19 418 345 -74 -50
5627 -50 237 338 205 -25 -92 168 449 145 -189 56 414 175 -90 -197 76 272 115 -178 -245 218 350
5648 350 -126 -351 -32 248 128 -248 -270 -77 254 64 -374 -356 174 135 -275 -337 -126 -6 58 -217 -422 -117
5670 -117 107 -50 -452 -264 -3 29 -230 -296 -193 51 88 -251 -378 -40 101 -132 -275 -99 64 72 -4 -282
$$ packed form
5507i6p9J70L17n9m30o0M64R7l63j54J50J92O2k18k60J61L62j02m12O0K98L3j87
5530e4r9r6K55J80l04k47K60K24j43j69J4OJ12M5k01l9L43kl38o1K31Nn1R4k22
5555b57M2J69lj59j1K25L1j10J9M8j09J13kj15j4J67p7N9L7o1q1J56N5j96J9J89
5581A34k7mJ0o1m2K19m3k70J13K19o0k16N5J37L5M2j61j30K14K45k62k90K13J81
5605B51j4j31j17O1J99O6l24o5L35O2k01j61J11J02J73j67l06J45L99p3m19K4
5627e0K87J01j33k30o7K60K81l04l34K45L58k39k65j07K73J96j57k93o7M63J32
5648C50m76k25L19K80j20l76k2J93L31j90m38J8N30l9m10o2K11J20O4k75k05L05
5670a17K24j57m02J88K61L2k59o6J03K44L7l39j27L38J41k33j43J76J63Qp6k78
$$ plain form
5692 -282 -218 84 138 -209 -128 76 85 -61 -74 -90 -30 131 34 -138 -115 120 91 -127 -34 13 -74 96 62 -64 -40
5717 -40 132 -21 2 39 -17 -98 110 153 -29 24 112 71 18 77 48 -47 186 135 -7 17 238 182 -23 32 133 174
5743 174 222 36 -61 182 398 148 -77 113 243 187 59 -72 20 299 306 -77 -157 246 375 -30 -230 -44
5765 -44 154 214 78 -239 -104 369 172 -338 -289 90 198 -35 -272 -235 50 163 -183 -485 -208 252 -2
5786 -2 -348 -312 -103 161 -12 -345 -422 75 222 -209 -374 -20 140 66 -202 -377 -103 164 50 -347 -274 204
5808 204 85 -197 -267 -131 59 123 -114 -384 -61 220 -24 -272 -163 67 115 -88 -240 -164 62 117 -182 -295
5830 -295 -40 103 -37 -174 -110 1 60 -14 -201 -169 136 127 -95 -89 23 50 20 -12 7 41 202 165 45 66 145
5855 145 87 108 174 -27 111 188 192 55 97 238 167 156 185 129 101 265 226 5 85 217 198 104 114 88 134 307
$$ packed form
5692b82O4L02N4l47Q1K04Rj46j3j6O0J61r7j72K3K35k9k18R3M7q7J70l4j26K4
5717d0J72j53K3L7n6q1K08M3j82N3Q8m1n3N9k9r5K33n1j42K4K21n6k05N5J01M1
5743A74M8j86r7K43K16k50k25J90J30n6j28j31R2K79Pl83q0M03J29m05k00J86
5765d4J98O0j36l17J35M73j97n10M9L79J08k33k37L7K85J13l46l02K77M60k54
5786bl46L6K09K64j73l33p7M97J47m31j65L54J60p4k68j75K74K67j14l97P3M78
5808B04j19k82p0J36J90O4k37k70L23K81k44k48J09K30M8k03j52P6K26N5k99j13
5830b95K55J43j40j37O4J11N9p4j87L2L05rk22OJ12K7l0l2J9L4J61l7j20K1P9
5855A45n8K1O6k01J38P7Mj37M2J41p1j1K9n6k8J64l9k21Q0J32j9r4J0k6M6J73
$$ plain form
5881 307 62 -96 54 269 146 -123 9 121 108 89 -47 -200 91 237 -75 -216 26 170 102 -23 -101
5902 -101 -7 196 87 -228 -258 127 154 -88 -158 -74 88 105 -46 -255 -76 291 136 -277 -162 137 86 -112
5924 -112 -197 -161 107 160 -201 -328 -40 268 -20 -344 -267 -90 66 -104 -304 -287 162 87 -292 -388 -53 69
5946 69 -58 -272 -319 -76 194 -55 -490 -228 153 89 -215 -247 -31 151 106 -158 -259 59 290 28 -213 -34
5968 -34 238 158 -41 -99 -64 232 262 -27 -95 266 297 16 -1 101 158 228 153 -88 28 362 181 -113 -28 253
5992 253 204 63 50 14 76 279 75 -124 54 182 124 -51 18 -42 99 214 4 -79 90 173 53 -46 56
6015 56 22 66 125 12 -76 112 268 1 -67 -28 51 58 189 -25 -86 84 203 -16 -140 -15 35 -33 16 -122 -104
6040 -104 117 96 -173 -230 -25 -3 -102 -174 -161 -117 34 -57 -354 -255 57 1 -299 -220 -73 -80 -67 -277 -393 -76 123
$$ packed form
5881C07k45j58J50K15j23k69J32J12j3j9j36j53K91J46l12j41K42J44o8j25p8
5902a01R4K03j09l15l0L85K7k42p0Q4J62J7j51k09J79L67j55m13J15K99n1j98
5924a12q5L6K68N3l61j27K88L08k88l24P7J77J56j70k00J7M49p5l79r6L35J22
5946F9j27k14m7K43K70k49m35K62L81o4l04l2K16J82m5k64j01L18K31k62k41J79
5968c4K72q0j99n8L5K96L0k89o8L61L1k81j7J02N7P0p5k41J16L34j81k94Q5K81
5992B53m9j41j3l6O2K03k04j99J78J28n8j75O9o0J41J15k10q3J69Q3j20r9J02
6015E6l4M4N9j13q8J88J56k67o8L9P9PJ31k14o1J70J19k19j24J25N0o8M9j38J8
6040a04K21k1k69n7K05K2r9p2J3M4J51r1k97R9L12n6l00P9J47pJ3k10j16L17J99
$$ plain form
6065 123 -168 -384 -262 79 51 -208 -262 -188 35 95 -210 -420 -53 255 -82 -261 -136 36 211 55 -270
6086 -270 -227 176 155 -167 -305 66 208 56 -108 -196 41 280 120 -243 -1 282 139 -96 -115 59 120 177
6108 177 -82 -128 112 287 13 -186 7 222 197 -8 -57 12 217 200 -109 -191 219 296 40 -43 -19 128 215
6131 215 145 -109 -52 295 200 2 -17 184 133 164 69 -96 122 261 177 -63 13 116 11 35 88 12 56 122 -29
6156 -29 -118 40 141 -21 -14 114 8 -56 88 -56 -76 -35 17 -110 -92 -34 -92 -42 -48 -59 -194 -58 17 -140 -143 -70
6182 -70 -61 -60 -111 -133 -211 -44 54 -175 -178 4 -14 -74 -107 -194 -97 115 108 -197 -147 109 -25 -175 -133 -28 54 36 -80
6209 -80 -182 -29 215 1 -202 -106 158 62 22 -97 -79 144 167 -123 -227 88 182 -49 -93 3 33 137 76 -169
6233 -169 -33 253 132 -132 -141 167 166 83 15 -91 187 264 116 -214 34 352 244 -9 -9 118 209 153 -61 -101
$$ packed form
6065A23k91k16J22L41k8k59n4P4K23O0l05k10L67L08l37j79J25J72J75j56l25
6086b70M3M03k1l22j38L71J42j52j64q8K37K39j60l63K42K83j43k35j9J74O1N7
6108A77k59m6K40J75k74j99J93K15k5k05m9O9K05j7l09q2M10P7k56q3K4J47Q7
6131B15p0k54N7L47r5j98j9K01n1L1r5j65K18J39q4k40P6J03j05K4N3p6M4O6j51
6156b9q9J58J01j62PJ28j06o4J44j44k0M1N2j27J8N8n8N0oj1j35J36P5j57lP3
6182g0RJn1k2p8J67R8k29lJ82j8o0l3q7R7K12pl05N0K56j34j50M2J05Q2j8j16
6209h0j02J53K44k14k03R6K64r6m0j19J8K23K3k90j04L15R4k31m4R6L0J04o1k45
6233a69J36K86j21k64rL08jq3o8j06K78P7j48l30K48L18j08k53%J27R1n6k14m0
$$ plain form
6257 -101 208 288 49 -42 154 244 224 142 -3 51 256 259 -145 12 282 287 82 -30 11 165 194 128 -39 22 219
6282 219 153 -104 -38 71 58 48 16 -86 30 137 25 -92 -24 157 10 -82 -89 -89 79 38 -74 -232 -71 95
6306 95 -75 -116 -78 -57 -67 44 -203 -225 78 47 -98 -99 -93 -112 -15 20 -119 -187 32 19 -146 -229 -104 -49 -31 -12 -103
6333 -103 -147 36 56 -174 -139 81 48 -21 -140 -95 10 74 22 -281 -102 191 51 -108 -128 67 97 138 -141 -254
6357 -254 70 263 -5 -258 -58 166 158 -70 -130 -88 173 271 -97 -240 158 227 26 -114 -77 199 239 38 -202
6380 -202 -90 283 224 -116 -92 138 280 48 -24 -119 124 291 157 -188 -2 333 166 -12 -56 23 188 185 -36
6403 -36 -137 181 328 30 -204 -2 87 138 -17 -60 -33 145 136 -228 -217 40 52 -18 -120 -106 8 70 -8 -250
6427 -250 -198 125 43 -212 -123 -93 -6 -54 -122 -187 -163 116 -74 -155 -97 0 -31 -57 -170 -153 -115 90 -22 -230 -44
$$ packed form
6257a01L09Q0k39r1J96R0k0q2j45N4K05Lm04J57K70Nk05j12M1J54K9o6j67O1J97
6282B19o6k57O6J09j3j0l2j02J16J07j12j17O8J81j47r2p%J68m1j12j58J61J66
6306I5j70m1L8K1j0J11k47k2L03l1j45jOj9R7L5j39o8K19j3j65q3J25N5J8J9r1
6333a03m4J83K0k30L5K20l3o9j19M5J05O4n2l03J79K93j40j59k0J95L0M1k79j13
6357b54L24J93k68k53K00K24qk28o0M2K61R8l68j43L98O9k01j40L7K76M0k01k40
6380b02J12L73n9l40K4K30J42k32p2r5K43J67j34l45J86L35j67j78m4P9J65lk21
6403c6j01L18J47k98k34K02Q9N1j55m3K7J78rl64J1K57J2p0j02J4J14O2p8k42
6427b50N2L23q2k55Q9L0Q7m8o8o5K4K79j90q1N8R7l1k6j13J7L8K05j12k08J86
$$ plain form
6452 -44 29 -118 -96 -54 -54 -45 90 -107 -246 -9 8 -193 -169 -92 13 8 -74 -130 -104 33 42 -183 -129 -18 44 -46 -12
6479 -12 -100 -86 27 -105 -172 -113 114 80 -124 -81 -34 -30 152 60 -125 28 306 87 -59 -63 65 96 128 32 -56 139
6505 139 168 4 -70 65 252 180 49 22 43 316 251 -56 -110 244 239 -1 -47 129 150 155 77 -175 11 266 203
6530 203 -41 -6 148 129 20 -69 -37 115 251 42 -209 41 216 71 -124 -59 35 108 161 -112 -169 109 201
6553 201 -63 -183 -2 63 17 -14 -174 -68 136 106 -189 -166 59 124 -58 -64 -66 -47 116 -34 -229 -12 207 -16
6577 -16 -168 -85 31 45 36 -75 -140 14 82 -126 -203 -23 87 26 -56 -115 -141 72 42 -207 -260 -29 114 -35 -142
6602 -142 -103 31 40 12 -207 -130 103 70 -63 -81 39 71 78 5 -32 -23 174 171 -18 -46 137 206 95 35 -8 107 269
6629 269 122 -83 -25 178 187 82 31 42 162 226 20 -5 122 308 153 5 79 131 236 123 -35 -83 162
$$ packed form
6452d4P3j47K2M2%RJ35j97j39K37J7k01K4P7J05nq2n6K6J37Rk25N4J11O2r0L4
6479a2q8J4J13j32o7N9K27l4k04M3M7MJ82r2j85J53K78k19j46mJ28L1L2r6q8J95
6505A39K9j64p4J35J87p2j31k7K1K73o5l07n4L54nk40m6J76K1Np8k52J86K55o3
6530B03k44L5J54j9j09q9L2J52J36k09k51K50J75j45j95O5R4P3N3k73n7K78R2
6553B01k64j20J81O5m6l1j60J06K04l0k95K3K25O5j82okJ9J63j50j95K17K19k23
6577a6j52Q3J16J4rj11o5J54O8k08p7J80J10o1q2n9k6K13l0k49n3K31J43j49j07
6602a42L9J34Rk8k19P7K33l3j33j8J20L2Pp3l7RJ97lj89k8J83O9j11o0m3J15J62
6629B69j47k05N8K03Rj05n1J1J20O4k06k5J27J86j55j48P4N2J05j13j58m8K45
$$ plain form
6652 162 307 90 -107 77 202 73 -31 -127 -87 236 149 -156 -153 94 157 -37 -127 -87 83 165 -5 -222 -115
6675 -115 210 138 -108 -162 65 81 54 -103 -140 28 243 0 -203 -114 176 97 -86 -129 -55 159 57 -94 -302
6698 -302 3 161 -31 -193 -75 -15 63 18 -199 -137 98 71 -189 -305 -60 25 -66 -189 -174 -33 78 -62 -249
6721 -249 -199 63 50 -109 -226 -123 -6 42 -138 -265 -105 69 -59 -220 -40 31 50 -29 -56 -145 2 115 -66
6744 -66 -115 40 145 61 8 -1 -42 38 179 3 -85 219 122 2 -27 65 18 89 102 -58 11 84 132 8 -39 35 23
6771 23 61 60 -78 25 182 72 -60 -32 8 65 12 13 -93 48 164 39 -79 -58 136 105 -57 -101 -6 90 166
6796 166 -48 -170 133 164 -4 -194 -88 150 138 31 -133 -93 151 155 -126 -129 62 124 31 -176 -73 16 154
6819 154 -87 -246 -137 100 41 -272 -170 -18 -2 -28 -233 -264 -65 168 -105 -296 -183 61 -24 -234 -307 -148
$$ packed form
6652A62J45k17j97J84J25j29j04r6M0L23q7l05LK47O3j94r0M0J70Q2j70k17J07
6675a15L25p2k46n4K27J6k7j57l7J68K15k43k03Q9K90p9j83m3P4K14j02j51k08
6698c02L05J58j92j62J18O0P8m5k17O2K35k7k60j16K45Q5r1j23J5J41J11j40j87
6721b49N0K62j3j59j17J03J17M8j80j27J60J74j28j61J80P1J9p9k7q9J47J13j81
6744f6m9J55J05q4n3rm1Q0J41j76q8L04r7j20k9R2m7P1J3j60O9P3M8j24m7P4j2
6771B3L8jj38J03J57j10j32K8M0N7n3Jj06J41J16j25j18K1J94l1j62m4R5R6P6
6796A66k14j22L03L1j68j90J06K38j2j07j64M0K44Mk81lJ91O2r3k07J03Q9J38
6819A54k41j59J09K37n9l13J02J52J6k6k05l1J99K33k73j91J13K44q5k10p3J59
$$ plain form
6841 -148 94 52 -263 -370 57 152 -153 -311 -110 3 113 -103 -252 -106 211 170 -263 -175 96 119 -32 -142
6863 -142 -84 90 174 42 -152 32 223 157 -8 -60 122 167 100 -43 -116 146 289 39 -109 67 198 139 17
6886 17 -42 70 152 255 -100 -98 112 157 35 -41 -14 78 194 45 -102 -14 127 126 -13 -66 11 111 154 88 -62
6911 -62 26 175 162 -16 -1 168 151 139 71 -65 84 255 155 -56 -40 152 101 34 -9 -18 160 146 -49 -172 67
6936 67 231 39 -118 -89 -23 86 66 -130 -154 50 240 -93 -159 -102 93 107 -92 -230 -131 128 104 -234 -352
6959 -352 4 146 -63 -251 -215 -23 139 -72 -319 -191 143 64 -224 -247 -15 138 77 -159 -227 67 237 -33
6981 -33 -309 -105 253 142 -166 -186 -103 229 174 -171 -181 130 189 -17 -132 -35 96 145 8 -236 -103 215 141
7004 141 -210 -157 102 206 62 -43 -81 139 284 70 -121 -18 199 142 -11 -17 45 194 164 -39 -147 111
$$ packed form
6841a48K42m2l15j07M27R5l05j58K01J13J10k16j49J46L17m1m33Q8K71K3j51j10
6863a42N8J74Q4j32j94J84J91o6j65n2J82M5o7j43p3K62J43k50j48J76J31n9j22
6886A7n9J12Q2J03l55KK10M5j22p6K7R2J16j49j47Q8J41jj39n3P7J00M3o6j50
6911f2Q8J49j3j78J5J69j7j2o8j36J49J71j00k11J6J92n1o7m3rJ78j4j95j23K39
6936F7J64j92j57K9O6J09k0j96k4K04J90l33o6N7J95J4j99j38R9K59k4l38j18
6959c52L56J42k09j88L6J92J62k11k47J28L34p9k88k3K32J53o1k36o8K94J70k70
6981c3k76K04L58j11l08k0Q3L32n5l45j0L11N9k06j15R7J31M9j37k44J33L18p4
7004A41l51N3K59J04j44j05l8K20J45k14j91J03K17n7j53oO2J49l0k03j08K58
$$ plain form
7026 111 237 83 -120 6 196 185 50 -25 -30 186 210 -9 -4 82 166 73 43 28 59 156 115 29 -65 163 122 -82
7052 -82 -41 -2 59 104 84 -51 -25 111 61 -75 4 -29 -13 52 -36 -83 -83 105 -7 -121 -124 61 23 -34 -112 -95 21
7079 21 115 -11 -268 -95 90 7 -154 -183 -135 19 58 -157 -217 20 105 -104 -200 -144 50 50 -52 -255 -183 100
7103 100 68 -186 -317 -33 76 -23 -125 -162 -4 110 -87 -202 -117 164 85 -169 -140 16 145 49 -149 -148 83
7126 83 219 -62 -252 -63 148 111 -58 -105 48 203 78 -133 -222 179 249 -25 -146 -40 151 193 48 -163
7148 -163 -5 323 177 -72 -125 214 240 64 -50 -63 98 284 28 -237 -25 152 193 -21 -111 69 181 125
7170 125 -87 -73 126 230 -22 -74 31 144 11 -2 -4 -28 200 47 -95 -37 177 169 21 -49 -18 80 116 36 -160
7195 -160 -85 97 89 -72 -75 -27 -14 -3 -53 -135 -74 54 21 -128 -93 -16 23 -12 -84 -171 -90 19 -1 -226 -157 33 16
$$ packed form
7026A11J26j54k03J26J90j1j35p5nK16K4k19NQ6Q4r3l0j5L1R7m1q6r4K28m1k04
7052h2M1L9O1M5k0j35K6J36n0j36P9l3J6O5q8m7%J88j12j14lJ85l8n7p8J7J16
7079B1R4j26k57J73J85q3j61k9M8J54L9k15o0K37Q5k09r6N6J94%j02k03P2K83
7103A00l2k54j31K84J09r9j02l7J58J14j97j15Q5K81p9k54K9J56J29r6j98JK31
7126H3J36k81j90J89K11l7j69m7J53J55j25k11q9M01P0k74j21J06J91M2j45k11
7148a63J58L28j46k49n3L39K6j76j14j3J61J86k56k65K12J77M1k14r0J80J12n6
7170A25k12J4J99J04k52n2J05J13j33j3kk4K28j53j42N8K14qj48p0L1R8L6q0j96
7195a60P5J82qj61lM8J3J1n0q2O1J28l3j49L5P7L9l5p2q7Q1J09k0k25O9J90j7
$$ plain form
7222 16 23 -108 -176 -56 138 -11 -292 -83 102 33 -156 -137 -89 140 146 -173 -221 59 245 -50 -166 -88 98 125
7246 125 -17 -215 -98 256 155 -129 -228 94 255 67 -175 -164 53 246 -2 -238 -119 199 169 -209 -222
7267 -222 -22 159 157 -150 -241 42 367 30 -301 -90 215 210 -48 -193 3 302 232 -147 -206 166 385 140
7289 140 -127 -70 227 294 145 -192 4 307 211 -68 -103 171 261 169 -38 -101 116 285 69 -189 -24 244
7311 244 161 -139 -84 -39 92 147 -151 -174 81 125 -82 -150 -53 39 13 -135 -192 -149 63 -12 -159 -231 -45 8 -63
7336 -63 -66 -153 -103 48 43 -140 -148 10 8 -113 -82 -64 -153 38 65 -160 -122 56 24 -129 -85 -44 13 44 -9 -191 -59
7363 -59 46 120 -122 -92 -1 109 5 -135 -160 -86 100 -44 -256 -62 76 -12 -157 -187 -119 103 127 -162 -232 62
7387 62 224 -60 -198 -42 75 120 14 -132 -80 188 256 -161 -162 139 255 130 -58 -90 186 299 101 -148
$$ packed form
7222A6Pj31o8J20J94j49k81K09J85o9j89J9M8K29Ol19m8K80J86k95j16P8J86K7
7246A25j42j98J17L54j01k84r9L22J61j88k42J1K17J93k48k36J19L18l0l78j3
7267b22K00J81kl07r1K83L25l37l31K11L05nk58j45J96K99p0l79n9L72K19k45
7289A40k67N7K97O7j49l37J96L03r6k79l5K74R0r2k07o3K17J69k16k58J65K68
7311B44q3l00N5M5J31N5k98k3K55M4k07o8R7R2k6j48n7M3K12p5j47p2J86N3p1
7336f3lq7N0J51nj83qJ58kj21L1J8q9J91K7k25L8J78l2j53M4M1N7L1n3j82J32
7363e9J05P4k42L0R1J10j04j40k5P4J86j44k12J94J38q8j45l0O8K22K4k89p0K94
7387F2J62k84j38J56J17M5j06j46N2K68O8m17jL01J16j25j88l2K76J13j98k49
$$ plain form
7409 -148 28 286 263 -7 -78 135 277 178 -70 -75 191 346 -4 -192 73 213 151 -49 -111 45 232 158 -233
7432 -233 -119 59 199 -79 -127 -22 138 172 -85 -201 -19 170 64 -169 -174 93 124 5 -138 -66 50 119
7454 119 -46 -213 -33 183 26 -148 -58 9 105 70 -92 -144 104 157 -68 -151 41 111 40 8 -104 -52 97 109
7478 109 -172 -127 111 29 -66 -78 -108 -87 23 -28 -194 -144 10 -4 -41 -96 -60 -53 -10 -41 -177 -43 57 17 -131 -88
7504 -88 -40 9 96 -7 -114 29 91 58 -117 -11 83 77 66 -3 5 118 282 -16 -95 36 223 30 -16 -23 49 149
7530 149 171 -63 -170 170 268 -3 -108 10 142 248 9 -154 27 263 160 -171 -175 125 272 29 -65 -82
7552 -82 149 268 17 -239 9 272 129 -113 -168 69 218 161 -157 -159 134 355 -20 -230 23 224 193 -16
7574 -16 -182 -15 151 153 -158 -92 244 228 5 -196 -30 168 117 -34 -192 -25 255 56 -227 -162 98 92 30
$$ packed form
7409a48J76K58k3k70p1K13J42r9k48nK66J55l50j88K65J40o2k00o2J56J87p4l91
7432b33J14J78J40k78m8J05J60L4k57j16J82J89j06k33nK67L1j19j43P2J16O9
7454A19j65j67J80K16j57j74R0O7R6l5j62n2K48N3k25q3J92P0p1l2j12N2J49J2
7478A09k81M5K38q2r5j2l0K1J10n1j66N0J54j4l7n5L6PM3l1j36J34J00m0j48M3
7504h8M8M9Q7j03j07J43O2l3j75J06R4oj1o9QJ13J64k98p9J31J87j93m6pP2J00
7530A49K2k34j07L40R8k71j05J18J32J06k39j63J81K36j03l31mL00J47k43r4j7
7552h2K31J19k51k56K48K63j43k42n5K37J49n7l18kK93K21l75k10K53K01l1k09
7574a6j66J67J66Kl11O6L36j6k23k01J66J98n1j51j58J67K80j99k83O5K60oo2
$$ plain form
7597 30 -105 -138 26 99 -76 -184 -80 138 -4 -81 -149 2 31 -19 -195 -210 -17 55 -105 -153 -72 -45 21 -94
7621 -94 -74 -101 44 23 -95 -74 10 -7 -24 5 -82 -53 108 -10 -129 -76 65 103 -10 -50 -45 -13 145 56 -119 -96
7647 -96 70 83 -11 -104 -31 4 136 -2 -44 0 63 38 21 -68 46 152 56 21 -87 23 207 30 -134 52 168
7672 168 172 32 -86 0 133 142 -64 -161 116 229 35 -27 -36 76 154 25 -86 -83 221 153 -140 -164 32 165 25
7697 25 -116 -60 98 224 -8 -299 -121 211 133 -58 -196 -38 133 73 -112 -203 101 183 0 -203 -62 156
7719 156 112 -26 -201 -65 206 82 -249 -172 86 99 -119 -328 -113 4 165 -32 -223 -22 166 -25 -223
7740 -223 -142 -75 118 -89 -240 -170 48 99 -123 -267 -24 99 -1 -172 -151 -44 -2 22 -172 -72 86 85 -87
7763 -87 -135 -21 64 23 -55 -147 -6 162 68 -99 -54 -15 104 88 -12 -25 -35 140 66 -65 -27 64 99 86 67 28
$$ packed form
7597C0j35l3J64P3j75j08J04K18j42p7o8J51K9n0j76j5J93P2j60m8Q1K7O6j15
7621i4K0k7J45k1j18K1Q4j7j7K9q7K9J61j18j19N3J41L8j13m0NL2J58q9j75K3
7647i6J66J3r4r3P3L5J32j38m2M4O3k5j7q9J14J06r6l5j08J10J84j77j64J86J16
7672A68Mj40j18Q6J33Rk06r7K77J13j94o2rJ12P8j29j11LL04o8k93k4J96J33j40
7697B5j41N6J58J26k32k91J78L32p8j91j38J58J71o0j85r1L04Q2j83k03J41K18
7719A56m4j38j75J36K71j24l31P7K58J3k18k09K15J17J61j97j91K01J88j91j98
7740b23Q1O7J93k07j51P0K18N1k22j44K43J23j00j71K1J07M2K4j94J00J58jj72
7763h7m8J14Q5m1p8r2J41J68r4j67M5L9J19j6j00j3j0J75p4j31L8R1L5j3j9l9
$$ plain form
7789 28 23 119 64 -32 11 170 42 34 25 22 5 114 18 -71 75 149 57 -101 16 32 97 119 -82 -112 65 153 -49 -96
7817 -96 38 192 58 -94 -123 24 163 97 -155 -173 158 255 9 -140 36 214 215 -61 -179 -10 323 129
7839 129 -185 -130 105 232 18 -253 -146 203 213 -102 -266 -8 186 92 -199 -213 7 79 54 -241 -237 70 109
7862 109 -147 -323 -78 91 38 -157 -277 -68 136 -5 -303 -312 83 128 -125 -249 -73 150 107 -72 -278 -21
7884 -21 245 92 -213 -99 149 178 2 -140 -93 204 205 -54 -184 87 255 137 -184 -98 46 147 126 -105
7906 -105 -54 97 166 -83 -121 3 69 81 51 -45 -28 135 52 -65 -80 15 34 25 -16 -38 46 136 -13 -83 -35 138 74
7933 74 10 -6 7 110 114 104 -32 39 155 119 -12 35 14 121 91 33 -13 171 222 37 -23 -22 132 198 141 -100 -62
7960 -62 110 159 -44 -90 -2 138 40 -56 -72 -66 97 53 -190 -183 61 73 -113 -177 -50 30 21 -137 -236 -62 99 39
$$ packed form
7789B8nR6n5r6M3J59j28qrlj7J09r6q9J46P4r2j58J17J6O5K2k01l0J77Q8k02m7
7817i6J34J54j34j52k9J47J39o6k52j8L31R7k46j49J76J78Jk76j18J69L33j94
7839A29l14N5K35J27k14k71J07L49J0l15j64K58J94r4k91j4K20P2k5k95ML07L9
7862A09k56j76K45J69n3j95j20K09K04j41k98rL95M5k53j24J76K23m3j79k06K57
7884b1K66j53l05J14K48K9j76j42M7K97Jk59j30K71J68j18l21Q6J44J01k1k31
7906a05N1J51O9k49l8J24O6J2l0r6J7J63q3j17j5R5J9rm1k2Q4R0j49p0M8J73o4
7933G4o4j6J3J03Mj0j36P1J16l6j31M7k1J07l0n8m6J84N1j85o0JJ54O6n7k41L8
7960f2J72M9k03m6Q8J40r8r6j6OJ63m4k43PK44J2j86o4J27Q0rj58r9J74J61o0
$$ plain form
7986 39 -235 -228 -50 43 -116 -140 -101 70 155 -80 -213 -24 130 -26 -106 -129 20 112 42 -191 -120 97 130 -12
8010 -12 -188 32 186 51 -107 -176 -27 181 70 -195 -143 151 147 -86 -235 -98 91 63 -91 -208 35 211
8032 211 3 -209 -127 105 105 -14 -112 -136 71 27 -62 -128 14 139 6 -36 -36 80 129 136 -148 6 191 170 -17
8057 -17 -84 136 200 163 27 20 99 216 134 -6 25 160 180 49 -50 29 163 215 33 -95 -22 77 73 -17 -41 13 95
8084 95 157 -27 -166 -6 52 -34 -79 -50 -29 32 17 -92 -58 27 79 -71 -80 10 -6 -7 -49 -92 -55 -20 56 -86 -136 35
8112 35 33 -69 -104 -125 -23 110 -64 -157 -80 79 69 -153 -136 -37 56 33 -156 -230 -68 166 -46 -196 -144 55 101
8137 101 -128 -207 -169 84 131 -215 -269 -2 160 -5 -228 -166 12 138 32 -205 -171 208 161 -88 -199 -47
8159 -47 156 46 -68 -113 15 229 110 -140 -101 150 163 23 -42 -3 173 175 -7 -125 54 216 111 -96 -51
$$ packed form
7986C9k74PJ78R3j59k4L9J71Q5k35j33J89J54j56q0k3J49R2p0k33P1K17L3j42
8010a2j76K20J54j35j58o9J49K08j11k65N2K94mk33j49J37J89k8j54j17K43J76
8032B11k08k12Q2K32%j19r8k4K07m4q9o6J42J25j33m2%J16M9Pk84J54J85k1j87
8057a7o7K20O4l7j36pP9J17q2j40L1J35K0j31r9P9J34N2j82j28P3R9mr0k4N4Q2
8084I5O2j84j39J60N8q6m5K9K1O1j5j09L4Q5N2j50rR0j6jm2m3L7L5P6j42n0J71
8112C5kj02l5k1J02J33j74r3P7J59j0k22J7R9R3k3j89p4J62K34k12j50N2J99M6
8137A01k29p9L8K53M7l46n4K67J62j65k23O2J78J26j06k37L4L79m7k49j11J52
8159d7K03j10j14m5J28K14j19k50L9K51J3j40o5L9J76Kj82j18J79J62j05k07M5
$$ plain form
8182 -51 201 133 11 -74 -46 150 175 -14 -104
$$ packed form
8182e1K52o8j22q5K8J96K5j89r0
8191a04
$$ Imaginary data points
##PAGE= N=2
##DATA TABLE= (X++(I..I)), XYDATA
$$ plain form
0 0 0 0 0 0 0 0 -8 8 -8 8 -16 16 -16 24 -24 32 -40 48 -54 64 -72 85 -96 112 -131 148 -170 190 -219 244
30 244 -276 311 -346 386 -432 481 -534 595 -659 730 -809 894 -992 1098 -1216 1352 -1503
47 -1503 1674 -1874 2106 -2382 2713 -3127 3650 -4343 5309 -6750 9125 -13767 26247 -129155
61 -129155 -381798 -116233 115955 55715 -199190 -243714 -56763 98044 -16059 -204724
71 -204724 -195942 -2109 74976 -48743 -177736 -129364 2241 34971 -68551 -138195 -73116
82 -73116 15904 -23164 -114880 -112070 -31917 -4606 -51075 -93027 -82709 -59607 -75305 -106049
94 -106049 -74634 -9707 -27277 -129462 -169116 -85392 2337 -24378 -128116 -170984 -91345 -810
106 -810 -38446 -153720 -167179 -52248 31381 -22798 -135979 -162106 -70891 15184 -18816 -107265
$$ packed form
0@%%%%%%qJ6j6J6k4L2l2M0m8N6p2Q8j02J18j36J57j81K08k43K79l18L60m09M63
30B44n20N87o57P32q18R13j015J129j254J389j539J703j886K090k314K568k855
47a503L177l548L980m488N095n840O777p993R652j2059J5875k2892M0014j55402
61a29155k52643K65565K32188o0240k54905m4524J86951J54807j14103j88665
71b04724Q782J93833P7085j23719j28993M8372J31605L2730j03522o9644O5079
82g3116Q9020l9068r1716K810Q0153K7311m6469m1952J0318K3102j5698l0744
94a06049L1415O4927j7570j02185l9654Q3724Q7729k6715j03738m2868P9639R0535
106h10l7636j15274j3459J14931Q3629n4179j13181k6127R1215Q6075l4000q8449
$$ plain form
118 -107265 -104695 -18155 20979 -34237 -97727 -83496 996 59311 9507 -88491 -98054 -1745
130 -1745 73774 39536 -52548 -88054 -19676 63408 43585 -49192 -75596 -338 62620 30134
142 30134 -55419 -94093 -41581 31784 26561 -41719 -67067 -30421 -12053 -41841 -70062 -57747
154 -57747 -23482 -14064 -51028 -90030 -77855 -44122 -41867 -56617 -55004 -53497 -68711 -74393 -55475
167 -55475 -31360 -32407 -66093 -87873 -50083 3815 -16695 -87639 -90917 -5946 57994 16000
179 16000 -79685 -102174 -8622 82326 43900 -58721 -66819 24094 72212 15913 -49626 -21647
191 -21647 69831 94575 9068 -64258 -19005 69914 72709 4701 -27641 11534 60252 48431
203 48431 -10508 -34518 9549 50819 33914 68 -7638 -4848 -6040 3522 21253 22304 -5416
$$ packed form
118a07265K570Q6540L9134n5216o3490J4231Q4492N8315m9804r7998r563R6309
130a745P5519l4238r2084l5506O8378Q3084j9823r2777k6404P5258O2958l2486
142C0134q5553l8674N2512P3365n223o8280k5348L6646J8368k9788k8221J2315
154e7747L4265R418l6964l9002J2175L3733K255j4750J613J507j5214n682J8918
167e5475K4115j047l3686k1780L7790N3898k0510p0944l278Q4971O3940m1994
179A6000r5685k2489R3552R0948l8426j02621q098R0913M8118n6299o5539K7979
191b1647R1478K4744q5507p3326M5253Q8919K795o8008l2342L9175M8718j1821
203D8431n8939k4010M4067M1270j6905l3846p706K790j192R562J7731J051k7720
$$ plain form
216 -5416 -41542 -35774 22598 56567 7750 -53844 -33374 30619 36231 -25001 -62332 -12719 66090
229 66090 61953 -27581 -69735 539 73338 43997 -30881 -35607 36382 84560 36401 -47304
241 -47304 -40286 58074 110230 49081 -29009 -22256 42748 78432 48714 3384 6858 44909 52299
254 52299 24199 14601 30459 36788 31578 31241 32164 25760 16796 12351 23062 43724 38094 2405
268 2405 -12493 15496 39613 26805 4952 7457 31500 39253 2996 -37706 -15343 51844 69081
281 69081 13073 -37558 -21872 34171 60330 23539 -27844 -18038 40991 63098 20665 -26140
293 -26140 -21517 26532 65146 45342 -12370 -28375 19152 61085 44466 820 -12691 17485
305 17485 50141 31840 -18741 -20999 38835 74610 31670 -31530 -34967 23324 68248 37402
$$ packed form
216e416l6126N768N8372L3969m8817o1594K0470O3993N612o1232l7331M9613P8809
229F6090m137q9534m2154P0274P2799k9341p4878m726P1989M8178m8159q3705
241d7304P018R8360N2156o1149p8090O753O5004L5684k9718m5330L474L8051P390
254E2299k8100r598J5858O329n210l37R23o404q964m445J0711K0662n630l5689
268B405j4898K7989K4117j2808k1853K505K4043P753l6257m0702K2363O7187J7237
281F9081n6008n0631J5686N6043K6159l6791n1383R806N9029K2107m2433m6805
293b6140M623M8049L8614j9804n7712j6005M7527M1933j6619m3646j3511L0176
305A7485L2656j8301n0581k258N9834L5775m2940o3200l437N8291M4924l0846
$$ plain form
317 37402 -27420 -31077 28222 52966 7171 -35359 -17756 28973 43894 12266 -21859 -14420
329 -14420 12684 10055 -7460 2310 21869 9193 -21103 -23265 7202 32418 16817 -22431 -24089
342 -24089 19204 35385 -8008 -38470 -2295 45684 31727 -29320 -51846 4111 66123 39386
354 39386 -41341 -48948 30234 72210 10106 -67066 -47736 47747 92417 19325 -72537 -52094
366 -52094 45315 75194 5401 -50282 -16923 48283 49670 -15429 -50809 -1329 58586 37804
378 37804 -25170 -33216 15081 44489 20458 -17243 -16762 19399 35542 4786 -22233 -4975 23677
391 23677 23636 7336 387 2425 4774 1213 -490 14637 29944 11031 -25480 -24436 13496 33140
405 33140 12479 -16601 -15961 13571 29475 425 -35314 -20656 22924 31746 -1775 -30212 -21687
$$ packed form
317C7402o4822l657N9299K4744m5795m2530J7603M6729J4921l1628l4125P439
329a4420K7104k629j7515R770J9559j2676l0296k162L0467K5216j5601l9248j658
342b4089M3293J6181m3393l0462L6175M7979j3957o1047k2526N5957O2012k6737
354C9386q0727p607P9182M1976o2104p7172J9330R5483M4670p3092r1862K0443
366e2094R7409K9879o9793n5683L3359O5206J387o5099l5380M9480N9915k0782
378C7804o2974q046M8297K9408k4031l7701M81L6161J6143l0756k7019J7258K8652
391B3677m1j6300o949K038K349l561j703J5127J5307j8913l6511J044L7932J9644
405C3140k0661k9080O40K9532J5904k9050l5739J4658M3580Q822l3521k8437Q525
$$ plain form
418 -21687 9835 23548 -2353 -29181 -11797 23400 20096 -17380 -36447 -12973 26154 31945
430 31945 -10593 -47678 -24372 28476 38315 -767 -32489 -21422 14807 27237 -4089 -34774
442 -34774 -15192 26553 27333 -9131 -30348 -14344 12936 16468 -6268 -19390 -813 13481 -7669
455 -7669 -31031 -19361 7130 11424 -6877 -24299 -21907 -5431 -3060 -17694 -19591 -4815 -6867
468 -6867 -28524 -32845 -12291 2602 -9394 -34305 -37035 -6600 13931 -14870 -51791 -34645 13844
481 13844 21798 -21124 -55615 -36285 13306 27389 -12491 -41222 -12288 25160 9947 -30540
493 -30540 -32557 7650 37193 16122 -27858 -30819 14126 38960 8812 -22503 -8181 24090
505 24090 28205 2077 -17640 -4578 22393 21543 -2578 -7478 8185 10422 -2644 -1857 13315
$$ packed form
418b1687L1522J3713k5901k6828J7384L5197l304l7476j9067K3474L9127N791
430C1945m2538l7085K3306N2848R839l9082l1722J1067L6229J2430l1326l0685
442c4774J9582M1745P80l6464k1217J6004K7280L532k2736j3122J8577J4294k1150
455g669k3362J1670K6491M294j8301j7422K392J6476K371j4634j897J4776k052
468f867k1657m321K0554J4893j1996k4911k730L0435K0531k8801l6921J7146M8489
481A3844P954m2922l4491J9330M9591J4083l9880k8731K8934L7448j5213m0487
493c0540k017M0207K9543k1071m3980k961M4945K4834l0148l1315J4322L2271
505B4090M115k6128j9717J3062K6971q50k4121m900J5663K237j3066P87J5172
$$ plain form
518 13315 18005 1639 -19703 -16816 11680 24561 -1386 -25002 -8142 17809 10389 -17139 -23006
531 -23006 3897 28552 12747 -26879 -30084 10077 29991 1684 -25292 -8192 26826 31852
543 31852 -1527 -29467 -8679 35606 40533 2767 -18641 1234 27995 29983 10728 -2513
555 -2513 9456 29239 24826 4449 4126 21462 27136 16088 5051 3898 11782 18122 11628 4557
569 4557 12428 19551 9217 -3480 -2299 3639 5544 4739 826 -879 1996 -2046 -14009 -11801 7293
584 7293 13643 -3025 -20641 -19192 -467 13690 2124 -22179 -19789 8659 19274 -1971 -21938
597 -21938 -13572 12990 26898 8392 -19688 -13709 19513 30195 5393 -13086 1336 27638
609 27638 30412 2935 -15940 8257 44958 36961 -6139 -21282 7738 36289 28079 -2476 -12020
$$ packed form
518A3315M690j6366k1342K887K8496J2881k5947k3616J6860K5951p420k7528n867
531b3006K6903K4655j5805l9626l205M0161J9914k8307k6976J7100L5018N026
543C1852l3379k7940K0788M4285M927l7766k1408J9875K6761J988j9255j3241
555b513J1969J9783m413k0377l23J7336N674j1048j1037j153P884O340o494p071
569D557P871P123j0334j2697J181N938J905q05l913j705K875m042j1963K208J9094
584G293O350j6668j7616J449J8725J4157j1566k4303K390K8448J0615k1245j9967
597b1938Q366K6562J3908j8506k8080N979L3222J0682k4802j8479J4422K6302
609B7638K774k7477j8875K4197L6701p997m3100j5143K9020K8551q210l0555r544
$$ plain form
622 -12020 13339 33987 13312 -17914 -12503 15029 20355 -427 -15871 -8968 6256 3233 -18426
635 -18426 -22989 266 11471 -11901 -33938 -22592 1037 3208 -18449 -34718 -22025 829
647 829 -4414 -30755 -30884 -1741 10618 -11622 -35520 -28093 2047 15442 -9047 -35218 -17738
660 -17738 19150 17875 -18137 -32731 -4814 28138 24450 -11072 -28741 -1927 28324 16658
672 16658 -13405 -13326 11610 22661 6148 -14368 -9982 15405 24280 198 -20041 -7730 12076
685 12076 9092 -8905 -16730 -6960 6849 3418 -15720 -21296 -5734 3147 -8144 -19293 -17239
698 -17239 -11786 -11096 -15938 -19318 -11627 -1975 -9497 -26336 -25995 -10593 -3411 -10053 -19244 -19689 -9413
713 -9413 -1713 -11550 -24515 -16627 309 892 -11604 -16953 -10221 -84 1325 -10450 -17802 -6735
$$ packed form
622a2020K5359K0648k0675l1226N411K7532N326k0782j5444O903J5224l023k1659
635a8426m563K3255J1205k3372k2037J1346K3629K171k1657j6269J2693K2854
647H29n243k6341j29K9143J2359k2240k3898P427L0140J3395k4489k6171J7480
660a7738L6888j275l6012j4594K7917L2952l688l5522j7669K6814L0251j1666
672A6658l0063P9K4936J1051j6513k0516M386K5387Q875k4082k0239J2311J9806
685A2076k984j7997p825R770J3809l431j9138n576J5562Q881j1291j1149K054
698a7239N453O90m842l380P691R652p522j6839L41J5402P182o642r191m45J0276
713i413P700r837j2965P888J6936N83j2496n349O732J0137J409j1775p352J1067
$$ plain form
727 -6735 4435 -3588 -16662 -13750 -388 7709 1234 -15315 -21288 -7090 5145 -4202 -17637
740 -17637 -15515 -5782 -2935 -9262 -17611 -16371 -4496 -1251 -14526 -22554 -14477 -6969 -10505 -15516
754 -15516 -14849 -9726 -4499 -9002 -19424 -17921 -4827 -275 -7314 -10710 -7327 -3823 -2865 -5400 -6930
769 -6930 -405 6379 627 -6444 1547 12827 11013 2297 -116 5091 12469 12358 2317 270 13938
784 13938 22819 13277 1923 4004 12128 15888 11088 3291 5161 15249 14161 9 -3627 8138
798 8138 15226 8929 -939 -4006 2410 9472 4129 -7216 -5230 4721 3890 -5319 -7983 -3415 1226
813 1226 1871 -4108 -8550 -2731 2943 -3886 -10923 -4181 4814 2969 -5022 -9283 -3726 7098 8512
828 8512 -3229 -7172 4492 10814 2027 -5339 -247 9541 12842 4957 -5038 -143 14431 14988 1485
$$ packed form
727f735J1170q023j3074K912J3362Q097o475j6549n973J4198J2235r347j3435
740a7637K122R733K847o327q349J240J1875L245j3275q028Q077P508l536n011
754a5516O67N123N227m503j0422J503J3094M552p039l396L383L504R58k535j530
769f930O525O784n752p071P991J1280j814q716k413N207P378j11j0041k047J3668
784A3938Q881r542j1354K081Q124L760m800p797J870J0088j088j4152l636J1765
798H138P088o297r868l067O416P062n343j1345J986R951q31r209k664M568M641
813A226O45n979m442N819N674o829p037O742Q995j845p991m261N557J0824J414
828H512j1741l943J1664O322q787p366N092R788L301p885r995M895J4574N57j3503
$$ plain form
843 1485 -2582 8048 15356 10115 -1510 -5783 5179 17365 11032 -4025 -3172 9254 12118 3638
857 3638 -3639 -2626 4978 8410 -658 -9546 -1939 9866 7136 -4567 -8606 -2762 4497 4006 -6177
872 -6177 -10038 1685 10204 95 -12176 -8117 3523 7035 120 -8052 -4476 7965 9159 -4996
886 -4996 -10126 2858 12049 4518 -7047 -7241 4692 15133 8506 -6629 -4838 11653 14864 206
900 206 -8959 -636 12621 14392 1139 -9045 1539 17875 13044 -4893 -6973 7165 15000 6714
914 6714 -6790 -6706 9798 19659 5160 -11772 -4325 13538 14328 -197 -7924 1376 15557 13679
928 13679 -4750 -11639 5256 18577 8186 -7054 -4008 10508 16807 6457 -7174 -2974 14568
941 14568 16895 -865 -9320 3747 17267 13900 209 -5561 5200 18143 11689 -5716 -5142
$$ packed form
843A485m067J0630P308n241j1625m273J0962J2186o333j5057Q53J2426K864q480
857C638p277J013P604L432r068q888P607J1805k730j1703m039N844P259m91j0183
872f177l861J1723Q519j0109j2271M059J1640L512o915q172L576J2441J194j4155
886d996n130J2984R191p531j1565j94J1933J0441o627j5135J791J6491L211j4658
900B06r165Q323J3257J771j3253j0184J0584J6336m831j7937k080J4138P835q286
914F714j3504Q4J6504R861j4499j6932P447J7863P90j4525p727R300J4181j878
928A3679j8429o889J6895J3321j0391j5240L046J4516O299j0350j3631M200J7542
941A4568K327j7760q455J3067J3520l367j3691n770J0761J2943o454j7405N74
$$ plain form
954 -5142 12141 18116 5062 -7005 -2610 11986 17462 4010 -8874 574 17065 12979 -4549
967 -4549 -7939 5001 15265 9545 -5892 -9206 6633 17653 5237 -10082 -3909 11475 12550
980 12550 -716 -10334 -3374 12033 12582 -4754 -11996 2444 14027 5898 -7309 -7246 4387 12016
994 12016 3782 -10661 -8234 8693 12555 -2287 -11209 -2714 8885 8933 -2522 -9961 -950 12183
1008 12183 6763 -9574 -9923 4184 10428 2388 -6879 -5254 6035 11364 377 -10442 -2752 10450
1022 10450 8030 -4107 -7525 595 9849 8525 -3245 -7667 3856 12606 3808 -6593 -2379 7588
1036 7588 9445 1729 -5714 -2262 8719 9770 -2191 -6327 3651 10423 4672 -3807 -4897 2012
1050 2012 8568 3590 -7286 -5916 5491 7509 -1947 -6302 -1307 4193 3415 -4198 -9069 -2170 6027
$$ packed form
954e142J7283N975j3054j2067M395J4596N476j3452j2884R448J6491m086j7528
967d549l390J2940J0264n720j5437l314J5839J1020j2416j5319O173J5384J075
980A2550j3266r618O960J5407N49j7336p242J4440J1583q129j3207O3J1633P629
994A2016q234j4443K427J6927L862j4842q922Q495J1599M8j1455p439R011J3133
1008A2183n420j6337l49J4107O244q040r267J625J1289N329j0987j0819P690J3202
1022A0450k420j2137l418Q120R254j324j1770m422J1523Q750q798j0401M214R967
1036G588J857p716p443L452J0981J051j1961m136R978O772n751q479j090O909
1050B012O556m978j0876J370J1407K018r456m355M995N500p78p613m871O899Q197
$$ plain form
1065 6027 818 -9005 -6730 2067 3697 -2106 -7581 -6464 1270 4503 -3991 -10384 -3568 3937 324
1080 324 -6306 -6192 -1202 2832 378 -6702 -6107 3085 4703 -4893 -8855 -2033 3079 817 -4543 -6569
1096 -6569 -1723 4199 731 -7508 -5946 1400 620 -5648 -7276 -3962 -895 -1324 -6736 -9479 -3128
1111 -3128 1530 -4915 -11747 -8153 -2266 -2964 -7398 -11049 -9499 -3624 -2781 -9938 -12445 -5425 -2196
1126 -2196 -7169 -10918 -8915 -4878 -3222 -6910 -12637 -9409 -501 -896 -9189 -10529 -3692 186 -1914
1141 -1914 -6815 -8811 -3243 2617 -1749 -8731 -4949 2553 1471 -3807 -4831 -1507 2944 2797 -3884
1156 -3884 -7060 356 5824 221 -6152 -4330 885 3426 1241 -4572 -5356 1705 4045 -3203 -7376
1171 -7376 -2440 1971 -18 -4168 -6503 -3023 3292 1470 -7349 -8017 1035 4289 -2086 -7753 -6638
$$ packed form
1065F027n209r823K275Q797J630n803n475J117P734L233q494o393O816P505l613
1080C24o630J14M990M034k454p080N95R192J618r596l962O822N112k262n360k026
1096f569M846N922l468q239J562P346p80o268j628L314L067m29n412k743O351
1111c128M658o445o832L594N887o98m434l651J550N875Q43p157k507P020L229
1126b196m973l749K003M037J656l688n727L228Q908l95q293j340O837L878k100
1141a914m901j996N568N860m366o982L782P502j082n278j024L324M451j47o681
1156c884l176P416N468n603o373J822N215K541k185n813p84P061K340p248m173
1171g376M936M411j989m150k335L480O315j822q819o68R052L254o375n667J115
$$ plain form
1186 -6638 71 4916 -82 -8524 -5424 4786 4802 -3560 -5911 169 5226 3601 -3421 -6303 1894
1201 1894 9340 3023 -6554 -3264 6777 8745 1960 -4727 -3189 6354 9746 -463 -8637 -1348
1215 -1348 8434 5902 -2768 -5560 176 6691 3468 -7592 -8919 3061 7779 -2777 -11665 -6730
1229 -6730 2754 4215 -4335 -12692 -7661 4243 3353 -9586 -13342 -3504 2926 -1942 -10154 -10943 -2463
1244 -2463 3968 -2971 -12446 -6904 4747 3036 -7929 -11244 -3328 5302 4182 -6298 -10804 -232
1258 -232 9289 2773 -7397 -4832 4791 7467 1146 -6238 -3935 6881 9453 -1322 -7276 1746
1272 1746 10084 5737 -3551 -5578 2144 10329 6495 -5544 -7417 3788 9092 1853 -5059 -3239
1286 -3239 2848 6037 1724 -5047 -2923 5048 4418 -3741 -5565 150 4044 2861 -1491 -3911 602
$$ packed form
1186f638O709M845m998q442L100J0210J6q362k351O080N057j625p022k882Q197
1201A894P446o317r577L290J0041J968o785o687J538R543L392j0209q174P289
1215a348R782k532q670k792N736O515l223j1060j327J1980M718j0556q888M935
1229f730R484J461q550q357N031J1904q90j2939l756R838O430m868q212p89Q480
1244b463O431o939r475N542J1651j711j0965l315P916Q630j120j0480m506J0572
1258b32R521o516j0170K565R623K676o321p384K303J0816K572j0775n954R022
1272A746Q338m347r288k027P722Q185l834j2039j873J1205N304p239o912J820
1286c239O087L189m313o771K124P971o30q159j824N715L894j183m352k420M513
$$ plain form
1301 602 6149 2668 -4394 -2735 3712 5217 2636 -194 -997 2380 6021 3443 -214 3277 7373
1316 7373 4977 1130 1797 4934 7705 7064 1279 -706 6440 11445 6015 -27 2096 7718 10002
1331 10002 6248 -824 -922 7718 11079 2995 -2687 2265 8160 6974 1073 -2279 2354 9757 6620
1346 6620 -4800 -6072 4734 10042 3213 -4459 -3751 3486 8110 2318 -6030 -2806 6706 6355 -2033
1361 -2033 -4314 537 4475 3173 -1648 -2864 3530 7718 870 -5504 -83 7547 5524 -1522 -3912
1376 -3912 505 6538 5730 -1712 -2704 5176 7364 -339 -4456 1145 6637 5166 -1061 -4641 899
1391 899 8088 4016 -6007 -4694 5520 8115 922 -5282 -4020 2736 6120 107 -5925 -1494 4961
1406 4961 1849 -3741 -2137 2592 3599 831 -3283 -3039 2551 4476 -813 -3420 1107 3655 1575
$$ packed form
1301F02N547l481p062J659O447J505k581k830q03L377L641k578l657L491M096
1316G373k396l847O67L137K771o41n785j985P146N005n430o042K123N622K284
1331A0002l754p072r8Q640L361q084n682M952N895j186n901l352M633P403l137
1346F620j1420j272J0806N308o829p672P08P237M624n792q348L224R512l51q388
1361b033k281M851L938j302m821j216O394M188o848o374N421P630k023p046k390
1376c912M417O033q08p442r92P880K188p703m117N601N492j471o227l580N540
1391H99P189m072j0023J313J0214K595p193o204J262O756L384o013o032M431O455
1406D961l112n590J604M729J007k768m114K44N590J925n289k607M527K548k080
$$ plain form
1421 1575 80 463 1585 3402 2945 20 810 4141 2453 -790 1831 6141 5130 1588 -423 106
1437 106 4403 7089 3192 -978 1725 5109 3124 398 611 1634 3364 3972 988 -899 2323 3707
1453 3707 320 -1314 129 513 338 560 -1479 -2807 290 2501 -172 -2967 -3707 -3462 -853 1965
1469 1965 -1278 -6067 -4683 -791 -796 -3006 -3940 -3762 -1577 -111 -3906 -6920 -3344 -84 -2968 -5367
1485 -5367 -3295 -1552 -2113 -3964 -5826 -4187 541 188 -5439 -6220 -1591 -812 -4023 -4771 -2727 -828
1501 -828 -1385 -5277 -6832 -584 4213 -1992 -9652 -6197 1883 2377 -4187 -9330 -5423 3946 4992 -6009
1517 -6009 -11996 -2962 5861 1673 -7187 -8103 -1021 4231 -870 -10000 -7548 4554 6648 -4435 -10866
1532 -10866 -4037 4316 3431 -4631 -8882 -2279 5596 1386 -7751 -5767 3091 3631 -3040 -5718 -1488
$$ packed form
1421A575j495L83J122J817m57k925P90L331j688l243K621M310j011l542k011N29
1437A06M297K686l897m170K703L384j985k726K13J023J730O08k984j887L222J384
1453C707l387j634J443L84j75K22k039j328L097K211k673k795p40K45K609K818
1469A965l243m789J384L892nk210r34J78K185J466l795l014L576L260k884k399
1485e367K072J743n61j851j862J639M728l53n627p81M629P79l211p48K044J899
1501h28n57l892j555O248M797o205p660L455Q080M94o564n143L907R369J046j1001
1517f009n987R034Q823m188q860r16P082N252n101r130K452J2102K094j1083o431
1532a0866O829Q353q85q062m251O603P875m210r137J984Q858N40o671k678M230
$$ plain form
1547 -1488 3318 1880 -4697 -5494 3083 6751 -2214 -9113 -2799 6519 6287 -1458 -6205 -1241 6885
1562 6885 4488 -5590 -6014 4860 8761 469 -6113 -2373 5894 8016 468 -6328 -735 9034 6655
1577 6655 -3479 -5452 1909 7416 5524 -691 -3847 1130 6522 3675 -1434 -63 3054 1935 236
1592 236 657 1305 2382 2676 324 -851 1433 1726 -340 785 2837 989 -1250 -103 856 0 -344
1609 -344 -592 31 2702 2758 -1782 -3877 58 2491 983 -287 -1046 -1608 -393 980 258 248 980 -1223
1627 -1223 -2320 1317 3128 -927 -3697 -807 2629 2354 -1332 -4441 -1198 5232 4121 -3994 -5324
1642 -5324 1910 4869 -523 -5616 -3159 4403 7051 -1288 -9831 -4262 7044 6490 -3653 -7175 -973
1657 -973 5141 3263 -4472 -6756 846 6465 478 -6181 -2318 3988 2864 -2272 -3578 597 4650
$$ packed form
1547a488M806j438o577p97Q577L668q965o899O314R318k32p745m747M964Q126
1562F885k397j0078m24J0874L901q292o582L740Q267K122p548o796N593R769k379
1577F655j0134j973P361N507j892o215l156M977N392k847n109J371L117j119j699
1592B36M21O48J077K94k352j175K284K93k066J125K052j848k239J147R59q56l44
1609c44k48O23K671N6m540k095L935K433j508j270p59n62J215J373p22j0P32k203
1627a223j097L637J811m055k770K890L436k75l686l109L243O430j111q115j330
1642e324P234K959n392n093K457P562K648q339q543N569J1306n54j0143l522O202
1657i73O114j878p735k284P602N619n987o659L863O306j124n136j306M175M053
$$ plain form
1672 4650 1750 -5080 -3921 4716 6310 -817 -4003 1034 5140 3053 -1436 -1870 4206 7633 898
1687 898 -6164 -474 9323 7868 -1233 -4017 2395 9112 6313 -3111 -5100 4939 11409 4082 -4333
1702 -4333 -1923 5265 6614 1866 -2356 240 6333 5157 -2263 -3266 3462 5776 915 -2795 -1560
1717 -1560 1733 3275 900 -1831 289 2877 -335 -3512 -560 2478 284 -2543 -1389 1358 2522
1732 2522 -560 -4969 -2964 4238 5069 -1955 -5137 -1160 2530 2035 -923 -2652 -79 3648 1632
1747 1632 -3311 -2056 2789 2945 -324 -1571 -940 593 1816 88 -1785 -93 1531 -288 -946 778
1763 778 -178 -2374 -924 1593 577 -2583 -4692 -3322 1649 3786 -1860 -7098 -3444 1981 117
1778 117 -4789 -5426 -1656 2089 15 -6334 -7183 -319 2755 -2761 -6488 -2793 1419 428 -4029 -6191
$$ packed form
1672D650k900o830J159Q637J594p127l186N037M106k087m489m34O076L427o735
1687H98p062N690R797j455r101k784O412O717k799r424j989J0039O470p327q415
1702d333K410P188J349m748m222K596O093j176p420j003O728K314m861l710J235
1717a560L293J542k375k731K120K588l212l177K952L038k194k827J154K747J164
1732B522l082m409K005P202Q31p024l182L977L690m95k958j729K573L727k016
1747A632m943J255M845J56l269j247O31J533J223j728j873J692J624j819o58J724
1763G78r56k196J450K517j016l160k109J370M971K137n646n238L654N425j864
1778A17m906o37L770L745k074o349q49O864L074n516l727L695M212r91m457k162
$$ plain form
1794 -6191 -2513 2708 729 -5129 -4272 1273 1528 -2176 -2360 480 1387 -959 -4004 -2468 3765 4873
1810 4873 -2459 -6132 428 6020 2143 -4553 -4356 2624 7432 1882 -7440 -5754 4931 7097 -2004
1825 -2004 -7147 -1311 5507 3793 -4605 -8146 -320 7876 2933 -7830 -7815 1221 4873 -313 -5823
1840 -5823 -4803 1276 3531 -2155 -6424 -1971 2629 -426 -4528 -2868 459 436 -2056 -3281 -572
1855 -572 3026 395 -5562 -4289 2508 3645 -1507 -3765 -861 2420 1450 -3252 -4799 896 5856
1870 5856 1257 -5372 -3638 2191 3365 -660 -4524 -3625 1567 3583 -1491 -5343 -2208 1507 548
1885 548 -1702 -3059 -3747 -2538 -590 -973 -2122 -2356 -3154 -3389 -1231 -799 -3777 -4228 -750 327 -2677
1902 -2677 -5093 -4198 -663 2120 -649 -5608 -4211 2018 2387 -2922 -4740 -898 3374 3101 -1629 -4786
$$ packed form
1794f191L678N221j979n858Q57N545K55l704j84K840R07k346l045J536O233J108
1810D873p332l673O560N592l877o696J97O980M808n550r322J686J0685K166r101
1825b004n143N836O818j714q398l541P826Q196m943j0763J5R036L652n186n510
1840e823J020O079K255n686m269M453M600l055m102J660L327k3k492j225K709
1855e72L598k631n957J273O797J137n152k258K904L281r70m702j547N695M960
1870E856m599o629J734N829J174m025l864Q99N192K016n074l852L135L715r59
1885E48k250j357o88J209J948l83j149k34p98k35K158M32k978m51L478J077l004
1902b677k416Q95L535K783k769m959J397O229L69n309j818L842M272k73m730l157
$$ plain form
1918 -4786 -874 4444 2917 -1564 -509 3028 2914 633 152 1819 3861 2789 -1017 -578 4763 5643
1934 5643 547 -1052 3212 5693 2693 -1504 -1325 3944 7324 2506 -3680 -413 6655 5204 -2243
1949 -2243 -3825 2721 8273 5199 -3558 -5805 2763 9020 3063 -4828 -2339 5026 6159 811 -3368
1964 -3368 -300 6009 5861 -1064 -3100 3055 6229 2132 -1260 929 4713 4968 1344 -1283 2366
1979 2366 6889 4279 -911 450 5104 4576 800 140 3652 6805 4321 -1946 -2420 5044 8457 2101
$$ packed form
1918d786L912N318j527m481J055L537j14k281m81J667K042j072l806M39N341Q80
1934E643n096j599M264K481l000m197J79N269L380m818o186L267P068j451p447
1949b243j582O546N552l074q757k247Q568O257n957p891K489P365J133n348m179
1964c368L068O309j48o925k036O155L174m097l392K189L784K55l624k627L649
1979B366M523k610n190J361M654n28l776o60L512L153k484o267m74P464L413o356
$$ [...]
8191G4
##END NTUPLES=NMR FID
##END=
