##TITLE=1H_TG-2263-1
 CDCl3, 8 sc, 
 19.11.2019
##JCAMPDX= 6.0         $$ Bruker NMR JCAMP-DX V2.0
##DATA TYPE= NMR FID
##DATA CLASS= NTUPLES
##ORIGIN= UXNMR, Bruker Analytische Messtechnik GmbH
##OWNER= root
$$ XWIN-NMR		Version 3.5
$$ Tue Nov 19 14:30:00 2019 Russian Standard Time (UT+4h)  she@DPX200
##.OBSERVE FREQUENCY= 200.1315
##.OBSERVE NUCLEUS= ^1H
##.DELAY= (6, 6)
##.ACQUISITION MODE= SIMULTANEOUS
##.ACQUISITION SCHEME= undefined
##.AVERAGES= 8
##.DIGITISER RES= 18
##SPECTROMETER/DATA SYSTEM= spect
##.PULSE SEQUENCE= zg30
##.SOLVENT NAME= CDCl3
##.SHIFT REFERENCE= (INTERNAL, CDCl3, 0, 15.7039)
##AUDIT TRAIL= $$ (NUMBER, WHEN, WHO, WHERE, WHAT)
$$ ##TITLE= Audit trail, XWIN-NMR		Version 3.5
$$ ##JCAMPDX= 5.01
$$ ##ORIGIN= Bruker BioSpin GmbH
$$ ##OWNER= she
$$ F:/spectra/data/she/nmr/H-F/1/audita.txt
$$ ##AUDIT TRAIL=  $$ (NUMBER, WHEN, WHO, WHERE, WHAT)
(   1,<2019-11-19 14:29:02.40 +0400>,<she>,<DPX200>,
      <created by zg, POWCHK disabled, PULCHK disabled
       configuration hash MD5:
       00 E9 B6 7A A2 85 ED C7 34 08 36 98 17 FE 4E 26
       data hash MD5: 16K
       14 5C 35 E9 C4 87 CF 82 4C 7D 8E 83 83 32 0C C3>)
$$ ##END=
$$ 
$$ hash MD5
$$ 58 91 9D 41 32 EB 1C 0E 6F 30 B7 F0 47 8D 87 F1
##$RELAX= 
##$RELAX= 
##$RELAX= 
##$RELAX= 
##$RELAX= 
##$RELAX= 
$$ Bruker specific parameters
$$ --------------------------
##$DU= <F:/spectra>
##$EXPNO= 1
##$NAME= <H-F>
##$PROCNO= 1
##$TYPE= <nmr>
##$USER= <she>
##$AMP= (0..31)
100 100 100 100 100 100 100 100 100 100 100 100 100 100 100 100 100 100 
100 100 100 100 100 100 100 100 100 100 100 100 100 100 
##$AQSEQ= 0
##$AQ_mod= 1
##$AUNM= <au_zg>
##$AUTOPOS= <>
##$BF1= 200.13
##$BF2= 200.13
##$BF3= 200.13
##$BF4= 200.13
##$BF5= 200.13
##$BF6= 200.13
##$BF7= 200.13
##$BF8= 200.13
##$BYTORDA= 1
##$CFDGTYP= 0
##$CFRGTYP= 5
##$CHEMSTR= <none>
##$CNST= (0..31)
1 1 145 1 1 1 1 1 1 1 1 1 1 1 1 1 1 1 1 1 1 1 1 1 1 1 1 1 1 1 1 1 
##$CPDPRG= <>
##$CPDPRG1= <>
##$CPDPRG2= <>
##$CPDPRG3= <>
##$CPDPRG4= <mlev>
##$CPDPRG5= <mlev>
##$CPDPRG6= <mlev>
##$CPDPRG7= <mlev>
##$CPDPRG8= <mlev>
##$CPDPRGB= <>
##$CPDPRGT= <>
##$D= (0..31)
0 1.2 0 0 0 0 0 0 0 0.06 0 0.03 0 0 0 0 0.0002 0 0 0 0 0 0 0 0 0 0 0 0 
0 0 0 
##$DATE= 1574159341
##$DBL= (0..7)
120 120 120 120 120 120 120 120 
##$DBP= (0..7)
150 150 150 150 150 150 150 150 
##$DBP07= 0
##$DBPNAM0= <>
##$DBPNAM1= <>
##$DBPNAM2= <>
##$DBPNAM3= <>
##$DBPNAM4= <>
##$DBPNAM5= <>
##$DBPNAM6= <>
##$DBPNAM7= <>
##$DBPOAL= (0..7)
0.5 0.5 0.5 0.5 0.5 0.5 0.5 0.5 
##$DBPOFFS= (0..7)
0 0 0 0 0 0 0 0 
##$DE= 6
##$DECBNUC= <off>
##$DECIM= 24
##$DECNUC= <off>
##$DECSTAT= 4
##$DIGMOD= 1
##$DIGTYP= 9
##$DL= (0..7)
0 120 120 120 120 120 120 120 
##$DP= (0..7)
150 150 150 150 150 150 150 150 
##$DP07= 0
##$DPNAME0= <>
##$DPNAME1= <>
##$DPNAME2= <>
##$DPNAME3= <>
##$DPNAME4= <>
##$DPNAME5= <>
##$DPNAME6= <>
##$DPNAME7= <>
##$DPOAL= (0..7)
0.5 0.5 0.5 0.5 0.5 0.5 0.5 0.5 
##$DPOFFS= (0..7)
0 0 0 0 0 0 0 0 
##$DQDMODE= 0
##$DR= 18
##$DS= 0
##$DSLIST= <SSSSSSSSSSSSSSS>
$$ [...]
##$SUBNAM2= <"">
##$SUBNAM3= <"">
##$SUBNAM4= <"">
##$SUBNAM5= <"">
##$SUBNAM6= <"">
##$SUBNAM7= <"">
##$SUBNAM8= <"">
##$SUBNAM9= <"">
##$SW= 24.9337058887773
##$SWIBOX= (0..15)
0 0 2 0 0 0 0 0 0 0 0 0 0 0 0 0 
##$SW_h= 4990.01996007984
##$TD= 16384
##$TD0= 1
##$TE= 0
##$TE2= 300
##$TE3= 300
##$TEG= 300
##$TL= (0..7)
0 120 120 120 120 120 120 120 
##$TP= (0..7)
150 150 150 150 150 150 150 150 
##$TP07= 0
##$TPNAME0= <>
##$TPNAME1= <>
##$TPNAME2= <>
##$TPNAME3= <>
##$TPNAME4= <>
##$TPNAME5= <>
##$TPNAME6= <>
##$TPNAME7= <>
##$TPOAL= (0..7)
0.5 0.5 0.5 0.5 0.5 0.5 0.5 0.5 
##$TPOFFS= (0..7)
0 0 0 0 0 0 0 0 
##$TUNHIN= 0
##$TUNHOUT= 0
##$TUNXOUT= 0
##$USERA1= <user>
##$USERA2= <user>
##$USERA3= <user>
##$USERA4= <user>
##$USERA5= <user>
##$V9= 5
##$VALIST= <valist>
##$VCLIST= <CCCCCCCCCCCCCCC>
##$VD= 0
##$VDLIST= <DDDDDDDDDDDDDDD>
##$VPLIST= <PPPPPPPPPPPPPPP>
##$VTLIST= <TTTTTTTTTTTTTTT>
##$WBST= 1024
##$WBSW= 4
##$XGAIN= (0..3)
0 0 0 0 
##$XL= 0
##$YL= 0
##$YMAX_a= 204333
##$YMIN_a= -84677
##$ZGOPTNS= <>
##$ZL1= 120
##$ZL2= 120
##$ZL3= 120
##$ZL4= 120
##$ABSF1= 10
##$ABSF2= 0
##$ABSG= 5
##$ABSL= 3
##$ALPHA= 0
##$AQORDER= 0
##$ASSFAC= 0
##$ASSFACI= 0
##$ASSFACX= 0
##$ASSWID= 0
##$AUNMP= <proc_1d>
##$AZFE= 0.1
##$AZFW= 0.1
##$BCFW= 1
##$BC_mod= 2
##$BYTORDP= 1
##$COROFFS= 0
##$CY= 11.3945322036743
##$DATMOD= 1
##$DC= 2
##$DFILT= <>
##$DTYPP= 0
##$F1P= 16.9975609425685
##$F2P= -3.02152046262296
##$FCOR= 0.5
##$FTSIZE= 0
##$FT_mod= 4
##$GAMMA= 1
##$GB= 0.15
##$INTBC= 1
##$INTSCL= 1
##$ISEN= 128
##$LB= 0.24
##$LEV0= 0
##$LPBIN= 0
##$MAXI= 10000
##$MC2= 0
##$MEAN= 0
##$ME_mod= 0
##$MI= 1.114404
##$NCOEF= 0
##$NC_proc= 0
##$NLEV= 6
##$NOISF1= 3.799351
##$NOISF2= 2.8
##$NSP= 1
##$NTH_PI= 0
##$NZP= 0
##$OFFSET= 15.70392
##$PC= 1
##$PHC0= -9788.919
##$PHC1= 17.40086
##$PH_mod= 1
##$PKNL= yes
##$PPARMOD= 0
##$PSCAL= 0
##$PSIGN= 0
##$REVERSE= no
##$SF= 200.130013532006
##$SI= 16384
##$SIGF1= 3
##$SIGF2= 2
##$SINO= 400
##$SIOLD= 16384
##$SREGLST= <1H.CDCl3>
##$SSB= 0
##$STSI= 0
##$STSR= 0
##$SW_p= 3612.71676300578
##$SYMM= 0
##$S_DEV= 0
##$TDeff= 0
##$TDoff= 0
##$TI= <>
##$TILT= no
##$TM1= 0
##$TM2= 0
##$TOPLEV= 0
##$USERP1= <user>
##$USERP2= <user>
##$USERP3= <user>
##$USERP4= <user>
##$USERP5= <user>
##$WDW= 1
##$XDIM= 8192
##$YMAX_p= 0
##$YMIN_p= 0
$$ End of Bruker specific parameters
$$ ---------------------------------
##NTUPLES= NMR FID
##VAR_NAME=  TIME,          FID/REAL,        FID/IMAG
##SYMBOL=    X,             R,               I
##VAR_TYPE=  INDEPENDENT,   DEPENDENT,       DEPENDENT
##VAR_FORM=  AFFN,          ASDF,            ASDF
##VAR_DIM=   8192,          8192,            8192
##UNITS=     SECONDS,       ARBITRARY UNITS, ARBITRARY UNITS
##FACTOR=    0.0002004,     1,               1
##FIRST=     0,             0,               0
##LAST=      1.6414764,     0,               0
##MIN=       0,             -84677,          0
##MAX=       1.6414764,     204333,          0
$$ Real data points
##PAGE= N=1
##DATA TABLE= (X++(R..R)), XYDATA
$$ [...]
$$ plain form
3147 -3468 -2598 2109 -1275 -4381 1035 849 -4123 -367 2271 -3080 -2121 2602 -823 -3699 1862 1426
3163 1426 -3729 -223 2928 -2336 -1973 3229 -87 -3076 2297 2242 -2946 147 3716 -1331 -1449 3578
3179 3578 465 -2481 2393 2934 -2261 531 4048 -424 -1253 3802 1351 -2147 2523 3142 -1669 443
3195 443 4588 -52 -1103 3846 1868 -1798 2455 3489 -1747 616 4416 -68 -1507 3697 1834
3210 1834 -1978 2077 3434 -1472 370 4148 -134 -1682 3580 1677 -2469 1765 2871 -1763 -358
3225 -358 3711 -247 -2321 2957 1355 -2944 884 2767 -2579 -1442 2895 -666 -3075 2081 929
3240 929 -3739 325 2339 -2561 -2008 2800 -989 -3354 1477 444 -4024 -708 2311 -3322 -2618 1881
3256 1881 -1240 -4084 1209 233 -4227 -1107 1657 -3129 -2745 1796 -1303 -4238 580 527 -3988 -1259
$$ packed form
3147c468Q70M707l384l106N416j86m972L756K638n351R59M723l425k876N561m36
3163A426n155L506L151n264L63N202l316k989N373n5n188L093L569n047j18N027
3179C578l113k946M874N41n195K792L517m472q29N055k451l498M670O19m811K112
3195D43M145m640j051M949j978l666M253J034n236K363L800m484j439N204j863
3210A834l812M055J357m906J842L778m282j548N262j903m146M234J106m634J405
3225c58M069l958k074N278j602m299L828J883n346J137M337l561k409N156j152
3240I29m668M064K014m900N53M808l789k365M831j033m468L316L019n633P04M499
3256A881l121k844N293r76m460L120K764m786L84M541l099k935M818n3m515K729
$$ plain form
3272 -1259 1529 -2913 -3110 2052 -741 -4009 457 702 -3758 -1097 2196 -2258 -2845 1999 -511 -3581
3288 -3581 1159 1505 -3197 -820 2597 -1819 -2472 2415 225 -3160 1583 2498 -2628 -138 3475 -971
3304 -971 -1772 3068 1149 -2593 1802 3237 -1992 -71 3698 -8 -1279 3350 1815 -2099 1826
3319 1826 3222 -1681 267 4280 111 -1043 3285 1852 -1740 2018 3429 -1063 -11 4200 476
3334 476 -1309 3434 2388 -1610 1470 3632 -1086 -397 4037 125 -1948 2897 2033 -1829 1301 2958
3350 2958 -1607 -774 3544 -26 -2277 2533 1876 -2660 357 2991 -1906 -1542 2887 -225 -2722 1935
3366 1935 1498 -3043 -89 2581 -2102 -2127 2099 -617 -3324 942 949 -3426 -840 2119 -2523 -2619 1488
3383 1488 -597 -3840 487 870 -3570 -1238 1831 -2706 -3304 1499 -1015 -3660 273 712 -3608 -1542
$$ packed form
3272a259K788m442j97N162k793l268M466K45m460K661L293m454n87M844k510l070
3288c581M740L46m702K377L417m416o53M887k190l385M743R15n126K490L613m446
3304i71q01M840j919l742M395J435n229J921L769l706j271M629j535l914L925
3319A826J396m903J948M013m169j154M328j433l592L758J411m492J052M211l724
3334D76j785M743j046l998L080K162m718O89M434l912k073M845q64l862L130J657
3350B958m565Q33M318l570k251M810o57m536L017K634m897L64M429l112k497M657
3366A935m37m541K954K670m683k5M226k716k707M266Pm375K586K959m642r6M107
3383A488k085l243M327L83m440K332L069m537n98M803k514k645L933M39m320K066
$$ plain form
3399 -1542 1733 -2336 -3271 1537 -456 -3723 318 1420 -3436 -1345 1882 -1767 -3087 2102 -244
3414 -244 -3625 494 1816 -2862 -1298 2347 -1263 -2694 2126 741 -3092 529 2282 -2195 -839
3429 -839 2646 -809 -2130 2554 1453 -2434 861 2985 -1404 -456 3372 -5 -1637 2832 2029 -2145
3445 -2145 1432 3567 -1132 -418 3596 481 -1278 2950 2286 -1627 1216 3770 -847 -376 3821 1093
3461 1093 -1423 3028 2446 -1510 1143 3634 -840 -368 3598 1029 -1928 2594 2386 -1611 784 3081
3477 3081 -1030 -1088 3281 842 -1991 2088 2292 -2551 144 3073 -1149 -1744 2505 164 -2522 1451
3493 1451 1684 -2491 -541 2239 -1666 -2555 2173 -42 -3134 509 1460 -3036 -1052 1760 -1561 -2774
3509 -2774 1274 -329 -3425 443 1127 -3215 -1854 1815 -1881 -3324 1257 -428 -4000 -106 1198
$$ packed form
3399a542L275m069r35M808j993l267M041J102m856K091L227l649j320N189k346
3414b44l381M119J322m678J564L645l610j431M820j385l833L621J753m477J356
3429h39L485l455j321M684j101l887L295K124m389R48L828l377j632M469q03m174
3445b145L577K135m699P14M014l115j759M228o64l913K843K554m617M71M197k728
3461A093k516M451n82l956K653K491m474M72L966k569k957M522k08l997K395K297
3477C081m111n8M369k439k833M079K04m843K695K929m222n95M249k341k686L973
3493A451K33m175J950K780l905q89M728k215l092L643R51m496J984K812l321j213
3509b774M048j603l096L868O84m342J361L669l696j443M581j685l572L894J304
$$ plain form
3524 1198 -3253 -1486 2051 -1799 -2940 977 -57 -3594 -202 1255 -2929 -2119 1931 -1544 -3102
3539 -3102 962 89 -3502 66 1721 -2526 -1382 2193 -635 -2886 1472 1155 -2677 317 2304
3554 2304 -1985 -1163 2726 -136 -2149 1932 1741 -2382 532 2413 -1309 -903 3019 440 -1776 1981
3570 1981 2014 -1556 741 3228 -742 -744 3179 1089 -1653 2107 2438 -1408 770 3925 -181 -781 3396
3587 3396 1015 -1627 2239 2591 -1457 683 3616 -71 -1000 3292 1196 -1656 2029 2631 -1320 155
3603 155 3249 -519 -1107 2793 843 -1918 1438 2400 -1794 -259 2984 -650 -1492 2538 742 -2306
3619 -2306 706 1853 -1985 -808 2453 -928 -2414 1824 339 -2901 248 1587 -2282 -1275 2008
3634 2008 -1365 -3049 1283 274 -3372 -443 1135 -2650 -1762 1690 -1494 -2967 460 18 -3369
$$ packed form
3524A198m451J767L537l850j141L917j034l537L392J457m184Q10M050l475j558
3539c102M064q73l591L568J655m247J144L575k828k251M358l17l832K994J987
3554B304m289Q22L889k862k013M081j91m123K914J881l722M06L922k579k216L757
3570A981L3l570K297K487l970kL923k090k742L760L31l846K178L155m106o00M177
3587C396k381k642L866L52m048K140K933l687r29M292k096k852L685O02l951J475
3603A55L094l768n88L900j950k761L356R62m194J535L243l634q42M030j796l048
3619b306L012J147l838J177L261l381j486M238j485l240L149J339l869J007L283
3634B008l373j684M332j009l646K929J578l785Q88L452l184j473L427m42l387
$$ plain form
3649 -3369 -595 1267 -2626 -1920 1711 -1344 -3108 585 308 -3380 -683 1255 -2651 -1992 1309 -1022
3665 -1022 -3161 1010 434 -3117 -582 1467 -2319 -2101 1672 -365 -2810 1325 939 -2467 -512 2048
3681 2048 -1455 -1509 2149 -123 -2401 1613 1416 -2190 -305 2792 -687 -969 2562 344 -1949 1612
3697 1612 2174 -1793 119 3209 -112 -1225 2855 1086 -1533 2184 2763 -1073 429 3142 -116
3712 -116 -873 2877 1490 -1623 1857 2870 -741 314 3620 345 -1283 3018 1563 -1347 1621
3727 1621 2873 -1114 -165 2999 178 -1399 2650 1651 -1603 1247 2403 -1268 -721 2650 -182 -1810
3743 -1810 2250 1383 -2224 562 2203 -1743 -1187 2566 -512 -2149 1426 914 -2642 2 1685 -2091
3759 -2091 -1507 1646 -645 -2806 1097 763 -2899 -517 1352 -2367 -2048 1358 -903 -3255 547 409
$$ packed form
3649c369K774J862l893P06L631l055j764L693k77l688K697J938l906O59L301k331
3665a022k139M171n76l551K535K049l786K18L773k037k445M135l86l406J955K560
3681B048l503n4L658k272k278M014j97l606J885L097l479k82L531k218k293L561
3697A612N62l967J912L090l321j113M080j769k619L717N79l836J502K713l258
3712a16p57L750j387l113L480J013l611J055L306l275j628M301j455k910K968
3727A621J252l987R49L164k821j577M049r99l254K850J156l671N47L371k832j628
3743a810M060q67l607K786J641l946N56L753l078j637L575n12l556K644J683l776
3759b091N84L153k291k161L903l34l662K382J869l719L19L406k261k352L802j38
$$ plain form
3775 409 -2825 -698 1390 -2178 -2444 1023 -836 -2985 329 632 -3055 -1032 1208 -2192 -2394 1087
3791 1087 -923 -2980 367 740 -2747 -1011 1684 -1886 -2424 1249 -390 -2934 538 1130 -2268 -610
3807 -610 1863 -1303 -1770 1890 332 -2481 909 1816 -1823 -769 2684 -496 -1534 2179 1370 -1919
3823 -1919 1280 2268 -1525 -62 2774 -102 -1317 2518 1483 -1894 1427 2556 -912 -149 3181
3838 3181 202 -1008 2664 1932 -1317 1100 2904 -833 9 3025 300 -1126 2318 2093 -1309 888
3854 888 2873 -532 -314 2982 457 -1221 2487 1782 -1500 671 2493 -975 -324 2724 382 -1631
3870 -1631 2018 1569 -2171 277 2166 -1294 -1391 2251 -79 -2219 1184 1162 -2044 -261 1727 -1500
3886 -1500 -1990 1635 -258 -2535 992 1248 -2719 -764 1373 -1773 -2046 1189 -392 -2843 356 629
$$ packed form
3775D09l234K127K088l568k66L467j859k149L314L03l687K023K240l400k02L481
3791A087k010k057L347L73l487J736K695l570n38L673j639k544L472N92l398J658
3807f10K473l166m67L660j558k813L390R07l639J054L453l180j038L713q09l289
3823a919L199R88l793J463K836k876j215L835j035l377L321J129l468P63L330
3838C181k979j210L672p32l249K417J804l737Q42L016k725j426L444k25l402K197
3854H88J985l405K18L296k525j678L708p05l282K171J822l468O51L048k342k013
3870a631L649m49l740K448J889l460r7L642k330k140L403k2l206J783J988l227
3886a500m90L625j893k277L527K56l967J955K137l146k73L235j581k451L199K73
$$ plain form
3902 629 -2573 -1243 1344 -1946 -2595 1013 -396 -3134 -163 886 -2895 -1413 1306 -1757 -2646 1191
3918 1191 -240 -2978 -227 1091 -2626 -1514 1374 -1600 -1940 930 143 -2545 156 1324 -1992
3933 -1992 -1286 1826 -976 -2051 1371 621 -2711 404 1640 -1509 -961 2189 -398 -1785 1699 774
3949 774 -1786 775 2258 -1227 -491 2578 85 -1343 2152 1835 -1492 857 2885 -680 -348 2892
3965 2892 437 -1109 2163 1897 -1299 852 2821 -311 -162 3002 644 -1321 2027 2128 -1187 594
3981 594 3149 -479 -490 2695 788 -1260 1779 1944 -1213 501 2488 -286 -791 2569 802 -1844
3997 -1844 1472 1982 -1303 -221 2520 -852 -1141 1880 223 -2163 977 1649 -1509 -468 1829 -658
4013 -658 -1614 1735 157 -2547 787 1365 -2695 -1227 1911 -1391 -2229 1347 271 -2885 23 865
$$ packed form
3902F29l202J330K587l290o49L608j409k738K971J049l781J482K719l063q89L837
3918A191j431k738K751J318l717J112K888k974l40K870p87k688K701J168l316
3933a992P06L112k802j075L422p50l332L115J236l149N48L150k587j387L484r25
3949G74k560K561J483l485P36L069k493j428L495l17l327K349K028l565L32L240
3965B892k455j546L272k66l196K151J969l132J49L164k358j965L348J01l315J781
3981E94K555l628j1L185j907k048L039J65l157J714J987k774n05L360j767k646
3997a844L316N10l285J082K741l372k89L021j657k386L140O72l158J041K297k487
4013f58r56L349j578k704L334N78m060J468L138l302q38L576j076l156K908Q42
$$ plain form
4029 865 -2521 -1705 1133 -1569 -2415 896 -175 -2795 -47 1112 -2520 -1561 1366 -1378 -2922 687
4045 687 -151 -3102 -411 1241 -2198 -1436 1099 -951 -2483 734 470 -2643 -237 1625 -1783 -1546
4061 -1546 1948 -954 -2350 1146 901 -2076 6 1484 -1430 -1155 2018 231 -2089 1505 1418 -1874
4077 -1874 40 2325 -915 -972 2485 257 -1803 1653 1982 -1237 676 2379 -647 -591 2763 910
4093 910 -1228 1767 2265 -1185 440 2991 -186 -467 2877 1149 -1203 1706 2363 -873 422 2615
4109 2615 14 -667 2485 1211 -1341 1562 2389 -864 371 2582 -141 -985 2074 1213 -1705 1403
4125 1403 2315 -1203 -309 2369 -470 -1412 1804 718 -1617 465 1808 -1435 -957 1734 -484 -2028
4141 -2028 1395 563 -2593 -33 1432 -1686 -1122 1622 -994 -1964 1255 45 -2640 -516 1342 -2138
$$ packed form
4029H65l386Q16K838k702q46L311j071k620K748J159l632R59K927k744j544L609
4045F87q38k951K691J652l439P62K535k050j532L217k64l113K406J862l408K37
4061a546L494k902j396L496k45k977K082J478k914K75L173j787k320L594q7l292
4077a874J914K285l240n7L457k228k060L456L29l219J913J703l026N6L354j853
4093I10k138K995M98l450J625K551l177k81L344j728k352K909O57l236J295K193
4109B615k601o81L152j274k552K903Q27l253J235K211k723q44L059q61k918L108
4125A403R12l518Q94K678k839r42L216j086k335K082J343l243M78K691k218j544
4141b028L423q32l156K560J465l118N64K744k616r70L219j210k685K124J858l480
$$ plain form
4157 -2138 -1565 1442 -925 -2664 580 95 -2729 -409 1149 -2160 -1911 1359 -909 -2888 270 156
4173 156 -2570 -795 1249 -2070 -1800 1266 -487 -2578 595 369 -2472 -834 1393 -1862 -1987 1596
4189 1596 -165 -2627 641 1064 -2260 -891 1984 -1285 -1553 1805 274 -2245 835 1423 -1837 -271
4205 -271 2161 -469 -1488 1685 495 -1689 1330 1658 -1193 -56 2231 -54 -938 2517 1458 -1476
4221 -1476 1415 2306 -1111 262 2766 -108 -908 2093 1395 -1419 1070 2556 -795 162 2862 -67
4237 -67 -1006 2510 1752 -1497 1244 2568 -807 -302 2531 74 -1533 2168 1792 -1323 786 2238
4253 2238 -975 -869 2335 260 -1732 1659 1244 -1662 427 1900 -1297 -888 2083 -88 -2114 1190
4269 1190 866 -2232 -51 1958 -1341 -1176 1451 -229 -2098 836 735 -2787 -492 1539 -1524 -1747
$$ packed form
4157b138N73L007k367j739L244m85k824K320J558l309K49L270k268j979L158j14
4173A56k726J775K044l319K70L066j753k091L173k26k841J638K227l255j25L583
4189A596j761k462L268M23l324J369K875l269k68L358j531k519L080N88l260J566
4205b71K432k630j019L173j190k184L019L28k851J137K287k285q84L455j059k934
4221a476K891Q91l417J373K504k874q00L001o98k814K489J486l351R57K700k929
4237f7r39L516p58l249K741J324l375N05K833k457j607L701l76l115K109J452
4253B238l213J06L204k075j992L391m15k906K089J473l197M09K971k171k026L304
4269A190l24l098K181K009l299J65K627j680j869K934j01l522K295K031l063k23
$$ plain form
4285 -1747 1554 -769 -2594 455 514 -2521 -786 1253 -2010 -1981 1354 -587 -2809 171 390 -2415
4301 -2415 -1202 1046 -1664 -2397 1339 -394 -2870 237 869 -2121 -1055 1626 -1321 -1848 1245 -184
4317 -184 -2651 188 1018 -2089 -902 1423 -1052 -1599 1763 354 -2316 438 1647 -1338 -697 1995
4333 1995 -390 -1360 1892 1044 -1909 604 1929 -1126 -538 2685 165 -976 2075 1414 -1264 987
4349 987 2476 -917 -267 2567 235 -937 1985 1614 -720 1010 2517 -614 -302 2447 407 -937
4365 -937 1819 1762 -1100 793 2450 -650 -310 2669 295 -1056 1402 1606 -1046 770 2147 -909
4381 -909 -901 2088 641 -1579 1550 1571 -1619 11 1976 -858 -1291 1737 82 -1985 1098 1244 -1847
4398 -1847 -375 1811 -986 -1682 1432 205 -2329 513 1091 -1919 -614 894 -1285 -2065 1048 -352
$$ packed form
4285a747L301k323j825L049N9l035J735K039l263K9L335j941k222K980K19k805
4301b415J213K248k710p33L736j733k476L107O32k990J066K681k947n27L093j429
4317a84k467K839Q30l107J187K325k475n47L362j409k670K754J209k985O41K692
4333A995k385r70L252q48k953K513J325l055N88L223k520j141L051o61k678K251
4349I87J489l393O50K834k332j172K922l71k334J730J507l131L12K749k040j344
4365i37K756n7k862J893J657l100L40K979k374j351K458K04k652J816J377l056
4381i09QK989j447k220L129K1l190J630J965k834m33L028j655k067L083J46l091
4398a847J472K186k797o96L114j227k534K842N78l010J305J508k179p80L113j400
$$ plain form
4414 -352 -2486 193 827 -2400 -1020 1195 -1529 -2393 669 -16 -2324 -123 766 -1937 -1035 1262
4430 1262 -1174 -2252 557 -395 -2783 -256 1109 -2238 -1273 1161 -1038 -1995 957 353 -2259 -251
4446 -251 1279 -1798 -1179 1574 -720 -1981 1075 815 -1819 172 1660 -1464 -1088 1898 -134 -1591
4462 -1591 1453 765 -1849 471 1816 -916 -725 2674 221 -1498 1663 1364 -1224 288 2457 -433
4478 -433 -626 2334 699 -1169 1737 1894 -1165 330 2654 -487 -605 2351 593 -1161 1847 1984
4494 1984 -899 289 2613 -357 -763 2170 1117 -1063 1470 2186 -837 335 2396 -458 -904 2029
4510 2029 690 -1396 1179 1647 -1199 -212 2278 -492 -1322 1832 573 -1968 924 1461 -1277 -286
4526 -286 1586 -784 -1667 1257 378 -1932 326 1187 -1776 -845 1147 -835 -1866 860 364 -2215
$$ packed form
4414c52k134K679O34l227J380K215k724q64L062o85k308K201Q89k703R02K297
4430A262k436j078K809r52k388K527J365l347R65K434k199r57K952o04k612K008
4446b51J530l077O19K753k294j261L056k60k634J991J488l124L76K986k032j457
4462a591L044o88k614K320J345k732J91L399k453j719L161k99k588J512K169k890
4478d33j93K960j635j868K906J57l059J495K324l141j18K956j758j754L008J37
4494A984k883J188K324k970m06K933j053k180K533P16l023J172K061k854m46K933
4510B029j339k086K575M68k846R87K490k770q30L154j259k541K892N37k738R91
4526b86J872k370q83K924q79k310K258Q61k963R31J992j982j031K726m96k579
$$ plain form
4542 -2215 -181 938 -2098 -1379 1252 -889 -2362 519 306 -2234 -472 829 -2267 -1299 1149 -965
4558 -965 -2280 615 361 -2491 -140 1173 -1987 -1431 1088 -888 -2476 600 500 -2061 -323 1363
4574 1363 -1569 -1217 1507 -488 -2090 699 936 -2044 -254 1415 -930 -1329 1504 315 -1613 788
4590 788 1188 -1645 -126 1887 -781 -1203 1920 589 -1424 1158 1826 -1430 264 2217 -315 -937
4606 -937 1967 812 -1249 1255 1892 -1071 236 2444 -327 -1125 2294 1259 -1224 1689 2139 -1062
4622 -1062 232 2588 -52 -968 1991 1024 -1314 1144 1856 -1503 65 2313 -155 -1021 1994 1166
4638 1166 -1618 750 2087 -819 -248 2012 76 -1109 1485 836 -1381 696 1699 -1497 -721 2060
4654 2060 -447 -1400 1033 802 -2070 46 1270 -1327 -1008 1207 -697 -1819 832 534 -2080 -391
$$ packed form
4542b215K034J119l036P19K631k141j473K881k13k540J762J301l096R68K448k114
4558i65j315K895k54k852K351J313l160N56K519j976j588L076j00k561J738J686
4574A363k932L52K724j995j602K789K37k980J790J669k345l99K833j189j928K401
4590G88M00k833J519K013k668m22L123j331k013K582O68l256J694J953k532o22
4606i37K904j155k061K504O37k963J307K208k771p98L419j035k483K913M50l201
4622a062J294K356k640r16K959r67k338K458P12l359J568K248k468q66L015q28
4638A166k784K368J337k906N71K260j936j185K594o49k217K077J003l196P76K781
4654B060k507r53K433k31k872K116J224k597L19K215j904j122K651k98k614J689
$$ plain form
4670 -391 1512 -1680 -1663 771 -688 -2220 403 410 -2249 -613 1185 -1743 -2085 1070 -936 -2157 307
4687 307 489 -2423 -755 1227 -1501 -1868 1194 -487 -2370 573 419 -2157 -929 1209 -1386 -1517
4703 -1517 1322 -460 -2054 467 727 -1758 -538 1532 -717 -1248 1405 179 -1848 735 1467 -1562
4719 -1562 -188 1876 -468 -1195 1833 710 -1373 409 1243 -765 -212 2126 -173 -1287 1702 1121
4735 1121 -1141 926 1722 -847 -75 2398 214 -1037 1963 1151 -1136 942 2054 -451 20 2084
4751 2084 512 -716 2085 1609 -1045 834 2293 -753 -435 1966 233 -1177 1448 1241 -1294 717
4767 717 1646 -985 -338 1902 150 -1231 1180 1066 -1307 217 1296 -894 -592 1817 -200 -1806
4783 -1806 718 911 -1764 -194 1161 -1355 -1219 1044 -654 -1973 634 996 -2074 -685 1328 -1385
$$ packed form
4670c91J903l192J7K434j459j532K623Pk659J636J798k928l42L155k006j221K464
4687C07J82k912J668J982k728l67L062j681j883K943j54k576J228K138k595j31
4703a517K839j782j594K521K60k485J220K070k249n31K653j226k027K583P32l029
4719a562J374K064k344p27L028j123k083J782Q34k008N53K338k299j114K989n81
4735A121k262K067P96k569P72K473k184j251L000q12k287K078J112k505M71K064
4751B084j572j228K801m76k654J879J459l046L18K401j733j410K625k07k535K011
4767G17R29k631O47K240j752j381K411j14k373J524J079k190L02K409k017j606
4783a806K524J93k675J570J355k516J36K263j698j319K607L62l070J389K013k713
$$ plain form
4799 -1385 -1601 1318 -438 -2197 195 901 -2009 -797 1049 -911 -1660 780 -188 -2129 217 604
4815 604 -1941 -834 1046 -1584 -1814 1040 -7 -2038 134 780 -1639 -819 1382 -914 -1951 1083
4831 1083 197 -1992 158 1010 -1358 -755 1265 -559 -1422 1330 368 -1692 108 1122 -1239 -385
4847 -385 1918 -260 -1421 1326 816 -1674 626 1631 -852 -545 2042 24 -868 1513 924 -1160
4863 -1160 604 1861 -563 -149 1873 280 -950 1714 1465 -878 623 1876 -345 -350 2137 611
4879 611 -778 1457 1549 -831 784 2064 -438 -469 1862 969 -903 1330 1508 -806 430 1882 -298
4896 -298 -604 1625 563 -1070 1123 1523 -1366 -115 1956 -536 -932 1595 220 -1536 492 1181
4912 1181 -1578 -596 1534 -778 -1326 1313 171 -2078 456 1130 -1599 -678 1157 -691 -1796 934
$$ packed form
4799a385k16K919j756j759K392P06k910J212J846j960p49K440r68j941K346L87
4815F04k545J107J880k630k30K854j047k031K172O46k419Q20K201k296j037L034
4831A083q86k189K150Q52k368O03K020j824q63K752r62k060J800J014k361Q54
4847c85K303k178j161K747n10k490K300J005k483L07K587k018q92K381n89k084
4863a160J764J257k424M14K022j593j230K664k49k343J501J253k221nK487j526
4879F11j389K235R2k380J615J280k502l1K331q93j872K233J78k314J236J452k180
4896b98l06K229j062j633K193M00k889J251K071k492l96K527j375j756K028O89
4912A181k759R82K130k312n48K639j142k249K534O74k729R21J835j848j105K730
$$ plain form
4928 934 13 -1566 -201 836 -1773 -1153 895 -941 -1707 586 -204 -1723 -425 715 -1680 -1258
4944 -1258 1078 -1183 -2040 682 -68 -2011 -245 826 -1506 -1117 677 -777 -2016 622 222 -1701
4960 -1701 -23 967 -948 -1125 1005 -393 -1125 552 606 -1502 -377 1446 -1200 -1086 1390 -433
4976 -433 -1423 1093 1122 -1152 244 1477 -770 -413 1807 92 -1176 1237 1049 -1255 269 1494
4992 1494 -429 -529 1612 539 -595 1124 1320 -991 316 2015 89 -261 1624 927 -756 971
5008 971 1662 -731 329 1919 -379 -326 1684 791 -1047 1248 1288 -933 130 1720 -265 -584 1606
5025 1606 685 -816 392 1424 -817 -225 1592 -669 -781 1134 610 -1413 495 1227 -1074 -430
5041 -430 1782 -124 -1225 822 373 -1535 75 847 -1482 -863 1001 -495 -1703 851 278 -1714
$$ packed form
4928I34r21j579J365J037k609O20K048j836p66K293p90j519J298J140k395M22
4944a258K336k261q57K722p50j943J766J071k332L89J794j454j239K638m00j923
4960a701J678R90j915j77K130j398p32J677N4k108J125J823k646J14K476j823
4976d33r90K516K9k274J396J233k247L57K220j715j268K413j88k304J524J225
4992A494j923j00K141j073j134J719J96k311J307J699j926l50J885o97j683J727
5008I71O91k393J060J590k298N3K010q93j838K295M0k221J063J590j985l19K190
5025A606r21j501J208J032k241N92J817k261j12J915n24k023J908P32k301O44
5041d30K212j906j101K047m49j908J610P72k329O19J864j496j208K554n73j992
$$ plain form
5057 -1714 -230 864 -1090 -1029 732 -540 -1709 369 -93 -1904 -459 733 -1552 -1250 989 -369
5073 -369 -1815 305 108 -1680 -662 707 -1314 -1501 757 -567 -1911 411 326 -1819 -614 842
5089 842 -1202 -1058 788 -415 -1472 295 379 -1621 -41 1050 -659 -950 1220 317 -1514 525
5105 525 823 -1336 -191 1213 -427 -930 1289 527 -1181 693 1329 -937 -66 1663 -246 -560 1694
5122 1694 733 -960 819 1606 -662 32 1861 284 -587 1490 1006 -966 1066 1463 -730 73 1760
5139 1760 56 -525 1642 961 -869 944 1697 -657 -59 1911 59 -573 1364 1094 -812 607
5155 607 1884 -655 -843 1633 252 -1045 1145 687 -920 307 1269 -805 -598 1338 50 -1256
5171 -1256 879 507 -1187 -70 1024 -748 -948 1056 -268 -1512 430 227 -1843 -571 599 -1223
$$ packed form
5057a714J484J094j954O1J761j272j169K078m62j811J445J192k285L02K239j358
5073c69j446K120j97j788J018J369k021j87K258j324j344K322q5k145J205J456
5089H42k044J44J846j203j057J767Q4k000J580J091j709k91K170r03j831K039
5105E25K98k159J145J404j640n03K219p62j708J874O36k266Q71J729j909l14K254
5122A694r61j693J779P87k268O94J829j577q71K077m84j972K032L97k193Q03J687
5139A760j704n81K167o81j830J813P53k354N98J970j852o32J937k70j906J419
5155F07J277k539j88K476j381j297K190m58j607J227R62k074K07J936j288j306
5171a256K135l72j694J117J094j772k00K004j324j244J942k03k070J272J170j822
$$ plain form
5187 -1223 -1055 566 -199 -1619 29 654 -1614 -499 897 -1052 -1257 484 -70 -1697 183 211 -1770
5204 -1770 -836 896 -1211 -1255 632 -397 -1657 45 662 -1383 -343 739 -860 -1474 719 137
5220 137 -1716 200 829 -1459 -457 894 -577 -910 749 89 -1420 435 834 -966 -518 1292
5236 1292 -230 -966 1037 633 -1155 490 1335 -772 -105 1487 -85 -872 1315 863 -612 540
5252 540 1345 -219 11 1539 346 -771 1187 918 -1071 623 1529 -381 -98 1581 473 -705
5268 -705 1230 961 -734 410 1359 -379 -176 1627 315 -467 1052 984 -728 206 1523 -179 -399
5285 -399 1461 -186 -1036 768 903 -822 116 1486 -639 -1024 1162 187 -1313 675 850 -1301 -111
5302 -111 846 -639 -802 752 -339 -1576 413 480 -1503 -613 562 -668 -1223 770 -85 -1716 197
$$ packed form
5187a223J68J621p65j420J648O25k268J115J396j949k05J741n54j627J880K8j981
5204a770R34J732k107m4J887j029j260J702O17k045J040J082j599o14K193n82
5220A37j853J916O29k288J002J351j471l33J659o60j509J855L99j800M48J810
5236A292j522p36K003m04j788J645Q45k107O67J592j572p87K187m52j475J152
5252E40Q05j564K30J528j193j117J958k69j989J694R06j910K83J679j108j178
5268g05J935k69j695J144R49j738K03J803j312p82J519o8j712R34J317j702k20
5285c99J860j647q50J804J35j725R38J370k125l85K186r75j500J988J75k151J190
5302a11R57j485j63J554j091j237J989O7j983Q90J175j230n55J993q55j631J913
$$ plain form
5319 197 478 -1622 -756 1081 -1064 -1283 918 -223 -1676 -257 252 -1393 -711 981 -681 -1650 629
5336 629 -30 -1583 12 577 -1301 -854 717 -746 -1485 387 152 -1663 7 929 -1264 -610 763
5353 763 -260 -1314 700 504 -1162 -17 1193 -833 -466 1269 -150 -1127 298 572 -1046 355
5369 355 876 -718 -405 1495 338 -759 989 1071 -537 257 1483 -334 -360 1385 297 -712 1224
5386 1224 1300 -791 144 1442 -239 -356 1663 566 -779 618 1293 -750 171 1594 -89 -514 989
5403 989 759 -731 903 1018 -598 88 1890 -231 -521 1152 489 -813 819 1183 -481 -199 1155
5420 1155 -353 -776 1164 300 -1064 411 792 -827 -259 1154 -390 -784 996 199 -1597 58
5436 58 535 -1296 -784 930 -504 -1115 404 -346 -1650 -141 829 -1147 -1042 582 -637 -1329 586
$$ packed form
5319A97K81k100Q66J837k145k19K201j141j453J419N09j645O82J692j662r69K279
5336F29o59j553J595N65j878M47J571j463p39J872k35j815J670R22k193O54J373
5353G63j023j054K014j96j666J145J210k026L67J735j419r77J425K74j618J401
5369C55N21j594L13J900j157j097J748Q2j608P94J226j817k6J745j088j009J936
5386A224P6k091R35J298j681j17K019j097j345J397O75k043R21J423j683m25J503
5403I89k30j490J634J15j616O86J802k121k90J673o63j302J632L64j664K82J354
5420A155j508m23J940q64j364J475L81j619N68J413j544l94J780p97j796J655
5436E8M77j831N12J714j434o11J519p50j304J509R70j976J05J624j219o92J915
$$ plain form
5453 586 -26 -1584 164 410 -1340 -1139 537 -779 -1333 308 141 -1624 -68 340 -1131 -1207 448
5470 448 -382 -1430 584 248 -1617 -349 723 -863 -692 793 -545 -1097 689 463 -1192 -194 932
5487 932 -665 -854 1052 157 -1018 554 774 -879 -51 1057 -702 -846 1066 409 -755 878 1178
5504 1178 -753 113 1444 179 -464 1283 589 -589 1012 1018 -802 150 1683 313 -453 1425 852
5521 852 -827 819 1200 -414 401 1521 238 -33 1390 701 -724 616 701 -319 15 1401 50
5538 50 -503 1042 771 -629 623 1218 -562 -33 1445 -286 -766 973 602 -1068 161 1196 -814
5555 -814 -277 1177 112 -897 830 244 -1051 70 1032 -884 -766 782 -593 -1089 563 162 -1370
5572 -1370 -179 432 -870 -1181 581 -315 -1231 77 303 -1521 -344 552 -1248 -1217 633 -499 -1442
$$ packed form
5453E86o12j558J748K46j750K01J676j316n54J641j67j765J556M08j471p6J655
5470D48q30j048K014l36j865J268J072j586J71J485j338n52J786k26j655R98J126
5487I32j597j89J906q95j175J572K20j653Q28J108j759j44J912o57j164J633L00
5504A178j931Q66J331j265o43J747o94j178J601Oj820R52J533j370p66J878n73
5521H52j679J646L81j614Q15J120j283k71J423o89j425J340Q5j020L34J386j351
5538E0n53J545k71j400J252N95j780N29J478j731m80J739l71j670J229J035k010
5555h14N37J454j065j009J727n86j295J121R62j916J18J548j375m96J652m01j532
5572a370J191O11j302l11J762q96r16J308K26j824J177Q96j800L1J850j132r43
$$ plain form
5589 -1442 188 204 -1460 -416 787 -1195 -975 651 -380 -1206 195 345 -1157 -610 921 -910
5605 -910 -938 903 -126 -1189 306 449 -855 -244 926 -779 -953 1041 -16 -1189 517 731 -629
5622 -629 71 1189 -400 -625 918 202 -856 492 848 -682 -248 1249 102 -662 1215 508 -906
5639 -906 720 1177 -583 -43 1552 305 -385 1398 830 -996 544 1380 -258 -70 1159 199 -402
5656 -402 1311 939 -489 654 1296 -282 34 1437 14 -664 732 729 -593 401 1419 -635 -241
5673 -241 1432 -87 -862 1020 709 -1097 321 1036 -566 -421 1040 -148 -929 613 763 -1005 86
5690 86 642 -804 -758 632 -332 -1382 276 276 -1359 -304 859 -1000 -839 707 -534 -1192 112 628
5708 628 -1398 -526 778 -737 -1240 690 -231 -1500 -9 218 -1362 -668 508 -689 -1047 893 -52
$$ packed form
5589a442J630J6j664J044J203j982K20J626j031q26J401J50j502N47J531j831
5605i10k8J841j029j063J495J43j304O11J170j705j74J994j057j173J706K14j360
5622f29P00J118j589k25J543p16j058J348L56j530M34J497j147p64J877p07j414
5639i06J626M57j760N40J595j247o90J783n68j826J540Q36j638J88J229r60o01
5656d02J713l72j428J143O42j578L16J403j423o78J396lj322R94J018k054L94
5673b41J673j519p75J882l11j806J418P15j602J45J461j188p81J542J50j768J091
5690H6N56j446M6J390r64j050J658%j635J055J163j859J61J546j241o58J304N16
5708F28k026Q72J304j515n03J930r21j269J491K27j580O94J176j197l58J940r45
$$ plain form
5725 -52 -1583 -22 135 -1268 -415 711 -859 -912 571 417 -1263 166 646 -972 -425 852 -471
5742 -471 -937 739 232 -1304 218 686 -640 -411 953 -122 -618 842 608 -1082 401 1159 -607
5759 -607 -201 1208 -106 -467 645 760 -885 468 1054 -192 207 1295 615 -495 973 629 -342
5776 -342 446 1216 -335 -258 1544 473 -485 1011 870 -655 308 1428 -259 -212 1191 228 -534 999
5794 999 857 -607 222 1284 -583 -518 1008 196 -749 418 880 -658 -11 878 -345 -840 968 220
5812 220 -1184 427 519 -1059 -174 1002 -385 -908 673 -83 -1093 198 606 -727 -363 857 -621
5829 -621 -1032 806 -56 -1221 -155 695 -1199 -711 544 -657 -1179 435 95 -1568 100 418 -1008
5846 -1008 -734 717 -536 -1028 240 247 -1382 21 674 -1073 -554 768 -532 -1145 392 45 -1407
$$ packed form
5725e2j531J561J57j403Q53J126j570n3J483j54j680J429M80j618N47J277j323
5742d71m66J676n07j536J522M68j326K29J364j075m96J460k34j690J483P58j766
5759f07M06J409j314l61J112J15j645J353N86j246L99J088o80j110J468l44r71
5776c42P88P70j551P7J802j071r58J496j41j525R63J120j687M7J403r63p62J533
5794I99j42j464Q29J062j867O5J526q12r45J167M62j538O47Q89j223m95J808p48
5812B20j404J611R2j578Q85J176j387n23J581p56j010J291M08j333L64J220j478
5829f21m11J838q62j165J066Q50j894M88J255j201n22J614l40j663J668L18j426
5846a008K74J451j253m92J268Pj629J403O53j747N19J322j300o13J537l47j452
$$ plain form
5863 -1407 -38 501 -689 -759 665 -251 -1169 453 440 -942 -138 897 -820 -355 804 -79 -866 644
5881 644 354 -1165 18 1119 -224 -536 1040 317 -686 640 896 -616 210 1086 -342 -400 1320
5898 1320 253 -768 871 998 -562 234 1334 -87 -234 1268 298 -601 773 1042 -604 499
5914 499 1469 54 -333 1512 483 -762 814 947 -579 42 1145 -241 -405 1344 498 -886 715
5931 715 1036 -756 -131 1232 -61 -760 854 44 -1050 326 612 -842 -177 968 -428 -646 508
5948 508 191 -1304 134 714 -738 -536 903 -504 -1072 261 144 -975 -8 198 -1138 -557 895
5965 895 -532 -1289 168 121 -1090 -390 457 -1123 -852 563 -492 -1349 402 347 -1455 -192 527 -1112
5983 -1112 -668 421 -407 -1175 573 123 -1157 -248 180 -668 -873 630 -184 -957 483 373 -1118 -356
$$ packed form
5863a407J369N39j190p0J424r16r18J622j3j382Q04J035j717M65J159q83p87J510
5881F44k90j519J183J101j343l12J576p23j003J326K56j512Q26Q76j428n8J720
5898A320j067j021J639J27j560P96J100j421j47J502r70q99J374K69j646J103
5914D99R70j415l87J845j029j245J576J33j526O21J103j386j64J749q46j384J601
5931G15L21j792O25J363j293o99J614q10j094J376K86j454O65J145j396k18J154
5948E08l17j495J438N80j452K02J439j407n68J333j17j119R67K06j336N81J452
5965H95j427p57J457m7j211P00Q47j580K71J415j055q57J751n5j802J263P19j639
5983a112M44J089q28p68J748m50j280R09M28q48k05J503q14p73J440j10j491P62
$$ plain form
6001 -356 923 -535 -595 725 197 -814 638 713 -939 -145 1131 -197 -302 1003 224 -878 565
6018 565 875 -707 282 1251 3 -340 1116 553 -597 610 1003 -636 -9 1383 -6 -419 1071
6035 1071 669 -425 530 1215 -448 -19 1458 76 -244 1201 661 -568 522 775 -644 46 1390
6052 1390 -60 -496 945 303 -611 748 635 -425 -302 1083 -17 -491 746 479 -946 98 789
6069 789 -584 -277 822 8 -962 381 393 -1033 47 606 -502 -889 655 -272 -928 400 344 -1295
6087 -1295 -288 839 -898 -752 471 -610 -1264 145 586 -1160 -489 607 -935 -776 473 -125
6103 -125 -1291 47 293 -848 -516 405 -627 -1053 304 -234 -1348 103 378 -1053 -424 615 -809
6120 -809 -969 573 -18 -1121 144 384 -1072 -391 739 -700 -872 793 -91 -895 626 655 -821
$$ packed form
6001c56J279j458o0J320n28j011J452P5j652P94J276j328j05J305p79j102J443
6018E65L10j582R89R69j248l43J456n63j150J207L93j639O27J392j389m13J490
6035A071m02j094R55O85j663M29J477j382l20J445n40j229J090K53j419O90J344
6052A390j450m36J441o42r14J359j13j060J23J385j100m74J237k67j425J044O91
6069G89j373L07J099q14r70J343J2j426J080N59j108l87J544r27o56J328n6j639
6087a295J007J127j737J46J223j081o54J409M41j746O71J096j542J59J249n98
6103a25j166J338K46j141L32R21j032m26J357n38j114J451K75j431O29J039j424
6120h09j60J542n91j103J265K40j456O81J130j439j72J665q84q04J521K9j476
$$ plain form
6137 -821 -41 1009 99 -397 1058 362 -770 560 726 -659 -86 1280 3 -504 939 434 -779
6154 -779 428 984 -432 -6 1249 129 -269 858 791 -171 198 1293 77 -138 1193 148 -139
6171 -139 554 770 -433 345 1189 -340 -175 837 185 -524 959 701 -312 -30 1143 -537 -270 1442
6189 1442 229 -951 538 699 -605 161 981 -532 -528 880 18 -830 621 838 -820 143 390 -664
6207 -664 -561 604 74 -1219 239 644 -658 -192 473 -871 -672 696 -130 -1316 183 171 -1076
6224 -1076 -415 263 -554 -987 544 -224 -1224 -28 139 -1360 -717 649 -748 -1238 349 -266 -1230
6241 -1230 52 404 -955 -386 309 -549 -1173 646 47 -912 46 572 -869 -316 961 -577 -943 374
6259 374 28 -988 173 452 -577 -264 880 -38 -738 584 178 -707 182 568 -480 -553 1022 206
$$ packed form
6137h21P80J050r10m96J455o96j132J330J66j385N73J366j277n07J443n05j213
6154g79J207N56j416M26J255j120l98J127o7r62L69J095j216k15J331j045k87
6171a39O93K16j203P78Q44j529J65J012o52p09J483k58j013K82J173j680K67J712
6189A442j213j180J489J61j304P66Q20j513MJ408q62q48J451K17j658R63K47j054
6207f64J03J165n30j293J458M05j302M66O65j344J99J368q26j186J499j2j247
6224a076O61O78q17m33J531p68j000J196J67j499O43J366j397m90J587o15r64
6241a230J282L52j359N69O95q58o24J819n99r59R58N26j441N53J277j538l66J317
6259C74l46j016J161K79j029L13J144r18p00J322m06q85Q89L86j048p3J575q16
$$ plain form
6277 206 -691 700 443 -498 263 1209 -406 94 1017 -173 -445 740 1102 -422 313 1479 -223 -214
6295 -214 1026 157 -379 745 418 -158 12 1250 -140 -26 1276 300 -446 501 832 -473 298 1182
6313 1182 -370 -638 908 306 -745 283 658 -813 -75 858 -170 -447 817 58 -785 226 681
6330 681 -843 -147 675 -422 -700 579 256 -726 182 724 -1145 -406 459 -418 -483 665 -216 -937 -39
6349 -39 316 -984 -392 461 -626 -1119 224 134 -1316 30 220 -975 -589 563 -420 -838 352 18
6367 18 -1144 228 424 -703 -471 559 -634 -1075 436 162 -1256 -6 550 -398 -660 663 -449
6384 -449 -859 201 94 -915 -46 649 -741 -185 1024 208 -598 438 372 -888 159 896 -478 -354
6402 -354 816 9 -624 514 595 -563 -13 1056 -126 -139 1049 411 -893 689 731 -395 179 1220
$$ packed form
6277B06q97J391k57r41P61R46j615N00R23j190k72J185L62j524P35J166j702R
6295b14J240q69n36J124l27n76J70J238j390J14J302r76p46R47L31j305P71Q84
6313A182j552k68J546o02j051J028L75j471P38R33j028k77J264p59q43J011M55
6330F81j524O96Q22j097k78J279l23r82R08N42j869P39Q65q77o5J148q81p21Q98
6349c9L55j300N92Q53j087m93J343r0j450J346J90j195L86J152r83m18J190l34
6367A8j162J372J96j127K32J030j193m41J511k74j418J250N56r48k62J323j112
6384d49m10J060j07j009Q69O95j390N56J209q16q06J036o6j260J047P37j374J24
6402c54J170q07o33J138Q1j158N50J069j182j3J188o38j304J582M2j126N74J041
$$ plain form
6420 1220 50 -217 766 354 -376 431 703 -322 72 882 -89 -398 1057 -5 -373 473 662 -665
6438 -665 -30 1055 106 -543 712 287 -874 265 745 -482 -131 967 -460 -390 603 489 -774 504
6456 504 747 -583 -331 637 -396 -970 439 362 -1005 317 363 -677 -547 709 -263 -1096 181 303
6474 303 -1047 -24 458 -646 -322 705 -400 -990 39 539 -778 -80 532 -731 -887 534 -582
6491 -582 -1356 367 -119 -759 -103 518 -682 -433 618 -132 -836 51 -108 -833 -348 773 -548 -650
6509 -650 586 -47 -962 472 442 -954 -464 338 -445 -780 462 233 -827 192 374 -565 -291 996
6527 996 -176 -314 898 266 -279 365 910 -398 96 896 -109 -201 887 287 -641 595 746 -157
6545 -157 133 947 13 -266 966 546 -486 483 908 -333 169 1032 -40 -358 735 665 -673 479
$$ packed form
6420A220j170k67R83m12p30Q07K72j025L94Q10r71l09J455j062l68Q46J89j327
6438f65O35J085r49o49J255m25j161J139M80j227L51J098j427P0R93j14j263J278
6456E04K43j330K52R68j033n74J409p7j367J322M6j040J30J256r72q33J277J22
6474C03j350J023M82j104L24J027j105n90J029N00j317O98O12j263j56J421j116
6491e82p74J723m86o40O56O21j200K49J051p50p04Q87j59p25M85J121j321j02
6509f50J236o33r15J434l0j396M90Q02p83l35J242k29j060J019J82r39K74J287
6527I96j172j38J212o32n45O44N45j308M94Q00j005r2J088o00r28J236J51r03
6545a57K90Q14r34k79J232m20j032R69M25j241N02Q63j072l18J093p0j338J152
$$ plain form
6563 479 947 -370 -41 696 7 -284 470 491 -646 273 842 -298 -12 729 -118 -414 665 80 -593
6582 -593 20 735 -437 -169 499 -34 -546 532 211 -1000 -15 452 -364 -348 686 80 -953 427
6600 427 304 -749 -128 666 -697 -1069 479 -376 -1103 45 -168 -997 -435 329 -664 -638 441 -58 -1194
6619 -1194 132 29 -963 -158 520 -699 -514 178 -130 -943 205 260 -701 -298 412 -523 -465 544 -148
6638 -148 -825 -80 153 -543 -532 332 -221 -543 437 151 -791 112 588 -544 -311 677 -421 -715 433
6657 433 248 -505 415 811 -542 -128 990 11 -310 648 482 -348 296 808 -461 102 920 68 -342
6676 -342 721 549 -650 363 966 61 -11 1091 268 -146 576 700 -293 211 809 -405 -223 789
6694 789 145 -301 688 424 -248 32 841 -350 -67 1095 -23 -736 149 532 -383 17 650 -263 -223
$$ packed form
6563D79M68j317L29P37o89k91P54K1j137R19N69j140K86P41q47k96J079n85o73
6582e93O13P15j172K68O68n33n12J078l21j211R85M67q16J6J034o06j033J380
6600D27j23j053O21P94j363l72J548q55p27J148k13q29N62P64r93K6J079m99j136
6619a194J326j03r92Q05O78j219J85O92l08q13J148N5r61M03P10r35N8J009o92
6638a48o77P45K33o96J1Q64n53l22R80k86r42R03M76j132K33R88j098k94J148
6657D33j85p53R20L96j353M14J118r79l21R58j66q30O44N12j269N63Q18q52m10
6676c42J063j72j199J013O03r05p2J102q23m14P22J24r93N04N98j214J82J012
6694G89o44m46R89k64o72K80Q09j191K83J162j118p13Q85L83r15M00O33r13M0
$$ plain form
6713 -223 647 212 -564 290 564 -566 -107 464 -260 -544 144 135 -761 263 197 -614 -412 364 -438 -389 335
6734 335 -95 -1069 186 366 -1025 -256 232 -460 -707 298 -303 -901 -33 15 -881 -359 288 -537 -363
6753 -363 38 -233 -1005 -185 416 -833 -546 815 -495 -718 396 -29 -955 -94 347 -438 -305 652 -89
6772 -89 -569 366 116 -707 147 790 -550 -422 593 -315 -591 611 328 -618 -2 715 -57 23 592 264
6792 264 -573 574 396 -271 143 807 -276 39 848 25 -142 503 693 -472 545 847 -225 -299 912
6811 912 189 -460 770 624 -87 302 771 -134 48 927 454 -435 384 386 -388 176 857 9 -177 582
6831 582 132 -414 207 606 -538 86 844 -293 -562 608 242 -531 274 416 -241 -37 596 -87 -372
6850 -372 490 -91 -732 226 358 -372 -238 523 -225 -319 462 -82 -899 378 205 -755 -651 453 -443 -577
$$ packed form
6713b23Q70m35p76Q54K74j130M59N71p24k84O88rq96J024o6q11K02P76q02M9P24
6734C35m30r74J255J80j391P69M88o92k47J005o01n98Q68M8q96N22O47q25J74
6753c63M01k71p72Q20O01j249K87J361j310k23J114m25r26Q61M41p85J33R57p41
6772h9m80R35k50q23Q54O43j340J28J015r08k76J202k83r46O16P17p72Q0N69l28
6792B64q37J147j78o67M14O64j083L15Q09q23j67O45J90j165J017L02j072p4J211
6811I12p23o49J230j46p11L89M69r05J82Q79m73q89Q19Kp74N64O81q48j86P59
6831E82m50n46O21L99j144O24P58j137k69J170l66p73Q05J42o57K04O33o83k85
6850c72Q62n81o41R58J32p30J34P61p48r4P81n44q17J277j73r60J04J104q96j34
$$ plain form
6870 -577 259 -19 -781 -133 524 -556 -451 310 -108 -827 157 -20 -633 -28 352 -771 -498 333 -470
6889 -470 -505 287 37 -750 -124 345 -572 -702 376 -74 -696 326 332 -751 120 399 -152 28 304 -57
6909 -57 -667 308 321 -247 -83 621 -268 -481 732 338 -425 654 360 -43 469 552 -314 -37 748 125
6929 125 -619 543 535 -473 75 1026 -172 -408 925 370 -638 279 638 -373 21 593 -113 -265 926
6948 926 230 -212 397 413 -188 246 670 -127 -361 497 132 -530 496 579 -492 -170 460 -114 -85 505
6968 505 249 -370 223 115 -656 -363 443 -195 -680 334 -130 -806 -41 305 -681 -250 651 -308 -488 641
6988 641 55 -857 -146 73 -641 -702 205 -484 -812 292 180 -895 -161 381 -455 -847 143 -410 -911 340
7008 340 386 -933 -109 227 -646 -759 393 -338 -665 197 105 -556 -14 480 -185 -600 658 -232 -919 557
$$ packed form
6870e77Q36k78p62O48O57j080J05P61m18p19R84j77o13O05L80j123K73Q31q03
6889d70l5P92k50p87O26M69r17j30J078m50o22J022Oj083Q71K79n51J80K76l61
6909e7o10R75J3n68J64P04q89k13J213l94p63J079k94m03N12Q3q66K77P85o23
6929A25p44J162qj008N48R51j198k36J333n55j008R17L59j011L94N72p06j52J191
6948I26o96m42O09J6o01M34M24p97k34Q58l65o62J026Q3j071L22O30n74K9N90
6968E05k56o19N93j08p71K93Q06o38m85J014m64o76P65L46r86M31R01r59j80J129
6988F41n86r12P11K19p14o1R07o89l28J104j12j075P34N42q36l92R90n53n01J251
7008C40M6j319Q24L36q73j13J152p31l27Q62r2o61N42M94o65m15J258q90o87J476
$$ plain form
7028 557 238 -475 -222 494 -404 -379 708 23 -273 323 99 -416 90 652 -180 -374 189 349 -435 503
7048 503 895 -496 321 931 -471 -207 420 304 -459 209 555 -398 424 867 -91 -147 825 502 -446 303
7068 303 545 -129 13 763 61 -152 938 613 -468 98 671 -155 -172 1034 250 -84 547 413 -541
7087 -541 -19 811 -347 -187 623 42 -321 341 222 -594 324 413 -304 -314 276 -21 -717 71 279 -259
7107 -259 -50 584 -278 -348 301 -254 -504 301 6 -429 -285 333 -620 -368 321 2 -1019 166 127 -750
7127 -750 -324 153 -650 -948 415 -263 -1029 -2 177 -871 -425 401 -639 -608 -79 92 -589 -18 335
7146 335 -795 -305 477 -519 -628 93 87 -601 363 651 -546 49 687 -375 -250 324 16 -478 -31 156
7166 156 -571 -6 772 -240 -532 305 356 -496 254 567 -128 16 893 273 -195 602 369 -448 337 722
$$ packed form
7028E57l19p13K53P16q98K5J087o85k96N96k24n15N06N62q32j94N63J60p84R38
7048E03L92j391Q17O10j402K64O27j16p63O68L46r53Q22M43r58n6R72l23r48P49
7068C03K42o74J42P50p02k13J090l25j081N66N73q26j7J206p84l34O31j34r54
7087e41N22Q30j158J60Q10n81l63O62j19q16R18Q9p17j0N90k97o96P88K08n38
7107b59K09O34q62p0O49n55k50Q05k95m35J44O18r53K52O89l19j021J185l9q77
7127g50M26M77q03k98J363o78p66J027J79j048M46Q26j040L1N29J71o81N71L53
7146C35j130M90P82r96j09P21oo88R64K88j197N95O38j062J25N74l08m94M47J87
7166A56p27N65P78j012k92Q37N1q52P50L13o95J44Q77o20m68P97k33q17P85L85
$$ plain form
7186 722 53 59 681 92 -222 590 200 -580 391 755 -413 171 720 -50 -266 238 424 -447 360 770
7206 770 -328 -128 609 -14 -406 412 638 -327 62 550 -162 -98 691 202 -1 577 546 -628 -239 809
7226 809 -84 -187 769 -6 -585 464 374 -726 -44 707 -568 -346 202 -191 -681 407 378 -708 -340
7245 -340 521 -399 -373 543 134 -481 -304 238 -802 -512 195 -3 -440 263 -219 -806 162 -185 -614 -163
7265 -163 373 -339 -500 146 -210 -901 -63 205 -752 127 445 -369 -391 390 248 -683 38 190 -790 37
7285 37 361 -339 -307 -18 152 -689 153 254 -335 -166 642 -286 -405 246 434 -354 180 615 -426 -475 671
7306 671 176 -277 494 371 -144 81 631 -364 -129 713 444 -425 305 532 -305 288 612 157 -134 829
7326 829 474 -491 292 536 -85 61 857 -142 -160 975 254 -309 445 227 -232 136 739 -174 -387 821
$$ packed form
7186G22o69OO22n89l14Q12l90p80R71L64j168N84N49p70k16N04J86q71Q07M10
7206G70j098K00P37o23l92Q18K26r65L89M88p12O4P89m89k03N78l1j174L89J048
7226H09q93j03R56p75n79J049r0j100O82P51j275K22N48l93m90J088k9j086L68
7245c40Q61r20K6R16m09o15J77N42j040K90P07j98m37P03m82n87R68l47m29M51
7265a63N36p12j61O46l56o91Q38K68r57Q79L18q14k2P81j42r31P21J52r80Q27
7285C7L24p00L2K89J70q41Q42J01n89J69Q08r28j19O51J88p88N34M35j041m9J146
7306F71m95m53P71j23n15K25N50r95K35Q42k69q69P30K27q37N93L24m55k91R63
7326H29l55r65P83K44o21J46P96r99j8J135p21n63P54k18m59L68O03r13k13J208
$$ plain form
7346 821 412 -364 109 531 -442 -115 574 -26 -416 744 214 -668 257 495 -547 -220 429 -52 -599
7365 -599 436 151 -483 326 102 -484 -195 471 -239 -499 81 9 -805 -44 -35 -305 -443 415 -508 -927 237
7386 237 -282 -803 -186 318 -665 -626 305 -268 -670 157 -27 -612 -151 266 -537 -665 579 -196 -707 -72
7406 -72 -215 -920 23 224 -619 -331 452 -196 -882 210 112 -341 100 445 -141 -299 643 7 -439 182
7426 182 265 -248 317 543 -389 -283 363 27 -569 298 192 -378 -35 449 254 -244 557 59 -585 650
7446 650 460 -332 131 852 -260 -317 547 302 -384 517 626 -331 169 371 23 35 713 305 -318 442
7466 442 514 -420 -160 652 -428 -193 663 224 -475 274 671 -193 -277 651 -77 -242 487 89 -302 21
7486 21 682 -154 -412 441 -143 -593 -147 313 -703 -89 344 -595 -330 216 -205 -590 291 322 -453 -194
$$ packed form
7346H21m09p76M73M22r73L27O89o00l90J160n30q82R25K38j042L27O49m81n47
7365e99J035k85o34Q09k24n86K89O66p10k60N80p2q14P61Rk70j38Q58r23m19J164
7386B37n19n21O17N04r83L9R31n73m02Q27j84n85M61M17q03j28J244p75n11O35
7406g2j43p05R43K01q43K88P83o48o86J092r8m53M41L45n86j58R42o36m46O21
7426A82Q3n13N65K26r32J06O46l36n96Q67j06n70L43M84j95m98Q01m98o44J235
7446F50j90p92M63P21j112n7Q64k45o86R01J09r57N00K02l48J2O78m08o23P60
7466D42P2r34K60Q12j080K35Q56m39o99P49L97q64q4R28p28j65P29l98l91L23
7486B1O61q36k58Q53n84m50M46M60j016O14M33r39K65N46m21l85Q81L1p75K59
$$ plain form
7506 -194 345 -791 -322 219 -111 -623 383 128 -932 -240 167 -598 -469 367 -363 -742 241 83 -918
7525 -918 -170 107 -539 -449 633 -267 -457 352 108 -766 -186 467 -388 -276 272 -168 -577 -13 323 -502
7545 -502 -110 348 175 -378 553 248 -675 163 124 -270 -230 585 -191 -316 620 -38 -648 235 296 -359 2
7566 2 595 197 -134 626 286 -416 569 723 -206 -60 803 -14 -49 930 478 -301 337 759 -423 -26 1097
7587 1097 125 -473 464 246 -612 355 516 -336 -314 839 -79 -478 417 512 -530 157 395 -248 -339 252
7607 252 -32 -494 267 346 -371 0 624 -236 -329 435 126 -205 234 205 -711 -3 226 -358 -377 402 -168
7628 -168 -490 106 64 -444 -59 189 -286 -592 97 46 -870 200 199 -727 162 144 -877 -606 197 -273 -604
7649 -604 56 -145 -633 -280 491 -401 -422 253 -263 -792 49 389 -428 -342 306 -338 -489 512 -315 -641
$$ packed form
7506a94N39j136M69N41l30n12J006k55j060O92M07p65J29Q36p30l79R83j58j001
7525i18P48K77o46R0J082r00j90Q09k44q74N80O53q55J12N48m40m09N64L36q25
7545e02L92M58j73n53R31l05r23Q38l9l94M0Q15p76j25R36o58o10Q83O1o55L61
7566BN93l98l31P60l40p02R85J54r29J46Q63q17l5R79m52p79O38M22j182L97J123
7587A097r72n98R37k18q58R67J61q52K2J153r18l99Q95R5j042O87K38o43r1N91
7607B52k84m62P61P9p17L71O24q60r3P64l09l31M39k9r16P08K29n84j9P79n70
7628a68l22N96m2n08L85K48m75l06O89n1r16J070jr26Q89j8j021K71Q03m70l31
7649f04O60k01m88L53P71q92k1O75n16n29Q41L40q17Q6O48o44j51J001q27l26
$$ plain form
7669 -641 -72 243 -427 -371 541 88 -322 409 68 -719 252 316 -551 -109 601 -276 -327 639 74 -470 129
7690 129 494 -366 105 431 198 -681 306 55 -509 587 758 92 -27 897 15 -283 505 275 -109 157
7710 157 649 -188 -189 640 123 -387 287 250 -147 331 471 4 289 654 94 -345 403 530 -285 121 354
7731 354 43 -3 479 238 -393 171 337 -364 148 327 -307 -401 447 8 -429 407 254 -560 -231 42 -344
7752 -344 -87 431 114 -465 -91 142 -194 -333 448 -440 -224 235 152 -689 -6 231 -494 -542 539 -107
7772 -107 -612 361 -200 -934 117 120 -600 -468 248 -229 -720 97 20 -858 117 62 -433 -691 -153 -192 -470
7793 -470 268 178 -639 -47 372 -535 -99 250 97 -453 -55 456 -499 -128 99 -237 -296 424 -10 -256 456
7814 456 117 -262 353 423 -355 -112 668 118 -467 630 86 -284 -175 576 -139 134 643 209 -136 607
$$ packed form
7669f41N69L15o70N6R12m53m10P31l41p87R71O4q67M42P10q77n1R66n65n44N99
7690A29L65q60M71L26k33q79R87k51n64J096J71o66j19R24q82k98P88k30l84K66
7710A57M92q37jQ29n17n10O74l7l97M78J40m67K85L65n60m39P48J27q15M06K33
7731C54l11m6M82k41o31N64J66p01N12J79o34r4Q48m39m37Q36j53q14L29K73l86
7752c44K57N18l17n79L74K33l36j39P81q88K16M59q3q41O83K37p25m8J081o46
7772a07n05R73n61p34J051Lp20J32P16m77m91Q17p7q78R75n5m95k58N38l9k78
7793d70P38r0q17N92M19r07M36L49j53n50L98N11r55L71K27l36n9P20m34k46P12
7814D56l39l79O15P0p78K43P80n50n85J097n44l70J09P51p15K73N09m34l45P43
$$ plain form
7834 607 554 -378 309 793 74 144 550 -102 -288 576 665 57 136 434 -55 -222 540 277 -226 188 617
7855 617 -276 -69 437 96 -225 427 401 -77 449 600 -594 -327 705 73 -577 298 -95 -398 289 86
7875 86 -333 -301 259 -277 -299 64 105 -599 106 -61 -430 -217 189 -206 -297 24 159 -571 -313 131 -614 -301
7897 -301 328 -442 -367 182 187 -744 2 359 -433 -274 294 -24 -608 133 -198 -624 -306 316 -312 -132 57
7918 57 -152 -82 384 288 -188 21 348 -60 -204 44 -294 -539 175 217 -505 166 511 -330 -496 272 -63
7939 -63 -602 403 197 -483 290 395 -373 -125 648 -53 -370 563 305 -408 305 382 -203 -63 538 269
7959 269 -313 319 336 -322 -42 616 258 160 692 132 -328 67 341 -191 105 597 -138 13 449 207 -355
7980 -355 460 398 -107 26 458 136 -507 354 532 -275 258 227 -464 -212 768 -281 -281 383 -92 -494 -4
$$ packed form
7834F07n3r32O87M84p19P0M06o52j86Q64Q9o08P9K98m89j67P62k63n03M14M29
7855F17q93K07N06l41l21O52k6m78N26J51j194K67J032o32o50Q75l93l03O87k03
7875H6m19L2N60n36k2L63M1p04P05j67l69K13M06l95r1L21J35p30K58M44p45L13
7897c01O29p70P5N49Nr31P46L57p92J59N68l18n84P41l31m26L18O22o28J80J89
7918E7k09P0M66r6m76K09L27m08j44K48l38k45P14M2p22O71L45q41j66P68l35
7939f3n39J005k06o80P73J05p68K48P73p01l17R33k58p13P13P7n85J40O01k69
7959B69n82O32J7o58K80O58l58r8N32n60m60L95K74n32K96M92p35J51M36k42n62
7980c55Q15o2n05J33M32l22o43Q61J78q07N33l1o91K52R80j049%O64m75m02M90
$$ plain form
8001 -4 286 -370 -89 388 22 -307 173 303 -566 220 68 -427 -188 82 -231 -374 209 -235 -645 65 78
8022 78 -324 -180 248 -315 -425 -37 232 -766 -580 339 12 -425 328 -195 -554 105 119 -578 199 646 -546
8043 -546 -463 212 -226 -131 236 33 -653 -302 636 -489 -277 535 -261 -439 469 438 -354 -128 95 86 -256
8064 -256 491 -174 -245 213 247 -385 -15 480 -437 -284 318 209 -432 104 209 -342 -81 603 -107 -40 354
8085 354 88 -332 315 481 -13 -352 553 -3 -6 355 417 -266 380 576 28 50 346 25 -576 387 188
8106 188 -319 -21 610 -269 150 463 -156 -211 484 468 -367 244 222 -38 238 549 -349 -343 332 299 -422 294
8128 294 490 -226 -187 302 -159 -159 128 -51 -511 77 529 -416 -261 428 -197 -534 159 48 -561 -37 370
8149 370 -330 -140 230 16 -634 -165 146 -574 -241 136 -80 -560 310 56 -375 143 -23 -454 -184 11
$$ packed form
8001dK90o56K81M77l66l29M80J30q69P86j52m95K39K70l13j43N83m44m10P10J3
8022G8m02J44M28n63j10L88K69r98J86R19l27m37P53n23l59O59J4o97P77M47j192
8043e46Q3O75m38R5L67k03o86L51R38j125K12Q12p96j78R08l1p92K26K23rl42
8064b56P47o65p1M58L4o32L70M95r17J53O02j09o41N36J05n51K61O84p10O7L94
8085C54k66m20O47J66m94l39R05n56lL61O2o83O46J96n48K2K96l21o01R63j99
8106A88n07K98O31q79M19L13o19n5O95j6q35O11k2k60K76L11q98OO75l3p21P16
8128B94J96p16L9M89m61%K87j79m60N88M52r45J55O89o25l37O93j11o09N24M07
8149C70p00J90L70k14o50M69L11p20L33L77k16m80Q70k54m31N18j66m31K70J95
$$ plain form
8169 11 -148 -410 239 -188 -456 -134 191 -603 -20 328 -429 -490 423 214 -406 54 131 -235 -351 349 -394
8190 -394 -236
$$ packed form
8169A1j59k62O49m27k68L22L25p94N83L48p57o1R13k09o20M60P7l66j16P00p43
8190c94J58
8191b36
$$ Imaginary data points
##PAGE= N=2
##DATA TABLE= (X++(I..I)), XYDATA
$$ plain form
0 0 0 0 0 0 0 0 0 -8 8 -8 8 -12 16 -16 24 -25 32 -40 48 -56 64 -73 85 -98 113 -129 148 -168 190 -214 242
31 242 -272 304 -340 379 -424 472 -523 580 -644 711 -787 873 -966 1070 -1188 1321 -1470
48 -1470 1645 -1848 2087 -2373 2729 -3178 3767 -4581 5778 -7725 11427 -21025 98751 204333
62 204333 42043 55725 113943 117227 84927 80108 46063 85983 145977 82963 -15686 45616
74 45616 112947 57482 5474 23617 17570 29406 53314 -6171 -58611 24845 69009 -26567
86 -26567 -65600 5642 20005 -10976 -10944 -29233 -40332 16823 17713 -66968 -55730 34024 16736
99 16736 -45062 -27341 -12321 -29351 -4134 -5754 -62888 -37755 32464 -13815 -80501 -32139
111 -32139 10768 -20195 -25123 -20613 -47875 -22944 15862 -36884 -68558 9007 32173 -36918
$$ packed form
0@%%%%%%%qJ6j6J6k0K8l2M0m9N7p2Q8j04J20j37J58j83K11k42K77l16L58m04M56
31B42n14N76o44P19q03Q96r95J103j224J355j498J660j839K036k258K509k791
48a470L115l493L935m460N102n907O945q348J0359j3503J9152l2452J19776J05582
62B04333j62290J3682N8218L284l2300m819l4045L9920N9994o3014r8649O1302
74D5616O7331n5465n2008J8143o047J1836K3908n9485n2440Q3456M4164r5576
86b6567l9033P1242J4363l0981L2j8289j1099N7155Q90q4681J1238Q9754j7288
99A6736o1798J7721J5020j7030K5217j620n7134K5133P0219m6279o6686M8362
111c2139M2907l0963m928M510k7262K4931L8806n2746l1674P7565K3166o9091
$$ plain form
123 -36918 -39987 4125 -7920 -8523 17688 -15569 -36019 21753 23837 -43578 -25175 35301 10771
136 10771 -16938 4534 -9250 -20409 21470 9760 -47480 -11522 41437 -11040 -46812 4415
148 4415 14230 -15587 3515 6055 -27127 -243 29869 -21674 -35353 28464 28063 -20098 -1051
161 -1051 18862 -7747 7191 31363 -10466 -16789 38416 18485 -38976 -3885 37419 2376
173 2376 -8810 13840 -6179 -11059 23922 1114 -36097 10609 36556 -21697 -30860 18066 10404
186 10404 -7401 17961 6848 -19882 18781 33665 -23031 -18011 43533 28262 -12119 10148
198 10148 20057 4105 27690 30650 -14535 4614 55243 14735 -32167 12828 39470 5318
210 5318 6738 18320 -7689 4811 36501 -5613 -36515 19549 35964 -20484 -24496 6671 -5089
$$ packed form
123c6918l069M4112j2045o03K6211l3257k0450N7772K084o7415J8403O0476k4530
136A0771k7709K1472j3784j1159M1879j1710n7240L5958N2959n2477l5772N1227
148D415R815k9817J9102K540l3182K6884L0112n1543j3679O3817m01m8161J9047
161a051J9913k6609J4938K4172m1829o323N5205j9931n7461L5091M1304l5043
173B376j1186K2650k0019m880L4981k2808l7211M6706K5947n8253r163M8926p662
186A0404j7805K5362j1113k6730L8663J4884n6696N020O1544j5271m0381K2267
198A0148R909j5952K3585K960m5185J9149N0629m0508m6902M4995K6642l4152
210E318J420J1582k6009J2500L1690m2114l0902N6064J6415n6448m012L1167j1760
$$ plain form
223 -5089 -3322 14258 -19603 -34030 19463 15527 -50424 -34893 20139 -1348 -28774 -12113 -20259
236 -20259 -25187 11671 295 -49516 -19750 27205 -15254 -48464 -10975 973 -13686 3059
248 3059 -6974 -38557 -2271 32136 -20084 -43192 13312 22923 -18352 -14433 -2011 -13464 10039
261 10039 26080 -20670 -26432 30273 21003 -32501 -14601 18830 2070 970 10085 -20430 -15845
274 -15845 33962 14440 -35359 -2955 34475 -1486 -20394 1422 -3840 -1340 26629 1963
286 1963 -33580 8755 36299 -13485 -25649 16642 12656 -8492 6487 -4349 -23504 15086
298 15086 30563 -19587 -21809 27411 14025 -21372 -813 9172 -6379 13267 18058 -22266 -10467
311 -10467 37712 13596 -22711 11329 28535 -3033 1012 15637 -6782 3491 36893 7833
$$ packed form
223e089J767J7580l3861j4427N3493l936o5951J5531N5032k1487k7426J6661q146
236b0259m928L6858j1376m9811K9766M6955m2459l3210L7489J1948j4659J6745
248C059j0033l1583L6286L4407n2220k3108N6504R611m1275L919J2422j1453K3503
261A0039J6041m6750n762N6705r270n3504J7900L3431j6760j100R115l0515M585
274a5845M9807j9522m9799L2404L7430l5961j8908K1816n262K500K7969k4666
286A963l5543M2335K7544m9784j2164M2291l986k1148J4979j0836j9155L8590
298A5086J5477n0150k222M9220j3386l5397K0559R985j5551J9646M791m0324J1799
311a0467M8179k4116l6307L4040J7206l1568M045J4625k2419J0273L3402k9060
$$ plain form
323 7833 -21658 18652 32425 -8255 -3896 23330 4873 -829 20018 -3337 -20625 21144 27266
336 27266 -17223 -6610 28132 3044 -14878 10140 4838 -9756 17188 15320 -22891 -4888
348 -4888 29654 694 -17066 17003 15388 -10364 5249 8941 -17235 740 27434 -7343 -22814
361 -22814 16671 13928 -20922 -4893 11870 -11081 -6056 10401 -18519 -24983 14483 5681 -29862
374 -29862 -5798 16315 -14164 -18921 4538 -10576 -16671 12274 -1695 -33361 -3648 19134
386 19134 -16739 -21340 11376 396 -17710 779 -6751 -28065 1467 15302 -26051 -26321 12835
399 12835 -2385 -29392 -7298 -534 -19285 -3349 2380 -32075 -23829 15975 -3794 -32393 -1979
412 -1979 11535 -14823 -9226 3049 -16766 -6232 23366 -3906 -29055 8604 22607 -12002
$$ packed form
323G833k9491M0310J3773m0680M359K7226j8457n702K0847k3355j7288M1769O122
336B7266m4489J0613L4742k5088j7922K5018n302j4594K6944j868l8211J8003
348d888L4542k8960j7760L4069j615k5752J5613L692k6176J7975K6694l4777j5471
361b2814L9485k743l4850J6029J6763k2951N025J6457k8920o464L9466q802l5543
374b9862K4064K2113l0479m757K3459j5114o095K8945j3969l1666K9713K2782
386A9134l5873m601L2716j0980j8106J8489p530k1314K9532J3835m1353k70L9156
399A2835j5220k7007K2094O764j8751J5936N729l4455Q246L9804j9769k8599L0414
412a979J3514k6358N597J2275j9815J0534K9598k7272k5149L7659J4003l4609
$$ plain form
424 -12002 -7942 16529 2643 630 17200 -5025 -19151 19839 25261 -16192 -8548 23988 6966
437 6966 -7078 11303 3789 -5450 22265 17609 -21357 -4445 31506 7888 -11070 14665 16467
450 16467 761 16214 14479 -11251 10319 37961 4038 -15356 19605 23550 -1610 9965
462 9965 18720 -120 12513 28570 -4390 -14608 25465 23498 -11125 1808 19332 -368 2921
475 2921 18476 -3460 -7238 27149 15654 -21440 -1223 23506 -767 -5455 14926 1708 -5778
488 -5778 17910 6435 -21234 5081 25546 -7760 -15994 10528 1120 -12858 6691 2207 -19662
501 -19662 2337 14652 -20189 -23594 9224 -1119 -23036 -4691 -1666 -21967 -7529 3936
513 3936 -22851 -20018 11005 -6133 -31261 -7970 1468 -21170 -12234 3046 -17778 -17529 7366
$$ packed form
424a2002M060K4471j3886k013J6570k2225j4126L8990N422m1453P644L2536j7022
437F966j4044J8381p514r239K7715m656l8966J6912L5951k3618j8958K5735J802
450A6467j5706J5453j735k5730K1570K7642l3923j9394L4961L945k5160J1575
462I965Q755j8840J2633J6057l2960j0218M0073j967l4623J2933J7524j9700L289
475B921J5555k1936l778L4387j1495l7094K0217K4729k4273m688K0381j3218p486
488e778K3688j1475k7669K6315K0465l3306q234K6522r408j3978J9549m484k1869
501a9662K1999J2315l4841l405L2818j0343k1917J8345L025k0301J4438J1465
513C936k6787K833L1023j7138k5128K3291R438k2638Q936J5280k0824K49K4895
$$ plain form
526 7366 -9019 -28881 -178 8556 -20560 -14955 4471 -13155 -16641 6440 -4611 -20091 5540
539 5540 9442 -22074 -12544 13783 -4750 -14950 8234 2302 -14820 5431 10220 -14132 -1037
552 -1037 22797 -1454 -15141 11592 9295 -10509 6366 14170 -7311 2531 21266 -3001 -12411
565 -12411 19087 16139 -10936 2889 16509 -4051 -1112 16854 -1541 -6788 21272 13109 -14900
578 -14900 3538 21094 -2069 -4182 15606 2434 -5641 16183 9026 -13990 8808 26261 -2799
591 -2799 -8853 15174 7234 -6020 11563 8468 -9247 10083 20269 -9912 -9791 20983 10460
604 10460 -10501 5643 8863 -8536 4395 13350 -10915 -7222 21757 5380 -18825 1857 12094
617 12094 -7151 -1736 7804 -11443 -7362 15726 -3280 -22420 5626 15579 -12096 -10486 5908
$$ packed form
526G366j6385j9862K8703Q734k9116N605J9426j7626l486K3081j1051j5480K5631
539E540L902l1516R530K6327j8533j0200K3184n932j7122K0251M789k4352J3095
552a037K3834k4251j3687K6733k297j9804J6875P804k1481R842J8735k4267r410
565a2411L1498k948k7075J3825J3620k0560K939J7966j8395n247K8060q163k8009
578a4900J8438J7556k3163k113J9788j3172q075K1824p157k3016K2798J7453k9060
591b799o054K4027p940j3254J7583l095j7715J9330J0186l0181J21L0774j0523
604A0460k0961J6144L220j7399J2931Q955k4265L693K8979j6377k4205K0682J0237
617A2094j9245N415R540j9247M081K3088j9006j9140K8046R953k7675J610J6394
$$ plain form
630 5908 -7620 -9608 8227 -6232 -20686 6392 11088 -19191 -14526 9043 -3824 -12276 3300
643 3300 -6801 -18931 3852 5317 -23673 -12824 14079 -4824 -20387 -1406 -2170 -15483 270
656 270 2015 -21570 -10858 11347 -10297 -23070 3391 4683 -14051 -2918 2239 -16828 -5625
669 -5625 13848 -8234 -19112 9575 9902 -13946 -2654 11504 -3489 47 14589 -3330 -9907
682 -9907 16208 12581 -11397 3796 20404 1084 -571 16383 3422 -4541 18334 14380 -9029
695 -9029 5689 21850 -141 -4626 16050 8582 -2289 14092 10244 -9135 5973 19174 -3961
708 -3961 -5844 17447 7267 -9908 7926 10798 -7535 3983 16544 -5150 -8680 13668 4155
721 4155 -11945 6315 11050 -8466 -690 12470 -6134 -7251 14442 3211 -13948 6394 11758
$$ packed form
630E908j3528j988J7835j4459j4454K7078M696l0279M665K3569j2867q452J5576
643C300j0101j2130K2783J465k8990J0849K6903j8903j5563J8981p64j3313J5753
656B70J745k3585J0712K2205k1644j2773K6461J292j8734J1133N157j9067J1203
669e625J9473k2082j0878K8687L27k3848J1292J4158j4993L536J4542j7919o577
682i907K6115l627k3978J5193J6608j9320j655J6954j2961p963K2875l954k3409
695i029J4718J6161k1991m485K0676p468j0871J6381l848j9379J5108J3201k3135
708c961j883K3291j0180j7175J7834K872j8333J1518J2561k1694l530K2348r513
721D155j6100J8260M735j9516P776J3160j8604j117K1693j1231j7159K0342N364
$$ plain form
734 11758 -11084 -3575 14806 -1240 -7699 11931 4323 -10576 6858 11399 -10171 -1730 15651
747 15651 -2243 -9890 10734 5248 -10796 5648 10826 -10859 -4298 13488 -5406 -15280 7681
760 7681 6143 -12591 -1788 4845 -12039 -5949 8890 -8613 -15191 7475 2079 -20020 -5649
773 -5649 6964 -10123 -8544 6511 -8077 -15372 6071 2223 -18301 -4560 9168 -9597 -11996
786 -11996 4186 -4886 -10967 6741 515 -18325 -1050 11893 -11839 -14325 7517 144 -12063
799 -12063 2343 1856 -13879 405 11304 -10772 -11926 10941 2547 -12833 1853 5074 -8748
812 -8748 3428 12082 -9778 -8283 15987 4811 -13744 4503 13016 -4290 268 10019 -4730
825 -4730 -2542 17330 5241 -11282 7899 14573 -5361 -859 12608 56 -1160 15344 3501
$$ packed form
734A1758k2842P509J8381j6046o459J9630p608j4899J7434M541k1570Q441J7381
747A5651j7894p647K0624n486j6044J6444N178k1685O561J7786j8894r874K2961
760G681j538j8734J0803O633j6884O090J4839j7503o578K2666n396k2099J4371
773e649J2613j7087J579J5055j4588p295K1443l848k0524J3741J3728j8765k399
786a1996J6182r072o081J7708o226j8840J7275J2943k3732k486K1842p373j2207
799a2063J4406m87j5735J4284J0899k2076j154K2867q394j5380J4686L221j3822
812h748J2176Q654k1860J495K4270j1176j8555J8247Q513j7306M558R751j4749
825d730K188J9872j2089j6523J9181O674j9934M502J3467j2552j216J6504j1843
$$ plain form
838 3501 -10783 10736 17973 -5686 -3010 14731 3403 -3706 10525 4038 -6995 10924 13708
851 13708 -8807 -2106 17015 2173 -7834 8723 5661 -7264 6621 10504 -10283 -3676 15920
864 15920 995 -11043 6612 6703 -8183 1785 7188 -8785 -2021 13676 -3427 -13090 8109
877 8109 7847 -10763 -630 9262 -7731 -5154 9973 -3150 -12256 7854 7257 -12565 -2937 8258
891 8258 -6731 -6972 7756 -4169 -12730 5985 3029 -16463 -3830 9368 -8819 -11552 5925
904 5925 -3277 -14540 1461 1863 -15500 -5138 6908 -10344 -12591 5464 -3272 -14867 1316
917 1316 2771 -14798 -5460 7040 -10265 -12920 6414 -838 -14426 1172 5099 -12352 -5677
930 -5677 7535 -6076 -9459 6836 -506 -12961 3330 7784 -10532 -3073 11330 -3617 -9454
$$ packed form
838C501j4284K1519P237k3659K676J7741j1328p109J4231o487j1033J7919K784
851A3708k2515O701J9121j4842j0007J6557l062j2925J3885L883k0787O607J9596
864A5920j4925j2038J7655R1j4886R968N403j5973O764J5697j7103r663K1199
877H109k62j8610J0133R892j6993K577J5127j3123r106K0110n97j9822R628J1195
891H258j4989k41J4728j1925q561J8715k956j9492J2633J3198j8187k733J7477
904E925r202j1263J6001M02j7363J0362J2046j7252k247J8055q736j1595J6183
917A316J455j7569R338J2500j7305k655J9334p252j3588J5598L927j7451O675
930e677J3212j3611l383J6295p342j2455J6291M454j8316P459J4403j4947n837
$$ plain form
943 -9454 7944 3610 -9613 4232 9606 -8225 -2557 13301 -531 -7526 9496 6990 -6966
956 -6966 5177 9620 -6198 362 15186 192 -7338 12054 10150 -6356 4252 12922 -2244
969 -2244 807 14717 972 -6089 13029 10848 -6455 4364 14409 -773 102 13368 1177
982 1177 -4874 13912 10038 -8920 3185 15648 -834 -3186 12028 3647 -4041 10310 7519
995 7519 -8897 3234 14537 -3220 -5675 10862 3507 -6660 6688 5598 -9210 1937 12295
1008 12295 -6800 -9303 9510 3275 -10200 2238 4504 -9127 -736 7503 -9333 -9810 8819
1021 8819 140 -14700 -551 4439 -10289 -4713 4978 -9262 -10365 7173 -2301 -16766 -1770
1034 -1770 5290 -11000 -8298 3079 -7860 -9658 4964 -3272 -16086 -6 5741 -12869 -9609
$$ packed form
943i454J7398m334j3223J3845N374j7831N668J5858j3832o995J7022k506j3956
956f966J2143M443j5818O560J4824j4994p530J9392j904j6506J0608Q670j5166
969b244L051J3910j3745p061J9118k181j7303J0819J0045j5182Q75J3266j2191
982A177o051J8786l874j8958J2105J2463j6482k352J5214q381p688J4351k791
995G519j6416J2131J1303j7757k455J6537p355j0167J3348j090j4808J1147J0358
1008A2295j9095k503J8813o235j3475J2438K266j3631Q391Q239j6836m77J8629
1021H819q679j4840J4149M990j4728N576R691j4240j103J7538r474j4465J4996
1034a770P060j6290K702J1377j0939j798J4622q236j2814J6080N747j8610L260
$$ plain form
1047 -9609 5010 -5663 -10992 3607 -2170 -13822 532 5866 -12555 -8996 7156 -3848 -11310
1060 -11310 3071 278 -11182 2018 6459 -10985 -6182 10352 -1828 -11526 4899 4410 -8938
1073 -8938 1541 7949 -7330 -3659 11831 -102 -9304 7484 7132 -7665 1808 9813 -4619
1086 -4619 -2228 12435 1183 -7388 9493 9363 -6996 2599 12331 -1881 -2023 12396 2986 -5339
1100 -5339 9745 10335 -5240 3333 13764 -691 -2143 13076 4461 -5569 9420 10354 -5268
1113 -5268 2644 13617 -762 -2959 11715 4471 -6400 7172 9576 -5756 864 11551 -1910
1126 -1910 -4906 10349 2991 -8326 5541 8785 -7738 -2071 10159 -2567 -7080 7685 2103
1139 2103 -9803 3331 7000 -9420 -4493 8852 -3732 -9484 5280 711 -10974 933 4999
$$ packed form
1047i609J4619j0673n329J4599n777j1652J4354N334j8421L559J6152j1004p462
1060a1310J4381k793j1460J3200M441j7444M803J6534j2180r698J6425m89j3348
1073h938J0479O408j5279L671J5490j1933r202J6788l52j4797R473Q005j4432
1086d619K391J4663j1252q571J6881j30j6359R595R732j4212j42J4419r410q325
1100e339J5084N90j5575Q573J0431j4455j452J5219q615j0030J4989R34j5622
1113e268P912J0973j4379k197J4674p244j0871J3572K404j5332O620J0687j3461
1126a910k996J5255p358j1317J3867L244j6523N667J2230j2726m513J4765n582
1139B103j1906J3134L669j6420M927J3345j2584n752J4764m569j1685J1907M066
$$ plain form
1152 4999 -10950 -5743 7657 -5301 -12442 3491 910 -11732 -1534 3566 -10960 -6362 6471
1165 6471 -5720 -12621 3579 1640 -12799 -2854 3776 -9768 -6615 6306 -5614 -12408 4740
1178 4740 2839 -12416 -3315 5509 -7185 -6800 5523 -4142 -10347 5352 3277 -11995 -1960 8128
1192 8128 -6021 -7197 6517 -1121 -8695 5515 4154 -10400 -353 10501 -4394 -6537 8227
1205 8227 1912 -6843 5503 5568 -7617 1840 11236 -3854 -5594 10356 4993 -5921 6025 8003
1219 8003 -5187 2349 11564 -2808 -4439 12454 6290 -6041 5776 9889 -3226 2195 11757
1232 11757 -1115 -2847 12893 5652 -7301 5889 11509 -3248 453 11323 -113 -3279 11173
1245 11173 4890 -7367 6093 11007 -4364 -1956 10344 222 -4790 8888 3942 -8101 4305
$$ packed form
1152D999j5949N207J3400j2958p141J5933k581j2642J0198N100j4526M598J2833
1165F471j2191o901J6200j939j4439R945O630j3544L153J2921j1920o794J7148
1178D740j901j5255R101Q824j2694L85J2323r665o205J5699k075j5272J0035J0088
1192H128j4149j176J3714p638p574J4210j361j4554J0047J0854j4895k143J4764
1205H227o315q755J2346O5j3185R457R396j5090j740J5950n363j0914J1946J978
1219H003j3190P536R215j4372j631J6893o164j2331J1817M113j3115N421R562
1232A1757j2872j732J5740p241j2953J3190N620j4757L701J0870j1436l166J4452
1245A1173o283j2257J3460M914j5371K408J2300j0122n012J3678m946j2043J2406
$$ plain form
1258 4305 9293 -6849 -3659 9378 -240 -7312 6034 2807 -8735 1853 7292 -7988 -4818
1271 -4818 8328 -2150 -9862 3823 2192 -9655 -478 5627 -8931 -6912 6577 -3451 -11878
1284 -11878 2312 2070 -11175 -2907 4234 -8879 -7658 5693 -4124 -12061 1731 1486 -11779 -3764
1298 -3764 4713 -8321 -8387 5371 -3384 -12238 1913 2671 -11182 -3267 5685 -7267 -8263 5358
1312 5358 -1687 -10650 2844 4186 -9614 -2618 6903 -5580 -6788 7173 530 -9352 3490 6028
1326 6028 -8161 -2036 8559 -3250 -5458 7557 1560 -8440 4419 7824 -6169 -1243 9943
1339 9943 -1374 -5018 8616 3736 -6855 5257 9110 -5493 -1079 11190 640 -4433 8916
1352 8916 5725 -4974 5660 9427 -3907 435 12375 1342 -4458 8993 6989 -4608 5170
$$ packed form
1258D305M988j6142L190J3037r618p072J3346l227j1542J0588N439j5280L170
1271d818J3146j0478p712J3685j631j1847R177O105j4558K019J3489j0028q427
1284a1878J4190k42j3245Q268P141j3113J221J3351r817p937J3792k45j3265Q015
1298c764Q477j3034o6J3758q755q854J4151P58j3853P915Q952j2952r96J3621
1312E358p045q963J3494J342j3800O996R521j2483j208J3961o643r882J2842K538
1326F028j4189O125J0595j1809k208J3015n997j0000J2859L405j3993M926J1186
1339I943j1317l644J3634m880j0591J2112L853j4603M414J2269j0550n073J3349
1352H916l191j0699J0634L767j3334M342J1940j1033n800J3451k004j1597R778
$$ plain form
1365 5170 10171 -2912 383 12362 1579 -4992 8838 7720 -4675 3795 9847 -2710 -351
1378 -351 10826 1085 -5486 8708 7618 -6304 1663 9280 -3394 -2712 8920 275 -7043 6449
1392 6449 4974 -8497 -357 8662 -4355 -4944 6509 -1141 -8162 4331 3688 -10133 -1610 7343
1406 7343 -6118 -7875 4911 -1008 -9865 1904 2335 -10388 -2938 5974 -7125 -9071 4369 -947
1420 -947 -10341 330 2058 -10683 -3555 5277 -7524 -9349 4689 -1093 -11722 -715 3043 -9122
1434 -9122 -4317 4532 -6886 -9174 4574 -510 -11080 392 4103 -8615 -4684 5095 -4927
1447 -4927 -7869 5483 619 -10551 679 5295 -7108 -4022 6962 -2231 -6723 5456 1851
1460 1851 -8505 2323 7571 -5899 -2996 8276 -881 -5918 6460 4719 -6397 3235 8656
$$ packed form
1365E170N001j3083L295J1979j0783o571J3830j118j2395Q470O052j2557K359
1378c51J1177r741o571J4194j090j3922P967P617j2674O82J1632q645p318J3492
1392F449j475j3471Q140R019j3017n89J1453p650p021J2493o43j3821Q523Q953
1406G343j3461j757J2786n919q857J1769M31j2723P450Q912j3099j946J3440n316
1420i47r394J0671J728j2741P128Q832j2801j825J4038n782j0629J1007L758j2165
1434i122M805Q849j1418k288J3748n084j0570J1472L711j2718L931R779j0022
1447d927k942J3352m864j1170J1230M616j2403L086J0984r193m492J2179l605
1460A851j0356J0828N248j3470K903J1272r157n037J2378j741j1116R632N421
$$ plain form
1473 8656 -4303 -2598 9681 1252 -4938 7226 5859 -4825 3335 9473 -3501 -1512 10731
1486 10731 2340 -4792 7401 6997 -5209 3093 10331 -1851 -1578 10347 2355 -4974 6995 7147
1500 7147 -4253 3180 10017 -2293 -2370 9905 3036 -5311 6610 7189 -5316 803 9124 -2334
1514 -2334 -3201 8813 2230 -6472 4097 6045 -5721 -123 7914 -2959 -4838 6900 871 -8290
1528 -8290 3020 5768 -6828 -2541 6574 -4093 -6633 5368 313 -9191 1438 4443 -8263
1541 -8263 -4633 4707 -4504 -7872 3910 -403 -9979 203 3425 -9250 -5634 5505 -4372 -8983
1555 -8983 2369 -890 -10314 -437 3713 -8522 -5610 5039 -4594 -9135 2609 915 -9226 -680
1569 -680 3812 -8422 -5150 6010 -3137 -8858 3377 2263 -8794 -1024 4828 -6399 -3663 6744
$$ packed form
1473H656j2959J705J2279q429o190J2164j367j0684Q160O138j2974J989J2243
1486A0731q391p132J2193m04j2206Q302P238j2182K73J1925p992p329J1969J52
1500G147j1400P433O837j2310p7J2275o869q347J1921N79j2505O119Q321j1458
1514b334q67J2014o583q702J0569J948j1766N598Q037j0873j879J1738o029r161
1528h290J1310K748j2596M287R115j0667k540J2001n055r504J0629L005j2706
1541h263L630R340r211l368J1782m313r576J0182L222j2675L616J1139r877m611
1555h983J1352l259r424R877M150j2235K912J0649r633m541J1744j694j0141Q546
1569f80M492j2234L272J1160r147n721J2235j114j1057P770N852j1227K736J0407
$$ plain form
1583 6744 -1983 -7846 4536 3533 -7428 76 6555 -4053 -3206 7539 -452 -6848 5701 5820
1597 5820 -6160 793 8150 -2722 -3052 8160 1653 -4324 6884 6489 -5430 1145 9800 -1191
1611 -1191 -2381 9004 3263 -4092 6403 6963 -4551 2018 10572 -338 -2678 8689 3870 -4326
1625 -4326 5796 7073 -3502 1490 9861 -1158 -3349 8593 4367 -4925 4563 7071 -3985 205
1639 205 8604 -1181 -3855 7615 3674 -5954 3113 6346 -4813 -993 7584 -1919 -5477 6167
1653 6167 2357 -7459 1949 6341 -5224 -3177 5623 -2829 -7110 4457 1752 -8093 324 4762
1667 4762 -7034 -4750 4688 -3149 -7687 3580 757 -9622 -1092 4115 -7046 -5669 4307 -3182
1681 -3182 -9020 1798 250 -9551 -1837 4250 -6934 -6287 3387 -3089 -8552 1649 1350 -8795
$$ packed form
1583F744q727n863J2382j003j0961P504O479j0608Q47J0745p991o396J2549J19
1597E820j1980O953P357j0872l30J1212o507n977J1208l95j1919O575Q655j0991
1611a191j190J1385n741p355J0495N60j1514O569Q554j0910k340J1367m819q196
1625d326J0122J277j0575M992Q371j1019k191J1942m226r292R488K508j1056M190
1639B05Q399r785k674J1470l941r628R067L233j1159L820Q577r503l558J1644
1653F167l810r816R408M392j1565K047Q800q452m281J1567k705r845Q417M438
1667D762j1796K284R438p837m538J1267k823j0379Q530N207j1161J377R976p489
1681c182n838J0818j548r801P714O087j1184O47R674o476n463J0201k99j0145
$$ plain form
1695 -8795 -1697 4288 -6735 -6435 4299 -1629 -8063 1949 2111 -8092 -1675 5096 -5169 -5170 5621
1710 5621 -395 -7513 2368 3491 -6795 -485 6034 -3796 -5044 6307 922 -6836 3223 5585
1724 5585 -4693 -271 6647 -2533 -3612 7252 2877 -5180 4262 6553 -4147 203 8199 -629
1738 -629 -2188 8390 3463 -5129 4820 7963 -3115 134 9155 956 -2285 7546 3880 -3974 5060
1753 5060 8328 -3026 -92 9016 856 -3033 6979 4324 -3788 4173 7533 -3635 -1443 8345
1767 8345 1227 -3584 5795 3729 -4613 2673 6014 -3826 -1601 7729 -469 -5852 4518 3466 -5860
1782 -5860 906 5391 -4456 -3153 6032 -1299 -6967 3287 3343 -6739 -1016 4327 -5240 -4590 4761
1797 4761 -2007 -7597 2526 1983 -8377 -2721 4260 -5124 -5387 3484 -2327 -8375 1339 1798 -8355
$$ packed form
1695h795P098N985j1023L00J0734n928o434J0012J62j0203O417O771j0265jJ0791
1710E621o016p118R881J123j0286O310O519r830j248J1351n385p758J0059K362
1724E585j0278M422O918r180j079J0864m375q057R442K291j0700M350P996q828
1738f29j559J0578m927q592R949L143j1078L249R021q199l241R831l666p854R034
1753E060L268j1354K934R108q160l889J0012k655q112P961L360j1168K192R788
1767H345p118m811R379k066q342P286L341r840K225R330q198n383J0370j052r326
1782e860O766M485r847J303R185p331n668J0254N6j0082N723N343r567O50R351
1797D761o768n590J0123n43j0360N656O981r384k63Q871n811o048R714M59j0153
$$ plain form
1812 -8355 -2453 4096 -5249 -6761 2768 -2324 -8029 1755 1676 -8427 -3118 4075 -5521 -6954 3570
1827 3570 -470 -7627 879 2257 -7677 -2444 4857 -4005 -6242 3943 415 -7268 1071 3509 -5804
1842 -5804 -1780 5821 -3034 -5774 5017 1831 -6145 1783 5194 -4199 -1784 6522 -1145 -4324 6393
1857 6393 3563 -4805 2625 6221 -2893 -545 7558 354 -3049 6903 4562 -4253 2973 7485 -1530
1872 -1530 21 8250 1217 -3104 6370 4847 -3473 3262 8148 -1455 -848 7672 1461 -3308 6254
1887 6254 5254 -3673 2613 7544 -2059 -1869 7415 2082 -3183 5212 4653 -4119 1362 7013 -2115
1902 -2115 -2690 6487 1399 -4831 3722 4048 -4775 349 6046 -3420 -4135 5330 253 -5966 2305 3131
1918 3131 -5723 -1242 4409 -4087 -4897 4386 -513 -7172 665 2365 -6495 -2635 3605 -4307 -5705
$$ packed form
1812h355N902O549r345j512R529n092n705R784p9j0103N309P193r596j433J0524
1827C570m040p157Q506J378r934N233P301q862k237J0185l528p683Q339K438r313
1842e804M024P601q855k740J0791l186p976P928L411r393K415Q306p667l179J0717
1857F393k830q368P430L596r114K348Q103p204l403R952k341q815P226M512r015
1872a530J551Q229p033m321R474j523q320O735M886r603O07Q520o211m769R562
1887F254j000q927O286M931r603J90R284n333n265Q395n59q772N481N651r128
1902b115n75R177n088o230Q553L26q823N124N697r466p15R465n077o219Q271Q26
1918C131q854M481N651q496q10R283m899o659P837J700q860L860O240p912j398
$$ plain form
1933 -5705 3353 -1121 -8475 -132 2385 -6519 -3717 2957 -4590 -6550 2355 -1246 -7963 7 2524
1948 2524 -6654 -4340 3022 -3788 -6547 2618 -315 -7476 -263 2684 -6450 -4170 3858 -2608 -5949
1963 -5949 2562 277 -6778 229 3504 -5003 -3079 5254 -1586 -5843 2999 2071 -5161 1220 4738
1978 4738 -3869 -2419 5904 -86 -4490 4363 3713 -4065 1083 5637 -2789 -1309 7014 1035 -3624
1993 -3624 5149 4555 -3731 1840 7067 -943 -792 7161 1660 -3397 5484 5744 -2695 1836 7532 -231
2009 -231 -1073 6761 2300 -2655 5395 5824 -3060 1415 7559 -403 -1906 6552 2650 -2958 4375 5051
2025 5051 -3447 931 7132 -980 -2333 5725 2140 -4080 2896 4252 -3908 -48 5898 -1757 -4132
2040 -4132 4644 1761 -4603 1739 3553 -4661 -1615 4723 -2816 -4847 3617 941 -6632 453 2698
$$ packed form
1933e705R058m474p354Q343K517q904K802O674p547j960Q905l601o717P970K517
1948B524r178K314P362o810k759R165k933p161P213K947r134K280Q028o466l341
1963e949Q511k285p055P007L275q507J924Q333o840m257Q842r28p232O381L518
1978D738q607J450Q323n990m404Q853o50p778N148M554q426J480Q323n979m659
1993c624Q773n94q286N571N227q010J51P953n501n057Q881K60q439M531N696p763
2009b31q42P834m461m955Q050M29q884M475O144p962j503Q458l902n608P333O76
2025E051q498M378O201q112j353Q058l585o220O976J356q160L860N946p655k375
2040d132Q776k883o364O342J814q214L046O338p539k031Q464k676p573P085K245
$$ plain form
2055 2698 -5100 -2972 3827 -3147 -5730 2817 -24 -7230 -707 2583 -5360 -3752 2853 -3477 -6667
2070 -6667 1918 132 -7184 -786 2660 -5661 -4487 2758 -3119 -6280 1993 636 -7278 -1292 2638
2085 2638 -5176 -4356 3364 -1873 -6121 1812 1001 -6442 -823 3839 -4264 -3485 4092 -727 -5308 2518
2101 2518 2210 -5102 -115 4480 -3177 -3425 4697 569 -4322 3230 3738 -3851 549 5492 -1783 -2025
2117 -2025 5841 1674 -3674 3476 4557 -2792 964 6287 -872 -1659 6221 2500 -3067 3718 5713
2132 5713 -2087 968 6684 -144 -1570 6046 3081 -2645 4303 5944 -2486 396 6526 134 -1790
2147 -1790 5988 3331 -3160 3119 5250 -2862 -297 6175 126 -2436 4517 2362 -3621 2180 5039
2162 5039 -3202 -1152 5463 -958 -3741 3760 1745 -4495 1384 4077 -3775 -2660 4248 -1473 -5021
$$ packed form
2055B698p798K128O799o974k583Q547k841p206O523L290p943J608O605o330l190
2070f667Q585j786p316O398L446q321J174P245n877l161Q273j357p914N986L930
2085B638p814Q20P720n237m248P933q11p443N619M662q103P79P577m819m581P826
2101B518l08p312M987M595p657k48Q122m128m891P552N08p589M400M943p275k42
2117b025P866m167n348P150J081p349L756N323p159p87P880l721n567O785J995
2132E713p800L055N716o828j426P616k965n726O948J641q430K882O130o392j924
2147a790P778k657o491O279K131q112K565O472o049k562O953k155n983N801K859
2162E039q241K050O615o421k783P501k015o240N879K693p852J115O908n721l548
$$ plain form
2177 -5021 2987 1485 -5514 -312 2797 -4267 -3204 3509 -1889 -6039 1780 860 -6272 -1467 2682
2192 2682 -4699 -3881 2822 -2343 -6339 1318 954 -6335 -1592 2093 -4936 -4468 2408 -2274 -5967 1350
2208 1350 1094 -6648 -2170 2637 -4020 -4494 2529 -1339 -5788 947 1161 -5923 -1527 3712 -3039 -4260
2224 -4260 3018 -256 -5106 1312 2803 -4339 -745 4346 -2591 -3694 4147 1222 -4268 2352 3452
2239 3452 -3262 -390 5266 -1225 -2501 5019 2632 -3796 2541 4496 -2382 143 5988 -187 -2041
2254 -2041 5357 2670 -3061 3110 5634 -1540 252 6017 703 -1649 5568 3528 -2602 3120 5655
2269 5655 -1394 -6 6292 1048 -1721 5291 3864 -2639 2441 5648 -1713 -223 5917 946 -2656
2284 -2656 3944 3388 -3434 1930 4883 -2244 -1414 5012 -124 -3779 3216 2833 -3811 191 3965 -3342
$$ packed form
2177e021Q008j502o999N202L109p064J063O713n398m150P819r20p132M805M149
2192B682p381Q18O703n165l996P657l64p289M743L685p029M68O876m682l693P317
2208A350k56p742M478M807o657m74P023l868m449O735K14p084M396N239o751j221
2224d260P278l274m850O418J491p142L594N091o937j103P841k925n490O620J100
2239C452o714K872N656o491j276P520k387o428O337J955o878K525N845o175j854
2254b041P398k687n731O171K524p174J792N765n314k352P217k040o130N722K535
2269E655p049J388O298n244k769P012j427o503N080L207p361J490O140m971l602
2284b656O600n56o822N364K953p127Q30O426n136l655O995l83o644M002L774p307
$$ plain form
2300 -3342 -2642 3837 -516 -4721 2060 2151 -4993 -1043 3141 -3253 -3333 3277 -862 -5409 865 1529
2316 1529 -5657 -1734 3068 -3925 -4453 2153 -1361 -6066 245 1219 -5815 -2395 2350 -3810 -4897
2331 -4897 2256 -1426 -6076 270 1124 -5631 -2736 2566 -3745 -4578 2581 -664 -5928 138 1852
2346 1852 -4975 -2381 3180 -2645 -4398 2151 349 -5188 637 2799 -4010 -1422 3696 -1685 -3803
2361 -3803 3520 1464 -3856 1374 3729 -3266 -1544 4598 -700 -2982 3889 2439 -3373 1567 4908
2376 4908 -1934 -523 5622 536 -2487 4390 3325 -2727 2029 5497 -1371 -503 5886 1221 -2292
2391 -2292 4742 3952 -2214 2562 5549 -1124 -530 5587 1384 -1971 4600 3914 -2653 1712 5732 -915
2407 -915 -896 5374 1528 -2717 3575 4001 -2734 1197 5289 -1215 -1676 4496 634 -3561 2785 3549
$$ packed form
2300c342P00O479m353m205O781R1p144L950M184o394q0O610m139m547O274O64
2316A529p186L923M802o993n28O606l514m705O311R74p034L420M745o160j087
2331d897P153l682m650O346Q54o755K895N302o311q33P159l245n264O066J714
2346A852o827K594N561n825j753O549j802n537N825K162o809K588N118n381k118
2361c803P323k056n320N230K355o995J722O142n298k282O871j450n812M940L341
2376D908o842J411O145n086l023O877j065o052M756L468o868Q68O389m665l513
2391b292P034p90o166M776K987o673N94O117m203l355O571o86o567M365M020o647
2407i15J9O270l846m245O292M26o735L931M092o504m61O172l862m195O346P64
$$ plain form
2423 3549 -3317 -12 4355 -2240 -2904 3912 389 -4077 1839 2411 -4041 -1281 3348 -2534 -3428 2869
2439 2869 25 -5217 278 2136 -4599 -2093 2745 -3090 -4321 2138 -801 -5791 -38 1761 -4913
2454 -4913 -2876 1864 -3109 -4688 1506 -665 -5969 -466 1512 -5227 -3425 2425 -2378 -4944 1404
2469 1404 -384 -5584 -643 2336 -4304 -3110 2862 -1970 -4488 1836 915 -4726 -238 2806 -3817
2484 -3817 -2620 3436 -825 -4017 2426 1989 -4456 423 3341 -2675 -2004 4524 339 -3173 3302
2499 3302 2431 -3100 763 4406 -1516 -1155 4670 962 -2597 3820 3586 -2427 1241 5116 -802 -1217
2515 -1217 5158 1607 -2486 3958 4366 -2010 1491 5393 -427 -772 5497 2109 -2249 3773 3989 -2220
2531 -2220 1256 5423 -106 -1342 4911 1940 -2738 3102 3706 -2338 405 5342 -608 -2208 4070
$$ packed form
2423C549o866L305M367o595o64O816l523m466N916N72o452K760M629n882q94O297
2439B869k844n242N495J858o735K506M838n835j231O459k939m990N753J799o674
2454d913K037M740m973j579O194k171n304N503J978o739J802N850m803k566O348
2469A404j788n200M941K979o640J194N972m832k518O324r21n641M488L044o623
2484c817J197O056m261l192O443m37o445M879K918o016O71O528m185l512O475
2499C302q71n531L863L643n922L61N825l708l559O417k34o013L668L875n918m15
2515a217O375l551m093O444M08o376L501L902n820l45O269l388m358O022K16o209
2531b220L476M167n529j236O253k971m678N840O04o044K743M937n950j600O278
$$ plain form
2546 4070 1855 -2714 2178 3997 -3211 -555 4268 -1049 -3232 3634 1345 -3970 1428 2998 -3566
2561 -3566 -1735 3580 -1751 -3705 2630 663 -5086 -10 2418 -3903 -2401 2836 -2120 -4667 1852
2576 1852 216 -5522 -809 2251 -4004 -3207 2248 -2068 -4795 1267 93 -5624 -1296 2126 -4291
2591 -4291 -3587 2516 -2300 -4984 906 605 -5391 -1025 2121 -4091 -3337 2678 -1454 -5124 1062 1284
2607 1284 -4628 -827 2659 -3506 -2888 2930 -384 -4463 1620 1685 -4041 -626 3396 -2702 -2269 3904
2623 3904 783 -3485 1901 3067 -3235 279 4527 -842 -1855 4386 1265 -3127 2615 3497 -1869
2638 -1869 519 5107 -510 -1721 4687 1975 -2591 2912 4331 -1994 655 5169 284 -1396 4781
2653 4781 2373 -2052 3258 4485 -1694 276 5385 485 -1720 4503 2410 -2745 2238 4629 -1736
$$ packed form
2546D070k215m569M892J819p208K656M823n317k183O866k289n315N398J570o564
2561c566J831N315n331j954O335j967n749N076K428o321J502N237m956k547O519
2576A852j636n738M713L060o255P97N455m316k727O062j174n717M328L422o417
2591d291P04O103m816k684N890l01n996M366L146o212P54O015m132l670O186K22
2607A284n912L801L486o165O18N818l314m079O083O5n726L415M022o098M33O173
2623C904l121m268N386J166o302L514M248n369j013O241l121m392N742Q82n366
2638a869K388M588n617j211O408k712m566N503J419o325K649M514m885j680O177
2653D781k408m425N310J227o179J970N109m900k205O223k093n155M983K391o365
$$ plain form
2668 -1736 -99 5043 -29 -2461 3431 2051 -2784 1884 3904 -2301 -923 4362 -451 -3181 2854
2683 2854 1913 -3686 690 3214 -2844 -2146 3584 -692 -3971 2203 1137 -4563 -279 2739 -3103
2698 -3103 -2978 2771 -1236 -4642 1268 864 -4825 -1209 2197 -3559 -3628 2360 -1504 -5222 718 997
2714 997 -5231 -1944 1943 -3598 -3848 2006 -1244 -4958 356 909 -5107 -1823 2417 -3006 -3925 2071
2730 2071 -878 -4857 698 1414 -4306 -1501 2909 -2717 -3760 2667 -44 -4480 1090 2416 -3529
2745 -3529 -1588 3549 -1694 -3337 3479 736 -3468 1397 3160 -2744 -675 4192 -876 -2331 3685
2760 3685 1967 -3047 2005 3904 -1853 -104 5021 -167 -2147 3934 2500 -2181 2527 4628 -1662
2775 -1662 -206 5157 854 -1617 4093 2923 -2317 2314 4708 -1254 -45 5319 963 -1856 4213
$$ packed form
2668a736J637N142n072k432N892j380m835M668K020o205J378N285m813k730O035
2683B854r41n599M376K524o058O98N730m276l279O174j066n700M284L018n842
2698c103J25N749m007l406N910m04n689L616L406n756o9N988l864l718N940K79
2714I97o228L287L887n541k50N854l250l714N314N53o016L284M240n423r19N996
2730B071k949l979N555P16n720K805M410n626j043O427k711m436N570J326n945
2745c529J941N137n243j643O816k743m204M865J763n904K069M867n068j455O016
2760C685j718n014N052J899n757J749N125n188j980O081j434m681M708K101o290
2775a662J456N363m303k471N710j170n240M631K394n962J209N364m356k819O069
$$ plain form
2790 4213 3084 -2235 1770 4775 -1139 -571 4960 874 -2310 3510 3139 -2810 1265 4342 -1679
2805 -1679 -1328 4410 419 -2932 2789 2528 -3049 -20 3814 -2234 -2247 3231 -152 -3884 1878 1857
2821 1857 -3901 -650 3011 -2414 -3308 2621 -598 -4334 912 1315 -4495 -1629 2493 -3024 -3774 2115
2837 2115 -974 -4866 405 1065 -4482 -2013 1834 -2903 -4101 1967 -769 -5228 -213 1084 -4611
2852 -4611 -2098 2341 -2634 -4153 1519 -318 -4927 -132 1632 -4051 -2211 2838 -2146 -3821 2034
2867 2034 512 -4324 401 2330 -3198 -1948 3109 -1249 -3140 2561 1079 -3613 523 3338 -2572
2882 -2572 -1097 3999 -569 -2907 2983 2025 -2777 1246 3927 -1828 -757 4330 575 -2333 3485
2897 3485 2816 -2352 1516 4509 -1199 -508 4913 1176 -1833 3981 3470 -2255 1463 4759 -866 -623
$$ packed form
2790D213j129n319M005L005n914N68N531m086l184N820l71n949M075L077o021
2805a679L51N738l991l351N721k61n577L029L834o048j3N478l383l732N762k1
2821A857n758L251L661n425q94N929l219l736N246M03n810K866M122n517p50N889
2837B115l089l892N271O60n547K469L847m737j198O068k736m459N015J297n695
2852d611K513M439m975j519N672j837m609M795J764n683J840N049m984j675N855
2867B034j522m836M725J929n528J250N057m358j891N701j482m692M136K815n910
2882b572J475N096m568k338N890r58m802M023K681n755J071N087l755k908N818
2897C485o69n168L868K993n708O91N421l737l009N814n11n725L718L296n625K43
$$ plain form
2913 -623 4776 1622 -1913 3352 3303 -2211 1167 5086 -861 -1054 4213 1106 -2607 3085 2993 -2282
2929 -2282 772 4649 -1031 -1641 3760 1075 -3000 2029 2655 -2776 -83 3936 -1568 -2290 3175 675
2945 675 -3775 1363 2530 -3514 -1057 2815 -1745 -3428 2513 149 -3921 543 2054 -3674 -1607
2960 -1607 2433 -2466 -4029 1637 -152 -4770 -228 1686 -4185 -2391 2545 -2124 -4021 1621 -23
2975 -23 -5119 -579 1619 -4102 -2798 2088 -1936 -4489 1241 220 -4699 -537 2049 -3949 -2760
2990 -2760 2571 -1640 -4240 1599 981 -4253 -305 2494 -3004 -2170 2564 -866 -3661 1783 1575 -3781
3006 -3781 -93 3111 -2258 -2041 3557 -136 -3175 2556 2600 -2871 356 3757 -1009 -1363 4085 763
3022 763 -2698 2881 3248 -2267 808 4475 -781 -1350 4262 1711 -2056 2789 3748 -1601 731 4785
$$ packed form
2913f23N399l154l535N265m9n514L378L919n947j93N267l107l713N692r2n275
2929b282L054L877n680o10N401k685m075N029O26n431K693M019n504p22N465k500
2945F75m450N138J167o044K457L872m560j683N941k364m070M464J511n728K067
2960a607M040m899j563N666j789m618M542J914n871J794M936m669j897N642j644
2975b3n096M540K198n721J304M886m024k553N730j021m919M162K586n998J189
2990b760N331m211k600N839o18n234L948K799n498Q34M734l430k795N444k08n356
3006c781L688L204n369K17N598l693l039N731M4n471L227L401m766l54N448l322
3022G63l461N579L67n515L075L667n256n69N612k551l767M845R59n349K332M054
$$ plain form
3038 4785 -462 -722 4412 1721 -1885 2952 3637 -1877 442 4570 -298 -1298 4144 1766 -2461
3053 -2461 2661 3476 -1805 255 4201 -293 -2035 3520 1589 -2745 1711 2903 -2412 -649 3796
3068 3796 -627 -2812 2786 1038 -3638 923 2557 -2840 -1588 3155 -890 -3282 2417 722 -3926
3083 -3926 151 2371 -3382 -2345 2375 -1517 -3863 1729 316 -4377 -640 1583 -3703 -2871 2249
3098 2249 -1371 -4434 1207 311 -4680 -1192 1974 -3621 -2952 1998 -1691 -4354 1132 794 -4289 -1117
3114 -1117 1987 -2819 -3135 2247 -1089 -4375 661 1180 -4073 -928 2300 -2613 -2638 2309 -167 -3606
3130 -3606 1240 1713 -3493 -547 2860 -2183 -2416 3005 498 -2820 1737 2589 -2562 70 3732 -1003
3146 -1003 -1753 3647 1489 -2586 2136 3408 -2082 124 4129 -297 -1455 3617 1761 -2334 2544
$$ packed form
3038D785n247k60N134k691l606M837O85n514K319M128m868j000N442k378m227
3053b461N122Q15n281K060L946m494j742N555j931m334M456J192n315J763M445
3068C796m423k185N598j748m676M561J634n397J252M743m045k392N699j695m648
3083c926M077K220n753J037M720l892k346N592j413m693L737K223n286Q32N120
3098B249l620l063N641q96m991L488L166n595O69M950l689k663N486l38n083L172
3114a117L104m806l16N382l336l286N036N19n253L145L228m913k5M947k476l439
3130c606M846M73n206K946L407n043k33N421k507l318M557Q52n151K632L662m735
3146a003p50N400k158m075M722J272n490K206M005m426j158N072j856m095M878
$$ plain form
3161 2544 3735 -1571 161 4539 69 -1532 3895 2127 -2033 2205 3842 -1093 159 4478 366
3176 366 -1577 3801 2076 -2070 1858 4019 -1379 -468 4073 -126 -1773 3446 2021 -2742 1179
3191 1179 3088 -1835 -1095 3468 -399 -2545 2458 1804 -2821 419 3071 -2146 -1801 2896 -426 -3304
3207 -3304 1688 1302 -3494 -282 2148 -2398 -2351 2234 -763 -3752 794 905 -4027 -899 1947 -2897
3223 -2897 -2755 1737 -954 -4282 840 817 -4110 -1497 1900 -2664 -3466 1577 -933 -4275 403 1133
3239 1133 -4074 -1548 1649 -2352 -3408 1588 -525 -4090 478 1589 -3581 -1385 2254 -1970 -2950
3254 -2950 2036 311 -3568 527 1866 -2958 -869 3333 -1043 -2328 2620 752 -2831 1058 2392
3269 2392 -2193 -629 3522 -466 -2354 2899 1608 -2509 1306 3221 -1615 -532 3856 81 -1747
$$ packed form
3161B544J191n306J732M378m470j601N427j768m160M238J637m935J252M319m112
3176C66j943N378j725m146L928K161n398R11M541m199j647N219j425m763L921
3191A179J909m923P40M563l867k146N003o54m625L240K652n217L45M697l322k878
3207c304M992l86m796L212K430m546M7M585k997k989M546J11m932L128K846m844
3223b897J42M492k691l328N122k3m927K613L397m564q02N043k510l342M678P30
3239A133n207K526L197m001j056M996k113l565M568J111n170K196L639m224r80
3254b950M986j725l879M095J339m824K089M202m376j285M948j868l583L889J334
3269B392m585J564M151l988j888N253j291m117L815J915m836J083M388l775j828
$$ plain form
3284 -1747 3178 2176 -2236 1704 3433 -1158 191 3949 662 -1702 3616 2286 -1876 1781 3855
3299 3855 -833 -491 4261 780 -1491 2933 2509 -2059 1284 3551 -1091 -652 3831 845 -1992 2608
3315 2608 2460 -2219 838 3325 -1181 -1410 3421 595 -2624 2287 1921 -2613 52 3274 -1786 -1863
3331 -1863 2664 -224 -3189 1207 1608 -2864 -668 2560 -1978 -2527 2169 -546 -3695 767 1562 -3344
3347 -3344 -1114 2218 -2258 -3109 1463 -635 -4024 -34 1260 -3799 -1951 1376 -2129 -3257 1455
3362 1455 -400 -3922 95 1108 -3731 -2030 1980 -2142 -3735 1140 -278 -3951 151 1316 -3200
3377 -3200 -2053 2321 -1504 -3022 1384 258 -3475 531 2126 -2473 -1438 2702 -847 -2788 1791
3392 1791 1245 -2928 386 2706 -2241 -1143 2977 92 -2354 2335 1851 -2248 793 3437 -1437
$$ packed form
3284a747M925j002m412L940J729m591J349L758l287k364N318j330m162L657K074
3299C855m688L42M752l481k271M424m24m568L343K267m642M39M483k986k837M600
3315B608j48m679L057K487m506k29M831k826l219M911l66m534K665L222n060p7
3331a863M527k888k965M396M01m472K196L228m538n49M696k715l149M462P95m906
3347c344K230L332m476q51M572k098l389L990J294n059J848L327l505j128M712
3362A455j855l522M017J013m839J701M010m122j593M875j418l673M102J165m516
3377c200J147M374l825j518M406j126l733M006J595m599J035M140l549j941M579
3392A791n46m173L314K320m947J098M120k885k446M689m84m099L041K644m874
$$ plain form
3407 -1437 -828 3601 327 -1808 2987 2302 -1879 1039 3599 -1045 -695 3689 779 -1784 3009 2876
3423 2876 -1706 1155 4093 -537 -765 3631 1090 -1827 2513 2916 -1617 661 3731 -612 -1040 3654
3439 3654 1418 -2081 2046 2710 -1742 309 3491 -711 -1629 2726 1011 -2265 1790 2379 -2214 -230
3455 -230 3219 -1147 -2040 2546 541 -2814 1089 1869 -2126 -947 2326 -1230 -2739 1870 479 -3469
3471 -3469 290 1583 -2834 -1700 1756 -1899 -3298 1344 50 -3939 -117 1576 -2803 -2231 1541
3486 1541 -1592 -3246 994 77 -3816 -283 1546 -2831 -2383 1485 -1429 -3253 1071 349 -3711 -641
3502 -641 1659 -2880 -2203 1637 -910 -3524 1132 832 -3370 -407 1962 -2244 -2027 2301 -294 -2795
3518 -2795 1281 1254 -2950 -398 2227 -1752 -1546 2892 -21 -2336 1744 2067 -1879 276 3097 -1059
$$ packed form
3407a437O09M429l274k135M795o85m181K918K560m644L50M384k910k563M793j33
3423B876m582K861K938m630k28M396k541k917M340M03m533K278L070m343m28M694
3439C654k236l499M127O64m452K051L182m202r18M355j715l276M055N89m593J984
3455b30L449m366q93M586k005l355L903P80l995J179L273l556j509M609j391l948
3471c469L759J293m417J134L456l655j399M642j294l989L822J693m379N72L772
3486A541l133j654M240r17l893L533J829m377M48L868k914j824M324p22m060L070
3502f41K300m539O77L840k547k614M656l00m202K963K369m206K17M328k595k501
3518b795M076k7m204K552K625l979K06M438k913k315M080L23l946K155K821m156
$$ plain form
3534 -1059 -1164 2997 945 -1820 1742 2664 -1598 504 3288 -579 -714 3352 1242 -1570 1854 2891
3550 2891 -1262 477 3677 1 -1187 3269 1666 -1742 2130 3085 -1128 463 3722 98 -929
3565 -929 2924 1699 -1603 1609 2777 -1344 -75 3697 -242 -1563 2514 1581 -1927 1428 2484
3580 2484 -1648 -691 2634 -141 -1782 2208 1116 -2387 450 2131 -2101 -1372 2573 -452 -2756
3595 -2756 1701 870 -2944 -42 1810 -2271 -1793 2018 -887 -3012 1091 717 -3274 -537 1668 -2504
3611 -2504 -2326 1603 -969 -3531 302 368 -3475 -1044 1611 -2597 -2134 1400 -1142 -3462 492 244
3627 244 -3457 -859 1401 -2168 -2197 1282 -540 -3180 421 887 -2907 -842 2028 -1558 -2153 1419
3643 1419 97 -2742 631 1377 -2587 -796 2060 -1046 -1920 2411 635 -2423 936 1943 -1973
$$ packed form
3534a059j05M161k052k765L562R22m262K102K784l867j35M066k110k812L424J037
3550B891m153J739L200l676j188M456j603l408L872R55m213J591L259l624j027
3565i29L853j225l302L212J168m121J269L772l939j321M077r33l508L355J056
3580B484m132R57L325k775j641L990j092l503K837J681m232P29L945l025k304
3595b756M457q31l814K902J852m081M78L811k905k125M103l74l991K737K205m172
3611b504J78L929k572k562L833O6l843K431K655m208M63L534k542k320L954k48
3627B44l701K598K260l569k9L479j822k640L601M66l794K065K870l586n95L572
3643A419j322k839L373P46l964J791K856l106q74M331j776l058L359J007l916
$$ plain form
3658 -1973 -163 2453 -967 -1615 2605 1073 -2031 1692 2622 -1409 274 2905 -169 -832 2857 1557
3674 1557 -1658 1548 2739 -1151 273 3549 158 -906 2853 1819 -1295 1910 2951 -809 250
3689 250 3717 303 -1165 2933 1889 -1528 1441 3079 -871 -226 3374 354 -1150 2077 1825 -1754
3705 -1754 814 2551 -1054 -512 2539 123 -2060 1821 1208 -2266 223 2291 -1380 -988 2309 86
3721 86 -2537 907 1327 -2627 -519 2185 -1919 -2110 1886 -504 -2774 612 1035 -2692 -844 1424
3737 1424 -2034 -2192 1230 -497 -2880 20 947 -2913 -988 1231 -1892 -2581 955 -612 -3139 87
3753 87 1011 -2998 -1244 1652 -1517 -2445 1091 -281 -3047 54 587 -2793 -940 1780 -1177 -2416
3769 -2416 1257 264 -2926 238 1309 -2430 -980 2234 -500 -2198 1499 707 -2362 553 2042
$$ packed form
3658a973J810K616l420o48M220j532l104L723R30m031J683K631l074o63L689j300
3674A557l215L206J191l890J424L276l391j064L759j034l114L205J041l760J059
3689B50L467l414j468M098j044l417K969J638l950O45L600l020j504L227k52l579
3705a754K568J737l605N42L051k416k183L881o13l474K489K068l671L92L297k223
3721H6k623L444M20l954K108K704m104j91L996k390k270L386M23l727J848K268
3737A424l458j58L422j727k383K900R27l860J925K219l123o89L536j567k527L226
3753H7R24m009J754K896l169r28L536j372k766L101N33l380J853K720k957j239
3769b416L673r93l190L164J071l739J450L214k734j698L697p92l069K915J489
$$ plain form
3784 2042 -1787 -812 2412 -314 -1812 2302 1419 -2282 1003 2268 -1088 -505 2769 308 -1230 2461
3800 2461 1855 -1656 1168 3100 -988 -382 3136 552 -1270 2565 1967 -1361 1475 2952 -820 -172
3816 -172 3341 974 -1224 2154 1885 -1342 774 3121 -748 -502 3194 628 -1601 1916 1947 -1725
3832 -1725 736 2687 -701 -930 2648 420 -1735 1444 1665 -1768 -44 2243 -860 -1756 2340 169
3848 169 -2253 841 1268 -2171 -658 1825 -1406 -2035 1596 -16 -2654 568 1051 -2637 -1236 1692
3864 1692 -1556 -2497 1060 -219 -3042 -219 1063 -2853 -1444 1336 -1649 -2626 1104 -448 -3069
3879 -3069 48 956 -2621 -1815 1108 -1436 -2962 702 162 -3076 -307 1103 -2272 -1676 1754 -1077
3895 -1077 -2775 1094 392 -2610 113 1568 -2105 -1643 1919 -511 -2061 1246 835 -2413 239 2047
$$ packed form
3784B042l829R75L224k726j498M114q83l701L285J265l356N83L274k461j538L691
3800B461o06l511K824J932m088O06L518k584j822L835n98l328K836J477l772O48
3816a72L513k367k198L378k69l227K116K347l869K46L696k566k229L517L1l672
3832a725K461J951l388k29L578k228k155L179K21l433J724K287l103q96M096k171
3848A69k422L094M27l439J513K483l231o29L631j612k638L222M83l688J401K928
3864A692l248r41L557j279k823K823J282l916J409K780k985r77L730j552k621
3879c069L117R08l577Q06K923k544j526L664n40l238K769J410l375N96L430k831
3895a077j698L869p02l002K723J455l673M62L562k430j550L307m11l248K652J808
$$ plain form
3911 2047 -1399 -1074 2305 -154 -1956 1534 1863 -1794 213 2502 -1170 -628 2688 313 -1750 2085
3927 2085 1572 -1567 916 2975 -523 -409 2740 1108 -1176 2214 2271 -1235 795 3035 -266 -552
3943 -552 2636 1231 -1158 1925 2525 -1098 818 2957 -362 -878 2530 978 -1400 1854 2296 -1109
3959 -1109 197 2820 -434 -1069 2380 840 -1850 999 2031 -1324 -271 2498 -657 -1629 1906
3974 1906 557 -1978 603 1793 -2139 -1057 1867 -959 -1980 1543 232 -2769 375 1345 -1961
3989 -1961 -1279 1607 -1015 -2799 799 387 -3133 -198 1248 -2260 -1880 1464 -992 -2556 660 8
4005 8 -2923 -668 1220 -2082 -1743 1442 -993 -2806 343 386 -2523 -653 1401 -2326 -1941 1541 -571
4022 -571 -2964 550 704 -2777 -597 1488 -1800 -1693 1737 -384 -2343 882 1008 -2237 -318 1927
$$ packed form
3911B047l446L25L379k459j802L490L29l657K007K289l672N42L316k375k063L835
3927B085n13l139K483K059l498J14L149j632k284L390N7l506K030K240l301k86
3943e52L188j405k389L083O00l623J916K139l319n16L408j552k378L254M42l405
3959a109J306K623l254o35L449j540k690K849J032l355J053K769l155r72L535
3974A906j349k535K581J190l932J082K924k826j021L523j311l001L144R70l306
3989a961O82K886k622j784L598m12l520K935J446l508L80L344k456j564L216o52
4005Hk931K255J888l302L39L185k435j813L149M3k909J870K054l727L85L482k112
4022e71k393L514J54l481K180K085l288J07L430k121j959L225J26l245J919K245
$$ plain form
4038 1927 -1070 -1221 1932 -134 -2057 1219 1446 -1795 13 2437 -908 -867 2208 648 -1708 1446
4054 1446 2087 -1524 73 2700 107 -740 2390 1123 -1488 1726 2047 -981 354 3096 -18 -645
4070 -645 2557 1333 -1049 1539 2543 -1011 179 2920 125 -915 2815 1307 -1436 1659 2332
4085 2332 -995 47 2958 195 -1134 2360 1151 -1483 894 2238 -1231 -592 2562 -102 -1520
4100 -1520 1801 1129 -1894 38 1669 -1403 -1136 1911 -789 -2167 1129 1039 -2423 -124 1384 -1711
4116 -1711 -1756 1641 -668 -2857 711 494 -2735 -551 1413 -2072 -2091 1655 -618 -2663 588 499 -3016
4133 -3016 -743 1160 -1611 -2035 906 -536 -2819 339 642 -2773 -850 1270 -1778 -2122 1142 -462
4149 -462 -2631 281 870 -2137 -802 1673 -1427 -2179 1305 119 -2288 592 1031 -1836 -769 1718
$$ packed form
4038A927k997j51L153k066j923L276K27l241J808K424l345M1L075j560k356L154
4054A446O41l611J597K627k593q47L130j267k611L214L21l028J335K742l114o27
4070f45L202j224k382K588J004l554J190K741k795j040L730j508k743L095O73
4085B332l327J042K911k763j329L494j209k634K377J344l469O39L154k664j418
4100a520L321o72l023J932J631l072K67L047k700j378L296r0l462K299J508l095
4116a711m5L397k309k189L568k17l229K184J964l485j9L746k273k045L251q9l515
4133c016K273J903k771m24K941j442k283L158L03l415J923K120l048l44L264j604
4149d62k169K912N89l007J335K475l100p52L484j186k407K880M39k867J067K487
$$ plain form
4165 1718 -891 -1785 1783 290 -2122 829 1726 -1702 -318 2679 -158 -1357 1936 885 -1867
4180 -1867 883 2059 -787 -94 2434 -126 -797 2205 1177 -1218 1086 2620 -436 175 2583 433
4196 433 -840 2222 1609 -1154 768 2638 -566 -99 2797 822 -1169 2101 1627 -1440 995 2429
4212 2429 -754 -528 2881 422 -1191 2050 1768 -1420 836 2307 -1048 -519 2456 196 -2061 974
4228 974 1470 -1983 417 2171 -1032 -1294 1933 -1 -2414 1139 1220 -2120 -515 1552 -1411 -1510 1355
4245 1355 -501 -2539 663 1114 -2416 -900 1397 -1740 -1888 1157 -328 -2618 277 672 -2535 -1181
4261 -1181 1123 -1180 -2171 971 -463 -2736 121 518 -2701 -1509 1015 -1325 -2440 866 -265
4276 -265 -2691 5 883 -2231 -1385 950 -908 -2182 1290 399 -2255 -34 1163 -2245 -1060 1952
$$ packed form
4165A718k609q94L568j493k412K951Q97l428J384K997k837j199L293j051k752
4180a867K750J176k846O93K528k560o71L002j028k395K304J534l056O11K408k150
4196D33j273L062o13k763J922J870l204M67K896j975j991L270m74l067K435J434
4212B429l183K26L409k459j613L241k82l188K256J471l355N29K975k260k257L035
4228I74M96l453K400J754l203k62L227j934k413L553Q1l340J605K067k963r9K865
4245A355j856k038L202M51l530J516K297l137j48L045j485k290K895L95l207J354
4261a181K304k303r91L142j434k273K857L97l219J192K524k340j115L306j131
4276b65k426K696Q78l114Q46K335j858j274L472q91k654K221J197l408J185L012
$$ plain form
4292 1952 -501 -1749 1241 655 -1926 325 1782 -1350 -373 2050 -282 -1901 1591 1109 -1793 822
4308 822 2131 -1145 -542 2301 339 -1384 1829 1698 -1471 575 2474 -696 -592 2684 643 -1179
4324 -1179 1973 1829 -1245 797 2646 -473 -482 2503 882 -1321 1801 1777 -1114 755 2598 -460
4340 -460 -652 2350 952 -841 1717 1823 -1112 136 2357 -652 -1101 2243 442 -1767 1342 1498
4356 1498 -1441 41 2292 -961 -1071 1740 305 -2143 580 1775 -1642 -723 1614 -954 -2201
$$ packed form
4292A952k453j248K990n86k581K251J457l132R77K423k332j619L492m82k902K615
4308H22J309l276O03K843j962j723L213j31l169K046J899l170J04L276k041j822
4324a179L152j44l074K042J849l119rK985j621k203L122k4k891J869J843l058
4340d60j92L002j398j793K558J06k935J248K221l009m49L344j801k209L109J56
4356A498k939J482K251l253j10K811j435k448K723J195l417R19K337k568j247
$$ [...]
8191C88
##END NTUPLES=NMR FID
##END=
