##TITLE=1H_TG-2262
 DMSO, 56 sc, 
 18.11.2019
##JCAMPDX= 6.0         $$ Bruker NMR JCAMP-DX V2.0
##DATA TYPE= NMR FID
##DATA CLASS= NTUPLES
##ORIGIN= UXNMR, Bruker Analytische Messtechnik GmbH
##OWNER= root
$$ XWIN-NMR		Version 3.5
$$ Mon Nov 18 14:04:07 2019 Russian Standard Time (UT+4h)  she@DPX200
##.OBSERVE FREQUENCY= 200.1315
##.OBSERVE NUCLEUS= ^1H
##.DELAY= (6, 6)
##.ACQUISITION MODE= SIMULTANEOUS
##.ACQUISITION SCHEME= undefined
##.AVERAGES= 56
##.DIGITISER RES= 18
##SPECTROMETER/DATA SYSTEM= spect
##.PULSE SEQUENCE= zg30
##.SOLVENT NAME= DMSO
##.SHIFT REFERENCE= (INTERNAL, DMSO, 0, 15.7039)
##AUDIT TRAIL= $$ (NUMBER, WHEN, WHO, WHERE, WHAT)
$$ ##TITLE= Audit trail, XWIN-NMR		Version 3.5
$$ ##JCAMPDX= 5.01
$$ ##ORIGIN= Bruker BioSpin GmbH
$$ ##OWNER= she
$$ F:/spectra/data/she/nmr/H-F/1/audita.txt
$$ ##AUDIT TRAIL=  $$ (NUMBER, WHEN, WHO, WHERE, WHAT)
(   1,<2019-11-18 14:03:02.76 +0400>,<she>,<DPX200>,
      <continue with go, POWCHK disabled, PULCHK disabled
       configuration hash MD5:
       00 E9 B6 7A A2 85 ED C7 34 08 36 98 17 FE 4E 26
       data hash MD5: 16K
       E4 AE 40 F9 F7 BB D2 CB 09 1C A8 91 39 B5 94 CD>)
$$ ##END=
$$ 
$$ hash MD5
$$ 91 DE 6E FC DA 02 D9 5C EC 04 B8 90 58 68 BF 72
##$RELAX= 
##$RELAX= 
##$RELAX= 
##$RELAX= 
##$RELAX= 
##$RELAX= 
$$ Bruker specific parameters
$$ --------------------------
##$DU= <F:/spectra>
##$EXPNO= 1
##$NAME= <H-F>
##$PROCNO= 1
##$TYPE= <nmr>
##$USER= <she>
##$AMP= (0..31)
100 100 100 100 100 100 100 100 100 100 100 100 100 100 100 100 100 100 
100 100 100 100 100 100 100 100 100 100 100 100 100 100 
##$AQSEQ= 0
##$AQ_mod= 1
##$AUNM= <au_zg>
##$AUTOPOS= <>
##$BF1= 200.13
##$BF2= 200.13
##$BF3= 200.13
##$BF4= 200.13
##$BF5= 200.13
##$BF6= 200.13
##$BF7= 200.13
##$BF8= 200.13
##$BYTORDA= 1
##$CFDGTYP= 0
##$CFRGTYP= 5
##$CHEMSTR= <none>
##$CNST= (0..31)
1 1 145 1 1 1 1 1 1 1 1 1 1 1 1 1 1 1 1 1 1 1 1 1 1 1 1 1 1 1 1 1 
##$CPDPRG= <>
##$CPDPRG1= <>
##$CPDPRG2= <>
##$CPDPRG3= <>
##$CPDPRG4= <mlev>
##$CPDPRG5= <mlev>
##$CPDPRG6= <mlev>
##$CPDPRG7= <mlev>
##$CPDPRG8= <mlev>
##$CPDPRGB= <>
##$CPDPRGT= <>
##$D= (0..31)
0 1.2 0 0 0 0 0 0 0 0.06 0 0.03 0 0 0 0 0.0002 0 0 0 0 0 0 0 0 0 0 0 0 
0 0 0 
##$DATE= 1574071192
##$DBL= (0..7)
120 120 120 120 120 120 120 120 
##$DBP= (0..7)
150 150 150 150 150 150 150 150 
##$DBP07= 0
##$DBPNAM0= <>
##$DBPNAM1= <>
##$DBPNAM2= <>
##$DBPNAM3= <>
##$DBPNAM4= <>
##$DBPNAM5= <>
##$DBPNAM6= <>
##$DBPNAM7= <>
##$DBPOAL= (0..7)
0.5 0.5 0.5 0.5 0.5 0.5 0.5 0.5 
##$DBPOFFS= (0..7)
0 0 0 0 0 0 0 0 
##$DE= 6
##$DECBNUC= <off>
##$DECIM= 24
##$DECNUC= <off>
##$DECSTAT= 4
##$DIGMOD= 1
##$DIGTYP= 9
##$DL= (0..7)
0 120 120 120 120 120 120 120 
##$DP= (0..7)
150 150 150 150 150 150 150 150 
##$DP07= 0
##$DPNAME0= <>
##$DPNAME1= <>
##$DPNAME2= <>
##$DPNAME3= <>
##$DPNAME4= <>
##$DPNAME5= <>
##$DPNAME6= <>
##$DPNAME7= <>
##$DPOAL= (0..7)
0.5 0.5 0.5 0.5 0.5 0.5 0.5 0.5 
##$DPOFFS= (0..7)
0 0 0 0 0 0 0 0 
##$DQDMODE= 0
##$DR= 18
##$DS= 0
##$DSLIST= <SSSSSSSSSSSSSSS>
$$ [...]
##$SUBNAM2= <"">
##$SUBNAM3= <"">
##$SUBNAM4= <"">
##$SUBNAM5= <"">
##$SUBNAM6= <"">
##$SUBNAM7= <"">
##$SUBNAM8= <"">
##$SUBNAM9= <"">
##$SW= 24.0689530833862
##$SWIBOX= (0..15)
0 0 2 0 0 0 0 0 0 0 0 0 0 0 0 0 
##$SW_h= 4816.95568400771
##$TD= 16384
##$TD0= 1
##$TE= 0
##$TE2= 300
##$TE3= 300
##$TEG= 300
##$TL= (0..7)
0 120 120 120 120 120 120 120 
##$TP= (0..7)
150 150 150 150 150 150 150 150 
##$TP07= 0
##$TPNAME0= <>
##$TPNAME1= <>
##$TPNAME2= <>
##$TPNAME3= <>
##$TPNAME4= <>
##$TPNAME5= <>
##$TPNAME6= <>
##$TPNAME7= <>
##$TPOAL= (0..7)
0.5 0.5 0.5 0.5 0.5 0.5 0.5 0.5 
##$TPOFFS= (0..7)
0 0 0 0 0 0 0 0 
##$TUNHIN= 0
##$TUNHOUT= 0
##$TUNXOUT= 0
##$USERA1= <user>
##$USERA2= <user>
##$USERA3= <user>
##$USERA4= <user>
##$USERA5= <user>
##$V9= 5
##$VALIST= <valist>
##$VCLIST= <CCCCCCCCCCCCCCC>
##$VD= 0
##$VDLIST= <DDDDDDDDDDDDDDD>
##$VPLIST= <PPPPPPPPPPPPPPP>
##$VTLIST= <TTTTTTTTTTTTTTT>
##$WBST= 1024
##$WBSW= 4
##$XGAIN= (0..3)
0 0 0 0 
##$XL= 0
##$YL= 0
##$YMAX_a= 915499
##$YMIN_a= -533570
##$ZGOPTNS= <>
##$ZL1= 120
##$ZL2= 120
##$ZL3= 120
##$ZL4= 120
##$ABSF1= 10
##$ABSF2= 0
##$ABSG= 5
##$ABSL= 3
##$ALPHA= 0
##$AQORDER= 0
##$ASSFAC= 0
##$ASSFACI= 0
##$ASSFACX= 0
##$ASSWID= 0
##$AUNMP= <proc_1d>
##$AZFE= 0.1
##$AZFW= 0.1
##$BCFW= 1
##$BC_mod= 2
##$BYTORDP= 1
##$COROFFS= 0
##$CY= 11.3945322036743
##$DATMOD= 1
##$DC= 2
##$DFILT= <>
##$DTYPP= 0
##$F1P= 16.9975609425685
##$F2P= -3.02152046262296
##$FCOR= 0.5
##$FTSIZE= 0
##$FT_mod= 4
##$GAMMA= 1
##$GB= 0.15
##$INTBC= 1
##$INTSCL= 1
##$ISEN= 128
##$LB= 0.24
##$LEV0= 0
##$LPBIN= 0
##$MAXI= 10000
##$MC2= 0
##$MEAN= 0
##$ME_mod= 0
##$MI= 1.114404
##$NCOEF= 0
##$NC_proc= 0
##$NLEV= 6
##$NOISF1= 3.799351
##$NOISF2= 2.8
##$NSP= 1
##$NTH_PI= 0
##$NZP= 0
##$OFFSET= 15.70392
##$PC= 1
##$PHC0= -9442.139
##$PHC1= 31.40087
##$PH_mod= 1
##$PKNL= yes
##$PPARMOD= 0
##$PSCAL= 0
##$PSIGN= 0
##$REVERSE= no
##$SF= 200.130013532006
##$SI= 16384
##$SIGF1= 3
##$SIGF2= 2
##$SINO= 400
##$SIOLD= 16384
##$SREGLST= <1H.CDCl3>
##$SSB= 0
##$STSI= 0
##$STSR= 0
##$SW_p= 3612.71676300578
##$SYMM= 0
##$S_DEV= 0
##$TDeff= 0
##$TDoff= 0
##$TI= <>
##$TILT= no
##$TM1= 0
##$TM2= 0
##$TOPLEV= 0
##$USERP1= <user>
##$USERP2= <user>
##$USERP3= <user>
##$USERP4= <user>
##$USERP5= <user>
##$WDW= 1
##$XDIM= 8192
##$YMAX_p= 0
##$YMIN_p= 0
$$ End of Bruker specific parameters
$$ ---------------------------------
##NTUPLES= NMR FID
##VAR_NAME=  TIME,          FID/REAL,        FID/IMAG
##SYMBOL=    X,             R,               I
##VAR_TYPE=  INDEPENDENT,   DEPENDENT,       DEPENDENT
##VAR_FORM=  AFFN,          ASDF,            ASDF
##VAR_DIM=   8192,          8192,            8192
##UNITS=     SECONDS,       ARBITRARY UNITS, ARBITRARY UNITS
##FACTOR=    0.0002076,     1,               1
##FIRST=     0,             0,               0
##LAST=      1.7004516,     0,               0
##MIN=       0,             -533570,         0
##MAX=       1.7004516,     915499,          0
$$ Real data points
##PAGE= N=1
##DATA TABLE= (X++(R..R)), XYDATA
$$ [...]
2556B820k120l744J597L336M35k676j145O63J783J345l211j677L075J589n84j438
2572D8j926J061L518p25l914j259L903J761j422l609O4L554J863k679k680O56
2588a786N038j402k475j559J128L759j63l443k248L161L678k052l547o03K946
2603D32K651j897l336J28L377K88k055j254K48K107J940k716k101M04L501J1j272
2620D56k893R29L471K75k711k587K346L085j7l450j511R51L971j31l593j616L416
2637C91J877o94l311n51K582M011m065k517N02K796J593l014k134L58L331J776
2653B931l807k123K762K111q1l110k50j99M417j183l606j17L001J055j207k010
2669a416j227K859K039k110k686J296J827J140j333j807p14L733P38k983j783
$$ plain form
2556 2820 700 -3044 -1447 1889 2324 -352 -1497 -834 949 2294 -917 -2594 481 2070 1486 48
2572 48 -1878 -817 2701 1976 -1938 -3197 706 2467 1045 -2564 -2500 1054 2917 238 -2442 -1786
2588 -1786 3252 1850 -625 -2184 -1056 2703 2540 -903 -3151 10 3688 1636 -1911 -2514 432
2603 432 3083 1186 -2150 -2022 1355 1643 -412 -1666 -1418 689 2629 -87 -2188 -1784 1717 1728 456
2620 456 -2437 -1508 1963 2238 -473 -3060 -714 2371 2354 -1096 -2607 -1656 2315 2184 -1409 -3025 391
2637 391 2268 1574 -1737 -2288 294 4305 240 -2277 -1775 1021 2614 -400 -2534 -2176 1155 2931
2653 2931 -876 -2999 -237 1874 1793 -1317 -1567 -1766 2651 1468 -2138 -2255 746 1801 594 -1416
2669 -1416 -2643 216 2255 145 -2541 -1245 582 1722 389 -1418 -2132 1601 2339 -644 -2427
2684b427J419K424P60k355k706J483L681l72l220n69J466K448j73l285q41K145
2700a22L414k060m131P6M320J081k254k239j60L316J950l391k278J516L008n29
2716A517j792j846J677L246j827k313L57J377J581q78k980K18J127L224j669k943
2732a924J134J341K036j119k961J19K437J508k388l003J435L107K57j622l507
2747c150J865L416J040l867j116J640J747J06k535j386J999K670j455l512M95
2762b043K800J481o55l497N8K947J687k331k816J137K325M62j298k309J516K528
2778A992r91k431o39J576J750o18r44j718J710K247p48k739K32J898J212j072
2794G17k300n24L016J412j575k927P63K649K38j734j850R89K455N89k181r46J06
$$ plain form
2684 -2427 -1008 1416 2176 -179 -2885 -1402 2279 1907 -1313 -1882 -416 2032 1859 -1426 -2267 -122
2700 -122 3292 1232 -2899 -2823 1497 2578 324 -1915 -2075 1241 3191 -200 -2478 -962 2046 1517
2716 1517 -275 -2121 -444 2802 975 -1338 -981 396 1977 1099 -1881 -1663 -536 2688 1019 -1924
2732 -1924 -790 551 2587 1468 -1493 -1374 1063 2571 183 -2820 -1385 1722 1979 357 -3150
2747 -3150 -1285 2131 3171 -696 -1812 -172 1575 1681 -854 -2240 -241 2429 974 -2538 -2043
2762 -2043 757 2238 1583 -1914 -1856 1091 2778 447 -2369 -1232 1093 1555 257 -2052 -536 1992
2778 1992 1001 -1430 -2069 -493 1257 639 -305 -2023 -313 1934 1186 -1553 -1321 577 1789 717
2794 717 -1583 -2107 909 2321 746 -2181 -1418 1231 1469 -265 -2115 -1126 1329 1918 -263 -1209 -1103
2811a103K306j93j265k444J820L319j204k304l02J931J291n20l147K9L026J390
2827B630k406k258J126J853N55j365k191O99L657n88k595q17J585Q56M39j331
2843a51r76J470J058p52k347L74R07J147K20j931j123K752J375j395j861L96R69
2860A32J796j256k988J294J661J265k499n69L99J708J072k648j635J812J778m45
2876H77k018n93K209J062l94k622o77K803R28j311j393O00J094P05n71k368Q04
2893h65J870M33j929q10R66J254k9j323q02Q26J970m53j774N9r0J683k39j348
2911f01j544K313J109j332j315K11J488J606o17k469J84J875L05j047r27M04J754
2928A397k12k240n20J240K156j590j499J82J446J768j055k148j27J947J135j627
$$ plain form
2811 -1103 1203 1010 -255 -2699 -879 2440 1236 -1068 -1370 561 1852 1332 -1815 -1786 1240 2630
2827 2630 224 -2034 -908 945 1500 135 -2056 -1357 2300 1712 -883 -1700 -115 741 1180 -151
2843 -151 -1127 343 1401 649 -1698 -1324 -417 730 950 -981 -2104 648 2023 628 -1233 -837 132
2860 132 1928 672 -2316 -1022 639 1904 -595 -1164 -765 943 2015 -633 -2268 -456 1322 877
2876 877 -1141 -1734 475 1537 1143 -1479 -2156 647 1575 264 -1129 -529 565 1270 699 -1669 -865
2893 -865 1005 1438 -491 -1301 -335 919 890 -433 -1235 -409 1561 1108 -666 -607 -697 986 747 -601
2911 -601 -2145 168 1277 -55 -1370 -1159 329 1935 1318 -1151 -967 908 1213 166 -761 -357 1397
2928 1397 1185 -1055 -1575 -335 1821 231 -1268 -1086 360 2128 1073 -1075 -1202 745 1880 253
2944B53j578J075N38J117j122j868J30L358l81k657K23R70k89J222j288j051O39
2961g09J623k01r83m58M01R59j17q97r14J397J425j571o33n8R15J428r03j046
2979c42m28P91J055l21j900K70J319R88r33j872J403J643l90j105j384J760M69
2996A023j2j979j02K199N46j401j708J128L32J094p21j144N19Q47L91q72p49Q21
3014B12j84Q70n13j306J60K100j233j74l00n05J680k89K79k725J647R27l50p40
3032d44k22L0J222K45j805l15J534N09o10o12m22J041R62j014j256J42K268j89
3050A064j295J8l32J252R89k406Q2L84Q86r93o0j58J138k67M18q91K78j22J487
3069A472q52j036R02k55J345n79j610J142p6j159O53L81j022P60J464j278n82
$$ plain form
2944 253 -1325 -250 288 1405 283 -1585 -1455 1903 1522 -1135 -912 58 -231 991 -297 -1348 -709
2961 -709 914 713 -270 -728 -327 632 515 -382 -1296 101 1526 -45 -678 -736 179 1607 704 -342
2979 -342 -770 21 1076 755 -1145 -875 444 1432 499 -1373 30 1673 1283 178 -1206 554 1023
2996 1023 1011 -968 -1070 1129 1675 274 -1434 -306 26 1120 399 -745 -226 621 1012 140 -609 212
3014 212 28 898 385 -921 -761 1339 106 -68 -368 -873 807 518 797 -1928 -281 646 296 -444
3032 -444 -666 -636 586 831 -974 -1289 245 754 144 -468 -890 151 1113 99 -1157 -1015 1253 1064
3050 1064 -231 -213 -545 707 1696 -710 -628 -244 642 -351 -411 -569 569 302 720 -171 107 -15 1472
3069 1472 620 -416 486 231 1576 997 -613 529 453 -706 -53 328 -694 66 1530 252 -330
3086c30m30J017K55q57n00J49J412J01j703o40K068J027j330m97m90J215J046
3103A513j044l26KM67q5m06j50m96Q35O24j720O22M11j72n22Q28q8k35J99k1r77
3124g41P54J025j586K86m21N36n20K85L60n80R37L47n07j739K284j325O04O75
3142F74L54k103Q74K88N5K1j165J076l77P28j289l18K255k22j138Q2n96J073M23
3161F95l10o73K17J025L6j303J09N7k38Q15l32j239N03N22L94l49K2m32J509m18
3181F10j717Q38O00r97L06P84o13j24Q65j60p24r6K63r2P89J36r89L17K92l46
3201e8j26N85L47K07n44j212N87M78K79o27r73O16N77j76L31p33k02N64KK0k04
3222b62Q94m22l84k8m51N77Q48k50j462J049J002l88q47k49M67J223r04j457N78
$$ plain form
3086 -330 -760 257 512 -345 -845 -696 716 817 -886 -1526 542 1569 239 -258 -748 467 1513
3103 1513 469 143 145 612 527 121 -29 -525 310 934 -786 -164 247 75 -447 381 293 58 257 236 -741
3124 -741 13 1038 -548 -262 -683 -147 -667 -382 -22 -602 335 682 175 -1564 720 -605 -1 674
3142 674 1028 -1075 -201 87 142 163 -1002 74 -303 425 -864 -1182 1073 851 -287 -205 -801 272 695
3161 695 385 -288 -71 954 990 -313 -204 -147 -385 430 98 -1141 -638 -116 278 -71 -49 -481 1028 610
3181 610 -1107 -269 331 -666 -360 424 -189 -313 552 392 -332 -428 -165 -257 532 668 -321 -4 288 -58
3201 -58 -184 401 748 955 411 -801 -214 264 543 -84 -1057 -441 136 -40 291 -442 -644 -80 -78 -58 -262
3222 -262 632 210 -174 -202 -653 -76 772 522 -940 109 1111 723 -124 -373 94 1317 413 -1044 -466
3241d66R26p27K27J46l95Q05m07l89J88n08R43j23l9P89j388K1O03o06k4L92l97
3262d29M44N27j73j000L84P52n78m26N60J08L75j06j283J169N96n86j152J074
3280B56j35o16P92o44j14R43k57m04p50J019M0j260Q99n20N47K16O28p04p44J492
3300F84j75j333J306l7j35p5L87l95l69J97J26j109J332o84j17K62J14k06pl20
3320e54L16M04j19K05l04Q72l24j165R73p57J20L28o04j8R63M48j444J231l86
3339A85N09l06r10K29J95L84q10J28P07L26m13l69Q66j359J118k43m97O88l07
3358A21Q6l44L5j59L95K20l24P3O0k48J49k52L19l24R6L55n00J62j29r7k24J228
3380F98o83J82n04K82M91r87O73j61ML53r43k00J358q38j79O89M91l14l66J80
$$ plain form
3241 -466 460 -267 -40 106 -289 516 109 -280 -92 -600 343 220 181 970 -418 -397 206 -400 -424 -32 -429
3262 -429 15 542 369 -631 -247 505 -73 -499 61 169 544 438 -845 324 920 334 -818 256
3280 256 121 -495 297 -347 -461 482 225 -179 -929 90 130 -1130 -231 -751 -204 12 640 -64 -808 684
3300 684 509 -824 482 445 310 235 622 227 -142 55 181 -928 404 -280 -397 -135 -21 -227 -234 -554
3320 -554 -238 166 47 252 -52 820 496 -669 304 -453 -333 -5 -609 -627 336 784 -660 571 185
3339 185 694 388 -522 -293 -98 286 -524 -396 311 637 224 -145 721 -638 480 237 -260 428 121
3358 121 207 -137 -102 -261 134 354 30 103 163 -85 64 -188 131 -193 -97 258 -242 -80 -209 -306 -530 698
3380 698 15 197 -307 -25 466 -521 152 -9 -5 348 -595 -795 563 -275 -454 235 726 412 46 226
3400B26L50P8k33r8n20N55M70j664K29L56k24L46L09p83N09o7K2K22K73n1o53
3421c48K04m21J49M18m98L26K32Q2o8j6O86j852J046J41p21O25M65N7J90n95M05
3442E07r17Q71q50k83J045m89k02k15N79nk92Q18m52j85J107j561K29J6M10n92
3462d61k57J252m48p74Q84l43k50Q56j24n13L47N06q10j8J36lN71p10K26K71j21
3483B17L00j215K05R72j254N60L08j58O9P7p44J639p16q23J09N56l08J45r77R76
3503f2J36m7L26j167J50J238n16LK05j014J86J227j47J67l16k03j173M58O09K72
3523C32N0r6l86p94O63J63N4L84J01j410R79L49l48L7qn57R45J0J05j099R2P68
3545C34n16K85L58j510m07J284q62R38O9L17P6l07k46j3M83k01O24q43K45j011
$$ plain form
3400 226 576 654 421 323 -197 358 828 -836 -607 -251 -475 -129 180 -603 -94 -161 -139 83 356 305 -348
3421 -348 -144 -565 -416 2 -496 -170 62 144 76 60 746 -1106 -60 81 -640 -15 450 507 697 102 507
3442 507 -410 461 -389 -672 373 -116 -318 -533 46 41 -251 567 115 -70 1037 -524 -295 -279 131 -461
3462 -461 -718 534 86 -688 196 -147 -397 459 335 -178 169 675 -135 -153 -17 -20 551 -159 67 338 217
3483 217 517 -698 -493 479 -775 -215 93 -65 4 81 -663 976 260 -563 -454 102 -206 -61 -1038 -62
3503 -62 74 27 353 -814 -664 574 58 61 266 -748 -562 665 518 685 369 166 -1007 -549 60 332
3523 332 382 286 -100 -894 -231 -68 -14 370 471 -939 40 389 41 78 70 -487 458 468 573 -526 -434 334
3545 334 -182 103 461 -1049 -1456 -172 -1034 -96 -27 290 366 59 -187 -200 283 82 706 -137 108 -903
3565i03M60J94J41Q44j99m97O32p06K54J23r45Q27p72K14L80L95r35J219j651
3584i25N53J33O63m50j82J247q46k58m34R42N40l34j096n85J773p93O08o90M8
3603h6m7j65M49M58L0j189N26m5P59n68L13o07P75j086J62K97N42n3j119L89l21
3624e86J661m40l2p40J74O84k80k48n01L98R0m53L34J66K1K26j92l66m35R29l46
3645F4q20J031K73q77O79J79P8n57K12L38j128J022j072J72Q75j50p75P84l70
3664d2M93m92J46p18J268l53m09L00l35k0R1J38O7j710J324Q68o62J41K83l12
3684F6k32K16J75j46j28m94M19N14j007L09O47l72k17J52N92k45o38R55q69l66
3704f69J495n84KL85j98l99k10j30K09j07Q57k74o60j86R69j005L37r3O38j56
$$ plain form
3565 -903 -443 -249 -108 736 537 40 672 -34 220 343 -602 225 -547 -333 47 442 -493 726 -925
3584 -925 -372 -239 424 -26 -208 1039 193 -65 -499 443 983 649 -447 -1032 741 -52 556 -134 -86
3603 -86 -133 -298 151 609 639 -550 -24 -69 690 122 435 -172 603 -483 -321 -24 518 465 -654 -265 -586
3624 -586 1075 635 603 -137 37 721 441 193 -308 90 180 -273 61 227 248 474 282 -84 -519 410 64
3645 64 -756 275 548 -329 350 529 607 50 262 600 -528 494 -578 -406 469 319 -456 328 -42
3664 -42 451 -41 105 -613 655 302 -107 193 -142 -162 -71 67 134 -1576 -252 616 -46 95 378 66
3684 66 -166 50 225 79 -49 -543 -124 390 -617 -308 339 -33 -250 -98 494 249 -389 566 -303 -669
3704 -669 826 242 244 629 431 32 -178 -308 -99 -206 651 377 -283 -469 500 -505 -168 -261 377 221
3724B21n76P0J054j162N64o0j36kk73Q74j157K33Q09k06j437J344l15n67O57L65
3744C00k39M92k43m34k82O75n5k03Q18j090Q31n39j74R95o13k07m3O00M6j090
3764d55m55K81N66K62q18J264j001K30N22j50n4r1o61L79L69k46o1K84M19q01
3784b17O63q43L03j25K53n6Kj09O4k33N63j6m62N36j62N59k65p20k22L1P73n44
3806b27O08J044j035o03M46r1l20J097j353L78o97R91p76K11K61qm62O46k89Q7
3826i2M84m09j06J47Q20o24kM6L38j376K2R13Pj23j44j10m1L32m02j0J26J11K6
3849f7k42M21q07P56K97k42o40N89N36n09J06k34L03j72j176J087k66J115j134
3868b79J57K57K38p62J6K09p4P98p80J61l74r2K21N78M7K40p91K31J94r67J133
$$ plain form
3724 221 -355 -285 769 -393 171 111 -25 -27 -300 574 -583 -350 459 253 -1184 160 -155 -722 -65 300
3744 300 61 553 310 -124 -406 269 214 11 829 -261 570 31 -143 852 239 32 -11 589 635 -455
3764 -455 -910 -629 -63 199 -619 645 -356 -126 396 246 192 101 -560 -181 188 -58 -119 165 584 -217
3784 -217 446 -397 -94 -219 34 -22 -20 -129 -65 -298 265 249 -213 323 161 720 455 -265 -487 -456 317 -227
3806 -227 381 1425 390 -213 233 142 -178 919 -434 -56 -753 238 -538 -327 -66 -74 -536 110 -179 -92
3826 -92 392 -17 -123 24 844 220 218 264 602 -774 -752 161 168 45 -99 -209 -250 82 -320 -330 -204 -93 -67
3849 -67 -309 112 -695 61 358 116 -524 65 601 92 198 -36 267 95 -1081 6 -260 855 -279
3868 -279 -122 135 373 -389 -373 -164 -238 560 -220 -59 -433 -525 -304 274 321 561 -230 1 195 -772 361
3889C61o52L50K26k83J07K80m67l34J011j015j46Q79O54l97k86l64K90L83p20
3908a23P02k65L65j278M92J28J123j551K46l44K77J155j447K53j01L05L49l30
3926d4l29K8Q90k25j18o44j7R42q96P3N94J6l19O9j118J197j19j0q93N69L06j84
3948b32N1L67M39k32q26m52O96M90n40k66K80N84j63Q5N02q46%O63n1mq62K10
3970a07K43K73L37p23r1K95o79M30j20M84o11L54P24j209M77L0j73K82p65P65
3990B16L20N77o21r04R71r54R05r69J54J20L48l9q9M6P16o03p24L8L80P86q33
4011a59K42O71q05K58N57r50L60j088P46m49l47O60P11m16j78N62j029n5J041
4030C32n12Q43k93k22n9N04o30K35k53j73L02p3J63r52J234r98K26K18k53L20
$$ plain form
3889 361 -291 59 285 2 109 389 -78 -412 599 -416 -562 317 971 574 288 -76 214 597 -123
3908 -123 579 314 679 -599 -107 21 1144 -407 -161 -505 -228 927 -520 -267 -368 -63 286 -44
3926 -44 -373 -345 545 320 202 -442 -459 483 -413 -340 254 270 -49 20 -1098 99 -20 -30 -923 -354 -48 -232
3948 -232 -181 186 625 393 -433 -885 -189 301 -239 -505 -225 359 196 281 783 -63 -63 600 549 545 -317 -107
3970 -107 136 409 746 23 -68 227 -452 -22 -142 342 -269 85 809 -400 77 107 -66 216 -549 216
3990 216 536 1113 492 -412 559 -395 510 -459 -305 -185 163 124 35 81 797 194 -530 -492 -112 674 -159
4011 -159 83 754 -51 207 764 -186 174 -914 -168 -617 -964 -304 407 -9 -187 375 -654 -709 332
4030 332 -180 663 370 148 89 593 -37 198 -55 -228 74 1 164 -788 446 -552 -326 -108 -361 -41
4050d1o81J411q39K2j14M52l59J60l15O31k64j02R13p32o95L9J111n11m13K75
4070e2m73J004k27J35n97m76P29o89J88O97J69k13m73j67J182n90p93M02O12j21
4090B47J89j039J58J068l85j44o41O21K82m63K14p39J806j442L79l30p80O39J34
4109b26Q33r7n65j58j1J32L35m17l51J003r08J057j149q9P13l0j82q49J118k38
4129g9K56m99m85P39q6N95o85Q6l44J125o34o1j76M58L26p53m7j55J385r03l04
4150b41L38k44P75j39q37O01k59J312j699L83j6j83O65l57r98O84M10m70O02j91
4170A36k93K52j45l45J139j10r45L29J29l63j22J034o73P91n85o36P85K32k21
4189C89M8j015J149o67n53N37k76J161l54o82L51L25j200J199r22O52m72R42l82
$$ plain form
4050 -41 -722 689 -150 -128 -242 210 -149 11 -304 327 63 -39 874 142 -553 -514 597 86 -327 -52
4070 -52 -525 479 252 387 -210 -686 43 -646 -458 239 408 195 -278 -445 737 147 -646 -244 368 247
4090 247 436 -603 -445 623 238 94 -547 74 356 -107 107 -632 1174 -268 111 -219 -999 -360 -226
4109 -226 607 510 -55 -213 -224 -92 243 -174 -525 478 -430 627 -522 -611 102 72 -110 -959 159 -79
4129 -79 177 -322 -807 -68 -154 441 -244 -158 -502 623 -11 -72 -248 210 536 -217 -264 -419 966 63 -241
4150 -241 97 -147 628 489 -348 253 -6 1306 -393 -10 -26 -209 456 99 -899 -215 195 -275 327 136
4170 136 -157 95 -50 -395 744 634 -311 18 147 -216 -338 696 23 814 229 -407 378 610 389
4189 389 437 -578 571 -96 -649 -112 -388 773 419 -263 88 413 -787 412 -510 142 -330 612 230
4208B30n82L29m67J43N87k45J1L29l32j35J057O6j569P14N90k62P8n82N87r53
4228d06N24o24J35J91o8P37j030J063n12J28l63K21j04R85k84q05n9r6N92j57
4248F8M23l21L54j19kR7q29O01J33m57J054j639K05J38O32k00O84j49q43P56o23
4269c7n44K33J092j351L88l16L82r0N50q37L75j24N60o24P9J71j53L73o24k7K45
4290b79R29q65l15N97L4M40p90o6J65L89l67J01J29r24R11q0p0n3L72n5n78J29
4312b46m4P38K78j265O78Rn15P78n78R8M10k39n24R37m63k06J41L34L06j200O76
4333A03J90j72M62K3j368J068j99J33N10q13l37L70l10L63K27l37n3J05O87o33
4353A9n90M88K95Q5p31N01q04O95K72o50l23L32J26L12l73M71m14m6L87j4o83
$$ plain form
4208 230 -352 -23 -490 -347 240 -5 6 335 3 -132 925 991 -578 136 726 464 542 -40 547 -406
4228 -406 118 -506 -371 -180 -248 489 -541 522 10 138 -225 -4 -108 877 593 -212 -271 -367 225 68
4248 68 491 170 524 405 403 500 -329 272 405 -52 1002 -637 -432 -294 338 138 822 673 -170 586 -37
4269 -37 -581 -348 744 -607 -219 -535 -153 -243 307 -530 -155 -279 281 -343 -264 -93 -246 127 -497 -524 -279
4290 -279 650 -215 -530 67 101 541 -249 -315 -150 239 -128 -27 102 -822 89 9 -61 -114 258 203 -375 -246
4312 -246 -290 448 726 -539 139 148 -367 411 -167 -69 341 102 -422 515 52 -154 -13 321 627 -573 103
4333 103 293 121 583 606 -762 306 107 240 750 -63 -400 -30 -340 23 250 -87 -140 -35 652 19
4353 19 -571 -83 212 297 -434 67 -737 -42 230 -420 -743 -411 -285 27 -346 125 -289 -335 52 38 -645
4374f45O93m16O31k14j01J85Q4K0q75O10M54n86l80J077j70p16l99J104j73o34
4394d51R10o04l5k96P44j310K51Q99k27nK74m77M55L04J93l99r40J351j550J189
4414B76o2J28n30l95O65l2K08j20q5o89J47O04l11m53P50j23o3K80J191j175l31
4435a20Q6K42j44k92j84P48J40q80J68p65J310m5r17J101r99N41O16j047K73O79
4455E11p44k53M05m76K2L77q24J264o11O06k31N56n05L06jn71m59j6J18P48p23
4476e01R55l10p4j80M05J94l27r5o37L22L29mq40N97K68N78q99J13o98r3R83k38
4498a52m81J335l95k44j91r2o9P97j29q56Q53K49j60j52O8j109Q29n44RJ693r27
4519C32l75J75o27Q75L56p48J59r02P74M79r72M28k28O27n43L55k12j80K87K35
$$ plain form
4374 -645 48 -368 263 49 -52 133 217 237 -638 -28 426 -160 -540 537 367 -349 -748 356 183 -451
4394 -451 459 -145 -180 -476 268 -1042 -791 108 -119 -124 150 -327 128 432 625 226 -714 637 -913 276
4414 276 214 342 -188 -583 82 50 258 138 53 -636 -489 115 -196 -649 101 -22 -85 195 1386 211 -120
4435 -120 -34 208 64 -228 -412 336 476 -404 -236 -1001 309 264 -653 448 -551 -10 606 -441 -168 511
4455 511 -233 -486 -81 -557 -535 -158 -982 282 -329 277 46 602 97 403 402 -169 -628 -644 -526 222 -501
4476 -501 454 144 70 -110 295 489 162 67 -570 -248 81 77 -763 -166 102 680 -219 -106 -804 -897 86 -152
4498 -152 -633 702 307 63 -128 -220 -289 508 379 -477 376 625 465 313 381 -728 101 -443 -434 1259 332
4519 332 -43 132 -495 380 736 -12 147 -755 19 498 -474 -46 -274 353 -190 165 -47 -227 60 295
4539B95l41q7lm07L91K82r99Q88NL31m59j29N10j051L05J095k87r21P05K78q21
4560d20J39J274p05J68k42l1Q0l07K91r22P47L64m16m1J38R8m05M29J93q10N41
4581A63m10R7k36P93m7K91r56M51p3j18n15L19L71j74L2l69R44j0j255J082r38
4602e58R98n91P66m33j68O49j76o03k39J080r86J055J64p51k93L62J75m93O73
4621F31k53j87m11L89j93o4N5m3P6K47K76r99K4M42J94p19P49M05n99M88k49l80
4643a21p4J11j32R4L66K08o37P18l00l85K4j75j2P18r01N14j00L20o60N95j94
4664b3K7M90J70j908M46J276K59l57q49L28l44j94R38o18K9N32L61j218JO17O87
4685F50l89n87O83k42J58k07j025R41N1N08m03m6O38j084m4M24j15n36J103M8
$$ plain form
4539 295 -46 -133 -136 -543 -152 130 -869 19 24 355 -104 -233 277 -774 -469 626 339 -582 123 401 -420
4560 -420 -281 993 288 456 214 183 263 -44 247 -675 72 436 20 -21 117 215 -190 239 432 -378 163
4581 163 -247 -150 -386 407 360 651 -305 146 73 -45 -560 -241 130 -44 -12 -381 563 553 -702 380 -558
4602 -558 440 -151 615 182 14 663 487 -116 -355 725 -261 794 958 207 -86 276 451 -42 631
4621 631 378 191 -220 169 -24 -88 -33 -76 0 247 523 -476 -452 -10 184 -535 214 619 20 508 259 -121
4643 -121 -195 -84 -216 -122 244 452 -185 533 233 -152 -128 -303 -315 403 -498 16 -84 236 -424 171 -23
4664 -23 4 494 664 -1244 -798 478 737 380 -469 -141 -485 -679 259 -359 -330 202 563 -655 -654 -37 650
4685 650 261 -326 357 115 273 66 -959 -18 33 541 138 92 730 -354 -398 26 -89 -625 478 526
4705E26n55K01%M4J07q23L12M58n11J075p40m92J88J75k52j87K75k33M09K90l5
4726B32k18K56j23O9o2n96M61m8k59l0l43J389q59K23k93l33K07o2P26k33q43
4747g39P00l0K11P03j502O08L55L3m61N99mo45L18L79o34R7m34J267m08o85P42
4768D70k90N35k90r70k28J099r38L63K29j93J87j63O67n48J59m07L55M99m17n56
4788d37K96P2m02M17M12m98k08N23j55p9L49j262J233l85J102r87j28R33q68K79
4808B07J86k87L1m19N17m88j72K33k4Q3k44p1N85N45j099j13M16N4L46j40k26
4829h0l99M3J069r48O17l82J84k69Q6k07j76J073n51j0l29l16Q00m7l82m00J459
4850H35m11l70n43P16n72J436o29r33N84j55K0M20p75N0P79j6k10k96p12R20k22
$$ plain form
4705 526 -29 172 172 216 323 -500 -188 270 -241 834 94 -398 -210 -35 -287 -474 -199 -432 -23 267 232
4726 232 14 270 147 216 154 -442 19 -29 -288 -318 -661 728 -131 92 -201 -534 -327 -389 337 104 -739
4747 -739 -39 -69 142 845 -657 -49 306 339 -122 477 473 -172 146 525 -109 -12 -446 821 413 -272 470
4768 470 180 715 425 -545 -773 326 -612 -249 -20 -213 -26 -189 478 -70 89 -318 37 536 119 -437
4788 -437 -141 -69 -471 -54 358 -140 -348 175 20 -59 290 -972 261 -124 978 -9 -137 796 -72 207
4808 207 393 106 137 -282 235 -253 -425 -192 -216 -133 -377 -448 137 682 -417 -530 -114 -60 286 146 -80
4829 -80 -479 -436 633 -315 302 -80 104 -165 -79 -286 -462 611 60 50 -279 -595 205 158 -224 -624 835
4850 835 424 54 -489 227 -345 1091 462 -471 113 -42 -22 398 -377 -327 452 436 226 -70 -782 138 -84
4871h4KM01k91j52k28K44p50J290j06n31j56nL51J159n02p79j39O85j26n90M47
4892A40J08o5l49o79M78J79R45r02m16N81k68N77K64j252P14M66L40q30n4M52
4912D29o79j62J042j303R10m04M06J04q2K41m26l92K47J90k86R94q59P9j210Q36
4932c25L58q5K9M37p15J02M48j26n22N21p0M60j114k07N67R58n20J92o07O74j107
4953f52P69j7k64j30l80N11j72J160l42n05o61O36J70K30k85o16P46p21M33L93
4973C03r69M3R55n14K6m13Q88q72J41O52L25r07M54L93j017J314j208N58q6j4
4993E2l52J161j357Q69p6L3K9j07k98J96J60p67L52m43M54N63m02N73r46j1L9
5014b78O62J6j093O2Q60j44m97Q1P22L18p88N61jJ26j071J63N54o32L41J28j34
$$ plain form
4871 -84 -82 319 28 -124 -352 -108 -858 432 326 -205 -361 -366 -15 1144 642 -137 -276 409 283 -307 140
4892 140 248 183 -166 -845 -367 -188 757 -145 -561 20 -248 329 593 -659 55 521 861 31 -23 429
4912 429 -250 -412 630 -673 237 -167 239 343 261 502 76 -316 -69 121 -165 829 -30 49 -1161 -325
4932 -325 33 -52 -23 414 -301 -199 249 123 -399 122 52 512 -602 -809 -242 716 196 388 -219 455 -652
4953 -652 117 100 -164 -294 -674 -163 -335 825 483 -22 -683 -47 123 353 68 -548 198 -523 -90 303
4973 303 -666 -623 332 -182 -156 -569 319 -553 -412 240 565 -342 112 505 -512 802 -406 152 66 52
4993 52 -300 861 -496 373 297 330 359 252 -46 150 310 -457 -105 -548 -94 469 67 640 -306 -317 -278
5014 -278 384 400 -693 -631 229 85 -412 -331 391 709 -79 482 481 607 -464 -301 253 -379 -38 90 -44
5035d4L30m8q27J061k7k49o97J83J63M42l30l5k0m32R05j217K25L76K06k74L14
5056Em02N39m88M01J92p90R97j25k66M57j42n14P50o30j85j4L64K25o73j29k4
5077d52K6J83m21K24j2K23J16k78O99l67r7J88L7j97k7L62m17O19k56j18l8k62
5099b65m76j76J238L7o52Q89q39l77J353q93q5J97K41N45j013m35P26k23O01p05
5119c12N83K51q44Q30p31K61j64M82p9o87k68J037K64p74O98l2r63N80l35n76
5139g79J410p91P4r58J022J5O28m09j80N2M8M76o43k80k05J99l43L23j98N89K4
5160G4m76L29mN92m20J99O75j688Q60j12L79k83j91M5l9L56j003O37N97j4m89
5181B4o30N39M24L43k26l06m80N50n87M3L32n14K77O00j009L81M26K64n50J15
$$ plain form
5035 -44 286 238 -589 472 445 196 -501 -318 -155 287 -43 -78 -98 -530 375 -842 -617 -241 -35 -309 5
5056 5 -397 142 -346 55 247 -543 454 329 63 520 378 -136 614 -16 -201 -215 149 374 -299 -428 -452
5077 -452 -426 -243 -664 -440 -452 -229 -113 -391 308 -59 -156 32 69 -128 -155 207 -210 409 153 35 -3 -265
5099 -265 -741 -917 321 358 -294 595 -244 -621 732 -161 -246 -49 192 737 -276 -711 15 -208 393 -312
5119 -312 271 522 -322 508 -223 38 -126 356 277 -410 -678 359 623 -151 547 515 -448 132 -203 -779
5139 -779 631 -160 -86 -1044 -22 -7 621 212 32 84 132 608 -35 -315 -520 -321 -664 -341 -539 50 74
5160 74 -402 -73 -77 515 95 294 969 -719 141 29 408 125 -66 -21 -60 296 -707 -70 527 513 24
5181 24 -606 -67 357 700 474 168 -312 238 -349 -306 26 -488 -211 389 -620 -239 187 451 -99 16
5201A6o06oN6L90o33N31k35N82l5q23L66N49L73j040P37K00m97r14J043J84j19
5222A19K67l33M25p94N03L27o34j00O96n94Q1K88K29p51J282j431R10k84n37K79
5242e2k10J11l82O51J2N0l51O00p63N38j09n25L71O28r21M62L37j87l27n28K43
5263c52O68N46r68N80r22R44j448R78j79K66k10n2J218j128n78O62P8K53n64K22
5283A4q43R76M13p35P24m99k29n08M60J53m73m99J879o42r8M54m61j30l20q2l45
5304g91J90N40P23r71J45Q12r6k74j02j76J15r19M73J07N08R8K67q93N24L24k30
5325C74K28j99J12l73p89J395q28Q33r71L91K68m44J11m65R85l80k10l56P06o35
5345b47k61M80J06o11M20K31k90m3J10O92j26q43L21j82J014m05j166R70n02J32
$$ plain form
5201 16 -590 -596 -540 -150 -783 -252 -487 95 60 -763 -397 152 525 -515 222 422 -75 -989 54 238 119
5222 119 386 53 478 -316 187 514 -120 -220 476 -118 -37 251 480 -271 1011 -420 490 206 -331 -52
5242 -52 -262 -151 -533 118 130 180 -171 429 -334 204 95 -430 -59 569 -352 110 447 260 -67 -595 -352
5263 -352 316 862 -106 474 -448 496 -952 26 -153 113 -97 -149 1069 -59 -637 25 103 356 -208 14
5283 14 -829 147 560 -175 549 50 -179 -687 -227 -74 -547 -1046 833 191 93 547 86 -44 -364 -446 -791
5304 -791 -601 -61 662 -309 -164 648 552 278 176 0 115 -804 -331 -224 284 382 649 -244 280 604 374
5325 374 602 403 515 142 -647 748 -80 753 -218 173 441 -3 108 -357 628 248 38 -318 388 -247
5345 -247 -508 -28 78 -533 -113 118 -172 -215 -105 587 461 -382 -61 -243 771 366 -800 170 -332 -200
5365b00j92P91k59J23p46l89P97n76O45M57n09L63o30l01J049J9j202J283r01
5384c78q9L87P61n68k00O14q40L11N87j81J77m49n34P87m29K87K61r80P34N7o3
5405B52O3l74L4l59m24J122%n9n84l32J626j117J183p8j107l06L49K27m94J162
5425G84j215O06o71K37j50k12K32P32j88p63J303j507N55L78J01p9J49q3l18m58
5445e67M34L79n80K94m11J143m1l06n46K56j33P11q69M73o72N48j37n22P77J39
5465C70J18N39r03p97R41K2q22L49O88j024K88N58m32R2j89K96N21m57n2n94M95
5486GL33n05L94j72J23k70o67J194k76J8l04K72J002r58l37J32J51n17O87O79
5506I86n88kn51k12P0j89N36j21J10o36R2N16K62M27r69m1O03m16r1n0m6Q21m28
$$ plain form
5365 -200 -392 399 140 263 -483 -872 -75 -651 -6 451 -58 305 -325 -626 423 442 -760 523 -378
5384 -378 -467 -80 681 113 -87 527 -313 -2 585 404 581 132 -402 385 -44 243 504 -476 258 315 252
5405 252 315 -59 -25 -384 -808 314 314 255 -329 -661 965 -152 1031 953 -154 -460 -111 116 -378 784
5425 784 -431 175 -496 -259 -409 -621 -389 343 155 -608 695 -812 -257 121 222 143 292 209 -109 -567
5445 -567 -133 246 -334 -40 -451 692 651 345 -201 55 -78 633 -236 237 -435 113 -24 -546 231 370
5465 370 488 1027 124 -673 268 290 -532 -183 505 -519 -231 327 -105 -13 -202 94 615 158 106 -488 7
5486 7 340 -165 229 57 180 -90 -757 437 161 179 -125 147 1149 191 -146 -14 137 -380 307 986
5506 986 398 396 -155 -367 -297 -486 50 -71 39 -597 -505 11 273 700 -269 -310 293 -123 -214 -264 -310 511 83
5529H3J92q02L26L66L73r67J49J81O37j5p19L63l52L14j52O71r14M07j88p87R05
5550G1k92N6l79Q68M44j106j12M16l71K21N01p16J95M11o87O7J53j45K71L3m7
5571a48P4LJ19j34K75R82j250K61k48N67q44L65L18J61j86k59l5L60m10n38R13
5592C46J62p92J08M88M20n31k66M34l77O7m71P69n65m12N61q4L92L65p46N74l50
5613I2n47P52l47K05K54o43N33n05J17L65l13N86r73K60k40R4m17J242n03m9M53
5634D16m61J63l0k93L75jj10o79N32L84J4l98k95L7N91o41K36K33j19L45j85K14
5656C28j4q34J273m64l90L62j222O25J60N73j71k69k76P07j015O23m5M11j46m86
5676b70J72l33P36l00L0m47L23O9k72j014J187M80J46n96N0k20M7L97j009O00
$$ plain form
5529 83 275 -527 -201 165 538 -429 -280 -99 538 523 -196 167 -185 129 -23 648 -266 141 -47 -834 71
5550 71 -221 -165 -544 324 768 -338 -450 -34 -405 -184 317 -399 -204 207 -480 -413 -260 -405 -134 -101 -148
5571 -148 -74 -71 48 -86 189 1171 -79 182 -66 501 -343 22 340 501 315 56 21 381 -29 -567 346
5592 346 508 -284 -176 312 732 201 -65 369 -8 59 -412 357 -208 -620 -59 -143 249 614 -132 442 92
5613 92 -455 297 -50 155 409 -234 299 -206 -89 276 -37 549 -424 -164 -404 -310 -727 515 12 -37 416
5634 416 -45 118 88 -205 170 169 59 -620 -88 296 310 -88 -383 -346 245 -396 -160 73 -46 299 114 328
5656 328 314 -520 753 289 -101 261 -961 -336 -176 397 226 -43 -319 388 -627 -4 -49 362 216 -270
5676 -270 -98 -431 305 5 35 -412 -89 -20 -292 -1306 -119 361 507 -89 -39 -259 -212 185 -824 -224
5696b24R39J82j282m04P28l70M1L46j28K65k46n81P88m69p7M94M9j68k47R15p53
5717b02K89n11J065p37L14P6j56NK98m63J95p43K76Q0k07K66J34J68K7n33L00
5738e9J91k37N67l66l23O85l76m13K52J28p0L1m08l0R99J13J5m79r8L40m32m69
5760d39k96J089k88J92l6L53l0k83P44r86k89M99n87J16J04n77J117j4p90K77
5780a24M95n63J18N38O1o34P94m51j42O89o53n5O61q03M32J77n41m13J09K88O30
5801F13j164P23M78o81q3J60O57r49Q29n4l50l74L58o56P67o46Q87m76J70J29
5821C38m09L45q89m2P88n43J9R10m79K91L5k82m56N03j00K28n78j08N59q3o39
5842e92L81l16M93m32P21Q0j56J15n63M25p12K83N91J56j424J264k24n09O74q05
$$ plain form
5696 -224 715 897 -385 -789 -61 -431 -390 -44 -172 93 -153 -734 54 -415 -492 2 51 -117 -364 551 -202
5717 -202 87 -424 641 -96 218 294 138 143 441 -22 173 -570 -294 -214 -421 -155 -21 147 174 -359 -59
5738 -59 132 -105 462 96 -227 458 82 -331 -79 49 -21 10 -398 -428 571 684 699 220 122 462 30 -439
5760 -439 -735 354 66 258 222 575 545 262 1006 20 -269 230 -357 -241 -137 -714 403 389 -401 -124
5780 -124 371 -192 -74 464 525 -109 685 234 92 781 128 73 734 -69 363 540 -1 -414 -305 -17 613
5801 613 -551 172 650 -31 -114 46 703 -246 583 529 179 -195 163 -493 274 -372 515 39 209 338
5821 338 -71 274 -615 -657 131 -412 -393 517 38 329 364 82 -374 129 29 257 -321 -429 130 47 -592
5842 -592 -211 -527 -34 -466 255 335 179 294 -269 156 -556 -273 318 474 -950 314 90 -419 255 -550
5862e50J085k20k01o6M4J86o37N58O99q21j34M1N86j90l82l28j86J289r18J67
5882B2M73n84j96M1N97p49P73n82J87N42n96ol0L07K56p64j45M53l7J13O23j173
5904d75O75q12M86o62N37K55l5L07r02R6J206j228P17n43N62k53k5L41j363J229
5924A13Q0l2k88M19J73o90M75k42j13L77L95p74k50L20k96M72n64M69M09r20N38
5945G1k21Q19p62q1l86J182n29k66j4K98j42nr1K41l32N29K0l72J03j27k1o32
5967g18O71j05l6J24k50O8j73N05J29q26R39J65j047m7M53M8m6l89P73n58P06
5988C86q61N06o5l37J05P95k78l50O60j037P17l13N8K06o8m7m64J77J9L77jM92
6010F77q31N05n19L37O2l90l57j13K75j6N66k06j22l7J015k29r91J067j338O08
$$ plain form
5862 -550 535 315 114 48 92 278 -359 199 898 77 -57 -16 570 380 -2 -330 -516 773 -145 22
5882 22 495 -89 -285 -244 353 -396 377 -205 -18 524 -72 -78 -108 199 455 -309 -454 -1 -38 75 698 -475
5904 -475 200 -612 -126 -788 -251 4 -31 276 -626 -530 676 -552 165 -378 184 -69 -94 247 -1116 113
5924 113 193 161 -127 292 465 -225 250 8 -105 272 667 -107 -357 -37 -333 139 -425 44 453 -467 71
5945 71 -150 669 -93 -174 -560 622 93 -173 -187 111 -31 -36 -127 114 -218 311 331 -41 62 -65 -86 -718
5967 -718 -47 -152 -188 -64 -314 -246 -419 86 215 -611 328 493 -554 -601 -148 -100 -146 -535 238 -320 386
5988 386 -475 31 -34 -371 -266 529 251 -99 561 -476 241 -72 -14 192 124 77 -387 -210 -191 186 185 677
6010 677 -154 351 -168 169 231 -159 -516 -629 -354 -370 196 -10 -132 -169 846 617 -374 693 -645 -37
6030c7K1Q1n03N71j58j58M36k26L78Q4o02M33o10Q23o65m7j17Q29o54j69J00k85
6052d75L01N97j01n33M48J74n11N18l07k33mR41p51k55K46J64m85R52r32M23k92
6073a15k5m4L92J86k88Q5j72J56q0P8J80k40o1M04m80MM28k21k51M58l06M78q76
6096c10N81l03M23j050N97j52N25K59m28K1p62K24P94j155P17J28k05j67Q82j41
6116D78n41N72j094Q58p26Q51m14J16n8L55r48M81P30q95K17K03l95O43k18l62
6136a47k59R5m75O50pM9L33n3n89j8P71j472O68J046m94m72R1L9p6oR44l61k84
6159b7n40R12q99l11O18j75n9L83N68r95L4N08M2j75q05O71L42n27J67k30n2n10
6181a060O08K43Q27m64p47M66l67k04L61R54q46L53P0L66p32n49J138j313P6J224
$$ plain form
6030 -37 -16 65 -438 133 -25 -183 253 27 405 489 -113 320 -290 533 -132 -179 -296 533 -121 -290 -190 -475
6052 -475 -174 423 322 -211 237 411 -100 418 111 -122 -126 815 64 -191 55 219 -266 686 -246 177 -115
6073 -115 -140 -184 208 394 106 191 19 175 95 173 353 113 52 456 -24 -20 408 187 -64 394 88 566 -310
6096 -310 271 -32 391 -659 -62 -214 311 570 142 163 -599 -375 419 -736 -19 109 -96 -263 619 478
6116 478 -63 509 -585 273 -453 398 -16 100 42 397 -551 -70 660 -235 -18 185 -210 433 215 -147
6136 -147 -406 -311 -786 -136 -143 -94 239 186 -403 -421 350 -1122 -454 592 98 -374 -283 -244 -320 -326 618 257 -27
6159 -27 -567 345 -554 -865 -247 -422 -481 -98 470 -525 -491 17 59 -116 -921 -250 92 -435 -268 -498 -550 -1060
6181 -1060 -452 -209 618 154 -593 -127 -494 -698 -337 617 -229 124 194 560 -172 -721 417 -896 -820 404
6201D04o32M39l1o1N5m85K61k10K85k06N66p87M36Q0j84N24q9l52J50n86R01n74
6223i6P42o09J7m44k1O81l66L85l48L35n20K35M61k17K40m69K8K29R9j4l16P48
6245G80p98l88N77N68j100L94M23o83J09O26k09l62m70J439p83l86L13P10p69
6264iK9n36J5R53l18p77J72N61m84J483j431P28J8l78J45p08N20L55j063K07Q19
6285C01m20K42O78q23qL11n87J266j438O00j060K10L40L8j80L74k2K39J021j088
6305fK7O01n69k27L35r41J246n07l36M08N65q91R26j66j48l22N9L12L01p46o4
6326a43o42N60j64K97m69N65l35L79k62J44Q0n76Q00p14R67l57K33q27K07O52
6346C95p51J60M75r06l2N88l6J37R1L93n48L49k03m16l3J14J74m83M97J05K38
$$ plain form
6201 404 -228 211 180 119 174 -311 -50 -260 25 -181 385 -402 34 114 -70 454 365 13 163 -423 478 -96
6223 -96 646 37 54 -390 -411 270 -96 289 -59 276 -244 -9 452 235 475 6 34 263 362 348 32 780
6245 780 -18 -406 171 739 -361 33 456 -227 -118 508 299 -63 -533 906 123 -263 50 760 -9
6264 -9 20 -516 -501 452 134 -643 -471 90 -394 1089 -342 386 404 26 171 -537 -17 338 -725 -518 301
6285 301 -119 123 801 -22 -30 281 -306 960 -478 122 -938 -728 -388 -350 -530 -156 -178 61 1082 -6
6305 -6 21 622 53 -174 161 -780 466 -41 -377 31 596 -295 631 465 317 -5 54 366 667 -79 -143
6326 -143 -785 -225 -389 -92 -561 4 -331 48 -214 -70 10 -566 234 -480 487 130 363 -464 -257 395
6346 395 -356 -196 279 -627 -659 -71 -107 30 121 514 -34 315 112 -304 -337 -223 -49 -532 -35 70 308
6367C08n36L54k63K98q61L72K52P52j190L79K37m01N73m55P85j031R42l61J40
6386B94o39j39Q44q78N29l69R75k53L75n33J69m69j7R47q09J44n28L42o60R85
6406C10k82m51O15L45l65k52p5J0k03k06J021j012O83o9K59j07l09J082r53l4
6426Gk17j95Q7M67j05r8m25P01l10l82O35l03k3l18N92o68J61m24J434j18q63
6447c65P15p59M49n26N77N6n34M62n19Q40n09L34L72k22m35K2l43K57K36N1L68
6468E27l71Q0j65K10k07K35o1o8K12J93l98q71M30J49j82l28M8R33k98k04R2O7
6490B3J143j162K10k6r04Q39L93r21N09J64n37l00N45j64J31j62R6r41J194k12
6510h2K08l54O66o07M85o92M08m93N32M52q27L98p11J113l87j51k60M06J9j51
$$ plain form
6367 308 -228 126 -137 161 -700 -328 -76 676 -514 -135 102 -299 274 -181 604 -427 515 154 294
6386 294 -345 -484 360 -518 11 -358 617 364 739 206 375 -94 -111 836 27 171 -357 -15 -675 310
6406 310 28 -423 192 537 172 -80 -155 -145 -348 -554 467 -545 138 69 328 221 -88 994 41 7
6426 7 -210 -405 -318 149 44 -54 -479 222 -88 -470 165 -138 -161 -479 113 -555 -394 -818 616 498 -365
6447 -365 350 -409 40 -486 91 147 -387 75 -444 396 -113 221 593 371 -64 -42 -385 -128 108 159 527
6468 527 156 236 71 281 74 309 248 180 392 585 187 -684 -254 -105 -287 -615 -567 366 68 -136 -44 23
6490 23 1166 4 214 188 -716 123 516 -405 104 268 -269 -569 -24 -188 -57 -219 -123 -1064 130 -82
6510 -82 126 -228 438 -169 316 -376 32 -461 71 523 -304 94 -617 496 109 -42 -302 104 123 -28
6530b8k38l22M30j1mj16P04n59m00K88J20k34M97p11K16J065n57j75N04k58J62
6551C73j62r13P97p33N51l34P25K49q29M00M31r0m75m45j10N55q13R90l30N52
6571C89l38k24j71N54q45N36L26r91Q16j97MQ7j45j39L0L16j01N48r98%K40J47
6593a56NL48N20r38M07J53N7k46P04l41k30J52q47J054r48K68K12p91M42l00P05
6614B30L66q76K3p74J024M57j95j101J096p55M53M9P57Q4j267L71J03M29o43n9
6634b28O76o68J157j138k56O20k85J87M20j019m18R02K8J20r5K05q62N85m07J098
6654F22n46k49M21j95m57j51Q40k90M16J07p70Q85n43q34Q23m10Q62o39O28Jj04
6675D17m88m98O39m55L30J63m56l9Q7M41N0P43j077Q29l04o39J57pj39K98j36
$$ plain form
6530 -28 -266 -588 -158 -169 -173 -289 415 -144 -544 -256 -136 -370 127 -584 -368 697 140 -35 469 211 373
6551 373 211 -702 95 -638 -87 -421 304 553 -276 124 555 465 -10 -455 -565 -10 -823 167 -163 389
6571 389 51 -173 -344 210 -635 -99 227 -764 52 -145 -141 -54 -199 -338 -308 8 -93 455 -543 -543 -303 -156
6593 -156 -151 197 717 -221 186 339 396 150 854 513 283 435 -412 642 -306 -38 174 -617 -175 -475 230
6614 230 596 -280 -257 -1031 -7 450 255 -846 250 -505 -52 -3 754 838 -429 -58 45 474 -169 -228
6634 -228 448 -220 937 -201 -457 163 -122 65 485 -534 -952 -50 -22 98 3 208 -654 -69 -476 622
6654 622 76 -173 248 53 -404 -555 285 -5 411 518 -252 633 90 -744 79 -331 531 -108 520 521 417
6675 417 -71 -569 70 -385 -55 108 -348 -387 -300 141 191 934 -143 686 382 -257 -100 -107 -246 52 -84
6696h4l93J050r26M53L02p87L8P16j98o39Q95p70M77m59M98k43qo87M19m29J116
6717C41k18N96n91J26l59O29J26k82o98M75k23r82N44R48m56l12O95j126M34N81
6737B48o55K81J004j139K81j47J63q6k55N01K12k03L19n44M88l38k06j42n42R22
6757A62j45Q80r94J040q95j0P00q92J16K37R4n41J7km21J144l14l00J83J74j27
6778A06l23k1R4n92P05p5M06m87R7j52J33L87q34L77p1L22J96m00rJ82j4k91Q75
6801F11r36K59j63j79L73O1j71n7K18k18p3N51l9q35R53l77n2j53L43P2n07k30
6823e49O65L83p0n82j85r4M75P5L34j41j34k39J61K52q60R65l03m95J268q44m41
6844c59j57L12N26j72l35M30q57J125l28o3j143J253P4o80J67r56J005K95K94
$$ plain form
6696 -84 -477 573 -353 100 402 -385 -347 369 171 -468 427 -343 134 -325 173 -70 -78 -765 -346 -775 341
6717 341 123 719 128 254 -105 524 650 368 -330 145 -78 -1060 -516 432 -24 -336 359 -767 -333 248
6737 248 -407 -126 878 -261 20 -127 36 -50 -305 196 408 205 524 -20 468 130 -76 -218 -760 162
6757 162 17 897 -97 943 48 38 738 -154 -38 199 293 -248 -231 -233 -654 490 176 -124 59 233 106
6778 106 -217 -238 -144 -736 -31 -106 300 -187 -90 -242 -109 278 -556 -179 -250 72 268 -132 -141 41 27 -264 611
6801 611 -325 -66 -229 -408 -35 26 -145 -202 16 -202 -275 276 237 -598 355 -22 -74 -227 116 188 -319 -549
6823 -549 116 499 429 -153 -338 -432 43 118 452 311 177 -62 99 351 -509 456 153 -342 926 82 -359
6844 -359 -516 -204 322 150 -185 245 -612 513 185 122 -1021 232 306 -374 -207 -1163 -158 137 431
6863D31n91L72k96M04J82n87N81j202O91K36m85L44O7J17m54o09J78k88P59R32
6883G82j036K33R5J35l30K17J89p36M69M8k18n05J458o23JK03rn35J20o92Q12
6904G8j36l56L9j45Q84m89K67k38J21l48j11Q16o1M42j077L31k97n0P83o02k95
6925d44R5K63o51P59o15O66r6o39J203j625J534k30l72O6M87O13j051r32O06P27
6945C64J27o95L72j030M48R60p83nk51J41l90P8M34M98p01N80K63r73L52l17Q22
6966B94k44J31k57k89K98K69K77m51l41N09o28J203r04l06K52J2J6lR43m51L4
6987C64r57K5L95k62L30m9j62M57j16K32p01O19q69N98k93O33o16M12K65l65%
7008f0P9j86j13J193p46m17o0J71k70J51j40L51m03K76n47J340m37j90N0l02L76
$$ plain form
6863 431 -160 212 -84 320 502 -85 496 -706 -15 221 -264 80 147 264 -190 -799 -621 -909 -150 782
6883 782 -254 -21 74 209 -121 96 285 -451 18 66 -152 -657 801 178 179 382 373 -162 -42 -734 78
6904 78 -58 -414 -375 -520 364 -125 142 -96 25 -323 -434 382 321 763 -314 17 -280 -330 453 -149 -444
6925 -444 -349 -86 -737 22 -593 73 -23 -662 541 -1084 450 220 -152 -86 401 1014 -37 -969 -363 364
6945 364 491 -204 168 -862 -414 546 -237 -242 -493 -352 -742 -664 -230 268 -433 147 410 -563 -211 -528 294
6966 294 50 181 -76 -365 -67 202 479 28 -313 196 -432 771 -133 -439 -187 -175 -159 -162 781 330 364
6987 364 -593 -568 -173 -435 -105 -154 -316 141 25 257 -444 175 -694 -96 -389 244 -372 40 305 -60 -60
7008 -60 19 -167 -280 913 167 -250 -310 -139 -409 -258 -398 -47 -450 -174 -721 619 182 -8 42 -260 116
7029A16q76N99j69l78P41L66o34j0K67l79J56K57k66J82k30K86o37Q98m6P2n30
7050b15L8J98j62k16J034p55o0Lm39L73J60J78l13K87J5j001J040n58N64mn52
7071c85M89K58j298M89J75P76n74j19o11J41J113q57M44N21j11o25L01o48J43
7090c78M8Q49m82q55J318m17k42k20J97N77n36J50k13N88j96p55P11m13K85K08
7110B24o37J1M2N88q25Q40L49k02n03j14k71O80O5j55j3J94p31J061k08l76K45
7131B64m06L65j09j18J05l50J24J110j125M98J39l86R3n0K51r01N08l90L44n21
7151e55M61k97Q93j396J168m6j08o12O41k60O7J10j16K22k26N25M5J62k20n81
7171a23j27J71j19J7L86o56O66J89k21k59m7M85m76k13N6j14O72p40m27M47R27
$$ plain form
7029 116 -760 -161 -330 -708 33 399 -235 -245 22 -357 -201 56 -210 -28 -258 28 -609 289 243 315 -215
7050 -215 -177 21 -141 -357 677 -78 -138 -135 -574 -201 -41 137 -176 111 126 -875 165 -393 171 167 -385
7071 -385 104 362 -936 -447 -272 504 -70 -189 -800 -659 454 -403 41 562 451 -174 127 -521 -378
7090 -378 -330 519 37 -818 500 83 -159 -379 -182 395 -141 9 -204 384 188 -567 144 -269 16 224
7110 224 -413 -402 -360 228 -597 243 592 390 -113 -227 -498 182 247 92 79 273 -458 603 395 19 264
7131 264 -142 223 114 -4 101 -249 -125 985 -140 358 497 111 204 154 405 -496 12 -378 -34 -555
7151 -555 -94 -391 502 -894 274 228 120 -492 149 -111 -44 66 -50 172 -54 471 516 678 458 -123
7171 -123 -250 -79 -198 -181 205 -451 215 404 183 -76 -123 362 -114 -327 -271 -385 287 -453 -880 -433 494
7192D94r03L97o07L15O57k33O4L61m75J1m23J50J05l99K21R78l54L35k14j87k14
7213G9n20M48p32M22J63J78o90Q8M89L66j15l37k74l8K62M25j90K92m40m0J75
7234A1j042K120k24j319K60R62j286j2P79k30p4o10J89O34oj52K61m34R28q47
7254i2L36m2k01op43J090o56L42J089j384N32j9l56N63rJ88j028N38J20l25K20
7275A57o24N84p4m11N36k15j47k82P7J8L69L3l17K07K28k56j51L03m33R25l81
7296A46J57n62k3R3Q98k00m90l52J94L4o56J048N8M4K95p95m94P87m04O61o47
7317b08l81M58J89l09k6P23q2l76j88L06m47L24k86M60L46m47L28n33l75P32n87
7338c79Q32m8n52L7P20p39j83m44K48O61p41M05O83j53n82K11l29l92R70m88p4
$$ plain form
7192 494 -409 -12 -619 -304 353 120 184 545 70 81 -342 -192 -87 -486 -265 713 359 694 480 293 79
7213 79 -441 7 -725 -303 -140 38 -652 -564 -75 291 176 -161 -435 -473 -211 214 24 316 -124 -164 11
7234 11 -1031 1089 865 -454 -194 768 -518 -530 249 19 -55 -665 -476 158 152 0 261 -173 755 -92
7254 -92 244 202 1 -5 -748 342 -314 28 1117 -267 265 246 -110 453 444 632 -396 142 262 -63 157
7275 157 -467 117 43 -368 168 -47 -194 -476 -399 -381 -12 21 -296 -89 139 -117 -268 35 -398 527 146
7296 146 303 -259 -282 -189 709 509 19 -333 -139 -105 -761 287 345 389 684 -111 -605 182 -222 439 -208
7317 -208 -589 -131 58 -251 -277 446 364 -12 -200 106 -341 -17 -303 157 503 56 384 -149 -524 208 -379
7338 -379 453 405 -147 -110 610 -129 -312 -756 -508 153 -588 -183 500 347 -235 -24 -353 -745 225 -263 -337
7359c37N1N55m70l6N90L74j96l41l69N97o54k37J010j78J00p22N56p54P84j069
7379g46P41j82j31J83L19J25n88R62o18j1j9j57N6Q8K25O72j182K62r9N1M67m92
7401g4O86q33K93R8p9j38M73n69j79l22j39O56K72p36P36M59m38n49J7J31K87
7422E2l05L17n08Q10l80n64J085n01M59k67K72m29n93N77M67j08J75r93J461j370
7442c43J55O65q54J127j051R23n31j75O92p28O28o0j83j03o1m44J53K27k42K77
7462G2L00k58J69q95P23J10m59p3P31m25M80n41K64k39P77j249l77N09J037o97
7482d1n76L73Kj75K34M74L92n98L78q66N0M69m63N6k48O72n38J384j328P98q92
7503d43j60K84j28Q20m00j92M04R1p76L58J71n01O44N48j041J31M5K81r0L46l42
$$ plain form
7359 -337 -286 269 -201 -237 353 727 531 190 -179 418 -236 -473 537 359 459 -263 293 -461 323 -746
7379 -746 -5 -187 -318 -135 184 309 -279 683 65 54 35 -122 -66 22 247 919 -263 -1 -100 -49 418 -74
7401 -74 612 -221 72 170 91 -47 426 -143 -322 -644 -783 -127 145 -591 145 604 166 -383 -366 -235 52
7422 52 -253 64 -444 366 -14 -578 507 6 465 198 470 41 -552 25 492 384 559 -434 1027 -343
7442 -343 -188 477 -377 750 -301 622 91 -84 608 -120 508 448 265 162 101 -343 -190 37 -205 72
7462 72 372 114 283 -612 111 221 -238 -311 420 -5 475 -66 198 -41 736 -513 -890 -381 656 -41
7482 -41 -617 -244 -242 -417 -183 291 683 85 463 -403 -353 116 -347 -291 -539 133 -405 979 -349 449 -443
7503 -443 -603 -319 -447 373 -27 -219 185 276 -500 -142 29 -472 172 720 -321 -190 -145 136 46 392 50
7524E0O22o42J62O5j63k19k85J88L73l09M18p53Q3J074m16j50J21j13k45j37k22
7545d98K61n5K76L2o32L84N30K03m37J98p78m1Q68l11K28r06J239n04L65j86J12
7566C48K35q56N95n27K61k85j04O96o7l78K05j18J00L58n68O51o34K36l61O80
7586D67p87P35l93J03L10p54J13P82j134O31M60q25L04O26n97n14P56j049R97
7605B31N5j60k0p7j60M30l01L05n60P41j211J50M14k64K12M39j05k25j59L46O59
7626G40q53RQ1M92n42J87l31L33K44j196J651r46N54n67NL6l39M41k05N60K10
7647E64q32p2O96j48J26q71M26Q0o18J72K13L55m71P74l08p19N67l05P87j211
7667g95J095o00J037n99r55J192p47M86p34J22P8O17n6m71K51L72o42O20J37O7
$$ plain form
7524 50 672 30 192 257 94 -125 -410 -222 151 -158 260 -493 -410 664 248 98 219 106 -139 -276 -498
7545 -498 -237 -292 -16 16 -616 -232 298 501 64 262 -516 -557 311 0 228 -678 561 57 422 236 348
7566 348 583 -273 322 -205 56 -229 -333 363 296 -82 123 5 105 463 -105 546 -88 148 -213 467
7586 467 -320 415 22 125 435 -319 -206 576 -558 73 533 -292 12 638 41 -473 283 -766 231
7605 231 286 126 106 29 -131 299 -2 303 -257 484 -727 -577 -163 -427 -215 224 119 -106 -265 81 740
7626 740 -113 -104 -23 469 -73 114 -217 116 360 -836 815 -131 423 -144 -139 -103 -442 -1 -206 354 564
7647 564 -268 -340 356 208 334 -537 -111 -31 -649 -477 -264 91 -380 394 86 -633 -66 -371 416 -795
7667 -795 300 -300 737 138 -817 375 -372 114 -620 -498 -420 197 141 -330 -79 293 -349 271 408 475
7687D75j087P37K88j072O00R3j95LM94M6l66m27M12k32N96l80K93o49N3M81l07
7708a44j81M93m43j51K7O61j306P42L07k92K89L42j97j00p20J111p58qM62K21
7728C55p05L40j029rJ289j13l1J14o10R01n54P2K0L06o9p52O57K85j76l77m48
7749e34J352L2j065N84M78j335J3J406j089k04M11K00j76K42j23K68n15k18R98
7768G25j048K93M17m08l4M48m44P08p49k11K70L30m64m44N55K05l06J7PQ29n74
7789A22M76o31j78K87j12J16p03P17L61j560J367j069L71L66L62q6o64J399j177
7808b36J74N34q01j80P51l48M22o04O17j92k69L2k76p4N51o39R0K58J118r68J76
7829A36n24R06M31k53l87l28N40q25P73m51M24j180N17q7K20p0M78p12N87k87
$$ plain form
7687 475 -612 125 413 -659 -59 34 -161 -158 336 382 16 -411 1 -231 365 -15 278 -371 -318 163 -144
7708 -144 -325 168 -275 -426 -399 262 -1044 -302 5 -287 2 344 147 47 -673 438 -320 -328 134 355
7728 355 -350 -10 -1039 -1048 241 128 97 211 -399 502 -52 20 40 346 277 -475 182 467 291 -86 -534
7749 -534 818 850 -215 369 847 -488 -475 931 -158 -362 49 249 73 315 192 460 -55 -273 725
7768 725 -323 -30 387 -21 -55 393 -51 657 -92 -303 -33 297 -167 -611 -56 149 -157 -140 -133 696 122
7789 122 598 -33 -211 76 -36 80 -623 94 455 -1105 262 -807 -436 -70 292 206 -458 941 -236
7808 -236 -62 472 -329 -509 242 -106 316 -288 329 137 -132 -100 -376 -450 101 -538 -448 -190 928 -40 136
7829 136 -388 518 949 696 309 -19 521 -304 469 18 442 -738 -221 -308 -88 -158 320 -392 195 -92
7849i2L95l13j07L81j48J42k39L7J63k08J35L49p13k26R42r10M67L36j99n10O4
7870b54K56m05J39R5P05o91M76l16O0j61Q07m86l25j06r3O03N6m15m04L87N18
7891D46n85j48N03l68p59J91P17L65p90O21P0m23N1Q75m51p26J51Q27k00l7p3
7912B57j13m1M49k86o6l16J87J64L33n75o4L93K03p9n15P27j352J199j335Q01
7932b9j25L87j64N5M69p61M97q98L30K52p15R90pj67Jl75K13N76p04r5r2J280
7954I18j92r35K02m01K54O32o78o57Q14L68j034Q69k34k02M20l61N46p2O3q68
7974e48R88r3j46k39N2l00M1k12k11L57P92l32K7j30O1J16q3K14q46M36K20n5
7996A09O27j460J084m22j06R0L08j78k18O34K1m59n18n8J008k24l89K81j88J77
$$ plain form
7849 -92 303 -10 -117 264 116 258 19 56 219 11 146 495 -218 -444 498 -412 55 391 192 -318 -254
7870 -254 2 -403 -264 -169 536 -155 321 5 65 -96 711 225 -100 -206 -299 304 360 -55 -459 -72 446
7891 446 -139 -287 216 -152 -911 -720 -3 362 -428 193 263 -160 -109 766 315 -411 -260 567 367 330 257
7912 257 144 103 552 266 200 -116 71 235 568 -7 -71 322 525 446 -69 658 -694 505 -830 -29
7932 -29 -154 233 69 124 593 -168 329 -569 -239 13 -702 288 281 114 115 -260 -47 529 -175 -270 -362 918
7954 918 726 -209 -7 -408 -154 478 -200 -857 -43 325 -709 160 -74 -276 144 -217 329 257 320 -548
7974 -548 440 347 201 -38 14 -286 -245 -457 -668 -311 481 149 176 46 107 223 140 354 -492 -56 164 109
7996 109 736 -724 360 -62 -168 -78 230 52 -166 468 489 30 -488 -546 462 238 -151 130 -58 119
8016A19M84j004M79m7j28k58P26O1J68p57J69l9q3P55o63J12j18m87Q63l52l68
8037c68K60M15j22m24P7m3K66l93O19j87K53P5m05P44o06k40K86o01R26o02j53
8058b23m31O31O40p82J09L0j66O71J27o69J93pNN08o41K16o99N52L11o52k6N15
8080B12J90j17p98L7M63l19K00K91l4n80O56l62k89M63J2N58q84M10L80n66j049
8101a126J096l11l16O79l84L60j60k04l68P69n24M44K87k67n22O73m65j52L65
8120a26M63l02p78N40J039q97L9P15r30k5Q5q9J9j91m8Q12j3q34R75m82n9l5J42
8143B0p6J91j48o94O04Q8j01k42N93l31k85J77M38n77KL13N80p70j5J61L34j17
8165A45L45j002l3J68J171j059N13J89K16r81k88K32n13R15r14J705m31J66j171
$$ plain form
8016 119 603 -401 78 31 -97 -355 371 432 600 -157 12 -27 -110 645 -18 94 -24 -511 352 0 -368
8037 -368 -108 307 185 -239 -162 -205 61 -332 287 100 353 428 23 767 161 -79 207 -394 532 -70 -223
8058 -223 -654 -23 617 -165 -56 -26 -192 479 606 -63 130 123 128 636 -5 211 -488 64 375 -277 -303 212
8080 212 402 285 -513 -476 -13 -332 -132 159 125 -455 201 -161 -450 13 25 583 -301 109 489 -77 -1126
8101 -1126 -30 -341 -657 22 -362 -2 -162 -366 -734 35 -489 -45 242 -25 -547 126 -339 -491 -126
8120 -126 337 35 -743 -203 836 -61 -22 693 -237 -262 -177 -266 -247 -438 -486 326 313 -521 454 -28 -87 -122 20
8143 20 -56 135 -13 -707 -103 -15 -116 -358 235 -96 -381 -204 234 -343 -341 -28 552 -218 -233 -72 262 145
8165 145 490 -512 -545 -377 794 -265 248 437 653 -328 -616 -384 -897 18 -896 809 378 544 -627
8184f27J390r00m34N01O3L33p36
$$ plain form
8184 -627 763 -137 -571 -70 -7 326 -410
8191d10
$$ Imaginary data points
##PAGE= N=2
##DATA TABLE= (X++(I..I)), XYDATA
0@%%%%%%%%%n6J12j12J12j66K22k24K80l36L92m68N25o17P28q42R72j127J286
27F81j463J665j877K116k381K671k989L337l725M149m607N116n679O287o960P704
43D045q526R452j0483J1638j2952J4463j6205J8241k0680K3652k7363L2159l8629
56b1188M7883o2338Q8308j49559N59867M52526r56187m92882J68290O44499J96904
67D76123k91526m29563J4725K62547J78129q8807r0731k4538J2298q3901m1292
78a06536J20403J99937o0734k76356j28863K21174K64162j9747l01079j90227
88b77866J77335L23663J9535k85377j89565J39454K42886J8374k25524j27394
98a84479J63482J98604o9533k06853l2142J71183J14637j13653j94612K1400K34077
$$ plain form
0 0 0 0 0 0 0 0 0 0 0 -56 56 -56 56 -110 112 -112 168 -168 224 -244 281 -336 392 -450 522 -605 681
27 681 -782 883 -994 1122 -1259 1412 -1577 1760 -1965 2184 -2423 2693 -2986 3301 -3659 4045
43 4045 -4481 4971 -5512 6126 -6826 7637 -8568 9673 -11007 12645 -14718 17441 -21188
56 -21188 26695 -35643 52665 -96894 462973 915499 -40688 -533570 -365280 279219 476123
67 476123 184597 -244966 -230241 32306 210435 121628 30897 6359 18657 -65244 -106536
78 -106536 13867 213804 153070 -123286 -252149 -30975 233187 213440 -87639 -277866
88 -277866 -100531 223132 242667 -42710 -232275 -92821 150065 168439 -57085 -184479
98 -184479 -20997 177607 108074 -98779 -130921 40262 154899 41246 -153366 -131966 102111
109A02111J00671j88189k01282P2162K35465O3218k10343j90759J20150K59387
119A62591P879k38921j28720J44645J96976k4361k17156r5848J78435J89463q7549
130H7434k22511l0460J91832J35106j15875k05277J2752K21471R7047j63122j72107
141a63710N6132J90934O4827j58875j63554Q3573K15764K1119j93120j17742J15102
152d9550J78199q995j89099r8600J49399J73602n9394j94406m7677J56057J40307
163A49843p8309j96921k2852J97816J16213j34342j76935L2793J84404P7682j46196
174C196j65334O8237K04328L0476j79066j20342J02345J75664O98j83797r9450
185a63045J42489J70604n8383j85711m2937J49952J29985p3132j78723j8427J75450
$$ plain form
109 102111 202782 14593 -186689 -114527 120938 184156 -26187 -216946 -96796 162591
119 162591 170470 -68451 -197171 -52526 144450 120089 -97067 -192915 -14480 174983 87434
130 87434 -135077 -165537 26295 161401 45526 -159751 -146999 74472 171519 8397 -163710
141 -163710 -107578 83356 148183 -10692 -174246 -90673 125091 146210 -46910 -164652 -49550
152 -49550 128649 119654 -69445 -168045 -18646 154956 95562 -98844 -146521 9536 149843
163 149843 71534 -125387 -148239 49577 165790 31448 -145487 -112694 71710 149392 3196
174 3196 -162138 -93901 110427 140903 -38163 -158505 -56160 119504 120202 -63595 -163045
185 -163045 -20556 150048 91665 -94046 -136983 12969 142954 69822 -108901 -127328 48122
196D8122J04821j16039j56798K2430J62174P6786j23650j50646N1840J78691L3966
207A31697j50457j09545P4188J54110J7368j52831j05234J07547J59467k9800
217I6510j64686o0999J22649J33019m8392j69829l6106J54497J09379r2248j49739
228a05945K619J45792Q8415j04836j52512L5963J71985M4530j40457j12427P0463
239e6410J48677J8307j45712r5513J01919J43173k7795j45666n4798J07040J20250
250A13472l9015j51829l6046J37989R7995q2313j32661L434J28067P6102q8681
261B6514j30511K4820J42005M4251j09077j02247M2136J31394L5865j24110j01009
272a19969P8815J37081j1675j31627o0663Q7639J16687k2109j36693m8203J16072
$$ plain form
196 48122 152943 36904 -119894 -97464 64710 141496 17846 -132800 -80960 97731 131697
207 131697 -18760 -128305 -54117 99993 117361 -35470 -140704 -33157 126310 96510
217 96510 -68176 -129175 -6526 126493 78101 -91728 -127834 26663 136042 43794 -105945
228 -105945 -103326 42466 130881 26045 -126467 -90504 81481 126011 -14446 -126873 -56410
239 -56410 92267 110574 -35138 -130651 -28732 114441 86646 -59020 -113818 -6778 113472
250 113472 74457 -77372 -113418 24571 122566 40253 -92408 -88974 39093 115195 26514
261 26514 -103997 -79177 62828 107079 -1998 -104245 -62109 69285 105150 -18960 -119969
272 -119969 -41154 95927 84252 -47375 -108038 -20399 96288 74179 -62514 -110717 5355
283E355J03466n8746j28303j6324J19188Q9164p8655j34107J8727J39328M6536
294A05629j04603r6807M1243J19663L1421j10199r0382O8100J20662n558j15903
305c6734n8046P6233J07726j9729j26402l8246J05907Q4040n5464j03522j2271
316g6508R2533P3832n6249j10949L803J12169M9888p9174r0539K1817J07867L9726
328H8216r4588q7437N3845J08250L134r5266o0587N6081J00701j156j10147n4308
340i3262Q8833R1414l6216j06196k4333R2191P7813n3909j09983N061J06259M5389
352H3061p1119q3686J6540R6393M1912q4395q3661M6980J01154M174q9459n4630
364g6736N3782Q7810o115r5708l8953P4303P0313k9944q0532k3499O7379O9159
$$ plain form
283 5355 108821 50075 -78228 -94552 24636 113800 35145 -98962 -80235 59093 105629
294 105629 1026 -95781 -54538 65125 96546 -13653 -104035 -35935 84727 79169 -36734
305 -36734 -94780 -18547 89179 69450 -56952 -95198 10709 94749 39285 -64237 -76508
316 -76508 16025 89857 33608 -77341 -73538 38631 88519 9345 -81194 -59377 48490 88216
328 88216 -6372 -93809 -39964 68286 71420 -23846 -84433 -28352 72349 71193 -38954 -93262
340 -93262 -4429 86985 50769 -55427 -79760 12431 90244 36335 -73648 -68587 37672 83061
352 83061 11942 -71744 -55204 41189 83101 -1294 -84955 -37975 63179 67353 -22106 -76736
364 -76736 -22954 64856 58741 -36967 -75920 -1617 68696 38752 -41780 -65279 2100 71259
376G1259l5395r2340n790Q7127M4710n5713p1783Q379P9639M0636o5675p3194
388f8140L0304Q2712J5236o6945n8304L3931Q4633R817q7705m8342O4031P4050
400F5278k2939p8339k7290O2807O8361l2677q6425q399P9461M5019m6904p1022
412e3069L033P7021L9934o3757o9572L2099P8112P066o1991m6073L1587O9808
424D4198O262p2568l8381N1074N9255j3864o2946k7133M9714N7913k2168p1139
436c9783q652O2087L6612l3196n4979n767N8021M1329m4242o2020J6224O3856
448B9490J8296m7220m8649J9060O4652J4457o3434m0976M0710N6843p768n4993
460a9532l0153M0353N8702j6186o9141j1738N8024L7830l2077n3194l310N5924
$$ plain form
376 71259 35864 -56476 -62266 24861 69571 13858 -57925 -49546 30093 70729 5054 -68140
388 -68140 -37836 44876 60112 -6833 -65137 -31206 53427 63244 -24461 -72803 -8772 65278
400 65278 42339 -36000 -63290 -483 67878 35201 -51224 -59623 19838 64857 17953 -53069
412 -53069 -50036 26985 66919 3162 -66410 -34311 43801 50867 -11124 -57197 -25610 44198
424 44198 50460 -22108 -60489 -9415 49840 35976 -26970 -54103 -4389 53524 31356 -39783
436 -39783 -48435 13652 50264 17068 -37911 -43678 14343 55672 11430 -50590 -34366 29490
448 29490 47786 566 -48083 -29023 35629 50086 -13348 -54324 -13614 43229 35461 -19532
460 -19532 -49685 -9332 49370 33184 -35957 -47695 10329 48159 16082 -37112 -40422 15502
472A5502L4525m2555n3404J7567N5412J3280m1129l9844J4890N6159J1648n4201
484a2150l2645L5114M5040p250m2896k3372L0382M5918r814n1868j3285M0841
496D015L2098j6772m2780j2229M2741L5821l0411m7721P619M6151J5630k9278
508D884l7274O680M7841J7531m3455l6531K5385M3891J186m0022k9002K8273M6725
521C6112r254n0629j0823L8899K7888j6191l8079p800L6284L0568k6671m2127
533c1823Q801L9418J3357k6693l0827O887M1171J0435l7686k3476K3342K7287
545B0193P75k6280k1860J6104L6388k149l8009j2940K6990K5479p922l0579j3257
558b7067K8548K7955j7167l5531K012K9175J6144j4433l1320k905L6911J8400
$$ plain form
472 15502 50027 7472 -45932 -28365 27047 40327 -802 -40646 -25756 30403 42051 -12150
484 -12150 -44795 -9681 35359 28109 -14787 -38159 -7777 38141 28327 -23541 -36826 4015
496 4015 36113 19341 -23439 -35668 7073 42894 12483 -35238 -27619 18532 34162 4884
508 4884 -32390 -25710 22131 39662 -3793 -40324 -14939 28952 30138 -9884 -38886 -10613 36112
521 36112 26858 -23771 -34594 4305 32193 16002 -22077 -29877 6407 36975 10304 -31823
533 -31823 -23022 16396 29753 3060 -27767 -20880 20291 30726 -6960 -30436 -7094 20193
545 20193 20968 -5312 -27172 -11068 25320 23171 -14838 -27778 -788 24691 16769 -13810 -27067
558 -27067 1481 29436 12269 -23262 -21250 7925 24069 9636 -21684 -24589 12322 30722
570C0722l1536k7804J5512L1747M274k7151k2785J6241L5144m776l4757q418K3157
583d30K0910o792k6158j2285K6297K5148j7271l0715N209K7181P699j4938k0620
596a6765J832K5797Q955k1790j6937J0952J8234M107j3933j8781P017K7844Q63
609A7395k5430j0544J7449J5087j196j8990j2167J5175K3508r392k3594k786J7310
622A825J5462p271k3288o072K7767J3239k1036j9924R761J9917N277j5165j8252
635a7760Q406K4863Q47k4448q404J4599J5519k300j8907j0067J8695J7476j3417
648E102j9252N394J4590M269n505j3793k425J7418Q345j4588j1469O622J0419
661E127L916p540j2716L359J7205P1j3711m962O071Q136L440q969j2195P867J6959
$$ plain form
570 30722 -814 -28618 -13106 18641 22915 -4236 -27021 -10780 24364 19588 -15169 -23587 -430
583 -430 20480 13688 -12470 -24755 1542 26690 9419 -21296 -16087 11094 18793 3855 -16765
596 -16765 -14933 10864 19819 -1971 -18908 -7956 10278 14385 452 -18329 -11312 16532 17395
609 17395 -8035 -18579 -1130 13957 12761 -6229 -18396 -3221 20287 10895 -12699 -15485 1825
622 1825 17287 10016 -13272 -19344 8423 21662 626 -19298 -9537 10380 15657 492 -17760
635 -17760 -9354 15509 16356 -8092 -16496 -1897 13622 11322 -7585 -17652 1043 18519 5102
648 5102 -14150 -8756 5834 10103 4598 -9195 -11620 5798 14143 -445 -11914 -5292 5127
661 5127 9043 1503 -11213 -7854 9351 9422 -4289 -9251 -3180 4956 8396 -573 -12768 -4901 12058
676A2058l677j6039k525R005J0752p24j6744m777J6737J0602j2582j2405L028
689g291J1340O968q017j5388L183K0235P69j7636n756J0415R695j336j1208p182
703a1209J1415J0474p781j1057L484O313M597j473j0105k393J1027N069r764n072
717f475M933L926J653j655q062J58Q824K147o621k409O68L566O141m780j1061
732i047N840J0543j558r069r36J733N927L826r915o076Q852R996o911q844J96
747e443O929N667m557j1221K498J3562j22j1641j619M690M261J883o510o033O672
762i84Q365o023o977L326L876J438r24n628r85P636Q00o078P27J897j449J350
778C67K593n057r44N583Q9k930l65q04J123M622j667o531Q60O294p93j983j621
$$ plain form
676 12058 8381 -7658 -10183 -1178 9574 8850 -7894 -12671 4066 14668 2086 -10319 -7291
689 -7291 4049 11017 3000 -12388 -9205 11030 11799 -5837 -11593 -1178 8517 7181 -4027 -11209
703 -11209 206 10680 2899 -8158 -4674 1639 6236 4763 -5342 -7735 3292 8361 -1403 -6475
717 -6475 -1542 2384 4037 2382 -5680 -5522 3302 5449 -1172 -3581 -2913 653 6794 2014 -9047
732 -9047 -3207 7336 5778 -3291 -4227 -2494 3433 7259 -2656 -8732 120 10116 3205 -5639 -5443
747 -5443 1486 7153 2596 -8625 -6127 7435 7313 -4328 -5947 -1257 3004 4887 -1623 -7656 -984
762 -984 7381 1358 -5619 -2293 1583 3021 2097 -3531 -4516 3120 3920 -2158 -1431 466 -983 367
778 367 2960 -2097 -3041 2542 2631 -299 -664 -1468 -345 4277 2610 -3921 -3061 3233 2440 457 -1164
795a164j925L256N649o561o561P086O112m380m412M93J882M403j386p089L94Q729
811D526n99o243m99J251K406K788l298n783N712N940o753l745M613J430j526J222
827A442k123l14L039m55l873J766J860k529J450K436m294j02L592k281q61L409
843B162k368l250M915J840m696j349L291J071l81j689k784K809M862n002m011
858d580M419M409l731q85q02p69M086O19n708q74O411J407o063N05J195J747J730
875C116l312m447O579K436o144o04M429j011j888J386j216n69L296j231l254K477
891D3K494k967n53J539r64K31J562k450J09M814l794l335M721J514m278J88J212
908H6m46N20J014l163J376M203l092l672K336K774k252Q44j881o28L569J684n760
$$ plain form
795 -1164 -3089 167 5816 -745 -7306 -220 5892 1512 -2900 -2407 -525 3878 2492 -4597 -4203 4526
811 4526 3927 -2316 -2815 -1564 842 3630 332 -5451 261 6201 -552 -4297 316 1746 220 1442
827 1442 -681 -995 2044 1589 -2284 -518 1342 -1187 263 2699 -1595 -1697 1895 -386 -1247 2162
843 2162 -206 -3456 1459 3299 -1397 -2746 545 1616 1235 -454 -3238 -429 4433 -569 -4580
858 -4580 -161 4248 517 -368 -1170 -1939 2147 2766 -2942 -3816 2595 4002 -2061 -1556 -361 1386 3116
875 3116 -196 -4643 1936 4372 -1772 -2376 2053 1042 -846 540 -676 -1245 2051 820 -2434 43
891 43 2537 -430 -983 556 -408 -177 1385 -1065 -956 3858 64 -3271 1450 2964 -1314 -1126 86
908 86 -360 160 1174 -1989 -613 3590 498 -3174 -838 1936 -316 528 -1353 -1981 1588 3272 -2488
925b488k74N193o95l654K047r42O50J385j679k821M138J802m404N72K319r28j101
942h80K053k828J297K563j773m369M132K263l353j313K842p0o7r1k134J457K989
959B718k823k601L702J464l135K89O52j838L428l34l134M92M045j613l973K576
975h5J476r32J27j384j585M938l79m204N36M081j850j819J005K92l77J598j652
992b14k338M135J110m171k66L601j130r85nj603K106K452l367k607M408Q31k948
1009i91p30L101k083J081Q51l049R67L235k183k789L560O42j788L96o37n99K269
1026A253O90m666J458M250k665l110K685J157j585Q68j392q79L289M22l709M99
1042a435L287j628j28k51p00N10K964l891k392N059J358m740J068J784p57j23
$$ plain form
925 -2488 -2762 2431 1736 -1918 129 -813 -163 1222 -457 -3278 860 2662 -1742 -1170 1149 221 -880
942 -880 1173 -1655 -358 2205 432 -3937 195 2458 -895 -2208 634 564 497 406 -1728 -271 2718
959 2718 -105 -2706 996 2460 -675 -386 266 -1572 1856 1522 -1612 -1120 2925 1312 -2661 -85
975 -85 1391 459 586 -798 -2383 2555 2176 -2028 -1492 2589 739 -1080 -75 217 -160 1438 -214
992 -214 -2552 1583 2693 -1478 -1744 1857 727 -258 -263 -1866 240 2692 -675 -3282 1126 1957 -991
1009 -991 -1721 1380 -703 378 1229 -1820 -853 2382 199 -2590 970 1612 -176 220 -417 -1016 1253
1026 1253 1943 -2723 -1265 2985 320 -2790 -105 1052 -533 335 -1057 -1936 1353 1775 -1934 -1435
1042 -1435 1852 224 96 -155 -855 -345 2619 -1272 -3664 1395 2753 -1987 -919 865 108 -15
1058a5Q90k099R30K574k253j849K252M97k239O03J626j853J282J369m399K443
1074b41K660l047k597L799J723k384P7J182j726J303J31l480J950K985k677j594
1090a936K430r37J167N16k682j168M282J328n534N97L847o72j238N44k313J636
1106a33K025k572k144L412J866m500J668Q32j173Q56J490k279n97L091j088k189
1122a435K609l67j300J066P7j381N54L13k566K074K544l326m89M049r43l464J731
1139b54M94j736L686q29m184K168L676k612k182J142R83L81O88l149l95M318P86
1156B981n513J808J090N56j265Q8j147J435K175k560j810K331J521j976O38j185
1172h33m46K019Q28l280J521J886j008j474J451k80j415K349k01k103J141L8j469
$$ plain form
1058 -15 875 -1224 -294 2280 27 -1822 430 927 -1312 -709 917 -936 346 1715 -2684 -241
1074 -241 2419 -628 -3225 574 2297 -87 -10 1172 -554 749 880 -2600 -650 2335 -342 -1936
1090 -1936 494 -443 724 1240 -1442 -2610 1672 3000 -2534 -1937 1910 1238 0 544 -1769 -133
1106 -133 1892 -680 -2824 588 2454 -2046 -378 454 -719 137 1627 -652 -1249 1842 754 -1435
1122 -1435 1174 807 -493 573 650 -731 -177 136 -2430 -356 2188 -1138 -1627 2422 1479 -1985 -254
1139 -254 240 -1496 2190 1361 -2823 -655 3021 409 -1773 -631 352 733 1421 -1728 -2123 2195 2981
1156 2981 -2532 -724 366 922 -343 -255 -1402 33 2208 -352 -2162 169 1690 -286 352 -833
1172 -833 -1279 740 1568 -1712 -191 1695 687 -787 664 384 -1031 1318 1117 -986 155 193 -1276
1189a276J773J305k803p68L643q24j721J45l2N34J670j544l248L031L791l812
1205a36k783K807J304l89L04l725J129M188q44l659J09L116n23l8j82l003K383
1222E8L133m069j006J899K212k244j14L47j654K603P2k416l97K775j280k71J647
1239A295j379j394K529Q4k629J128J081j626J418J382l331J68K956m91k054K53
1255f10R0R71J894k510l307L810K721k680k812J714M86J520Q3k916j150M883N38
1272B725n337P2L061N32l26q98l032L720K387k607k819L161N37j671L52O03j485
1289a025K121O79l027O61J518j360N60K65j009r26K636k93k367K146q74k091K755
1306C69J912m442l25M705j445j687O6O36J217J524k976k617K850L575l512j460
$$ plain form
1189 -1276 497 1802 -1001 -1769 1874 1050 -671 -526 -558 -24 1646 102 -3146 -115 3676 -136
1205 -136 -2919 -112 1192 803 1107 -2618 -1489 2699 1855 -1804 -1695 1421 898 860 678 -2325 58
1222 58 3191 -878 -1884 15 2227 -17 -131 216 -1438 1165 1237 -1179 -1576 1199 -81 -352 1295
1239 1295 -84 -1478 1051 1135 -1494 -366 715 -911 507 1889 -1442 -1274 1682 1191 -863 -610
1255 -610 -520 451 2345 -165 -3472 338 3059 379 -2433 -719 -233 1287 1370 -1546 -2696 2187 2725
1272 2725 -2612 -2540 521 1053 727 -171 -3203 517 2904 297 -2522 639 1176 -495 -143 460 -1025
1289 -1025 1096 1775 -1252 -591 927 -433 127 392 -617 -1543 1093 800 -1567 579 -295 -2386 369
1306 369 2281 -2161 -2486 2219 774 -913 -847 -211 1006 2530 -446 -3063 -213 3362 -150 -1610
1322a610O58J32K342J14m180j37M743N54n209R33K087M36M20n62l182K126L224
1339B889k788j401J669N57q68O20j218j175K211J471l197J01J902j385j57K256
1355A487k206j497K907R0j241P13n10n90K067N07l427j69L645o99j667L25o79
1372i44J195J586j268l591K808K460j716j306l00R61J982m34l657n12N797q39
1388B222l566r7J702L50J036j590j792J151L222k062j997J035J068o6m35j603
1404a422O06K040L65k726J589J66j566P66J951k538n40J801K79j563J023j80k236
1421b185L864L69l893K70K270R4n09l52j444J342K716k355k846K401J946r95j318
1438f25o34Q54K211n45l778P58L914m83k264o95P73N73J480j821k991M044J956
$$ plain form
1322 -1610 -952 -820 1522 1636 -2544 -2681 2062 2616 -2593 -1660 427 863 1283 721 -2461 -335 2889
1339 2889 101 -1300 369 926 58 678 -540 -1715 496 1967 -1230 -1129 773 -612 -769 1487
1355 1487 -719 -2216 691 781 -460 253 -257 -847 1220 1727 -1700 -1869 1776 1077 -590 -265 -944
1372 -944 251 1837 569 -3022 -214 2246 530 -776 -1076 -115 1867 1433 -2224 -2736 3061 2222
1388 2222 -1344 -1441 261 611 1647 57 -1735 -584 2638 576 -1421 -386 682 616 181 -1422
1404 -1422 -816 1224 1589 -1137 452 618 -948 -182 1769 -769 -1309 492 771 -792 231 51 -2185
1421 -2185 1679 2048 -1845 -1575 695 789 280 -72 -1516 -174 2542 187 -2659 -258 1688 693 -625
1438 -625 -1259 -405 1806 1261 -2517 -1759 2155 1672 -592 -1287 -514 59 1539 -282 -3273 771 2727
1455B727l524j127K742J83q58P50j546M02J333p79j758R88P95j522Q59K331j771
1472B25j366K650j346r04O25p02p50K470R39k990K5R45O73m1m78j491J847K462
1490B793k179l197K517K135j520j226L88n06K253J038m231l26L799J48k674j53
1506i41M72Q93L70j369j847K941K276l260m2J167q79kJ105p21j028K386o85k518
1524a682K323j06j295L17J285q86m43R30j389O12J712j737j080K525L69k616K72
1541h89J906N56j593K56j531J048J888k38l417J981J316j003n96q9j239L787J85
1558B328m413O70K619l18j466K08N06l6L78J17k614K634M10k214K27J467l37j3
1576A53M40j380k60K866j264k396K382O46k508J62J757j364M80O85k86j17J344
$$ plain form
1455 2727 -797 -1924 818 1001 143 893 -653 -251 1082 303 -1455 -467 328 -1194 -335 1996 225
1472 225 -1141 1509 163 -741 -116 -818 -1568 902 1841 -1149 -1124 -179 494 453 -25 -1516 331 2793
1490 2793 614 -2583 -66 2069 549 -677 -289 -795 1458 2496 -1735 -2061 1738 1886 -788 -941
1506 -941 -469 424 794 -575 -2422 519 2795 -465 -507 660 -219 -221 884 163 -865 1521 836 -1682
1524 -1682 641 535 -760 -443 842 -44 -487 443 -946 -334 1378 -359 -1439 1086 1455 -1161 -889
1541 -889 1017 1573 -20 236 -1295 -247 1641 1403 -2014 -33 1283 280 -316 -405 -1644 2143 2328
1558 2328 -2085 -1415 1204 886 -580 -372 134 98 476 593 -2021 613 1023 -1191 -964 503 166 153
1576 153 593 -787 -1047 1819 555 -1841 541 1187 -1321 -1159 598 -766 -286 399 113 -4 1340
1593A340j694j167K380J355l142J91J388l40P28j48k338J588K112j393k302Q12
1609f30J206k63m74o53J39J782O29m056J705K113j475q13O41J04l4J005j239j670
1627a983K411J331j972o17J963p80l59R8r24Q18R32j072q24J200J473k480N86
1644a99R57j067J098j08j520Q94P97q11m39J261k04o89R2m25Q4N35L71k317K267
1663E77J425j631k193J122J320j170J254k247J09K269N56k721N17K238o99j067
1679c41k34n96J245J372j606r77J737P15k731j79J757l02J16K36n52k2R19n72
1697a5j298J249P55q65m49J014m33P45m93j486O64J983j437j952L006k10j168
1714c90L46n34N30J324n50j780O10K301j972l35J058o87R74N8j106q17K113Q56
$$ plain form
1593 1340 -354 -1521 859 2214 -928 -737 651 311 1039 891 -1447 141 2253 860 -1442 -630
1609 -630 576 313 -161 -814 -675 1107 1736 -2320 -615 1498 23 -790 -149 -45 -79 926 -313 -1983
1627 -1983 428 1759 -213 -830 1133 353 -6 92 -832 -14 918 -154 -978 222 1695 -785 -199
1644 -199 758 -309 789 681 -839 55 852 41 -398 863 659 -30 62 -363 -279 256 627 -1690 577
1663 577 2002 371 -1822 -700 620 -550 704 -1543 -1434 835 1391 -1330 -813 1425 726 -341
1679 -341 -575 -1171 74 1446 -160 -1137 600 1315 -1416 -1595 162 -140 -24 212 -340 -362 557 -15
1697 -15 -1313 -64 691 -174 -623 391 -42 703 210 -1276 -612 1371 -66 -2018 988 778 -390
1714 -390 -44 -578 -48 1276 726 -1054 -444 1857 -115 -450 608 -79 895 953 -153 -970 1143 1999
1732A999l521L57K711j884M33J07r55K57K041k142j73K419k40j898l96J409l52
1749A72j32O83j159qK044j580k332K618L40j315q3O20p21J773n23k060J339J022
1767F98m86j856J993K17j332J071j90p81J871M74l600J869Q85p56k42Mk71L27
1785a05Q14j280k67K723p23k563J692Q06q66j087K23k29M88J213j547l33J168
1802A27J4r63J16P02J99KL50j594R46J431j819o4Q85N37j770N54K71l67J191n58
1822A90r45N70R99j009j089K245r02r29J162q35r99K490p59k235K063Q67q04o85
1840f05L20P49Q27n67j189L1J159p5k488J737M72m54L96q4j260J325J129k281
1858h58l2J449J63k009Q21L62j36j63L94K55N20j24r52N7R03j48l62n7l87N42
$$ plain form
1732 1999 -1522 -1165 1546 -338 95 202 -753 -496 1545 -597 -770 1649 1409 -489 -885 524 172
1749 172 40 723 -436 -444 1600 20 -2312 306 646 -669 -752 -132 -853 920 397 -1663 -324 698
1767 698 212 -1644 349 566 -766 305 115 -666 1205 1679 -1921 -52 833 77 -165 -161 -432 -105
1785 -105 709 -571 -838 1885 1162 -1401 291 1097 231 -856 -633 -862 -374 839 -708 -1041 127
1802 127 141 -822 -706 -4 195 197 547 -1047 -101 1330 -489 -553 332 869 -901 -347 -76 -443 748 190
1822 190 -755 -185 814 -195 -1284 961 59 -870 292 -543 -1542 948 189 -2046 17 884 80 -605
1840 -605 -285 464 1291 724 -465 -434 725 650 -1838 -101 371 -83 313 229 -1031 294 1423 -858
1858 -858 -890 559 722 -1287 -466 -104 -240 -403 -9 246 766 642 -310 -253 650 502 140 83 -304 238
1878B38J33q46K01J10J752k034k90J074n37Q5R4n79r0K269j655j654J802K142
1896B215j631j339J587q22K04J80p18k75J736qj659M21O88k9j09o54q84J486Q98
1915A287j124j346J480K91o18j20L47j85J22O26j691J494J66j028l18J175K79
1932H37r84O18M62m39L04l87j545J382J410k174o75J801O74j280L14j412J179
1949H5K070j793k383K396J385j776n04L08p56R27J135j690k14J366L92j308m57
1966h17J085m83O23o48l01L43J547j305r62O54K28j73J85j6o03J080R28k651J002
1985b84R87j465O43J564k002l97R42O2N44l82m60o71K041Mj860L24K98j14L49
2004A23n75J48L01J366j417j681N72K575q91q39J38M23O39N13k506k49K556l28
$$ plain form
1878 238 371 -475 -274 -164 1588 -446 -736 338 -199 -114 -20 -599 -689 1580 -75 -1729 73 2215
1896 2215 584 -755 832 10 214 394 -324 -599 1137 1129 -530 -109 579 550 441 -213 -1097 389 1287
1915 1287 163 -1183 297 588 -30 -150 197 12 134 760 -931 563 729 -299 -617 558 837
1932 837 -147 471 933 494 798 411 -1134 248 1658 -516 -1191 610 1284 4 318 -1094 85
1949 85 2155 362 -2021 375 1760 -16 -520 -212 -968 -41 1094 -596 -810 556 948 -360 -817
1966 -817 268 -215 408 -240 -541 -198 1349 44 -918 -264 -36 -209 -24 -40 -643 437 1365 -1286 -284
1985 -284 703 -762 -119 1445 -557 -954 -12 50 594 212 -248 -919 1122 1126 -734 -410 -112 -226 123
2004 123 -452 -304 -3 1363 -54 -1735 -1163 1412 521 -318 -180 243 882 1395 -1111 -1360 1196 868
2022H68r70j026O46J100O30r71j852J151K022j287j246M43J54J82Q01r56j038
2039a349J334O58j009K54n20K20m18J878o10j374J951N41j305j41j050j24K023
2056I59P07l403M4K770K53j844l02j52J403K533l020j438J016J948O3l061O15
2073i09P49J426j44k790P0K890j78j560n68N16J485N04q39k603J473J719j021
2090B20j222K9P17L71R78j091j078L66J980j168J83m45q50J846P06j916j043J805
2108C88N12j249J094j097l54K833j294j727n09J877P05j116j143o70K208J692
2124B150j630k876J144L166o90k119q55Q84K824n06k426j508L154J409j925j105
2140i09m80J874J270j345k214R64J858L51j477j209R42J048R76j576k213J287
$$ plain form
2022 868 -102 -1128 -482 618 1248 277 -1575 -424 1598 311 -935 -492 -338 -156 645 -311 -1349
2039 -1349 -15 643 -366 -112 -632 -412 -830 1048 438 -936 1015 1556 251 110 -940 -1064 959
2056 959 1666 -1737 -1693 1077 1330 -514 -816 -968 435 2968 -52 -1490 -474 1474 1537 -1524 -909
2073 -909 -160 1266 1122 -1668 -1598 1292 1114 -446 -1014 -498 987 1491 652 -1951 -478 1241 220
2090 220 -1002 -973 -256 115 1093 2 -1076 -710 1270 102 285 -160 -1010 836 1542 -374 -1417 388
2108 388 900 -349 745 -352 -706 2127 833 -894 -1403 474 1179 63 -1080 -1750 458 2150
2124 2150 520 -2356 -1212 1954 1264 -855 -1710 -826 1998 1492 -934 -2442 712 2121 196 -909
2140 -909 -1389 485 1755 410 -1804 -840 1018 1369 -108 -1317 -375 673 1649 73 -2140 -853
2156h53K604q20l47j693M64J212J190k403j153K117M83R43j765j314K84L020k34
2173A735k419j249K162J647j892j237K07J418K788k638l372K336K207N94j803
2188D84k662R08L186M94l734r54L113J587j415k364l53K005J288j124k274M49
2204a366K102po00r98J76K053J010k357k451K282J259n91l67j470r7K358P55k693
2222a002o15J492R92L10q39k783J581L241j282l420L97K743M92K9k746p55K707
2239E42K264k325k754P65L186M34k041l113J743L654O0l825j151K743K422k028
2255E76j139j164J913K951j898l235q19L576R37r90k090j01K350J070j825j922
2271a810J228K113j33j087k102L85K534J183k339j942J417K197L44j960k769J587
$$ plain form
2156 -853 1751 931 584 -1109 -645 567 1757 -646 -1799 318 801 1744 -21 -1335 -1051 1969 1735
2173 1735 -684 -1933 229 1876 -16 -1253 -1046 372 3160 522 -2850 -514 1693 2287 484
2188 484 -2178 -1270 1916 2410 -1324 -2278 835 2422 1007 -1357 -1710 295 1583 459 -1815 -1366
2204 -1366 736 729 129 -869 -693 1360 2370 13 -2438 -156 1103 512 145 -1325 -1422 936 1691 -1002
2222 -1002 -1617 -125 867 1177 338 -2445 -864 2377 1095 -2325 -1928 815 1307 1336 -1410 -2165 542
2239 542 2806 481 -2273 -1508 1678 2112 71 -3042 -1299 2355 2415 -1410 -2561 182 2604 576
2255 576 -563 -1727 186 3137 1239 -1996 -2815 761 1698 708 -1382 -1483 867 1937 112 -1810
2271 -1810 -582 1531 1398 311 -1791 -1406 1128 2311 -28 -1970 -553 1644 1988 28 -2741 -1154
2287a154L363o48l107j493L553J588j91l221k026L711L109k316l923O09K757J976
2303B587l080j615K53L595J037l823j909K303K968J31l104k572L403K241q8n559
2319c232N02L694R11j412j668m78J892K304k033k654P95J942J894j466k287o51
2335a947L620N37j748k441J307K153Q58k222k675J200L500K71l542j556K355K704
2351B374K13m255j655L032L623k524l615L99K430K317j895l036J06M562J551m819
2367a192j133J627K359N6k589k717K414L862j002l579l44K530J820j089k618j422
2383c017L146K736k220l060K03K927J161k028j266l53K889J256j576k818L73L156
2399A509O82k279k537K37N058M61m438r22J694L071k79k952k575K488M377k095
$$ plain form
2287 -1154 2209 1561 -1546 -3039 514 2102 1911 -1310 -3336 375 3484 1168 -2755 -2146 611 2587
2303 2587 -493 -2108 -1855 1740 2777 -1046 -2955 -652 2316 2447 -657 -3229 174 2415 2327 -3232
2319 -3232 -2730 964 1875 463 -1205 -1683 209 2513 480 -2174 -1379 563 2457 991 -1296 -1947
2335 -1947 1673 2210 462 -1979 -672 1481 2339 117 -2558 -1358 2142 2413 -1129 -2685 -330 2374
2351 2374 2587 -1668 -3323 -291 3332 808 -2807 -2408 22 2339 444 -2592 -2486 2076 3627 -1192
2367 -1192 -2325 -698 1661 1717 -872 -3589 -1175 2687 1685 -1894 -2238 292 2112 1023 -1595 -3017
2383 -3017 129 2865 645 -2415 -2212 715 1876 -152 -1418 -1771 1118 2374 798 -2020 -1647 1509
2399 1509 2191 -88 -2625 -2388 2670 3131 -1307 -2229 -535 2536 2257 -695 -3270 -782 3595 1500
2415A500m409J150L037J373j064l928k29M928J078m007k186J231L674K42k377
2430A3l288K320L468j22l498r19J746K424k83l608q31J809L754j936l335Q69J813
2447C96J909r93k840j267M134J788k427k703N19J842K720k427l190N97M079P95
2463B932l685j570J131L051J087l267l366L103M816k281m035o53L297J750q3m550
2479b323p23L872K295k320l472J421K951J074k557l609J179N268j146l108j491
2494b689K523K214O8k904k473K152L798j656l254j79K370K598r35m063k42L403
2510G31K295j502l822k37L545K382j441m960K50M423J448k724l289K136K708O76
2526B619l790k721L062L842j538l019j469K947K989k120l256j069L754L350l343
$$ plain form
2415 1500 -2909 -1759 1278 2651 1587 -2341 -2570 2358 3436 -571 -2757 -1526 2148 2390 13
2430 13 -3275 -955 2513 2391 -1107 -2026 -280 2144 1861 -1747 -2578 -769 2985 1049 -2286 -1417 396
2447 396 2305 1312 -1528 -2795 1339 3127 700 -2003 -1484 358 3078 651 -2539 -1942 2137 2932
2463 2932 -753 -2323 -1192 1859 2946 -321 -3687 -584 4232 1951 -2084 -2737 560 2310 2227 -2323
2479 -2323 -3046 826 3121 801 -2671 -1250 1701 2775 218 -3391 -2212 3056 1910 -1198 -2689
2494 -2689 -166 2048 2116 -788 -3261 -1109 2689 1033 -2221 -2400 -30 2568 1633 -2430 -2672 731
2510 731 3026 1524 -2298 -2535 1010 3392 1951 -3009 -2759 1664 3112 388 -2901 -765 1943 2619
2526 2619 -1171 -3892 -830 3012 1474 -1545 -3014 -67 2922 802 -2454 -3523 231 3581 238
2541B38l588J238K858K124k502m231J669M481K76l399r96R08K961k56k031k284
2557b534J865L408r03l425l44K045K046Q15l856k640L617K334j701k185r27K161
2573b24K876p50m802O19L063K047l139j975l92M900O52l271k614J300L793k4l185
2590a126j458K277K289L10m467q54L753K272k231k449k44K688J742k416l095L50
2606b659N109Q30l844k488J905K751J457l940j803K143K578J27l780j31N88L466
2622B309l45l427j501K751L223j328k279k329K351L328j236l510j253M543J523
2637B820k173k772l01K877K830k990l917K719K857J15l372j733J899L513l47l166
2653a141j892L606K615j421l071n94J938K626j148l637L65L676O08j745l169O51
$$ plain form
2541 238 -3350 -2112 746 2870 368 -3863 -2194 2287 2563 -836 -1832 -924 2037 1781 -250 -2534
2557 -2534 -669 2739 1836 -1589 -1933 112 2158 2973 -883 -3523 94 2428 727 -1458 -2385 -224
2573 -224 2652 1902 -2900 -2281 782 2829 -310 -2285 -2677 2223 2875 -396 -3010 -1710 2083 2059 -1126
2590 -1126 -2584 -307 1982 2292 -2175 -3029 724 2996 765 -1684 -1928 760 2502 86 -3009 -2659
2606 -2659 2450 3280 -564 -3052 -1147 1604 3061 -879 -2682 -539 2039 2166 -1614 -1745 -1157 2309
2622 2309 1964 -1463 -2964 -213 3010 1682 -597 -2926 -575 2753 1517 -1993 -3246 1297 2820
2637 2820 647 -2125 -2426 451 3281 291 -3626 -907 1950 2065 -1307 -3040 -1141 2372 2025 -1141
2653 -1141 -3033 573 3188 1767 -1304 -1898 40 2666 1518 -2119 -1754 1922 2530 785 -2384 -1733
2669a733K887J247k124k266J232K087kj837j477R01L438k59k664k033K562K092
2685B051o95k370j060J917K803r23k564j661K754J714j016k004j033K981J568
2700B462j594l750J145L746M0k075k825R59L402J541l864l021L913K434r34k703
2716a124j313J937K660q27k735r58L375K50j646m55q18K443J166k189k340J567
2732a007L160n09j472j837O69K229N66k439j534J776J675Nk722q20J669K545n84
2749A370l090j120L873J235r54l040p06L222J923j352l702O42K629J060j917j811
2765a738o9L453P52k654k022K018J790K02k271j556K176J854r85k063r56K961
2781H92M26j032j757l29K801J227j269l103J000K237m34J7k633P54J490J130j699
$$ plain form
2669 -1733 1154 2401 277 -1989 -757 1330 1328 -509 -1986 -1085 2353 2094 -570 -2603 -41 2051
2685 2051 1356 -1014 -2074 -157 2646 1723 -841 -2502 252 1966 950 -1054 -2087 894 2462
2700 2462 868 -2882 -1737 2009 2049 -26 -2851 -1892 1510 3051 -813 -3834 79 2513 1579 -1124
2716 -1124 -2437 -500 2160 1333 -1402 -2360 1015 1265 -381 -836 -1654 789 1955 -234 -2574 -1007
2732 -1007 2153 1644 172 -1665 -996 1233 1799 -640 -2174 -398 1277 1282 -1440 -2260 -591 1954 1370
2749 1370 -1720 -2840 1033 2268 1314 -1726 -2432 790 2713 1361 -2341 -1699 930 1990 73 -1738
2765 -1738 -1807 1646 2398 -256 -2278 -260 1530 1732 -539 -2095 81 1935 950 -1113 -2069 892
2781 892 1318 286 -1471 -1800 1001 2228 959 -2144 -1144 1093 659 676 -1957 -1203 287 1417 -282
2798b82j299J235J753j04j139j866N64L234j1k826j229J560K122j174j844o65
2814a971K398K985k533k893M05K921m63o00k059O16K527N06k172j727J591K319
2830A850p10k044j252J179K533o77j813r02K009J237j137p72p44J341J771j120
2846G49j797R24P53Q81j039j502m72K282J026j937k081J524O99J309j251j986
2862a918J138K103L84l151l91K577P27o59j159j650J843K606j185l048j04K944
2878A057P44j339k465N60J846J385k223k379K136J549J59j053j593J042J784J34
2894A344k251n76J605M97l48j152n85R58J504o90j454L85J507M8O3j644m90J639
2912C60P11n22j925L62R46R44o72j371M07J581Q75j904n09N86J160O5j761j085
$$ plain form
2798 -282 -1581 -346 1407 1303 164 -1702 -1138 2096 2085 -741 -1970 -410 1712 538 -1306 -1971
2814 -1971 427 3412 879 -2014 -1609 1312 849 249 -1810 -1194 1333 1839 -333 -2060 -469 1850
2830 1850 1140 -904 -2156 -977 1556 879 -934 -1836 173 1410 273 -499 -1243 98 1869 749
2846 749 -1048 -124 629 1510 471 -1031 -1503 779 1805 -132 -2213 -689 10 1319 68 -1918
2862 -1918 -780 1323 1707 -1444 -1835 742 1469 810 -349 -1999 -156 2450 1265 -1783 -1887 1057
2878 1057 1801 462 -2003 -1443 403 1788 -435 -2814 -678 871 1030 -23 -1616 -574 1210 1344
2894 1344 -907 -1483 122 619 271 -881 -1466 -508 996 306 -1148 -763 744 792 855 -789 -1279 360
2912 360 1071 549 -1376 -1014 -68 876 204 -1167 -760 821 1696 -208 -717 -131 1029 1094 -667 -1752
2930a752J946K565j039l197m71K311R66j765j046n03K731M76o71k031P03J281
2946E04r3k0j335O01J847K78k456m83R97P14P59j965n64J792O06K35k359Q18R53
2965H29n5N14j340k011K451Q78q82k421K102N43R12j230j915m35L496l59j489
2982d12j022O71P26J001j417j097J246J870n97j854L59R80N32o84j081K73J243
2999G37O20j468m83J6R69L98m14j079L8J706r6j352j73M94P67k90Q1n74o02J827
3019A122n77q21j159P21J244N49k038j84J238R73r28o02N69j108K471j438j111
3036a079n27K531L56j340j124rJ408P46j483n87R20J445j0k187m0N95L89pk39
3055b42j006K076n9j011J90p53J363M20n27j349p2K383q74j289K96P91q13J443
$$ plain form
2930 -1752 194 2759 1720 -1477 -1948 363 1329 -436 -1482 -1985 746 1222 551 -1480 -777 504
2946 504 411 391 -944 -343 1504 1782 -674 -1157 -160 554 1313 -652 -1216 576 1182 1417 -942 -124 829
2965 829 774 1288 -52 -2063 388 1266 384 -2037 65 608 1520 290 -1625 -2060 1436 1077 -412
2982 -412 -1434 -763 -37 964 -453 -1550 -304 1566 969 -885 -526 454 986 302 -779 -506 737
2999 737 1357 -111 -594 -578 391 789 375 -704 -666 1040 944 -408 -581 -87 680 390 471 -103 -705 1122
3019 1122 545 -276 -1435 -714 530 1079 -959 -1143 95 1068 140 -462 107 -1001 1470 32 -1079
3036 -1079 -1606 925 1281 -59 -1183 -1192 216 962 -521 -1108 -188 1257 1247 -940 -980 -385 4 -3 -242
3055 -242 -1248 828 769 -242 -52 -805 558 978 451 -898 -970 1413 539 -750 -454 337 -476 967
3073I67r80p94M98R89k28m64j87k7J68R02j350O3K05J349o02j226K14K20J206
3092I23j68j269k30J206K78j69p52K24o35J716k72j003l51J353o64j012L4R44
3110A53P07P1j191q47J296lj058l62R21N33J57r91L42O13J10l5n59K56o33Q23
3130C03J18o61l65K96Q46p99l8M80L82n00oP9l90N58K05L3n76m03J053K49k79
3151E85j319O32l3N28j132O84j37L40P49r6j392m22J651l1q18m30J54J459j94
3170G78o54j083J085P87j552K35m86J205m00N24j212N11J089m19m02L46l90K64
3188B26K99m77o56J272j013N01r2p5j37P75Q0r00MP9l0K42j56K50o16J182k92
3209D66M0n73J273r56K47n09N94L92q49O13j768M29N87J31J68j63o97R7Q88r22
$$ plain form
3073 967 -13 -807 -309 680 452 -12 -199 -226 -58 844 -506 -443 -238 1111 509 -717 -503 -283 923
3092 923 755 -514 -744 462 740 571 -181 43 -592 1124 852 -151 -502 851 187 -825 -791 153
3110 153 860 931 -260 -1107 189 186 -872 -1234 -313 220 377 -614 -272 341 451 416 -143 113 -520 303
3130 303 421 -240 -605 -309 537 -262 -300 180 562 62 56 135 -255 303 508 541 -35 -438 615 864 585
3151 585 -734 -102 -135 393 -739 -55 -192 148 897 801 -591 -1013 638 607 -211 -641 -487 972 778
3170 778 124 -959 126 913 -639 -404 -890 315 -85 439 -773 -262 827 408 6 352 -38 226
3188 226 525 48 -608 664 -349 152 60 -15 -152 623 703 -197 -193 -114 -144 98 -58 192 -424 758 466
3209 466 506 -67 1206 250 497 -12 582 974 125 738 -1030 -601 -14 117 285 122 -575 -478 410 -512
3229e12m35J548j65r46M85m82j2J282l80q35Q07J07q1n96j37N59J04n86N21q87
3249f41N60o0j48N70j43p81N72m16J85m86P67k04O60q5n18K49L44J68j036N21
3269G8j71L44J56m55N13j020O05P33j283L62M57j75r36J151n53K0j22L80o02N27
3289IM16l58l66l50P78l35P35n23p95R72l16L22o15J109j654J055o58J47Q09k10
3309A72k78k05L50l7j12J302j219k33J72J85M11n11k33k83J395J3j393P75q05
3328e34oJ003l16o98N00J228j146o21K20P88k71R1j313Q25J187j001q06M6R91
3347A67N06j042L38k41J75M02j83j021O81Q15o56p19L87J339j351K61M71o17R07
3366F19j014L26pP65j740J421p19J61N78o8p96K02R42p90j34J107J32k014Q75
$$ plain form
3229 -512 -947 601 436 -510 -25 -507 -519 763 383 -452 355 462 381 -215 -352 207 311 -275 246 -641
3249 -641 -81 -141 -289 281 138 -643 -71 -487 -302 -788 -21 -225 435 350 -168 81 425 593 -443 78
3269 78 -93 251 407 -48 465 -555 50 783 -500 -138 319 144 -792 359 -194 -174 -296 84 -518 9
3289 9 425 67 -299 -649 129 -206 529 6 -789 183 -133 189 -426 683 -971 84 -574 -427 382 172
3309 172 -106 -311 39 2 -110 1192 -27 -260 -88 97 508 -3 -236 -519 876 889 -504 271 -534
3328 -534 -540 463 147 -551 -51 1177 31 -590 -370 418 147 238 -1075 -250 937 -64 -870 -824 167
3347 167 673 -369 -31 -272 -97 305 122 -899 -218 597 -59 -778 -391 948 -403 -142 329 -288 619
3366 619 -395 -69 -76 689 -1051 370 -349 -188 390 322 -474 -272 670 -120 -254 853 985 -1029 -154
3385a54k12N65k30o2l05K89N63k04j367J232j48m09J24J59p03J63Q6j89R70J78
3405C46Q77j913J82K93L31l22L31n15o96J406k57l32J18N5N27po74M53j39n67
3425e03MR80j53k22r29J233o63M04n55N22L3M84l03q39R27j177R88j19k49j69
3445c06K65l40k4j1Q38k91j11J63l94j45P78m87No37J276r69N4N51M67n78m53
3466c49J67O6M75j90m93J410j031j29Q0o55J001j412J390L83m00L18n21J88q86
3485e88J271l73j156J103p18lJ172j024K52K95m89L66L94m11m50O96J27j367N90
3504c13Q24m50Q0Q14j52j777P70J18L97l37j058J041R08m43k86l53m25P20j18
3523d0P0J7m52O58j025O78l26Q16k19J8l23j61m14O62J93l42J028q34r40P89J130
$$ plain form
3385 -154 -366 199 -31 -93 -398 -109 454 250 -1117 115 -33 -442 -318 -159 -862 -699 -613 -802 168 346
3405 346 1223 -690 -508 -215 116 -206 125 -390 -1086 320 63 -269 -151 -96 431 424 -250 203 64 -503
3425 -503 -499 481 328 106 -823 410 -253 151 -404 118 151 635 332 -507 420 -757 231 112 -137 -306
3445 -306 -41 -381 -405 -416 422 131 20 183 -211 -356 422 -65 -60 -697 579 -390 -336 215 682 104 -349
3466 -349 -182 -116 359 169 -324 1086 55 -74 6 -649 352 -1060 330 713 313 631 110 298 -588
3485 -588 683 310 -846 257 -461 -464 708 -316 -64 231 -258 108 502 91 -359 337 464 -903 -313
3504 -313 511 61 141 955 803 -974 -204 -86 311 -26 -1084 -43 865 422 136 -217 -642 78 -40
3523 -40 30 47 -405 253 -772 -94 -420 396 177 195 -128 -289 -703 -41 152 -190 838 4 -936 -147 983
3544I83m30p36Q18j080L84Pn68J012M03n37m18L21L09Q5j156P29p00R93m24m49
3564d54Q57K46p74j90L56K99Nn11j43o97J777m75p42J31J355r37q12J503o54m01
3584b61P26k82o97L54O37p08l30N62l06O65J41j230N74K29n68M50J36R6m76M25
3604A37M0K69l68p56k32O52M27o5p8l13Q85m65J23K46j298R20M68o87l31J108
3624F82l02n89K22J48j20K49M6j432R33N71m95m4j51M29j01J17M39k55p99Kj56
3645f06J200p77k44J92K5K50j1k30O66n70k6k74K49L8K76L6k51j50J40Q47j359
3666e79P2J061k52p33j60N59K26o6Q47q16n41L93p1l73Q93K06j59r13P51q66P22
3687B01O8J28j192L75N88o22O07ml5j91l58j24R88q68K04l63O06J282j328M5n18
$$ plain form
3544 983 553 -183 635 -445 -61 -54 -622 390 793 256 -162 159 468 553 -603 126 -574 419 -5 -454
3564 -454 403 649 -125 -315 41 340 345 -166 -309 -1006 771 296 -446 -315 1040 103 -709 794 140 -261
3584 -261 465 183 -514 -160 477 -231 -561 1 -305 360 501 -729 -155 74 -494 -44 92 188 -288 137
3604 137 177 446 78 -678 -910 -258 169 104 26 -287 598 133 256 502 -796 124 592 -95 -426 682
3624 682 380 -209 13 161 41 290 336 -1096 -163 408 -87 -131 -282 147 46 163 602 347 -452 -450 -606
3645 -606 594 -183 -427 -235 -210 40 29 -201 465 -105 -131 -405 -156 -118 158 194 -57 -207 -67 780 -579
3666 -579 -507 554 302 -431 -591 -32 194 128 975 159 -382 11 -60 -433 460 666 507 -406 345 -521 201
3687 201 269 397 -795 -420 168 -454 153 149 114 -77 -435 -559 429 -439 -235 -598 8 1290 -38 7 -511
3708e11L17O17p52J83k21N04q03K86L22J09l5J96L47p12J58L17o41j18P76j385
3728a046M85P68K32o86L78j18j94O91l63j62j115J748n04q07J099p51M24j16m6
3747h3l03L30n3o45R10k38M69n1p0p59R60k31n31M17J80Q7l54K72m39m91Q4M31
3769a08n8O07l20q56N76J58N35p71m96P37L18j2l52j90N13k83j79l20J67n9O48
3790B55j20o12N87M8m7N3o21J290j502J669m68j152Q83o53K97j058J778m52o95
3809e20J487r25N0j67n53m66J402J6q24M46M36R00q01k73l08K76k93J46n0R81
3829I60j095p5K79K62n48K54j98P42j213J55O70o28Q57M79l51p47j22J52l75N43
3849An55p4J186o10p14L92K72J67n27R17o15M97O67j012o47J120q5o77o5m3J175
$$ plain form
3708 -511 -194 423 -329 -146 -367 137 -666 -380 -58 51 16 212 559 -153 5 322 -319 -437 339 -1046
3728 -1046 -561 207 439 -247 131 13 -181 510 147 -15 -1130 618 114 -693 406 -345 79 -37 -83
3747 -83 -386 -56 -109 -754 156 -82 387 336 266 -493 467 236 -295 122 302 389 35 307 -132 -623 -539 -108
3769 -108 -166 441 121 -735 -159 -1 534 -237 -733 4 322 310 -42 -232 281 -2 -181 -501 -334 -393 255
3790 255 135 -477 110 158 111 164 -457 833 -669 1000 532 -620 263 -390 -93 -1151 627 175 -520
3809 -520 967 42 92 -75 -628 -1094 308 324 -500 -54 382 1282 481 208 -100 176 -117 29 -21 960
3829 960 -135 -210 69 331 -217 37 -161 581 -632 -477 193 -435 422 901 550 -197 -319 -167 -542 1
3849 1 -554 -628 558 -52 -766 -374 -102 65 -462 455 -160 337 1004 -8 -655 465 380 -297 -362 -405 770
3870G70k88m86k09P06k73j85l53j68k7P6M72j23j64J06N26n9j21N77j510P2P99
3891A38M85m48m11p2M9J65j12j74R6q5J40o25J398j73O47j502L53j62N53m32K94
3912A22r8K46L60m59k40O3k55J082j446K60L43k77K45K32p1O40n92p4q8k20J063
3933H36j059J22N05L19n68k08m05n8P60p1K84k08k86Q00j551Q13l46P31k36p9
3953I5J17n87M77j04l03P73o75n93J058k63N00j46j055R36N9k19q48O34M96p3
3973B79r5K48r14O18J52o75k57J085O5m20K20r74J465l71j222K31L89J059l16
3992E67k28N95j875P78l67O56n76L29p79J626n74MK31q70M77J48L21p27j6O69
4012C89n01j84qQ57j151L17L00K47M25r82J160j026P1K60K44n66N17r12J057l07
$$ plain form
3870 770 482 -4 -213 493 220 35 -318 -486 -513 -437 35 -88 -252 -146 380 321 200 777 -733 -661 138
3891 138 623 175 -236 -308 -259 -94 -206 -380 -284 -369 -229 -854 544 371 1018 -484 -131 -293 260 -172 122
3912 122 24 270 630 171 -69 -6 -261 821 -625 -365 -22 -299 -54 178 107 747 155 81 -7 -227 836
3933 836 -223 -101 404 723 155 -53 -458 -516 244 173 457 249 -37 763 -788 25 -321 410 174 95
3953 95 212 -375 102 -2 -305 468 -207 -800 258 -5 495 349 -706 230 289 70 -778 -144 352 279
3973 279 184 432 -482 136 288 -387 -644 441 506 86 306 -668 797 426 -796 -565 -176 883 567
3992 567 339 934 -941 -163 -530 126 -450 -121 -900 726 152 156 387 -483 -6 142 463 -264 -280 389
4012 389 -112 -296 -304 553 -598 -281 19 266 691 -291 869 -157 -86 174 418 -148 369 -543 514 207
4032B07n2o22R48n20N04j129L21K39M65j65L4o11N76K55q03J019p40o7LP12o16
4053d2Jo8l89L83l06N03j33R00j103o22R77M62j70q4m34k46L59j71j35o25R71
4074B8l95L86p3o7L06k03L86o59P26M06r76l52m9L30p0M2j13P92n52K45o82N45
4096AJ90n44j85J176o13N2r5L34L04k94n44O08K48j217Q02k0J1n98K71l11K72
4117a52k60LO10r2M13m97p38J313p39j73L62M00J95l84K23l5l45o05J45N31O15
4138G90m41q86N39K17j08m78R8j34J66j87L13J84M12j10m65Ln01J042j240Q81
4158I5k43N0l25O63m84J11L81q86O40r4r42J194m43O8k72R31o71j15J02N5L73
4179A88k13r6m10P56k97l21o0J062n43M55l10L52n99m89P17l45N5J11m63K35L60
$$ plain form
4032 207 155 -467 481 -39 465 -664 -343 -104 361 196 230 -381 195 450 -353 666 -74 -141 -138 574 -42
4053 -42 -41 -109 -498 -115 -421 82 -51 849 -254 -876 101 563 393 309 -125 -371 -12 -183 -318 -943 28
4074 28 -367 19 -54 -121 185 -18 368 -291 435 841 -135 -487 -536 -206 -276 -234 -347 445 -107 138 -544 1
4096 1 191 -353 -538 638 25 77 -18 316 620 326 -218 390 638 -579 223 203 214 -384 -113 -424 -152
4117 -152 -412 -409 201 109 522 25 -713 600 -139 -312 50 450 645 261 484 449 104 -501 -356 175 790
4138 790 349 -537 2 219 111 -367 -269 -403 -237 -424 -111 73 485 375 -90 -87 -588 454 -786 95
4158 95 -148 -98 -423 240 -244 -133 248 -638 2 -92 -1034 160 -283 -215 -487 444 -227 -342 -240 -185 188
4179 188 -25 -121 -531 225 -72 -393 -453 609 66 521 211 563 -36 -525 192 -153 -98 13 -450 -215 145
4200A45k42K76l2q39P61K7j013Q63N34j18M9K13M6o64m64M16N11m97m69Q18k19
4221A02p48L44OJ28K02J08j113J020p51j92J440m34r8o8n34J077m96K10r3j95
4241h5O38q61M09L34n18L34j50L84k76l95N92l09R7j58k28M93J94or17l74P57
4262d5q91O07M71M08q22N76l7j09J64m76n2N0K91r1O92l66q22J207o64l43O77
4283D25j163P19k79L72p43J26L68l18J14J81j70N56j261J001J3J86L78p14O97
4302D88J67j019k89N16OL3O49n10p95J516r79L20p58M00J13n36J161m47l34K66
4322c2N14l85K01o40L50J82kJ73m80m49M65Q1K2n8k84R51l70q20L56J052o43k96
4344a12j02K91K59J30n50k78J078q43J95j81p19O78L42m00K31n0L9M14j61m98
$$ plain form
4200 145 -97 179 147 -692 69 96 -917 -54 480 362 411 624 670 6 -458 -42 469 -28 -497 321 102
4221 102 -646 -302 -296 -168 34 142 -971 49 -702 -894 546 112 14 -54 -588 489 -7 203 110 -85
4241 -85 553 -308 101 435 -83 251 101 485 209 -186 406 97 194 36 -192 301 495 489 -428 -802 -45
4262 -45 -936 -329 142 550 -272 304 267 158 322 -154 -206 -156 135 44 736 370 -452 755 91 -252 425
4283 425 -738 -19 -298 74 -669 -543 -175 -493 -379 -198 -368 188 -1073 -72 -59 127 505 -209 488
4302 488 655 -364 -653 -137 -131 -98 551 41 -754 762 -217 103 -655 -255 -142 -678 483 36 -298 -32
4322 -32 482 97 298 -342 8 190 188 361 -119 -568 -103 -22 0 -58 -342 609 239 -581 -225 827 184 -112
4344 -112 -214 77 336 466 -84 -362 716 -127 68 -113 -832 -154 188 -212 19 -31 8 422 261 -237
4364b37k74P52q88R10K59j08M02j433k18N52P52n09RM51p21P1J016r75m37O64
4384C8l08l83L98P96q89O99q88N58o15KN01L64o52N80n93J2L60l60M48L89m14
4405D3N06m19%o7O06n06m31r0k29R21l51K87l2K9n00m93O08M13n88K69k62j00
4427c86P99p27N06K63K78r32j7K83p4J80l01n83J236j130Q40j71P28m84o74O65
4447B99P3l10n67R93j365P26k35M03j48L44n49L6R6N63m18O64q33J65J75J74N38
4468H24r46J39K75q07M93pl53M56L2l75n39R69p9P59q03Q18j109N62L85r91P03
4489D06m87l11O69q65J13O3P36l84l07p41P69M17P20j290P67q41L87o19J145M30
4509G77o67K36m30K58k55N70j5j39o55J285j061M29M38j456J64M84j30M64l72
$$ plain form
4364 -237 -511 241 -647 263 522 414 816 -617 -835 -283 469 -40 -31 420 -301 -230 786 -189 -626 38
4384 38 -270 -653 -255 541 -348 351 -537 21 -594 -592 -91 273 -379 201 -392 -380 -20 -380 68 457 43
4405 43 549 130 130 63 669 163 -268 -358 -587 334 -17 270 238 267 -233 -726 -118 295 -293 -24 -286 -386
4427 -386 413 -314 192 455 733 -199 -216 67 -7 173 -128 -711 525 -605 235 64 792 308 -366 299
4447 299 372 62 -505 488 -877 -151 -386 17 -131 213 -336 -300 -204 359 -59 605 -228 -63 112 286 824
4468 824 -122 17 292 -515 -22 -29 -382 74 106 -269 -808 161 82 841 38 856 -253 309 694 -297 406
4489 406 -81 -392 277 -588 -475 -412 324 -60 -367 -1108 -339 78 798 -492 275 -566 -179 -798 347 777
4509 777 110 346 -84 174 -81 489 474 335 -320 965 -96 333 771 -685 -521 -37 -167 297 -75
4528g5L46l44K90P15j962J016J2K03M00m18j10p85K22l02L93j51N59j80n11P95
4548A13J6k4J30q95R88n07M87q92N95k29k03N97l3K10n46pN61n98L37On82R08
4570D32k28m60J90n87O76j2p61Q35m04N98l49l55O36m26r2L94j71q6r1J210r88
4591c9l82K69j01P5n22Q66k36L76n02L14L60j57l26l49J47L31n62N50m87M23j94
4612a46K04o76J178l88K05o57J27J52o88R34m31L14P15M46k222L42J78O34p97
4631e76J159l16J47n57j88N63N56j285q4J490j342J86K68M94j466Q86j57K87N20
4650E85n30o42J94J205n76j238J159j168O17k91O56l00l59O79K1r9O52o14l47
4669c96J79L27Q0o24L62L56N95j366M98k3J40k92q5O21m2m72K42l04O33n41L47
$$ plain form
4528 -75 271 -73 217 932 -1030 -14 -2 201 601 183 73 -712 -490 -792 -399 -550 9 -171 -682 113
4548 113 129 105 235 -660 328 -179 308 -584 11 -218 -421 176 143 353 -193 -200 361 -237 100 106 -476 432
4570 432 204 -256 -66 -653 23 11 -750 85 -319 279 -70 -425 211 -215 -307 87 -84 -170 -261 949 -39
4591 -39 -421 -152 -253 -178 -700 166 -70 306 -196 118 478 321 -5 -354 -207 124 -438 112 -375 48 -146
4612 -146 58 -618 560 172 377 -280 -153 -1 -689 245 -186 128 843 1289 -933 -591 -413 221 -576
4631 -576 583 267 414 -143 -331 232 788 -497 -581 909 -433 -247 21 515 -951 -65 -222 65 585
4650 585 55 -587 -393 812 236 -1002 157 -1011 -394 -685 -29 -329 -688 -9 12 -87 565 -49 -396
4669 -396 -217 110 190 -434 -72 284 879 -487 11 -12 128 -164 -249 372 330 -142 100 -204 429 -112 235
4690B35r31K45J63Q2J95j84L54k37K37J54p34L72m33N93l32m03j3Q78k92k24J040
4711G65n83L40J52o64r08Q10K6N29n87N73o18m10L89P97p90j9J57K26n63O44k43
4732B3l45P30j97L93q9l23m23P07l79j18N1J166j706L61L54j89r34J133j46n62
4752d93O36K85k76o51J27L79N5O61j140R50k76j1l53n37M72J48K43J00m85j65
4772c31J014r30m51O47q15M69R45o47J02K05k41PK73l45P49p19Nn80L24Q54p61
4793b26O92q04l3M18j40l7o03K90k23L43N29j210R36l09m5L78L6k6j82O52p75
4814c39j64Q73O41j192q2P09K21q14K15K31J62k73q1K80K21K28p48Pl31K61j28
4835a03N83o67K55k89K49K54p28J216K9q23k46N44M78K00q17K29K60p50k16J94
$$ plain form
4690 235 -696 -451 -288 -206 -11 -195 159 -78 159 313 -421 -49 -482 111 -221 -624 -637 241 -51 -275 765
4711 765 182 522 674 10 -898 -88 -62 467 -120 453 -165 -575 -186 611 -179 -198 -41 185 -378 266 23
4732 23 -322 408 211 604 515 192 -231 476 97 -21 30 1196 -510 -149 205 16 -918 215 69 -493
4752 -493 143 428 152 -499 -372 7 62 723 -417 533 257 246 -107 -644 -172 -24 219 319 -166 -331
4772 -331 683 -247 -698 -51 -866 -397 548 -99 3 208 -33 -26 247 -98 651 -68 -63 -643 -319 535 -226
4793 -226 466 -338 -371 47 -93 -130 -733 -443 -666 -323 206 -1004 -68 -377 -422 -44 -8 -34 -216 436 -339
4814 -339 -503 370 1011 -181 -263 446 667 -147 68 299 461 188 107 387 608 836 88 95 -236 25 -103
4835 -103 480 -187 68 -221 28 282 -446 770 799 -24 -270 274 752 952 135 364 624 -126 -342 -148
4855a48o1j56Q98O4n50J02n24L24R0l63M48m28P06J40l60m20O76j003M25k92Q54
4876D22P7m35J69Mn97J44n26Q45n07J20K67N59j0p37J0L36p7P9j83k08K41k35
4898b42J34m74N73P00l06l64o18N63k38M83l30n02M75N02r85J094j002o2M07N21
4918C29m10L35m95P9M57m78j10N53l66o20P12K90o7j83q2N10q03o5J490j754N20
4939a58J15k62J93O7j64J8M24k77j19L85N43l84j52l33L94j67j24m13P50j0o13
4960b87Q23m70L91p17m41J049j126O6N69n64O34L93q0k09Q5k64l99L99j21Q72
4980F03m35j37k29j93O65n84K74J50J99m23o82Q39J31j34P36n02r76J114o46N04
$$ plain form
4855 -148 -209 -365 533 597 47 149 -375 -51 39 -324 124 -304 402 542 182 -238 438 -565 -140 -432 422
4876 422 499 64 233 237 -360 -216 -742 103 -404 -284 -17 542 532 -205 -195 141 64 143 -40 -248 -7 -242
4898 -242 -108 -582 -9 691 385 21 -597 -34 -272 211 -119 -621 -146 356 -629 465 -537 -599 -192 329
4918 329 -81 254 -241 -162 295 -183 -293 260 -106 -726 -14 276 209 26 -56 454 -349 -414 1076 -678 -158
4939 -158 -43 -305 -112 -45 -209 -191 233 -44 -163 222 765 381 229 -104 290 123 -1 -414 336 326 -287
4960 -287 536 66 457 -260 -701 348 -778 -712 -143 -707 -73 320 240 31 116 -148 -547 -148 -269 603
4980 603 168 31 -198 -391 274 -310 -36 114 313 -110 -792 47 178 44 780 278 -698 416 -230 274
$$ [...]
8191B57
##END NTUPLES=NMR FID
##END=
