##TITLE=1H_TG-2261
 CDCl3, 8 sc, 
 13.11.2019
##JCAMPDX= 6.0         $$ Bruker NMR JCAMP-DX V2.0
##DATA TYPE= NMR FID
##DATA CLASS= NTUPLES
##ORIGIN= UXNMR, Bruker Analytische Messtechnik GmbH
##OWNER= root
$$ XWIN-NMR		Version 3.5
$$ Wed Nov 13 14:01:25 2019 Russian Standard Time (UT+4h)  she@DPX200
##.OBSERVE FREQUENCY= 200.1315
##.OBSERVE NUCLEUS= ^1H
##.DELAY= (6, 6)
##.ACQUISITION MODE= SIMULTANEOUS
##.ACQUISITION SCHEME= undefined
##.AVERAGES= 8
##.DIGITISER RES= 18
##SPECTROMETER/DATA SYSTEM= spect
##.PULSE SEQUENCE= zg30
##.SOLVENT NAME= D2O
##.SHIFT REFERENCE= (INTERNAL, D2O, 0, 15.7039)
##AUDIT TRAIL= $$ (NUMBER, WHEN, WHO, WHERE, WHAT)
$$ ##TITLE= Audit trail, XWIN-NMR		Version 3.5
$$ ##JCAMPDX= 5.01
$$ ##ORIGIN= Bruker BioSpin GmbH
$$ ##OWNER= she
$$ F:/spectra/data/she/nmr/H-F/1/audita.txt
$$ ##AUDIT TRAIL=  $$ (NUMBER, WHEN, WHO, WHERE, WHAT)
(   1,<2019-11-13 13:59:55.71 +0400>,<she>,<DPX200>,
      <created by zg, POWCHK disabled, PULCHK disabled
       configuration hash MD5:
       00 E9 B6 7A A2 85 ED C7 34 08 36 98 17 FE 4E 26
       data hash MD5: 16K
       8D 44 AF 71 C8 72 16 B3 F0 97 A0 8F B5 51 D4 18>)
$$ ##END=
$$ 
$$ hash MD5
$$ 81 DF 4E 82 75 F6 C1 EB 05 C9 00 47 BD F5 64 AB
##$RELAX= 
##$RELAX= 
##$RELAX= 
##$RELAX= 
##$RELAX= 
##$RELAX= 
$$ Bruker specific parameters
$$ --------------------------
##$DU= <F:/spectra>
##$EXPNO= 1
##$NAME= <H-F>
##$PROCNO= 1
##$TYPE= <nmr>
##$USER= <she>
##$AMP= (0..31)
100 100 100 100 100 100 100 100 100 100 100 100 100 100 100 100 100 100 
100 100 100 100 100 100 100 100 100 100 100 100 100 100 
##$AQSEQ= 0
##$AQ_mod= 1
##$AUNM= <au_zg>
##$AUTOPOS= <>
##$BF1= 200.13
##$BF2= 200.13
##$BF3= 200.13
##$BF4= 200.13
##$BF5= 200.13
##$BF6= 200.13
##$BF7= 200.13
##$BF8= 200.13
##$BYTORDA= 1
##$CFDGTYP= 0
##$CFRGTYP= 5
##$CHEMSTR= <none>
##$CNST= (0..31)
1 1 145 1 1 1 1 1 1 1 1 1 1 1 1 1 1 1 1 1 1 1 1 1 1 1 1 1 1 1 1 1 
##$CPDPRG= <>
##$CPDPRG1= <>
##$CPDPRG2= <>
##$CPDPRG3= <>
##$CPDPRG4= <mlev>
##$CPDPRG5= <mlev>
##$CPDPRG6= <mlev>
##$CPDPRG7= <mlev>
##$CPDPRG8= <mlev>
##$CPDPRGB= <>
##$CPDPRGT= <>
##$D= (0..31)
0 1.2 0 0 0 0 0 0 0 0.06 0 0.03 0 0 0 0 0.0002 0 0 0 0 0 0 0 0 0 0 0 0 
0 0 0 
##$DATE= 1573639195
##$DBL= (0..7)
120 120 120 120 120 120 120 120 
##$DBP= (0..7)
150 150 150 150 150 150 150 150 
##$DBP07= 0
##$DBPNAM0= <>
##$DBPNAM1= <>
##$DBPNAM2= <>
##$DBPNAM3= <>
##$DBPNAM4= <>
##$DBPNAM5= <>
##$DBPNAM6= <>
##$DBPNAM7= <>
##$DBPOAL= (0..7)
0.5 0.5 0.5 0.5 0.5 0.5 0.5 0.5 
##$DBPOFFS= (0..7)
0 0 0 0 0 0 0 0 
##$DE= 6
##$DECBNUC= <off>
##$DECIM= 24
##$DECNUC= <off>
##$DECSTAT= 4
##$DIGMOD= 1
##$DIGTYP= 9
##$DL= (0..7)
0 120 120 120 120 120 120 120 
##$DP= (0..7)
150 150 150 150 150 150 150 150 
##$DP07= 0
##$DPNAME0= <>
##$DPNAME1= <>
##$DPNAME2= <>
##$DPNAME3= <>
##$DPNAME4= <>
##$DPNAME5= <>
##$DPNAME6= <>
##$DPNAME7= <>
##$DPOAL= (0..7)
0.5 0.5 0.5 0.5 0.5 0.5 0.5 0.5 
##$DPOFFS= (0..7)
0 0 0 0 0 0 0 0 
##$DQDMODE= 0
##$DR= 18
##$DS= 0
##$DSLIST= <SSSSSSSSSSSSSSS>
##$DSPFIRM= 0
$$ [...]
##$SUBNAM2= <"">
##$SUBNAM3= <"">
##$SUBNAM4= <"">
##$SUBNAM5= <"">
##$SUBNAM6= <"">
##$SUBNAM7= <"">
##$SUBNAM8= <"">
##$SUBNAM9= <"">
##$SW= 24.0689530833862
##$SWIBOX= (0..15)
0 0 2 0 0 0 0 0 0 0 0 0 0 0 0 0 
##$SW_h= 4816.95568400771
##$TD= 16384
##$TD0= 1
##$TE= 0
##$TE2= 300
##$TE3= 300
##$TEG= 300
##$TL= (0..7)
0 120 120 120 120 120 120 120 
##$TP= (0..7)
150 150 150 150 150 150 150 150 
##$TP07= 0
##$TPNAME0= <>
##$TPNAME1= <>
##$TPNAME2= <>
##$TPNAME3= <>
##$TPNAME4= <>
##$TPNAME5= <>
##$TPNAME6= <>
##$TPNAME7= <>
##$TPOAL= (0..7)
0.5 0.5 0.5 0.5 0.5 0.5 0.5 0.5 
##$TPOFFS= (0..7)
0 0 0 0 0 0 0 0 
##$TUNHIN= 0
##$TUNHOUT= 0
##$TUNXOUT= 0
##$USERA1= <user>
##$USERA2= <user>
##$USERA3= <user>
##$USERA4= <user>
##$USERA5= <user>
##$V9= 5
##$VALIST= <valist>
##$VCLIST= <CCCCCCCCCCCCCCC>
##$VD= 0
##$VDLIST= <DDDDDDDDDDDDDDD>
##$VPLIST= <PPPPPPPPPPPPPPP>
##$VTLIST= <TTTTTTTTTTTTTTT>
##$WBST= 1024
##$WBSW= 4
##$XGAIN= (0..3)
0 0 0 0 
##$XL= 0
##$YL= 0
##$YMAX_a= 258202
##$YMIN_a= -555043
##$ZGOPTNS= <>
##$ZL1= 120
##$ZL2= 120
##$ZL3= 120
##$ZL4= 120
##$ABSF1= 10
##$ABSF2= 0
##$ABSG= 5
##$ABSL= 3
##$ALPHA= 0
##$AQORDER= 0
##$ASSFAC= 0
##$ASSFACI= 0
##$ASSFACX= 0
##$ASSWID= 0
##$AUNMP= <proc_1d>
##$AZFE= 0.1
##$AZFW= 0.1
##$BCFW= 1
##$BC_mod= 2
##$BYTORDP= 1
##$COROFFS= 0
##$CY= 11.3945322036743
##$DATMOD= 1
##$DC= 2
##$DFILT= <>
##$DTYPP= 0
##$F1P= 16.9975609425685
##$F2P= -3.02152046262296
##$FCOR= 0.5
##$FTSIZE= 0
##$FT_mod= 4
##$GAMMA= 1
##$GB= 0.15
##$INTBC= 1
##$INTSCL= 1
##$ISEN= 128
##$LB= 0.24
##$LEV0= 0
##$LPBIN= 0
##$MAXI= 10000
##$MC2= 0
##$MEAN= 0
##$ME_mod= 0
##$MI= 1.114404
##$NCOEF= 0
##$NC_proc= 0
##$NLEV= 6
##$NOISF1= 3.799351
##$NOISF2= 2.8
##$NSP= 1
##$NTH_PI= 0
##$NZP= 0
##$OFFSET= 15.70392
##$PC= 1
##$PHC0= -9614.388
##$PHC1= 16.20088
##$PH_mod= 1
##$PKNL= yes
##$PPARMOD= 0
##$PSCAL= 0
##$PSIGN= 0
##$REVERSE= no
##$SF= 200.130013532006
##$SI= 16384
##$SIGF1= 3
##$SIGF2= 2
##$SINO= 400
##$SIOLD= 16384
##$SREGLST= <1H.CDCl3>
##$SSB= 0
##$STSI= 0
##$STSR= 0
##$SW_p= 3612.71676300578
##$SYMM= 0
##$S_DEV= 0
##$TDeff= 0
##$TDoff= 0
##$TI= <>
##$TILT= no
##$TM1= 0
##$TM2= 0
##$TOPLEV= 0
##$USERP1= <user>
##$USERP2= <user>
##$USERP3= <user>
##$USERP4= <user>
##$USERP5= <user>
##$WDW= 1
##$XDIM= 8192
##$YMAX_p= 0
##$YMIN_p= 0
$$ End of Bruker specific parameters
$$ ---------------------------------
##NTUPLES= NMR FID
##VAR_NAME=  TIME,          FID/REAL,        FID/IMAG
##SYMBOL=    X,             R,               I
##VAR_TYPE=  INDEPENDENT,   DEPENDENT,       DEPENDENT
##VAR_FORM=  AFFN,          ASDF,            ASDF
##VAR_DIM=   8192,          8192,            8192
##UNITS=     SECONDS,       ARBITRARY UNITS, ARBITRARY UNITS
##FACTOR=    0.0002076,     1,               1
##FIRST=     0,             0,               0
##LAST=      1.7004516,     0,               0
##MIN=       0,             -555043,         0
##MAX=       1.7004516,     258202,          0
$$ Real data points
##PAGE= N=1
##DATA TABLE= (X++(R..R)), XYDATA
0@%%%%%qJ2j2J6k4L2l6M4n6P2q8J04j28J56j83K15k51K93l40L93m54N19n91O71
29C56p59Q58r67J087j220J365j522J695j888K097k325K581k861L163l498L875
45B037m294M764n293N893o582P384q329R458j0843J2585j4854J7947k2438K9630
59A7065m3348J06391m34308m3747O33433n8023l18089J36492K29552k54686j39787
70a69055K62951J27175k85279j56569J48861J37693j71M3054q034j37461p6122
81a12957R2111N2854j7964J2979j4987o5673N8955J04505o4181j15088J2079q508
93f5875m4450J14613J45860r7325j71960J6403Q9804J1676J308j4665p6540J736
105h9415J43516O4876j15370q0044M3604j2257m8313J20183J36614j37311j80908
$$ plain form
0 0 0 0 0 0 0 -8 4 -8 8 -16 16 -20 24 -32 40 -48 56 -72 84 -99 116 -135 158 -182 211 -243 276 -315 356
29 356 -403 455 -512 575 -645 720 -802 893 -995 1102 -1223 1358 -1503 1660 -1838 2037
45 2037 -2257 2507 -2786 3107 -3475 3909 -4420 5038 -5805 6780 -8074 9873 -12565 17065
59 17065 -26283 80108 -354200 -397947 235486 177463 -140626 -4134 225418 -29268 -169055
70 -169055 93896 221071 -64208 -220777 -71916 65777 65606 108660 100626 -36835 -112957
81 -112957 -20846 32008 14044 27023 12036 -53637 5318 109823 45642 -69446 -57367 -65875
93 -65875 -110325 4288 150148 52823 -119137 -102734 -12930 -1254 54 -14611 -91151 -89415
105 -89415 54101 118977 3607 -76437 -32833 -45090 -93403 26780 163394 26083 -154825
116a54825J18162J60872j04981j10571P9130J5587q2242P5445J28441p9650j34882
127h9514K6408N8042j6469K2736N7795l7880q1225K4965R0898J3423o5711m8679
139d5211p12L7833O6268K2191o0141m1206K0159j1336j3125P9398K9805j28135
151d4212n0660J40455N9959j08107l3901N4391m0731m3772J02971P8383r8042
162A6734r2711O1451P0211l7331l3032L7743q92n6747J9125Q3354k243p7744l0222
175d2304J9269K5614L8505M571n8267k4962M1306J1583j9582J7777L031n1782
187c5241j0464O0805L3098k8449l5180j5852P160L2341K2796j7194l0949n749
199b2878J6971J5208Q926J13l0748l8466K6157O1431j2477n2162J5976K1312m7435
$$ plain form
116 -154825 -36663 124209 19228 -91343 -12213 3374 -78868 -3423 125018 45368 -89514
127 -89514 -63106 -5064 -21533 1203 58998 21118 -60107 -35142 55756 69179 3468 -45211
139 -45211 -45923 -8090 58178 80369 20228 -20978 -819 -12155 -25280 54118 83923 -44212
151 -44212 -94872 45583 105542 -2565 -36466 17925 -22806 -66578 36393 114776 16734
162 16734 -75977 -14526 55685 18354 -14678 23065 22173 -34574 -15449 67905 65662 -12082 -42304
175 -42304 -23035 2579 41084 45655 -12612 -37574 3732 15315 -4267 13510 16541 -35241
187 -35241 -45705 15100 48198 19749 -15431 -31283 -24123 8218 31014 13820 -17129 -22878
199 -22878 -5907 9301 18227 18340 -12408 -50874 -24717 36714 24237 -27925 -11949 9363 -38072
212c8072l99Q2083m763r9811l195Q9901J1679n5902l222K4899j8594j7644L4323
225A283L1403k6219l9036O096K5632Q259L843n916l1654r874L9061K1034k3755
238A57j3059J116j1058R931L1147o723k9160J901Q463n168J7691K2365k5149l7336
252c4882J2434L7133Q494j8594j4231L67M652O810J1292j143j8854p319J1363
265b478M975N739J3876j5899l5219J2369M1212k080k5813j242K157l623J6809
278A0783J3694j8166j5156Q724N233j878R610P677j4502j9631O415K7637P251
291B7691k4816j6951J0560J2871M618N18j1535j0462R308M288r334J1897J5441
304B4094k5600k3656K7757K6038j9667j9431P435M066k351J0032P219j3668j6304
$$ plain form
212 -38072 -38471 43612 38849 -60962 -64157 25744 37423 -18479 -21701 3198 -15396 -33040 1283
225 1283 32686 6467 -32569 -26473 -841 7418 11261 5345 -26309 -36183 2878 23912 157
238 157 -12902 -11786 -22844 -12913 18234 11511 -17649 -15748 -7285 -12453 5238 27603 2454 -34882
252 -34882 -22448 14685 23179 4585 -9646 -9279 -4627 2183 13475 12332 -6522 -13841 -2478
265 -2478 2497 8236 22112 6213 -29006 -16637 24575 22495 -3318 -4560 -2403 -6026 10783
278 10783 24477 6311 -8845 -121 5112 3234 12844 20521 6019 -13612 -7197 20440 27691
291 27691 2875 -14076 -3516 9355 13973 14491 2956 -7506 1802 6090 -3244 8653 24094
304 24094 -1506 -25162 2595 28633 8966 -10465 -3030 1036 -1315 8717 15936 2268 -14036
317a4036N997J6771m08j1347K781L690j3978j583K3601M299k5245j0370J2610
330g218J0121M433l590j4644k747J3994J645q508M923L928j2288m944J3638J0433
344I176m930j3284q175P510J3491J281q525o047M2O220M753m483k453L695n727
359g456n858J3835J0490j2973r685N570Q83J991J1787l336j8464J456J7801J684
373G725j0937j727M942p98m654L724J0426j390j4644k837J2433N284l493l178
387H76n751j336J1922N581j0732l994N816k320k176Q334K815o520k651k65N3P288
403F940L953r554p916O003J0180J413q174o182M443M572m065Q1O992k786r024
418c124K114O346Q12N06l748q605L999J2355j894r616l7K927n89J689J407k588
$$ plain form
317 -14036 -8039 8732 8324 -3023 -242 3448 -10530 -12113 11488 15787 -9458 -19828 -7218
330 -7218 2903 7336 3746 -10898 -13645 349 1994 -6514 -1591 2337 -9951 -14895 -1257 9176
344 9176 4246 -9038 -17213 -9703 3788 5069 -3456 -9503 -9461 -3241 1512 -2971 -5424 -1729 -7456
359 -7456 -13314 521 11011 -1962 -11647 -6077 -5194 -3203 8584 5248 -13216 -11760 6041 7725
373 7725 -3212 -4939 3 -795 -5449 -1725 8701 7311 -7333 -10170 2263 7547 4054 876
387 876 -4875 -6211 5711 11292 560 -3434 2382 62 -2114 6220 9035 2515 -136 -401 -348 6940
403 6940 10893 1339 -6577 -574 9606 11019 2845 -3337 1106 5678 1613 1694 8686 5900 -3124
418 -3124 -1010 5336 6148 6654 2906 -5699 -1700 10655 8761 -855 -892 2035 1446 3135 4542 1954
434A954j137l07j639K155M409j373n571l461J808P939L167r480o046O738M118
449C274l823m03J085k752M61J872j988K297M028p489p710Q496R128n070p199q4
465e877L346K504p89k352J20K32j923J729L223j649j375K99l427j54Q631J088
481C626r929k130O905K701j635j275k675L44L818q15k212L486J248n093j677M173
497a140L760n45m853l405M835O094l076m760J163J532L68J516p43j023K450j305
513H68m537L761O336l389n576J397L000J664J091l521l818L535L908k060k114
528E45J384Q05p97j533M07M004P26o551j965O760K567l841j784j72K08L133M41
545D337m175P2L517j817k415K897J539k005j846j211J544L975m52n442q26L702
$$ plain form
434 1954 817 510 -1129 1026 5435 4062 -1509 -4970 -3162 4777 7944 -1536 -7582 -844 3274
449 3274 -549 -952 133 -2619 -2158 -286 -2274 23 4051 -3438 -11148 -2652 6476 1406 -5793 -5877
465 -5877 -2531 -27 -816 -3168 -3048 -2816 -4739 -3010 213 -1436 -2811 -2512 -5939 -6093 2538 3626
481 3626 -6303 -8433 -1528 1173 -462 -1737 -4412 -4068 -250 -1065 -3277 209 1457 -3636 -5313 -1140
497 -1140 2620 2075 -2778 -6183 -1348 4746 1670 -3090 -1927 -395 -27 1489 746 -277 2173 868
513 868 -3669 92 6428 3039 -2537 -1140 1860 3524 4615 1094 -2724 811 4719 2659 545
528 545 1929 2734 1937 404 811 4815 5541 -1010 -2975 3785 6352 2511 727 555 763 3896 4337
545 4337 162 234 3751 1934 -481 2416 3955 1950 104 -1107 437 4412 3960 -1482 -2308 1394
561A394J537j165j814j351J921J770l183q87M198n52m994M68L745O43j089k286
577a645k454K611M325k551m065J674J984r51o90L45M14O02j721k112K671L198
593A635k617l070Q97J483J587M02l516j621L849J379l140J14K097p28j220k0K79
610b210K053R61l846j845M504K473l116k126J148J431J144j069j802J627J423
625G50k121o00K492M69j147m44j189R27L662o62m711Q77M064l65k149J49N50O11
643A163L81j331k06K428j61l009M51K307O25n07j854j355K884K291k711k261K397
660A532J102j352k26K68K51P26j375j712K377K443k609k534J564J545K19n09j751
677d1n82K399M17k353K45J638o24j088m58M61J945j57l580k49L763N16l119l39
$$ plain form
561 1394 2931 1766 -48 -1399 522 2292 -891 -1778 2420 1868 -3126 -2658 1087 1730 641 -1645
577 -1645 -4099 -1488 2837 286 -3779 -2105 -121 -1072 -1762 -1417 -1003 -401 -2122 -4234 -1563 1635
593 1635 -982 -4052 -3155 -1672 -85 317 -3199 -4820 -971 408 -2732 -2618 -521 -1249 -2469 -2489 -2210
610 -2210 -157 804 -3042 -4887 -383 2090 -1026 -3152 -2004 -573 571 -498 -2300 -673 750
625 750 -1371 -1971 521 990 -157 -601 -1790 -863 2799 2137 -2574 -1697 2367 2002 -147 2 552 1163
643 1163 1544 213 7 2435 2274 -735 -284 2023 2648 2141 287 -1068 1816 4107 1396 -865 1532
660 1532 2634 1282 1056 1324 1575 2301 926 -786 1591 4034 1425 -1109 455 2000 2219 1710 -41
677 -41 -623 1776 2193 -160 85 1723 1099 11 -447 14 1959 1802 -1778 -2027 1736 2252 -867 -1206
695a206R04L12L81m67j343J019J350j962j081J914P46j228q92m93J221J763j406
712d68k656J400K224r85j363M09L65J99R8j239O3K304n91k543N90K192k24p31
730i56r58m17J907J246k363j120K275P48j531k26M77O84K49j313p88K183J278
747A375k148j082J418R07p0k36j234K43J893j95j951P64J685p97j027L01Q00P73
765A419l18j936J64K587j8j864j23J009L24M1o65n61J236N71j589m29J689M62
783A999j227n08J5Q65J248j339j754J411J506j110j030O86L26p7l14p91M85J466
801A857q46j651O57J444l49o63r11P9J372L64j959l23J912o8j453N4P15J32j26
820B37q18m93J333P50j704p32J234N37n60l92n57M36J077o23j364J002R24r65
$$ plain form
695 -1206 -302 10 391 -76 -1419 -400 950 -1012 -2093 -179 567 -661 -1553 -2046 -825 938 -468
712 -468 -3124 -1724 500 -485 -1848 -1439 -1074 -875 -777 -2016 -1953 351 -240 -2783 -2193 -1 -225 -956
730 -956 -1914 -2331 -424 822 -1541 -2661 -386 362 -1169 -1395 -918 -234 15 -1298 -2086 97 1375
747 1375 -773 -1855 -437 470 400 164 -1070 -827 1066 871 -1080 -316 1369 572 -455 -154 646 1419
765 1419 1101 -835 -671 1916 1898 34 -89 920 1244 1285 620 59 1295 1866 277 -152 1537 1999
783 1999 772 264 279 1144 2392 1053 -701 710 2216 1106 76 762 1088 1011 697 -94 391 1857
801 1857 1011 -640 17 1461 1112 449 -462 -383 989 1353 -606 -929 983 915 -538 -484 231 363 237
820 237 -581 -1074 259 1009 -695 -1427 -193 344 -216 -608 -1165 -729 348 -275 -1639 -637 287 -678
838f78o34K87M66N12m59j266M81J528l77j526L76R13j33q3m11l18J051L29j324
857a266j49J451J28r86m30M72N89N81j061q57J264R46j134m43O59K58r2o1n71
876g02M33J241q23j180O60J318n07o44j11L03P47J42j272J81J279j92j161L74
894H6O54J06j47o97q3J113L92j280m09J226K88o37k69j82M34O32p91o72R66P60
914A490r57o12M56M65J14n36n27K76J187n59j034M44N15j00j67m59L9O62J2r82
934b73j6J171k62q88p3L47L07J77o68o10J063L09q76m25O26J29k76k04k58M46
954b54O16o34r04P58P31p04n56K70L25M16k19q68J79J023m09q10K90M95Mk46l45
975h42j69R90N1j048L9P63K15m42k32K4M58L75p00l35O95N22q46l08N38L69j04
$$ plain form
838 -678 -1312 -1025 -559 -47 -506 -1772 -1291 237 -140 -1666 -1290 -377 -510 -593 -1004 -1322 -271 58 -1266
857 -1266 -1415 36 164 -822 -1252 -780 -191 390 -671 -1528 -264 682 -452 -895 -236 22 -70 -131 -702
876 -702 -269 972 149 -1031 -371 947 440 -204 -315 -12 735 877 -395 -214 1065 873 -288 86
894 86 740 846 699 2 -81 1032 1424 144 -265 961 1249 612 343 161 595 1227 436 -236 730 1490
914 1490 533 -79 377 842 956 420 -107 169 1356 797 -237 207 722 622 455 -4 35 697 709 -273
934 -273 -289 882 620 -268 -341 6 313 490 -178 -788 275 584 -292 -717 -91 38 -238 -442 -700 -254
954 -254 362 -272 -1176 -418 313 -391 -947 -677 -352 64 -155 -1023 -844 179 -230 -1040 -750 -255 -251 -497 -842
975 -842 -1011 -21 30 -1018 -979 -216 -1 -443 -675 -651 -193 182 -518 -853 -158 364 -482 -790 -252 117 13
996A3k49l73M71P24n82p04N05O78l36k74m8J33N65q8p81J38R10l72m83J46L22
1017C15J37P8m79k64P38K59p78lN87K6l00o5j23M38L78o35n45Q08L45n60m02L81
1039C36Q7K95k78n87L26O90m42n86M15L68k57l7l71k0N37M1p32J08N66R3o77J4
1061a11J45J45R9n63J5M58K96p86j20M66M3m2l97p8K88N15n11n97N67L31l39k26
1083d02R4m0K56n4n23J77N60j21n90J88K83j4p5k32n8M87N4o30L2O96j84l10J7
1106c89K6L10J64m82l75Q12J95n33k30L19J38j3q8l88M29M20m20k73K76K40p7
1127F1j86o0J30M32j55n40K08M95k23m08K94O9K43r3k87j6N51j09m41j38M78J74
1149D79j89k06j02J82M23m24l19M12L42l18k72K14J97J08j13m55L43L44l51l83
$$ plain form
996 13 -236 -609 -138 586 4 -700 -195 483 147 -127 -175 -42 523 435 -346 -208 702 330 -153 -7 315
1017 315 452 530 51 -213 525 784 6 3 590 616 316 251 128 566 944 309 -236 572 917 357 -45 336
1039 336 423 718 440 -147 179 869 427 -159 256 624 367 330 -41 -61 476 517 -215 -107 459 552 -125 -111
1061 -111 34 179 278 -285 -270 188 484 -302 -422 44 87 45 -352 -430 -142 373 -138 -735 -168 163 -176 -402
1083 -402 -308 -348 -92 -146 -669 -492 68 -53 -643 -455 -172 -186 -261 -493 -551 -64 -10 -640 -608 88 -96 -406 -389
1106 -389 -363 -53 111 -371 -746 66 261 -272 -502 -183 -45 -58 -146 -534 -105 315 -105 -378 -102 138 61
1127 61 -125 -185 -55 377 222 -318 -110 385 162 -246 48 117 360 267 -20 -36 515 406 -35 -173 305 479
1149 479 290 84 -18 164 587 163 -156 256 598 280 8 222 419 527 414 -41 302 646 295 -88
1169h8J70K93j6k00j58P6K93J9n21RO05k43l01L7R3J26J09m19mK83J29m35o2J18
1193h7J58O0k06k31L53J44l67k62M41K5k37j51J97oK03k9m38J71L11j04l97K38
1215b14J98n6m9l64J79K94m4l09%J98K2n8r5J18J02P9j96l84O09k9l59m6K37J01
1239f6J52k22j81K56K54l02l73L91J72k10L7j25J65K27q6k69R4L10j32j50N6j8
1261b0K85j33j82J7L00N4m56J86K45J4j46l9m7K58r7j16k62M71L4j98j87J95J44
1284C20Q9k40k31K07L03k03l04K19Lk2P1j13l6L23j08l44J06J41m6j42n4J14J44
1307A97j6l24K0L72m2l20J47o4K98j13k38j24J57L22l79j35K54L4k22R1o8M3K82
1330A72l60k48L47K10k13j58P1P1O5m8j94k9K83N0l41L6K53k8j42K6OK37K1k54
$$ plain form
1169 -88 82 375 359 159 1 77 370 389 -132 -123 482 239 -62 -25 68 194 303 -116 -120 163 292 -143 -205 -87
1193 -87 71 131 -75 -306 47 191 -176 -438 3 28 -209 -360 -163 -169 34 5 -433 -262 49 -55 -452 -214
1215 -214 -16 -72 -121 -485 -306 -12 -56 -365 -365 -167 -145 -203 -298 -180 -78 1 -195 -579 30 1 -358 -404 -167 -66
1239 -66 86 -136 -317 -61 193 -109 -482 -91 81 -129 -92 -217 -52 175 89 -180 -86 224 92 -58 -2 -20
1261 -20 265 132 -50 -33 267 321 -135 51 296 310 164 125 78 336 239 123 -139 332 366 168 -19 176 320
1284 320 409 169 -62 145 448 245 -59 160 163 141 212 99 63 386 278 -66 40 181 135 -7 -61 53 197
1307 197 181 -143 -123 249 207 -113 34 -30 268 155 -83 -207 -50 272 -107 -242 12 46 -176 -85 -153 -110 172
1330 172 -188 -436 -89 121 -92 -250 -179 -108 -43 -91 -285 -314 -31 19 -322 -286 -33 -61 -203 -177 -171 66 87 -167
1354a67j88L08P0k70M9J6K52J8j88q8J52R0j69k56M25N1j36l2j45Q4L54j54k23
1377a47J41J58j3k73Q2K03O5j07k2n7J18O7k32m9K04P8j20l5j19K92J8j86k24
1400a58L45J0n9m6n4J11J23j84j37J92K05k39j56J82P7r2j5k10J99K76l25j73
1422a28Q2K32j4j18o3O2J97p5l03M3J64M2j64q2J35N9K1r5k15K34p1m7j76L02
1446B2l5J4j03k3J83m0j02j27J80O5j25N3j47K05j11N8j11l7J39L9j72J31J6j2
1470d0m7K4q1J76Rk96m4L27oj18M3j21J65o5J0p5L4Q4lj69J76J09j21J3j79K03
1496Hqk2j14J09L13l14l7O2RJ33o5k35J14K21j22j12qO7J08J13j66j10P2K62l59
1521h1J08N3R5Pk42J05J12n0k3j51Q8L43l55j27K37n8O1j6j50Q3J33q6k08J96
$$ plain form
1354 -167 -355 -47 23 -247 -198 -182 70 88 -100 -188 -36 54 -115 -371 54 105 -31 -63 -208 -124 230 76 -147
1377 -147 -6 152 139 -134 -52 151 216 109 87 30 148 215 -17 -66 138 216 96 61 -58 234 252 66 -158
1400 -158 187 197 138 92 38 149 272 88 -49 143 348 109 -47 135 212 120 105 -105 94 370 45 -128
1422 -128 -46 186 172 54 -9 53 250 175 -128 -85 79 121 -43 -125 10 69 90 -5 -220 14 -57 -104 -280 22
1446 22 -13 1 -102 -125 58 18 -84 -211 -31 34 -91 -38 -185 20 -91 -33 -144 -181 -42 -3 -175 -44 -28 -40
1470 -40 -87 -63 -144 32 41 -255 -299 28 22 -96 -53 -174 -9 -74 -64 -139 -105 -21 -24 -193 -17 92 -29 -16 -195 8
1496 8 0 -22 -136 -27 286 -28 -65 -3 6 139 74 -161 -47 174 52 -60 -68 -1 107 220 54 -56 16 278 -81
1521 -81 27 80 175 182 -60 45 157 107 84 -67 21 364 9 -118 119 61 122 106 -44 39 172 86 -122 74
1545G4P1Lj05M4o1P0l4j80P0K14p7j09o3J34J5j1j35J61j0N4j78J0rJ48j56o5
1571a25P0L5k0l0j64K32J17k25J02k2p9J44m9j46N6L4p2M9J3L1k4K3nr5O5Q6p4
1598g3p3J00M6K7p3K0K7oo4o8Q3O5q7P7j8l8k6J63j83R8Q5r1p6J74r7lr2M2l7
1627i8J20l9n4j2Q2L3j24J03j4J40l0j60N6NL0j02K3J69m0RJ5j43N5J3O1j72R6
1654B2J10j60K8l3K12l7J2p5l1J33q1j80J51Q9j7l2j80M8J27k5j21O3j13J81p2
1679A9q2J84j70N0L3q7O9J48k94N2J67j43O1nj54J05%K0P2l8r2Q6n0p1R9P3j50
1706i8p9Q2O0m9oNR0j32O6N3q4J36n3j35j0J66j01Q6kqm6O4q1p5J93K8j50lJ49
1735F6om0m8l1j33L34k17J25r0k0J75j45j2L4L5m0j06J20Q4j9o2J0L4J36j30N4
$$ plain form
1545 74 145 148 43 87 26 96 62 -118 -48 166 89 -20 -83 51 66 55 -80 81 71 125 -53 -43 -52 96 -60 -125
1571 -125 -55 -20 -40 -70 -234 -2 115 -110 -8 -30 -109 35 -14 -160 -104 -70 -142 -93 -80 -49 -73 -50 -55 -150 -85 1 -73
1598 -73 -146 -46 0 27 -46 -26 1 -5 -69 -137 -54 11 -76 1 -17 -55 -81 82 -101 -3 82 -9 -85 89 -8 -11 -103 -61 -98
1627 -98 22 -17 -71 -83 -1 32 -92 11 -3 137 107 -53 3 8 38 -64 -41 128 88 97 112 -31 24 37 98 -74 22
1654 22 132 -28 0 -33 179 142 154 79 48 181 100 -80 71 160 143 111 -69 -21 106 81 -40 23 -90 91 19
1679 19 -63 121 -49 1 34 -53 16 164 -130 -78 89 -54 7 2 -152 -47 -47 -27 45 7 -85 1 -49 -120 -21 52 -98
1706 -98 -177 -95 -35 -84 -90 -85 5 -127 -61 -8 -92 44 -9 -144 -154 12 -89 -3 -5 -13 -59 5 -76 -151 42 70 -80 -83 66
1735 66 60 20 -28 -59 -192 142 -75 50 -40 -60 115 -30 -42 -8 27 -13 -119 1 85 66 4 14 48 184 54 108
1761A08j87L0J27j41NJ02Rn2L7j02M4P6l7L5P1J0r4kr6Q1nP5q0nJ50r8l4P7l6
1790F8l9L7q0J00j2m1rN5Kn2J6o0N5k6kj28J32j60J42j12Q4Q4p5O9j38Q4q3J56
1818F7j21N7o0p1J57r8o2J00m5M5j7J12j52J13n7n8R8PQ1k39K56j50L2n3J12j45
1844i1M9l3o5Q8Q1m9k5mJ30j5q5j05R0k6k2Q2j01P3L6Nq3L3N2k5Jm5J26lp3q0
1874h4qJ21m7k7J21k0J7k6k2q1Q3m3J4K3J72j29r6N0k6O1k7n3j05J34qj12K03
1901H5j63J24kNj09J0J33r6K4QR8R3k10R2n4P4N1j43n9LJ20q7Q6l8k8Qm5n8O7
1930a1j2J54j50m2Q9qM1Mqm1k1m8P2l9o8k2J6J12p5N6p6k7J04p7K7O7j40P5N9
1959A1N1o6Mp4M3N5k9J04j35nkNN4r0J67P8l04J53j49R7j3l1J9N8P9p0nm2N0j
$$ plain form
1761 108 -79 -49 78 -63 -58 44 53 1 38 -64 -20 56 19 54 125 135 41 39 -57 24 19 94 14 9 159 61 27 104 68
1790 68 29 66 -14 86 74 33 24 79 81 29 45 -15 40 14 12 -116 16 -144 -2 -114 -30 54 -21 48 -90 -6 -89 67
1818 67 -54 3 -57 -128 29 -69 -131 -31 -76 -31 -48 64 -88 25 -32 -90 8 15 96 -143 113 -37 -5 -58 54 -91
1844 -91 -42 -75 -140 -52 29 -20 -45 -49 81 66 -19 -124 -34 -60 -82 0 -101 -28 8 13 -70 -37 15 -10 -9 -54 72 69 -4 -84
1874 -84 -92 29 -18 -45 76 56 73 47 25 -56 27 -16 -2 21 193 64 -32 18 -8 53 26 -27 -132 2 -6 -118 85
1901 85 -78 46 44 49 -60 -50 83 -13 11 19 117 210 0 92 38 112 163 20 -39 -36 84 -3 83 45 17 25 -20 -78 -11
1930 -11 -23 131 -19 -61 28 20 61 65 57 16 -5 -53 19 -20 -88 -110 -94 18 -57 -1 -77 -104 0 -77 -50 17 -123 -48 11
1959 11 62 -4 0 -74 -31 24 -5 99 -36 -41 -43 -38 16 -74 93 171 -133 20 -129 -32 -45 -76 -57 1 80 10 5 -37 13 12
1989A2jn9L3J0J00n4j78J15O9j35M2N0j37J02lJ10j96J32Joj53J07L3p3P5l2L5
2016aM1p6M2L1J03j79K52k30j3k8j4N8q5K23J7j90Q5r6Q7r4J06P9p8q5n1J13o9
2043e2K7P1l1j3m6K8M3MJ7j4j74O2M8kJ4p6J42o6p4K5o9J42m7K9n5k1J13Q3o9
2072C9K9k29J97n6m7l7R7O4n8J28k22J25k9J1j47P8m4L2J16l0Q2J3j83N9K1j3
2098dn2N2l5m8M4k1K0K2j09R3o0J40k4j84M3K17j13k6P2j06M3L7m9P3J5j21J77
2125I6p9r6N4j6J54j11Q6o1p1j1N5R1r2K4j33Q3J10r5jj69K09R1j01N9j09L1K9
2152B7k1K0J05j78J35j05qK4J06j12J0l3k1O3L4o3J06j98L1Q0o3Q0r0l2J36j7
2178A6j31J04r9J3J09P2r7k2l3J08L6j94J84n8p2K05j27L3L1q4j7PN8o2jn1J9
$$ plain form
1989 12 11 -48 -15 -5 95 41 -137 -22 47 -88 -46 4 -133 -31 -34 76 -120 12 13 7 -146 -39 -6 -79 -4 -36 -1
2016 -1 40 -36 6 37 140 -39 213 -17 -30 -58 -72 -14 -99 124 141 -49 36 -60 27 -67 39 118 40 -45 -96 17 -52
2043 -52 -25 46 15 2 -44 -16 27 31 48 34 -140 -78 -30 -32 -18 -94 48 -18 -92 -67 -136 6 -41 -12 -67 -88 25 108 39
2072 39 68 -161 36 -20 -67 -104 -7 57 -1 127 -95 30 1 12 -135 -57 -101 -69 47 17 99 112 -71 -12 9 -4
2098 -4 -56 -4 -39 -87 -43 -64 -44 -22 -131 -38 -98 42 18 -166 -123 94 -19 -45 27 -79 -36 1 -48 25 40 -81 96
2125 96 17 -79 -25 -41 113 2 88 27 -44 -55 0 91 -1 23 -110 -27 83 -12 -13 -182 27 118 17 76 -33 -2 27
2152 27 6 26 131 -47 88 -17 -25 -1 105 -7 3 -30 -51 12 46 -17 89 -109 -78 2 -61 19 -71 -103 33 16
2178 16 -115 -11 -110 -97 12 84 -13 -35 -68 40 76 -118 66 8 -64 141 14 47 78 -6 -23 -16 42 -20 -21 -72 -53
2205e3M0q0R1p2R5j6m1J04m0q3q0N0L2J48j50l1P0n8J61n4j11qN4l9n4M6J45r7
2233c1k2P5J07j14J01j20p1M8J12n0j6o9M1M9p2P5j00N2P6o3n1O9L4q5R0p3pk4
2261c9O2m3J9P3j23P4j8M0m8J05j74J63k03K31j77O4K5K3o3k7J02M6p2l6pP8q0
2288eM5r1N5j1m4J52n0M5r6Q3o9j38N3J74k01J67k4O3p9Jj46R5m3J0J49j91J17
2315B1j5P0o5o2J12jJ1m9K9j24j9J08m3JL5K8j52N8O4M6l1p1r4O7k8O7OM5L0m
2345D0po2j8R6Mjj0l5L8n2N5M6j28o5J19r1N2j6L9J19k03J24j5O1j57Q1n0R0q5
2374c1k5m6J31m7o1J01J17j92J37n4r4R8j8j2o0J21m6L0o8N0n5Q9j61q3J66N3
2400D0k5L9j92J65K6R6k04m3N3M2j32K63J2k71P9M8m8O9j01J23o6RK0l4P5k2m4
$$ plain form
2205 -53 -13 -93 -2 -74 21 5 -36 68 28 -55 -135 -85 -53 95 -55 -86 -16 -74 87 33 -78 -86 -32 -71 -125 -79 66 -31
2233 -31 -53 22 129 15 116 -4 -75 -27 85 35 19 -50 -9 40 -32 43 -57 -5 71 8 -43 26 60 -25 65 -8 -15 -39
2261 -39 23 -20 -1 72 -51 23 5 45 -3 102 -72 91 -112 119 -58 6 31 54 -9 -36 66 112 40 4 -3 75 -5
2288 -5 40 -51 4 -7 -51 101 51 96 0 83 14 -124 -71 103 -98 69 45 108 29 30 -116 -21 -64 -54 95 -96 21
2315 21 6 76 11 -51 61 60 71 22 51 -73 -92 16 -27 -26 9 37 -115 -57 7 53 22 -49 -143 -76 -104 -37 -31 14 44 40
2345 40 33 -29 -47 49 53 52 42 7 45 -7 48 94 -34 -99 20 -71 -19 -35 4 123 -80 44 29 90 -67 14 -36 54 -31
2374 -31 -56 -102 29 -18 -79 22 139 -53 84 30 -64 34 16 4 -56 65 19 49 -19 31 -24 65 -96 -179 -13 40
2400 40 15 54 -138 27 53 149 -55 -98 -45 -3 -135 128 140 -131 -52 -4 -52 17 -84 39 -27 -18 2 -32 43 21 -23
2427b3N6J42k08J12K9j35J00q1m3J00p4P7k2l9m5Q7r5L7MNM3m8KL4m8M2K8K2m1
2456A8R2o3n2jrp3J77q5l2J0J13j13J08m8j40J2J26r1N0Lj4j02J25K3j45K55j57
2483a3k1N6r0QR4Lr2J0K4K06j03n2j12J28Jk2o2K1l5n1J76L0j29P8M3j69J6qJ09
2512D4K6o5M2m5J5L5O2j39P0K6j27N2l2R4j4j6p9kJ62j88J08L4j1l6j15R7QJ1
2540A7J2l7J14o1K0q0J3m6R4M3j35Q7m9J16j86N9l1okJ13l4o0J0n2M4J1Q2n0L4
2569D0j82O6O3j33J79K3m8m6R2j16J12rk0j6m2N4J2mQ6q5O0j18k6J08j9K0J78
2596B29j67n1J6o2l9J48j24J5J0O3m9L0O1j52P9LK0l3K0r3K9Q8l9KO0j55J38n9
2624a2P6j32J7O2k3o8N9j2L8K6Qn8j15J15J6J56k12Q4M1K3r6R4o2k3JM2j22J05
$$ plain form
2427 -23 33 175 -33 79 108 -27 73 -8 -51 49 -25 52 30 -9 -54 33 -62 -25 -21 -16 27 -21 -19 15 -33 9 37 59 18
2456 18 110 47 -5 -6 -15 -88 89 4 -28 -18 95 -18 90 42 -98 -86 40 -51 -1 2 -12 -114 11 34 -111 144 -13
2483 -13 -34 22 -68 -60 34 37 -55 -45 -21 185 82 30 -82 46 47 25 -37 -16 -51 -102 74 104 -25 53 96 -73 -57 -65 44
2512 44 70 5 47 2 17 52 114 -25 45 71 -56 -4 -36 58 44 28 -51 -53 109 -79 29 63 52 16 -99 -2 6 17
2540 17 29 -8 106 45 65 -15 -2 -48 46 89 -46 41 -8 108 -78 -19 -50 -56 -58 55 21 -39 -29 -81 -37 -26 56 6 40
2569 40 -142 -76 -13 -146 33 56 8 -38 54 -62 50 41 21 5 -37 17 29 25 111 26 86 -32 -58 50 31 51 229
2596 229 62 11 27 -35 -74 74 -50 -35 -25 38 -11 19 80 -72 7 10 30 -3 17 -76 -47 41 2 4 64 -91 47 -12
2624 -12 64 -68 -51 11 -12 -80 -21 -33 5 31 39 -19 -134 -19 -3 153 -59 25 66 89 -7 87 25 2 3 45 -77 28
2652B8l1MJ9j3M0L9n9N1j05K9K8n4K9j69J46J08r3j91J91M8j79N1Q1p6Q2lm1j1
2680e1Pm2Q4J49j95J08o9l0R0j18Q0JJ65j51j04P5K3P2j28J7Jn6j01J56N1K0j45
2707i1Q4O8j00l9J38kLj50J52r3J3O8j14K9M3J8L7q5K0J8J4mn7N0op3k4N2N2l8
2737a7MJJ3J4p5P9J1q1J20q8JJ00j13Q2K6j19K5Nj57K94Rk22J63r0m0J79j04P4
2765I4j53M1L1m0Q5j25Q8nJ18j69m4P0o5P7n2O5k7o5J23p8P5j67J06j9Q0N4j59
2792f1N2k9N4O9j34L2k3J54j43r4O8l7J02PLr6J27r7L5Jn2J0l7K1P7l6L1ol1J89
2822A56j51o1M3K4M5j7lo2QL3J0m5L3o2N6j8rL3l8k6K5J6j8M8n1J7j4M2N7n1k7
2853gN8j47J79j3j34R7nm0L2p2K9M1M8m5l5L3R2j42j01J68Oj19J17nJ6j11N7m4
$$ plain form
2652 28 -3 1 20 7 47 86 27 78 -27 2 30 -24 5 -164 -18 90 -3 -194 -3 45 -134 -83 -2 -78 4 1 -40 -51
2680 -51 -44 -86 -2 147 -48 60 -9 -39 51 -67 13 14 179 28 -76 -1 22 94 -34 -17 -16 -72 -173 -17 34 54 -91
2707 -91 -7 61 -39 -78 60 58 61 -89 63 -30 -17 51 -63 -34 9 27 64 -21 -1 17 31 27 -30 20 14 -59 -83 -31 21 -17
2737 -17 -13 -12 1 15 -60 19 30 -51 69 -19 -18 82 -31 51 77 -42 -17 -12 -169 125 134 -88 75 -15 -55 124 20 94
2765 94 -59 -18 13 -27 58 -67 21 16 134 -35 -79 -9 -74 3 -49 16 -11 -76 47 -31 44 -123 -17 -36 44 98 -61
2792 -61 -9 -38 16 85 -49 -17 -40 114 -29 -123 -55 -92 10 17 20 -76 51 -46 -11 -10 -62 -52 -89 -68 9 -27 4 -2 -33 156
2822 156 5 -56 -13 11 56 39 36 -26 -18 15 25 -20 13 -49 7 -11 -20 13 -25 -51 -26 -10 -28 20 -31 -14 -28 14 71 20 -7
2853 -7 51 -96 83 70 -64 33 28 -12 20 -52 -23 18 66 21 -14 19 111 -31 -132 36 42 -77 40 35 51 -60 -3 -47
2881d7n3N0L5p5P5k9n3K20l7j11J32l4mNo6l7O3O3j09P7%p5l6J14r6L4o0N4k3
2910b3Q4j0n7jK6p4J2O6p2Q4j7K1o9M2j06J40l4l9P6Qj41L2O4n4R5K8j05j8K5
2939a7j2O5O7j05J21r1j10Q3M4k3n7n1J11K6j67L1N7J5Q1k2r7%J37l4j11P8o2
2966d3n0J37j08O7n3nJ38o6qL2P1j19j5j0j00J23n0L1K1K0ln9R1nj24J12r4KM6
2995b1k0j4J03j25M6R5j33J68j75J13P6j51nJ79j91Q4n0P5o1o9K2J9N1q8KP2n2
3022e0k9J45K7j51J06j03R7r0R9j79N2J00j00K0Q8K3j55K01j99J3N3J54j26M0
3046C6j81J47J50j48oJ3N6J09Nj82j3j5L5r2J12m7P4j1j12J01qq8N4m9K0J9J7
3073dR4k9k7m4n2R4j9K9l6p1J6j0J75j18J67j85M7qj8P5j85M8J21k6o1k8J54j88
$$ plain form
2881 -47 -100 -50 -15 -90 -15 -44 -97 123 86 -25 107 73 69 74 8 -29 34 97 -12 65 65 -10 -46 68 -28 6 -54 0 -23
2910 -23 61 51 -6 -7 19 -55 -43 23 -49 35 18 39 -30 12 -94 46 12 -27 49 57 -84 -52 12 -42 53 81 -24 -42 -17
2939 -17 -29 36 103 -2 119 28 -82 1 45 22 -35 -86 25 51 -116 -85 -28 -13 68 46 -51 -51 86 52 -59 19 -43
2966 -43 -93 44 -64 3 -50 -55 83 17 9 41 112 -7 -22 -32 -132 -9 -59 -28 -7 13 10 -49 42 37 -87 25 -69 -67 -21
2995 -21 -41 -55 48 -77 -31 64 -69 99 -76 37 113 -38 -43 136 -55 29 -21 54 -7 -76 -54 -35 16 -72 -70 2 -50
3022 -50 -79 66 93 -58 48 -55 42 -48 51 -128 -76 24 -76 -56 32 55 -100 101 -98 -85 -32 122 -4 36
3046 36 -145 2 152 4 -2 11 67 176 181 -1 -14 -29 6 -86 26 -21 53 42 -70 31 23 -65 -11 -60 -40 -21 -4
3073 -4 90 61 34 -10 -62 32 13 42 6 -65 -49 -59 116 -2 165 -20 27 19 1 76 -109 -61 60 34 -27 -55 99 -89
3101h9J05n4q0J09J1pQ2j71J16l0L7Q1r6j38J20Jqk01L29j07j8K8K4J4r8K5np0
3129i0J73p6mP1p4k0K3o9qP1p2R3l9J8K3J5P8p9j32J70jj18M2L7k1Q1j44P2jP
3159B6p1J28R4k18qL4Q8j40n1J48J00j75K0k0J39j56K5O8mk7J6k4J05l7l1P3j92
3186i0L5J10j84J34J01k16J24O5o2j32P1j0J0J04j96K01J1j50J03L3q2l5Mm8J05
3211Fj10J70K2k14J10N4M3m5Q0j17l3R3Nl8j55R3L3J49k54J08J4R9j81k2M0PM0
3238cp7L5K3m3J09o5O1j14N1LK5J7Qk7l4Jl5K7J46o3j71Q5l8N5l7Q9m2L9l3J8
3268A0J28k4q1N6j37m2m4K32Mo0n3N7kKP9o6J4m9j0q8J08Q3m8o4j25O4N9K2L2
3297E7j28K6J13m0j19J02r5N9k6J1J16p6M5l2q9J98j34L1l4K8q2J03j13J66m5
$$ plain form
3101 -89 16 -38 -118 -9 2 -5 77 -94 22 -8 29 110 14 -124 -4 -3 -11 -212 117 10 -8 20 44 58 -40 -15 -20 -90
3129 -90 83 7 3 74 0 -20 3 -66 -74 -3 -75 18 -21 -3 20 35 113 34 -98 72 71 -47 -5 32 11 92 -52 20 19 26
3159 26 -45 83 177 -41 -49 -15 73 -67 -118 30 130 -45 -25 -45 94 -62 -37 31 27 0 16 -8 97 60 29 102 -90
3186 -90 -55 55 -129 5 106 -110 14 79 17 -115 -44 -54 -44 60 -136 65 76 -74 29 62 -20 -55 -51 -99 6
3211 6 -104 66 88 -126 -16 38 81 36 116 -1 -34 59 64 26 -129 -36 -3 146 -108 0 14 113 -68 -90 -50 -43 -3
3238 -3 -80 -45 -22 -65 44 -21 40 -74 -23 -20 5 22 30 3 -31 -30 -65 -38 108 45 -126 -41 -79 -24 -61 28 -14 25 -8 10
3268 10 138 114 33 89 -48 -90 -134 98 102 42 -11 46 44 46 125 59 73 24 14 -74 34 117 69 5 -120 -56 3 25 57
3297 57 -71 -45 68 28 -91 11 -84 -25 -51 -40 76 0 45 13 -76 122 -12 19 -15 13 -69 34 -79 87 42
3322D2j7m2n9J55j58R0L0K8n0M9J5P3j00j05o7J23m6j8K15L2j61l5K4j11N6l8
3348g5J11p4oj0J73j66lK7ko1J3Q1O3o3k2k5M1k7j1J3p9O3q8J09p7O8n4J09j5
3377A3QK8n3j07J09jk3L6O6R8j57l5L1j7L3m7O3K5j23J2m8R1q7O7Kq1J66n5p0
3406e6Q3J4o4L7p3J66j06l2l0J26On9m8J54j85lQ7Mm5K4L1p2R5n4j06lKK7K36
3435A56j36p8Q2q3N4l2N2L6o6k0Q1n8J6R8j17R9M5j16Jn2J3Q8n1P0j32J01N5m3
3463F3j45L1K9J01m7j45J85q3L2j3Oj27P7q3L5O9K8l6N2op4K0oj1P3R4j20K5m4
3492b0kJ5Jm5J60Nk1j0n5j5JN2p3P9m4j20J63k3m9%l0K9R0p9Lk71K31j2O4jj5
3523HM9Pr5LP4L8L6j12J3k0K0L9jjj42R6j75J11J38o4j68J37N4Rm3M2r5P2j01
$$ plain form
3322 42 25 -17 -76 79 -79 11 41 69 19 68 83 156 56 -49 -116 7 -39 -57 158 190 29 -6 18 -93 -37 -75
3348 -75 36 -38 -44 -54 119 -47 -50 -23 -25 -86 -73 8 71 8 -14 -39 2 -25 -36 -23 -102 -39 -127 -18 -95 -27 -81 28 13
3377 13 21 49 -4 -111 -2 -3 -26 10 76 174 17 -18 13 -4 29 -18 45 70 -53 -41 -89 2 -85 -18 -16 -97 69 14 -56
3406 -56 27 41 -23 14 -59 107 1 -31 -61 65 71 12 -36 118 -67 -70 17 21 -24 0 31 -41 54 0 -106 -109 -107 -80 156
3435 156 20 -58 24 -59 -5 -37 15 51 -15 -35 46 -12 4 102 -15 84 129 13 14 -38 -25 63 12 82 -50 51 106 63
3463 63 -82 -51 -22 79 32 -113 72 -11 21 8 14 -113 -36 -119 -84 -15 13 -23 29 23 -51 -31 -37 -48 25 119 -1 24 -20
3492 -20 -22 -7 -6 -51 109 114 93 83 28 13 14 66 -7 72 28 -92 71 48 -1 -1 -31 -2 88 9 12 -259 -28 -40 24 23 8
3523 8 57 64 -31 -28 46 84 120 8 21 1 21 60 59 58 -84 12 -163 -52 86 22 -146 -9 45 54 11 53 -42 30 -71
3552g1J33N8k08J63n9j3k6J02q5MO0n0j8O9o3J01j65J46k5l4j0K4j4J35j59L5
3578C0o1j5J65j52l2M7K6K7L3r2Q0k6M2j22j26K99j26k4P1Rj8j05J2J26o4NoK0
3606B3n5J07Oo3J6r2J33J04k30J46j62J17m0o2MK4K7Mk4K7J9l8Q9o0OJ1n6n8o3
3635a40K18k23J15j3R2n5j2q3P4K4n6J45j02Q5p2r9Q1m1J02P5r4M6j58J78q5p0
3661f8Q2r2J51n1n6m0J01o3J14j14KP2j07J78j52P7m1l1J02j45P2OJ25j04j4P6
3687H0j17J56lj96P4R3j29N4N2j52K9L2L2J31j88j4L3J47q7rK3j03j5O6L5o0m0
3714g6J78j49L7l9O7j1J0j20R1o6J11L2j08%K5J53j16K7P3j42j1K6O5p5J01j4
3740F9k18J35R5j12NK1J4J00j20Ln7Q3n9j6KpJ03j78K32j35P7O8r3M9k3k3n2J39
$$ plain form
3552 -71 62 120 -88 75 16 3 -23 79 -6 -2 58 8 -10 59 -4 97 -68 78 53 19 9 33 19 154 -5 30
3578 30 -31 -46 119 -33 -65 -18 8 35 68 -24 56 30 72 -50 -176 123 -3 -27 44 53 35 -70 -58 68 4 9 3 23
3606 23 -32 75 81 18 34 -58 75 179 -51 95 -67 50 10 -52 -48 -24 3 7 -17 10 29 -9 80 20 26 37 -19 -77 -140
3635 -140 78 -145 -30 -43 49 -6 -18 -101 -27 -3 -59 86 -16 69 -3 -102 -21 -62 40 115 21 67 -91 87 2 -68
3661 -68 14 -78 73 22 -34 -74 27 -36 78 -36 -34 38 -69 109 -43 34 -7 -38 64 -81 -9 -3 122 18 4 80
3687 80 -37 119 116 -80 -6 87 -42 12 64 -88 -59 -27 5 136 -52 -66 -33 114 27 18 41 -62 -77 -11 24 -36 -76
3714 -76 102 -47 -10 -49 18 7 17 -103 -12 -78 33 65 -43 -43 -18 135 19 46 119 -23 -34 -8 57 -18 83 69
3740 69 -149 -14 81 -31 -26 -5 9 109 -11 -8 -65 18 -41 -57 -55 -62 41 -137 95 -40 37 105 12 61 38 15 -37 102
3768A02j94J23p3Q2j56N3P7M8q3M7P5j03o3KJ39j06M3j0p3Q6l6n8J4J07kq6R5
3795E0l1J12j16m8M4MKn3K5K3mJ06J7j44l9J22o9m0nJ22r3L0n4R2q5J08j13O1
3823B4j23J86l4j22P9j48J18J25j86N8J81k22K09j65jJ7Q3n5j25k3K02oj94J22
3847@j7J5K1j8Jj85Q7J30n6K1jJ4N6N8k55Q8Q2J0j1j22J27L0Kn8PRq9R4j17J58
3877H1j30Q9j26J07rm7M0j03N2l3Q7n5R8ql6l0j6j3J39j27J12n2J4Jm8J10j02
3904eQ9j35M0j3O9l8q7J48m1Mr7rJ40k9k05J66n3J09k1Q4j86O9k2ko9N7p4Q6K2
3933cO8q1j4K1RP3k6j22Q1Q3q8mp6J23m4P8j18J49j43o4J34L6o3ol9p0N1J22n1
3962A6p8J37n3n4N4L1M4j58l4l4L5J63PL4p3n4Qq4J07Qp3k4K1O5l9M5j00J33n0
$$ plain form
3768 102 -92 31 -42 40 -116 -63 14 62 -21 26 101 -2 -65 -63 76 -30 13 3 -70 16 -20 -78 -64 43 41 -45 50
3795 50 19 131 15 -33 11 15 17 -36 -11 12 8 114 131 -13 -52 70 1 -39 -44 78 -15 15 -39 53 -32 76 -37 24
3823 24 -99 87 53 -69 10 -138 -20 105 -81 -23 158 -64 145 -20 -21 -4 79 24 -101 -124 78 72 -122 0
3847 0 -17 -2 19 1 2 -183 -96 34 -22 -1 -2 12 68 126 -129 -41 41 51 40 -82 45 75 77 19 26 35 -54 40 -77 81
3877 81 -49 40 -86 21 12 -35 5 -98 -46 -79 8 -47 51 43 7 -23 -39 -52 87 -40 72 20 34 35 -13 97 -5
3904 -5 84 -51 -11 -24 45 7 -80 68 27 31 -66 -75 65 36 -169 -3 -56 53 32 116 -70 -1 -23 -25 -94 -37 -111 -25 -3
3933 -3 65 -16 -30 -9 0 73 47 -75 6 89 1 -3 -79 44 0 78 -40 109 -34 -98 36 72 9 3 -36 -106 -55 67 16
3962 16 -62 75 22 -32 22 53 97 -61 -95 -129 -94 69 76 110 37 -17 -9 -93 14 22 -51 -75 -54 11 -28 17 -83 50 0
3991@j32R6J04j13M9n4k6l6K18r2l6L9j00J43K3r5j1NL5J21r8j89K33j41j5Q5
4017A3M4o2p6L5J11j28J26n9j7o4oQ2P2J4j38J29j36Q0r6p9J13Q9n3o7N6j06M4
4044g9L3J24j52mm0K35p4l1q6KN0MJ00r1K4k1l5J11PKk5j64J28J02m7j00J02m3
4072C2L5p0N6n9R9j24J03q6m5O3q1M3o2J42k7l6n7J95k17J30q2PJ88q0N9r8l9
4099a1M6QL4M0j06q8O2qo3J39P2j57Q5l7m5R9j11L1j01J29K8k6O7l7j20J46j13
4126c7k6J15k25K82j01o1N2P4q7P9l8rJ8j9K8%n0j4n6J16p9Q2j36J77o8J7K4k
4154E6j4n6k3N1kl2Mo3J62p7L6NJ8q6j4K8n6J82j93P4k2j54J73LJ5n7N5j84K22
4183E1r4OJ13m1o2R3k6Nj0q6Q1o7l8P0m4r4J95j09J74j45r1N1O%J09q2O5p4pn
$$ plain form
3991 0 -132 -36 68 -45 4 -50 -76 -112 106 14 -22 17 -83 60 83 -12 -23 -18 17 138 40 -149 84 -57 -72 13
4017 13 57 -5 -81 -46 65 -63 63 4 -13 -77 -83 -1 71 85 -53 76 -60 20 -76 -155 -42 47 -6 -73 -17 -123 -79
4044 -79 -46 78 -74 -78 -118 117 43 12 -74 -72 -22 -18 82 -9 15 -6 -41 70 77 79 54 -110 18 120 73 -27 75 32
4072 32 67 -3 53 -6 93 -31 72 -14 -59 4 -77 -34 -96 46 19 -17 -74 121 -96 34 -48 -41 147 67 126 28 -11
4099 -11 35 43 77 117 11 -77 -15 -23 -86 53 125 -32 53 16 -29 70 -41 -10 -111 18 46 20 87 50 -70 76 -37
4126 -37 -63 52 -173 109 8 -53 -1 73 -14 65 27 18 36 17 45 45 -5 -19 -75 41 -38 44 -92 85 17 34 58 56
4154 56 42 -14 -37 14 12 -20 -16 -79 83 6 42 47 65 -21 -35 -7 -63 119 -74 0 -22 -176 -3 0 15 -42 13 -171 51
4183 51 -43 -37 76 35 -27 66 40 45 35 -51 30 -37 -75 -5 -49 -143 52 -57 117 -28 -119 -68 -62 -62 47 -35 30 -44 -51 -56
4213e6J52j86k0J73l6j17J09L3j14J55J5n0q5P2j29J23j9M4j4l7J16j43J4Q9j90
4238a01J77j12P9j48J62j3o5J85j28j0mrl6K3O4m6p3J51j8j51K09k53J89j43K0
4263e1M6o7J61j34jN4P2k0j36K3P5r4J68j08l6JJ4N3j0j47J30Q9j04n8R6l3j0
4290b7k6O3j31J3K00j53M9n4J8j7J09j17J63j52O5K3m7P0o9L8j88J88m3J3N2j62
4316a22K09m5n3j2k8P5j4q4J93m7j17N3j69J39k4QM6r1J05l9q7J87K6l2m9k0q4
4343g6J28n3L8J2j71J14ON3p4K3%%L3n2M5oJ14n4r9j6J40o3nj3j11J40Oj07R8
4372E0ok7n0K05m3k58Q7O9o8O0Q2m5K5M8k13N3j14J13K8N3k1j10L6R0Mj34J00
4399A4K5K4j9j40J21o7Q0N4q3jp4R5o1N1j1j2p8J09k3Pm8j9R7j5p6M8p9J13o8
$$ plain form
4213 -56 96 -90 -110 63 27 -90 19 52 -62 93 108 58 -27 45 -84 39 20 64 50 13 129 -14 0 89 -101
4238 -101 76 -36 43 -105 57 44 -21 164 36 26 22 13 -23 0 64 18 -55 96 78 -73 136 -117 72 -71 -51
4263 -51 -5 -72 89 -45 -46 8 80 60 -76 -53 22 -72 96 -12 -48 -47 -33 20 10 -137 -7 82 -22 -80 16 -17 -27
4290 -27 -53 10 -121 -108 92 -61 -12 -66 -48 -65 44 -73 90 -62 3 26 -21 49 -20 18 -170 18 -25 -12 40 -122
4316 -122 87 42 -11 -23 -51 24 10 -74 119 72 -45 8 -161 -22 -46 -38 8 -83 22 -17 -104 83 109 77 28 8 -76
4343 -76 52 -1 37 49 -122 -8 -2 51 -23 0 0 0 33 -19 26 20 134 80 -19 -35 105 42 37 24 -87 53 59 -48 50
4372 50 44 17 -33 172 129 -129 -42 27 -41 19 101 56 81 129 -84 -31 -145 -32 -4 49 28 -82 -46 44 48 -86 14
4399 14 39 63 44 -96 25 -42 38 92 9 8 -66 29 -32 19 8 -4 -82 27 4 11 -37 -56 41 26 -50 -2 -81 32 -36
4428c6l2QM3K2l1q1K11n6o6j8LQ6j5j5k9O4j35L5m5j6O6J57j71J5pJ06j53N0K8
4457a2m5N5J7K6m7N6K6ol2q8J16n6j02R8N3j35J11k3j15P3R1m1o1J42j59R0p2
4484d0J6Ll1l4J22k08J02J08j4l1N1n9jqq7J04l2M7p0J07l9m2M2r5J16j13J21
4511C5P7l5m5o3P4o6m2J36j49M2M6J21k27J02J27j20k7J0j0O2p9R9j07P5j47J74
4537F3NK5j36O6l8l6L0L7K7q1J81j89J16j36J71m1r9j8J69j40M9j04N0J0O8q3
4563c4j7M8l7J06K4r1J9j1OO0Ropj22QJ22r1P6j14K98k84j5J06p0N6kn3j00K03
4592H7p4P4o0n2P2qq0J8n0o0K5J14n6O9j85J79J5L4o0l7J84j97J04j28QLM4J42
4620A25k15J73n3k8L7p6lJ10j84J15K3K3rQq1Q3j39Q4l5j5O5M4o8O9n3J24j07
$$ plain form
4428 -36 -68 -60 -17 5 -26 -107 104 48 -18 -36 -33 53 38 23 -6 58 -77 -42 -87 -103 -37 120 -51 -36 -43 63 -90 -40 -12
4457 -12 -57 -2 15 41 -6 50 76 70 38 -50 66 10 -92 6 59 -76 35 12 -103 -30 61 20 -41 101 -58 32 -40
4484 -40 -24 -21 -52 -86 36 -172 -70 38 24 -7 44 -15 -16 -24 -111 -7 -39 8 -62 45 6 -36 6 -89 27 -86 35
4511 35 112 77 32 -31 43 -23 -65 71 -78 -36 10 131 -96 6 133 13 -14 -4 -14 48 -31 68 -39 36 -111 63
4537 63 68 93 -43 23 -15 -51 -21 16 43 -38 143 -46 70 -66 105 64 -35 -53 116 -24 25 -79 -29 -19 49 -34
4563 -34 -51 -3 -40 66 90 -1 18 7 13 73 82 76 69 -53 -45 77 -14 62 -52 246 -38 -53 53 -17 39 37 -16 -116 87
4592 87 13 87 27 -25 47 39 -41 -23 -73 -133 -108 6 -50 19 -166 13 28 62 2 -35 149 -48 56 -72 -64 -61 -17 125
4620 125 -90 83 30 2 39 -37 -40 70 -114 1 24 47 38 46 -35 48 -91 -7 -42 -57 8 52 -16 53 0 124 17
4647A7r8k%J67q6ko4J31n8n7j03J42J9j5J8L2r1O4j10J51r0jO2l9M6q1O3j70P2
4676h3J17j7J21j33j3j5J96k82P4p9P4R4l2rr3P5K3rj39LQ4N0m9K11k21p1K26
4703A03k2%j30J61q4j1K7Kq5Q8m0m1O8o0qj7L4J4N3j00l2kJ43q2j1l4mJ60j13
4732b3n8lJJ11j11O5J13p8j2J2jj3pJ44p2l9Lj03J39j72P6J77P8j43n6n1K6Kl2
4761b7j8J18o3QQ2p4P1j47J61j18P2j02Q0l8l5Oj5l5J70kq5k9n1J14r1l6NM8j11
4790a42K34n7k1n2P6m5Qo9J16p3Q4j06N8K4j0j34J19N0q3l3J50Oj35M2J8o3OO3
4818C1kk0m1r1J68j0n4O4p0K5m8K52j58j3j89K77Nk07M8n6J00R8r4n2n4Q3K7k8
4846ij0J13p8oN0q3N0o2N0N0k7q5M0P0j13j8J0L2M9j14J53o8q0J8M2j2n1Q1j6
$$ plain form
4647 17 -81 -83 -83 84 -2 -4 -68 63 5 -52 -155 -13 6 -9 9 41 -50 14 -96 55 -35 -36 26 -13 33 -48 15 -155 -83
4676 -83 34 17 138 5 -8 -23 173 -109 -35 -114 -40 54 22 13 -80 -5 18 9 -130 -127 -43 7 -42 169 -52 -123 103
4703 103 81 81 -49 112 28 17 44 46 -39 49 9 -32 36 -24 -32 -49 -15 -1 52 -48 -80 -82 61 -21 -32 -66 -70 90 -23
4732 -23 -81 -84 -83 28 -83 -18 95 17 5 17 16 3 -4 140 68 29 32 -71 68 -104 -28 149 227 84 28 -23 3 5 -27
4761 -27 -45 73 10 18 100 26 97 -50 111 -7 65 -37 43 5 -30 -24 -39 -74 96 94 9 -20 -71 43 -48 -84 -79 -31 -142
4790 -142 92 35 14 -38 38 -7 1 -68 48 -25 59 -47 11 35 25 -109 10 60 -23 -56 94 100 -35 7 25 -38 -32 31
4818 31 29 9 -32 -123 45 35 -19 45 -25 0 -48 204 46 33 -156 121 126 -81 -33 -89 11 109 15 -37 -91 -8 19 -9
4846 -9 -19 94 16 10 60 -23 27 -35 15 65 38 -47 -7 63 -50 -68 -58 -26 23 -91 62 -6 -86 -68 -26 -38 -89 -8 -24
4875b4Kj09K03l4j10N7n1M5q4K31o8j54J63l2m2QJ2j19J17o4J53mr7P4j44j21
4901a92J50K16k87J70o9p2J31j1n6J7M1J6q5p7O7P6p0R8j5Om5q0L3J19p5j4L5
4928B7n2L6R0j68K6n8J61Pj13P1k3K8p1L8qj8J56q7pl2j32J56K9Q3k01O7j8p9
4956i2L1l3J75j27P4j23J23j24J19r5J27j12J0l4M3O7j8k0j9K9j03Q5M9J3pP1
4982A09j35J75j61J12k9j08K3l8J7J79j63o5J00J8l2Q8q7J31k60R5K2m0N0o9k2
5007i0J5Q7r6m5J19J17k13K7L5P1k22K14j2nj1M0j33Q2j22N3J72m5k3L1r5P5Q5
5034A11j07n3K27j32Qj6m4n6O6N5K2%l2r9J2J54j70J26j23J94K9l24J23J09J7
5059I7m4r9J27p1qj5Q4j92O2N6j16M8Q3oO0j18K4Rk6O0J0n7L6q7Q3N5o9l3L4q8
$$ plain form
4875 -24 -22 -131 72 38 -72 -15 -66 -21 -105 126 58 -96 67 35 -7 1 13 -106 11 -53 100 96 -1 73 -71 -192
4901 -192 -42 174 -113 57 -12 -84 47 36 -20 -3 38 54 -31 -108 -41 35 -35 63 48 54 9 -71 -38 81 6 -8 27
4928 27 -25 11 101 -67 -41 -99 62 69 -44 27 4 32 -39 -1 -9 -27 129 42 35 3 -129 27 56 139 -62 5 -13 -92
4956 -92 -61 -94 81 -46 28 -95 28 -96 23 -72 55 -57 -47 -81 -38 29 11 -9 -28 1 -102 -17 32 45 38 109
4982 109 -26 149 -12 100 71 -37 -14 -52 -35 144 -19 -84 16 34 2 90 3 134 -126 -31 -9 -49 1 -68 -90
5007 -90 -75 12 -84 -129 -10 107 -106 -79 -44 27 -195 19 7 2 -9 31 -102 -20 -142 -89 83 38 15 46 -49 26 111
5034 111 4 -49 178 46 54 38 -6 -62 4 59 81 81 49 -50 -38 116 -54 72 -51 143 172 -152 -29 80 97
5059 97 53 -46 81 10 2 -13 71 -121 -59 -3 -119 -71 12 6 66 -52 -28 -19 -45 15 25 -32 4 -83 0 55 -14 -47 -13 -101
5089a01M3P2Ko3J02q6L2l4n2J48l9L8l9M4J9j3O6j71J7n3J21j9PO8k16J87j14
5116c4J01j33Q4r7KQ8o8O9n9j9N2j7M3K6j13M8J4O8k9P8k01J28j1n4M3l5P0o6
5144b2o5PL3j8J11j08J33j20J8J1K5m4Q4r8Q5j1o0n0Q1l8J59m7n2Q0r9m3R3Kn
5173D2j5j37O0J4j5kN0j69J60o4R2L0J5j28R9k1P9j20ML5n5P1M4l4r1j1M7M8k8
5202@j05J78j03O9q3R0j47K1J60Ll8r8M8qL8j15P3r9J65N8l6k0J0q1N7M4%p1j2
5231boJ5L2j03N3j13Q3j2L2N8O4o0l2M5jr5M3q2O6j04J80k9K4Om1m7J49j24j1
5260a2M8j8j12R7J4n5N6M0j45J11J07n6o2o7R5JO5m8j07J08kqr3J62r2q0Q4j54
5288a23P3J3O5j5K0j38L2jM5R6pj66O4J12l6J0O9j3p6N8q4q2M4R6j18J62k31O8
$$ plain form
5089 -101 -58 14 16 -47 55 -31 1 -33 -85 63 24 62 23 67 86 73 139 -32 -15 -68 53 34 41 109 -107 80 -34
5116 -34 67 -66 18 -79 -77 11 -57 12 -47 -66 -14 -31 12 38 -75 -27 -13 55 26 104 -97 31 20 -34 9 -26 44 -22
5144 -22 -87 -80 -47 -65 46 -62 71 -49 -31 -20 5 -39 45 -53 32 21 -39 -89 -8 -46 113 66 14 94 -5 -48 45 47 42
5173 42 27 -110 -50 -36 -51 -53 -3 -172 -12 -76 16 46 61 -67 32 11 90 -30 -26 9 -46 25 69 35 -56 -67 -20 28 0
5202 0 -105 73 -30 39 -44 46 -101 -80 80 83 45 -53 -5 -13 25 -90 -17 -116 49 107 71 51 61 -20 37 81 81 10 -2
5231 -2 -8 7 39 -64 -11 -124 -41 -53 -21 37 101 41 9 54 53 -42 1 -81 -15 -119 61 32 56 62 21 -26 123 -1 -12
5260 -12 36 18 -94 3 17 -38 18 58 -87 24 131 75 13 -54 41 42 107 59 -48 60 58 50 -43 119 27 -53 31 -123
5288 -123 -50 -37 28 13 33 -105 -73 -74 -29 67 60 -106 -42 70 34 44 113 100 24 82 -2 -84 -40 56 -62 100 -131 -63
5316f3mJ30k3l9j22Q6j16J76m1N0j5%m3oL1P7p0j9rk5J7n5J1QJ03KJ6j27mJ66
5346I2r1K9L0j37J37j54jJ11p6j5O8K6J09j45n7J03O6l8p0M2Jol9k9O4k6K5j6
5374Cj00J91o0j00j0P7Mr3qN7NM5j4M5l4P8k0j30M5Q5MK0n6r1NM3O6J0q7N4R8
5405A32p6o8L0J63l40J15J14j52N0JN1l2K4j7M2j5o2PJ10p7kO6n5j2j9Q6j10m4
5433i0J25k4R1j40n3J35l2j03Q7j5LKo8K39k02P6k0j5R8k10J08l7N9k5Q1J8j83
5460i5M5Q2n6N3m1J15j61J20j8n7n8R4l4K3j01R0m7R8J9j2n8Om2NQ1R6k8k45K90
5489A64j01k3r2O2k7J19j00J9q6ln0N6O3K6M7j07O5j1k4q3R4o4%J8J00j13P4m3
5517b0R5m5j6n2J34q9m3P6p4ml5M5J1J4R5j14n6NO6K4Pj9n8L8m7k2Q5l4j3k9J38
$$ plain form
5316 -63 -67 63 40 1 -121 -35 -151 25 -16 34 19 19 -24 -30 1 78 8 -11 -20 -45 -28 -83 -72 -64 39 41 57 -70 -74 92
5346 92 1 30 60 -77 60 -94 -95 16 -60 -75 -7 19 128 -17 -74 29 95 57 -13 29 30 24 -15 -44 20 -6 19 3
5374 3 -97 94 34 -66 -76 1 5 -88 -96 -39 -34 11 -3 42 8 86 66 -64 -19 66 70 90 34 -57 -52 -9 57 67 -20 34 132
5405 132 56 -12 18 181 -159 -44 70 -82 -32 -31 20 -12 12 -5 37 22 -40 -33 77 0 -2 64 9 -3 -22 64 -46 -90
5433 -90 35 11 102 -38 -91 44 12 -91 -4 -19 -16 -14 -82 157 -45 31 11 -4 94 -116 -8 -45 14 -11 70 88 -95
5460 -95 -50 32 -24 29 -12 103 -58 62 44 -13 -71 23 -11 12 -89 1 -46 52 71 59 1 7 -35 -30 51 147 119 -126 164
5489 164 63 40 -52 10 -17 102 2 21 -65 -68 -118 -62 1 27 74 -33 32 21 -3 -86 8 -56 -56 -38 62 -51 23 -20
5517 -20 75 30 14 -38 96 7 -36 40 -34 -38 -73 -28 -17 -3 92 -22 -78 -73 -7 17 24 5 -53 -15 -62 -84 1 -33 -46 -75 63
5548F3j2n2Q0j79NQ7rJ62j53l1j6J8N4J9ML4j35J89m7j33q8K75l3k6l3N6j57O
5576e2M5Q3o8O3m9j0m8J04m8Q1p6n0R5j11L8Q0j40J32m7p5J8M4o6j6Q7K6j4q2
5604e6J15L4j01J43j73pO6l0k6J0J51p6L5r3r8J60L9j60N7O3j3j3J9j6j05J84
5630A09m8m3M5M6j14p2P8m0K2o8R9j8J8m0j0K5jJ0j1J5k2O5l5j29jJ83j63J58
5658E8q2N6l0L3m6N8L5l5m1J14o8j37M2nJ0M0O9j43K1P0kk4O0j4j30%l2O3P4q6
5688g2O2o1Q0Pj0J3j60J98j4Jn5kp2J25M8k06M1J77j58N2R7j48M8r9J40qOr5o6
5717a31L11q5j54K2m2O4k6R0J5l9r2M6M6K9j51J1J15o4jQ7J8M4oj26j6J2Q0r9
5745d2pk0M7mO4r9Q4j46L8J19p9NM7j02K12j90N5K3p7lR8M3q5j14L19k30N3nN
$$ plain form
5548 63 51 -1 79 -100 -95 -8 -17 145 -8 -39 -55 -37 17 36 40 74 -61 128 81 -52 -140 135 102 76 43 99 -58 -52
5576 -52 -7 76 8 71 22 12 -36 68 20 101 25 -25 70 -41 -3 77 -63 69 22 -53 -35 9 -57 -73 14 40 26 -56
5604 -56 59 93 -8 135 -38 -45 21 -9 -35 -25 126 50 85 -8 -106 54 93 -67 -10 53 40 27 46 30 -75 109
5630 109 61 18 63 109 -5 -77 1 -39 -17 -85 14 -4 14 -26 -36 -11 -12 -2 -13 2 -20 45 10 -119 -120 63 -100 58
5658 58 -24 32 2 35 -11 47 82 47 6 120 52 -85 -43 -48 -38 2 71 -72 -51 19 17 -7 53 39 -91 -91 -123 -60 14 -72
5688 -72 -10 -71 9 16 6 19 -141 57 43 44 -11 -13 -85 40 88 -118 -77 100 -58 -6 91 -57 -9 -108 32 24 30 -65 -131
5717 -131 180 95 -59 -37 -79 -15 -41 49 64 25 -67 -21 25 54 -97 -86 29 -35 -36 51 69 113 107 -19 -35 -23 57 -42
5745 -42 -49 -69 -22 -26 38 -61 23 -123 -85 34 -45 -40 7 -95 117 -73 -18 5 -72 -75 23 66 -19 -133 186 -44 9 4 9
5774Ij7M6o8O0k4M0j25J18j38rJ71n7r8J05R4j63oN3j56K11k3m4R6j59K26k37
5800i5M4J12lk7k3J8M7m5k7j62K56k05J15L3q9KLJ28j15O2j11J45m6k7o5J96%
5827A21k18R6j8RN3j15L8M6p1Q8l3L9J0q4k6J44j10N1Pk6N0K3j12K8L4j14J84
5854I4K1j58J1j14J37kj74J50L4mQ7l9m2r5J13j2j6j03L1pP6N8Nj22M5j67J63
5881c0l0O2M0l9l1Q7m9qn5O8N0q5m9M0O9o5m8J44j48K7M2M8j23Q0J66j43m4m0
5909f4K9K0O4o7P4p3k9p5O5O3k0R6r7o3J13p0j20K05l5n7J32j06k2LK7j38N7J47
5937E9K0j03K2mj5Q7L1n7NN2o7q7pJ12PJ33j99L0OJ4j23J39J0j33O8jK3l0J03
5966I5j44J11L6j2j24J01Jj82P0J45j01p1K0jJ13j40R1p1P9m4k2Q7O0j30J47m5
$$ plain form
5774 9 -8 38 -30 30 6 46 -79 39 -99 -108 63 6 -92 13 107 -56 -62 -9 -165 46 23 -21 75 -84 142 -95
5800 -95 -51 61 58 31 8 26 73 28 1 -161 95 -110 5 38 -51 -49 -46 82 -33 29 -82 63 17 -10 -75 121 121
5827 121 -97 -1 -19 -10 43 -72 -34 12 -59 29 -4 35 45 -39 -65 79 -31 20 27 1 51 74 -38 -10 24 -90 94
5854 94 115 -43 -32 -146 -9 -11 -185 -35 -1 -5 82 43 1 -94 19 7 -9 -112 -81 -88 -12 46 51 -71 -26 -193 -30
5881 -30 -60 2 42 3 -28 59 10 2 -53 15 65 -20 -69 -29 40 -25 -73 71 -77 -50 -8 40 -83 -3 163 20 -24 -64
5909 -64 -35 -15 49 -18 56 -17 -46 -121 -56 7 -13 83 -14 -77 36 -34 -154 51 16 -41 91 -15 -37 -34 -7 -145 -88 59
5937 59 79 -24 -2 -6 -21 66 97 40 45 97 30 -57 -64 48 55 188 -11 19 25 39 -84 55 65 -68 0 -1 22 -8 95
5966 95 -49 62 98 86 -38 63 64 -118 -48 97 -4 -75 -55 -56 57 -83 8 -63 16 -28 -50 37 97 -33 114 69
5992F9j18JO2p4Q3J0L9m5O3K0k81L05j00p1L1P3l3J7o0r0J91j36N7M4k3q5L9K3
6020A1j2m3k5J57j40pp4p1J51l2NL8J65j38O8j04M2K4Lk3J9kO5n2q6J3Q6o6J3
6049a5N4J5j22O7j23Q8J01j26O1o5L6Q7l0l6Mj28J07J13k06J81j25J70j24J8p7
6074g5J57q4Oq8J4L8J6o4K8L5m4R3jJ3k3k8M3o5op7N5J25j41O4r1J12M6p9J5P
6104AKp8J33j15K2m4J29Or5N8m3n0P8Q4k41J34J4J2j3l6Q8n7m4M1K7r0P1j7N8
6133C5k6n8Nn7J39Ok7K6r3K0k0k3j2j6J70j39J58j37L9P6j47%J18j45Q7m3J13
6160D9j07M0j66J49L9n5P3l8L4j9J29j45O0J2q9L5k7Q1kn2J15pk28J66K5k4J9
6187F7n7M1q4L8K8j17N5l5R7p6M9kj4q0J18k6p2l3K7j43J36J31Jk8p0R9O5k8j12
$$ plain form
5992 69 -49 -48 14 -60 23 33 72 27 90 110 -171 134 34 -37 -6 67 34 51 -9 -99 92 -44 13 57 34 -51 -12 11
6020 11 -1 -44 -69 88 -52 -59 -133 -204 -53 -85 -80 -42 123 -15 53 -51 -9 15 18 -5 14 12 77 25 -61 -48 38 -28 -15
6049 -15 39 54 -68 -1 -124 -36 65 -61 0 -65 -29 58 28 -8 -4 -132 -25 88 -118 63 -62 108 -16 2 -75
6074 -75 82 -2 4 -84 -70 -32 -16 -80 -52 -17 -61 32 31 44 21 -7 36 -29 -35 -112 -57 68 -73 -9 -100 12 58 -21 -6 1
6104 1 3 -75 58 -57 -35 -79 50 56 -39 19 -24 -74 4 88 -153 -19 -5 7 -6 -42 46 -11 -55 -14 13 -77 -6 -23 35
6133 35 9 -49 -44 -101 38 44 17 43 -50 -30 -50 -73 -85 -101 69 -70 88 -49 -10 66 -81 -81 37 -108 -21 -64 49
6160 49 -58 -18 -184 -35 4 -51 22 -16 18 -1 128 -17 43 55 -34 1 -26 55 53 1 116 109 -119 47 72 48 67
6187 67 10 51 -33 5 33 -84 -29 -64 33 -43 6 4 -10 -90 28 2 -70 -103 -76 -219 -83 48 49 21 -49 50 115 87 -25
6216b5p3R6L8m3j8R0n6m2m8L3K00k00J1K4P2m2r5lR3k1l2J79o7j37J39j9o7K0
6244GlKR2o0P0q1o3L1Kq7J62l4j66O5j2J34o5L3j0l7r6Q2p1J15K3p5K4M4r3Q2
6274A5j09N2J00k5MR3j59J6jQN5j36J53l5k9k4L0rQ2n2o9n8M5R6n3pj4MJ08j27
6304d6j3O4j0N8m2k6m5k2N6P4j29J47n7lNj05P1L8m5J22p1J2Kl3M1l5Jn4N2q5
6334g8J37M3p7l8%j72K01l4R3j29Q9k4K0O5p6LK8ok3Q9j61n2O4J75j85P0J37j37
6362B2j04J92k00O9O8q2m3J20LN6j37lJ68o5q7j18Q8R0n4M4n3mm5QK6N8p7Q1M8
6391F9m5j13n6K20j35J2R4k1oR9j65J55j55P7k8l1o5P8p4l0J57p3J10J4m8o0K3
6418CO9q3L5K9n5J58j44J4l0m3J3J6l1N7J1N6j69J26j1j7j29J44o4K7MmJJ1o9
$$ plain form
6216 -25 -98 -2 36 -7 -25 65 9 -33 -81 -48 152 -48 -37 -13 59 17 -78 -81 12 -9 -41 138 71 -66 73 54 -13 7
6244 7 4 6 98 38 108 27 -36 -5 -3 -90 72 38 -128 -63 -75 59 -6 27 17 -20 -116 -34 -105 10 33 -42 -18 26 -67 15
6274 15 -94 -42 58 33 37 130 -29 -13 -14 -6 49 -87 66 31 2 -22 8 -1 81 29 -40 -98 -53 43 -10 -17 -31 -27 81 -46
6304 -46 -59 5 -5 53 11 -15 -60 -82 -26 48 -81 66 9 6 11 -94 -23 15 -30 92 21 33 35 2 43 8 9 -45 7 -78
6334 -78 59 102 25 -13 -13 -185 16 -18 75 -54 35 11 31 96 20 23 51 45 22 111 -50 -102 -38 137 -48 22 159 22
6362 22 -82 110 -90 -21 47 -35 -78 42 45 101 -36 -39 129 64 -23 -141 -53 37 -17 27 -26 -30 -75 -67 -41 17 -60 21 69
6391 69 24 -89 -145 75 -60 -48 46 25 19 118 -47 108 -47 30 2 -29 -94 -16 -90 -120 37 -36 74 88 40 -20 3
6418 3 72 -11 24 53 -2 156 12 26 -4 -47 -34 -18 -49 8 19 75 -94 32 21 4 -125 19 -45 -18 -14 -18 -17 -6 -75
6447g5Q5o2k8K4Q6O0Rj27L2K6j28K9R0r3Q9J21n6j53J14j2r4o1J36J6j21O9pJ05
6475G4j46Q0m9l9J42o5J4j08P0j9M9l4M3j3K8j60Q1M8J17p1k59K44OJ3r5N7k8
6502b0n1J19o3K3J6K9l4N6j11m3R5j5k8l7J79k26K09j07m5q7J68N8n3M8l7J6j03
6529d4Q6n8j7P7j11Q3j11J68m0n9J4n8J6r6J97n8j0L9l2o7m0L8K5J1J79j49P2
6556E5j0o8J4o5o8J69rq6J71j81N8Q6j66K24j08P4j03l6L6k5M6JN5J53k41r6Q2
6583c8P5o7J41q6Pq6P8%m4O2o7N8q4Q0k0J1k0O5J6m4L6J4r2O9o3j06P8L8j06N4
6613d1J1R4p4O2pLo3o8K8K20j15L6p3l6n8O5M8M7j27N3J8p6n8R7M8j18MP5L5j27
6643i7M8L4k0J1R8j48P9r2N9l8R3r8K3O3Qr2Q6m4pJ0J5M4j49N2O5N1n8K9N6r5
$$ plain form
6447 -75 10 -52 -80 -56 30 90 99 -28 4 30 -98 -69 21 -72 17 138 82 -71 43 31 -63 -124 12 28 -93 -24 -31 74
6475 74 -72 8 -41 -80 62 -3 11 -97 -27 -46 3 -31 12 -1 27 -133 -52 -4 113 42 -217 27 33 46 -49 8 -20
6502 -20 -71 48 -15 8 24 53 19 75 -36 -79 16 1 -27 -64 115 -111 98 -9 -54 -141 27 85 32 80 43 59 -44
6529 -44 42 -16 -33 44 -67 16 -95 73 33 -26 -12 -70 -54 -150 47 -11 -21 18 -14 -81 -121 -83 -58 -47 132 -17 55
6556 55 45 -23 -9 -74 -142 27 18 -68 103 -78 -20 66 -100 124 16 90 -13 -49 -13 -38 8 9 64 217 -24 -120 -38
6583 -38 37 -30 111 25 32 -54 24 24 -20 42 -25 33 -51 29 9 20 0 65 81 37 73 87 -5 64 1 -105 -27 11 -95 -41
6613 -41 -30 64 -10 52 45 48 -15 -83 -55 165 50 86 13 -23 -81 -16 32 79 -48 5 23 -53 -111 -14 34 -84 -80 -5 30 -97
6643 -97 -49 -15 -35 -24 74 -74 5 -87 -28 -66 27 -71 -48 15 23 -69 17 -27 -34 -24 -9 35 -114 -62 3 54 -4 25 81 -14
6673a4o5L3J30o0p0P6j08j3J24l9O1L7j01J8j2M8j22j1O5J75j29R8j78n8n8J61
6699a2j2P4o4M2j59J86n4Op8L4K1j5K2l8P4n0J3n5K8l3N0N0M5j19k6J01P8j26
6727a7j3J9j9Q5M7k21K27q9r1J60q8l3M0k7p5J68j43J6N8q4R5m4P2l4j4Q7j03
6754b1o1M8J09k12O0RJ00Q5j08pq6N5rl5J05q7K8J09P9j45K1o5J8M2j38K11j14
6781iJ1n6R6rl4L0p9Q6K1m4l6k5J36j63N8lj6N6L7n0N5mj15J29J22j89J30j64
6809b9J40j05n5nQ5m4NL0n4J03k4o4J09l3r0O5j4j23K17j39o9M8J79j73n6k9P4
6836e1R0n5j24j6J54k8KJ09K6k25J23p2OJ15p8L8j2o1l9J33lm9KM5Nj29J60N7
6864A23p6K8j58J00jJ4jp2j9L0n3K21j74N2k1k5oP5o4L4l5P6j72J08R1r8L2J8
$$ plain form
6673 -14 -79 -46 84 24 -46 30 -78 -91 33 -6 55 92 -9 9 -3 45 -77 -88 -23 152 23 121 -57 -115 -173 -12
6699 -12 -24 50 -14 28 -131 55 1 7 -71 -37 -16 -31 -9 -47 27 -23 -10 -65 -37 -70 -20 30 75 -44 -70 31 109 -17
6727 -17 -30 -11 -30 55 102 -119 108 19 -72 88 0 -33 7 -20 -95 73 -70 -54 4 -80 15 -29 43 9 -5 82 -21
6754 -21 -82 -34 75 -137 -77 -68 32 117 9 2 -84 -29 -38 -73 32 -55 -27 82 161 16 37 -28 -10 32 -106 105 -9
6781 -9 2 -54 42 33 -1 29 -50 36 57 13 -23 -48 88 -75 -17 -20 -36 20 57 7 62 58 -57 72 194 5 135 -29
6809 -29 111 6 -49 -54 31 -13 -8 22 -32 71 47 -17 92 59 -31 34 20 -103 114 -25 -94 -46 133 -40 -96 -125 -51
6836 -51 39 -16 -140 -156 -2 -30 -28 81 107 -118 5 -67 -61 54 -24 14 2 -59 -98 35 32 -17 -15 30 35 -94 66 123
6864 123 47 75 -83 17 16 30 29 -43 -62 -32 -85 136 -38 14 -7 -32 -38 37 -27 7 -28 48 -124 -16 75 -23 9 27
6892B7J08k03N5J03r2l1J9kp1L4n1R0m5J6P5j45J63n1j50J35OO1K6j21J32l1q4
6919b7O8N1o1K3j23J10k6j05R8p5OK0P2%m2p9Q9%P4j9o6j03J14K0j14j1M6Q5j01
6948g6M8k5J9N7m7R9m5l7oL2k13K21n8J16p3j7P8j08r9J47n2J0Q1j41O4j1MO7
6976C5N4o8J0K3L1j41J63j18M6RK7k2N3j23j2J34j68P6R2o6n7L5k7M2J9p6J08
7003G9k07J35j49M3J10KMO3j7j51J17m9R6n9n8j5Q3o7J8J11j05O1N3k28K66q3
7029E3j0j08R3j0k2R0n4j25J87j46O7k2J32k32J16Q4p7r0J09n3j8jp4O7J22N2
7055A30j76R5j5j0m9pl2J4O6k2N0q9n8P2n6J40l1j89J94n9K3J5R6q8R9j71n1J57
7083D8N3j24n2k4j6Q2Q5l1m9J57M1o5r6L2r0n2MJ14l0J5p2N8L7J3j06K7o0J07
$$ plain form
6892 27 135 -68 -13 90 -2 -33 -14 -16 -87 -53 -104 -14 -59 -43 32 -113 50 -1 -151 -16 -10 51 77 -44 88 57 -27
6919 -27 41 92 31 54 -69 41 15 -90 8 -67 -61 -41 31 31 -11 -90 -1 -1 73 54 -12 -115 -1 19 -95 -106 -60 25 -76
6948 -76 -28 -53 -34 23 -24 75 30 -7 -13 19 -194 27 -31 85 12 -5 73 -35 -134 13 -39 -29 52 -89 -25 -36 -32 35
6976 35 89 21 31 54 85 -56 107 -11 35 44 71 49 102 -21 -33 101 -67 9 101 35 -22 13 -14 28 47 -29 79
7003 79 -128 7 -142 -99 11 13 17 80 63 -88 29 -20 76 17 -41 -56 27 -40 -22 89 -16 45 98 -130 136 53
7029 53 43 -65 28 18 -4 86 32 -93 94 -52 15 -7 125 -107 9 93 16 -74 35 -18 -36 -37 -111 -44 78 130
7055 130 -46 49 34 24 -25 -32 -64 -50 16 -6 44 -45 -103 -31 -87 53 22 -167 27 -32 -9 6 102 14 113 -58 -109 48
7083 48 101 -23 -75 -99 -115 -33 52 21 -28 129 170 105 9 41 -49 -101 -97 17 -13 2 -70 -12 25 38 -68 -41 -101 6
7111Fj40Q4M8q8O1L6l4%p1Q9P2J1p3n0k1K9K06k64k2N4QmO7l8R4r6O0o8M7R1r9
7142eL3p5L8l1R7K6j02J9K0j6j05R0P5J2j08QJ33m5L1n7q9R9N1j35L5J18j83O0
7170fN3j8Nm0M5M7o6j40l0K00l4K5j4%j60J23rl3J88p1j0J9j16Q9j62M5j2J12
7198C0j35J62l9om2N0j4O3o0m0J15j57qR1J5J0n5p4J00l6q9J24NJ4oj13P6l8J5
7227d2P2p0l0L4j5J06j25N2m7l2J26j1n4J29j35p4J20r1J24p4J15j83J67j63N0
7252e1J02j03P6O0j02M6Rr1J38r1M6J48k90J02j2N3p9M7R0p5J56k19p9M7L9K7
7278fj3k2k9J75k0j59P8q0J21J8N2l5q3j58J90o3n6K7K6L5L3q1P3MJ9m6n0K7K9
7307Fm8N9q5K3OJ0M1J9o9J00Rqq0K2n6m6K15j20n2Q2L8j28Q3O5j27rqkN5j72J48
$$ plain form
7111 6 -134 -50 -2 -90 -29 7 -27 -27 -98 -9 63 74 1 -49 -70 -41 165 -99 -121 -67 -59 -63 4 -34 60 -36 24 -44 3 94 -5
7142 -5 28 -47 -9 -40 57 83 -19 0 20 4 -101 -11 64 76 -32 -24 109 64 95 38 -51 48 99 -36 -1 117 -66 -6
7170 -6 47 29 34 -6 39 86 20 -120 -150 50 16 41 27 27 -133 -10 -19 -52 136 65 55 74 -42 47 -115 -70 -82 30
7198 30 -105 57 18 12 -30 20 6 69 9 -31 84 -73 -81 10 25 35 -20 -94 6 -30 -119 5 10 24 18 -95 -19 -57 -42
7227 -42 30 -40 -70 -36 -51 55 -70 -18 -65 -97 29 18 -36 93 -42 -116 4 -87 37 -37 78 -105 62 -101 -51
7252 -51 51 -52 24 84 -18 28 37 -54 84 -7 39 187 -103 -1 -13 40 -39 8 98 23 179 -40 -119 -72 -33 -6
7278 -6 -19 -41 -70 105 85 -74 4 -76 45 63 115 80 -3 -161 29 -34 -90 -63 -37 -2 31 -50 23 27 46 0 -50 -23 6
7307 6 -42 17 -68 -45 -39 -29 12 31 -38 62 71 63 -17 5 -51 -97 118 -2 -54 28 66 -62 21 86 -41 -50 -58 -60 -5 -177 -29
7338b9jM2P1m1k35K28rO8q5q0K18o1j13j15J21J78q2j15J49j91M4Q2J6j01QO4
7364C1K1q7J59k02O4J23r2R1p1P1m2n7n0O0L6j18J51r6J0o9l3J15r7J00J18j79
7390d3L3l1M3k6J10j8j28o4J22j12J53r4Q5r0k8J9N7RL4K5q7P0N8Oj72O4j12J10
7418gm7NO0P6j0j8p3Q0n1mn3K8r0J03L1j09M7J8R9l4o8q7N6P0LM6J10j63r5l9
7448a16J83n2j49O7M6J6m2K03j34q3Q7j65K25n1k6p0N4nj00k8J77L5k30J58L7
7473C7Q8j02k0o5O5l0o3P1J44k35O0L8m0J45j47P9L4N6k56R5R5j00N0K2k6P1k1
7500D5m5M1q9Rmo0J45L2M6k83Q5J10j05J31N9k26J98j53P8K9j62P7m3J54r8k9
7526e8O0q6L5J37j6q6n3J40J2q0k1J10o5J7K3r9RO0j63O1P6P7q8R0j17N0R9j54
$$ plain form
7338 -29 -30 12 83 42 -193 35 26 94 9 -71 147 86 -27 -142 -21 157 75 -40 109 -82 -38 44 60 -41 -33 31
7364 31 52 -35 124 -78 -14 109 17 108 37 108 66 9 -41 19 55 -63 88 -8 2 -67 -100 15 -82 18 136 -43
7390 -43 -10 -41 2 -24 86 68 -60 -124 -2 -114 39 -55 30 -60 -88 -69 -12 -3 31 56 -31 39 97 103 -69 -5 -117 -7
7418 -7 -54 -49 11 87 77 59 -14 66 15 11 -42 -14 -104 -1 30 -79 -32 -14 85 51 -17 -104 -48 22 25 71 181 18 -77 -116
7448 -116 67 15 -134 -67 -21 -5 -47 156 22 -61 26 -139 86 35 9 -61 -7 -12 -112 -140 37 72 -158 0 37
7473 37 125 23 3 -62 3 -27 -90 -19 125 -110 -50 -12 -52 93 -54 25 59 115 -141 -46 49 -51 -1 21 -5 66 45
7500 45 0 41 -48 -39 -43 -103 42 74 120 -163 -78 32 -73 58 117 -109 89 -64 14 43 -119 -42 -85 69 -29 -58
7526 -58 2 -84 -49 88 72 -14 -67 73 85 5 -16 94 29 46 69 -30 -21 39 -124 -63 13 90 2 92 -25 25 124 -30
7554c0l5N0K7j04M7Q2o4J29m2j93J49J1Qm8r9J26O3j22L6k9N5L7n9%k4lj04P6
7582f0P7P6j42k8k9K3q4J28k7J89j16jr7P0R5o1J96l05J02J08r4N8k6K9j38M1
7608a6j6O1J9j48O5O3m2PJ9j4K8OK3o9o6L2pm7P7P4o8j08J70j61j7J43o1n9L0
7637h2P1j60K05m2Q3q3Q7k5r7K7K6nj65J99m1k1J03p6M4j5q3PJ25o3n4J49j26
7664a2p6K15p0l5L6n0m3N2n9N9L2q4j00J23M6m0m0R9N5k9p9j02J37l9N3p7M5r
7692HO2%J3j02r8J81J0m6p7p9N2J01m8L4K5o4L9P1p9N1l1o5j04J48l1K4J20%j35
7721b0l2O7J5M4J8j22J3k3J27l5k3L9j07R9o5J8L9j06J04p2mQ7j00M3Q8l2q3l3
7749e6J21M7q8q2L8K9n7K2k0J4J07l2p6K1r8J19J5k1L7M1n0n3L6j17K15p6M7j5
$$ plain form
7554 -30 -65 -15 12 -92 -45 37 -27 102 60 -133 16 27 35 -13 -112 14 77 -45 -9 -38 17 54 -5 -5 -29 -32 -136 -60
7582 -60 17 93 -49 -77 -106 -83 -167 -39 -66 123 7 6 -91 -21 74 13 209 -96 6 114 20 78 52 81 -57 -16
7608 -16 -32 29 48 -100 -35 28 -14 -7 12 -2 26 32 55 -14 -80 -48 -55 -102 -25 49 -19 -127 43 -118 -135 8 -53 -112 -82
7637 -82 -11 -171 34 -8 75 -8 79 54 -43 -16 10 5 -160 39 -2 -23 80 4 48 33 -50 -43 82 19 -35 114 -12
7664 -12 -88 127 57 22 58 8 -35 17 -42 17 49 -35 -135 -12 34 -6 -46 53 108 79 0 -102 35 -4 49 -28 17 8
7692 8 70 70 83 -19 -117 64 74 28 -49 -128 -76 25 -23 11 36 -28 11 82 3 54 23 -42 -146 2 -29 -5 115 115 -20
7721 -20 -52 15 30 74 92 -30 -17 -40 87 52 29 68 -39 60 -5 13 52 -54 50 -22 -26 61 -39 4 92 60 -23 -56
7749 -56 65 112 24 -58 -20 9 -48 -26 -46 -32 75 43 -33 -12 -110 9 24 3 40 81 31 -22 14 -103 112 36 83 68
7777F8j07J20k8Rj17jm7N8n2J05q7J77j45L7mM6r9J06L6j52P3l6j03J70l5l5J49
7804A06j80N5Q2K1q2j04K6J34q3N3j2n7O9n7Q4r4P5n1j12P5J14p7J09k1lp0K7
7831B7M0n7M2r1KM4P4q6P8l7L5m5J2rK2n8O3p9N1p5j5n3J47R2j19N2K2q3j5l6
7861e5N3J07k02J04M3Qj14K7J06k3p8k4o5J85rOp3k9R6j21J66j35J04j74R6pM6
7888C8q2J36j0p7L2m3p8P6j14K21j20N8j28K2K8L0M1oj41J34j11J41m6j01J42
7913D2j36M3P2l7J45j25j12J87j41O8%l9k0J14Q7r7j73Q9Q5M6j17K5N9q6l8O2
7939Cn1J18J0j25J55j02J79k21nO4Jon0J22l3m9Q1q5J6l9p0J26j9j1r1J17k8N5
7967F2k31K03o7j1P9k5p4j0J30o4L8r0J63p5M8p9N4o1o8J30k46K08j9J2r6P7n2
$$ plain form
7777 68 -39 81 53 62 -55 -56 -103 -45 -97 8 -79 98 -47 -10 -14 32 -67 39 75 -77 -4 -40 -143 27 -8 -43 106
7804 106 -74 -19 63 84 2 -102 -76 58 -25 28 16 -41 28 -29 55 -39 36 -15 -127 -52 62 -15 94 73 70 0 27
7831 27 67 10 52 -39 -37 7 81 -5 73 36 71 26 38 29 51 -7 56 -23 28 -47 -62 -115 32 124 5 57 79 -4 -19 -55
7861 -55 -2 105 -97 7 50 58 -56 -29 77 54 -24 -48 -113 72 63 69 -4 -33 63 -58 108 -27 77 -97 -1 -8 38
7888 38 -44 92 82 5 37 -6 -84 -8 -122 99 -21 37 -91 -69 -41 -11 30 24 -117 17 -94 47 1 -100 42
7913 42 -94 -51 21 -16 129 4 -108 79 -62 6 6 -33 -53 61 148 51 -122 -33 52 98 -19 6 65 -21 -59 3
7939 3 -48 70 80 -45 110 8 187 -34 -39 25 26 20 -30 92 59 10 91 6 22 -17 -87 39 20 9 -82 35 7 62
7967 62 -169 34 -33 -44 35 10 -64 -74 56 -8 30 -60 103 28 76 -3 51 -10 -78 52 -194 14 -5 7 -89 -12 -64
7994f4j8N1J08oqlK8p4k8J27j16OOj2R1o9o6oJ85p9q4K7%j5K7K1k00K06Mq9j5
8025f5r4J05J32j12k8n6J08k8J19n4k1j9N9j86J74J7o3M3n8P1M7o8p4j1l5J14
8051A7j6n8J18O4p0nPj49J53n0J1O6o6L7M1j30K4l3P8n2k1J9P3L1rl4m2O3m6j02
8081h1J9L0l4J7K2P5o1n5j05K54l4pj66Q5J5J63j39Q8j54P3kJK7j6q9L2MM7j02
8110i3R5O0k9n2J17j37m1R9R2j26M6j14J79O7k23Q1m7Q5JM8r9p3J81q0p4Q4J8
8137F5o4J08j64P6r7pJ17m0j01J79k3q0N4J1l0k0jpP9j00R0l9J03j35R9O3p2Q0
8165A44k14J75q4l4l6NJ21o3oK9N1p6Q6r2n7J25j09k8J60j76J41j36M7J1R1o0
$$ plain form
7994 -64 -82 -31 77 71 63 60 88 14 -14 113 -3 3 9 -3 88 19 -47 -53 132 53 -31 -4 -4 -19 8 29 -171 35 39 -50 -65
8025 -65 -159 -54 78 -34 -62 -118 -10 -38 81 27 6 -13 46 -140 34 51 -12 31 -27 44 91 23 -51 -62 -97 17
8051 17 1 -57 61 125 55 50 57 -92 61 11 22 88 22 59 100 -30 -6 -39 39 -13 -34 -15 58 89 80 46 4 67 21 -81
8081 -81 -62 -32 -66 -49 -27 48 -13 -68 -173 81 47 40 -126 -41 -26 137 -2 86 -68 5 3 4 31 15 -74 -42 -38 9 -93
8110 -93 2 62 33 -19 98 -39 -80 19 111 -15 31 -83 96 163 -60 21 -26 59 60 108 9 -64 117 37 -37 47 65
8137 65 1 109 -55 21 -76 -83 34 -6 -107 72 49 -31 23 34 4 -16 -17 -24 55 -45 45 6 109 -26 73 136 64 144
8165 144 -70 105 21 -13 -49 -44 77 14 8 37 88 12 98 6 -51 74 -35 -63 97 -79 62 -74 -27 -16 75 15
8191A5
$$ Imaginary data points
##PAGE= N=2
##DATA TABLE= (X++(I..I)), XYDATA
0@%%%Qj6J6j6K4m0M8n6P2r1J15j36J60k00K40k80L36l95M59n36O16p07Q12r26
27d93J055j197J351j524J716j925K154k405K679k981L314l678M078m519N002n536
43b909O130o792P534q368R314j0398J1653j3127J4886j7034J9725k3206K7905
56A5313l4641M5173o4051J08128l86369k38596Q13245n2071m08879N9774K92514
67A49540k27314j59254K45874J42844k93798j22441K27336J81172o9069m4634
77C0256l1014j03506m2855J33492P4632m4633k2615L868m5195L8898Q1547o9797
89C078j24400L9719O4719r937P4270R8054j21817j73513N5146J40283N248l9221
101A1629j2671l6979J4561J16799K8521j42911q6817P6182M3530l1907P2853Q8739
$$ plain form
0 0 0 0 0 8 -8 8 -8 16 -24 24 -32 40 -51 64 -72 88 -112 128 -152 184 -211 248 -288 328 -379 433 -493
27 -493 562 -635 716 -808 908 -1017 1137 -1268 1411 -1570 1744 -1934 2144 -2375 2627 -2909
43 -2909 3221 -3571 3963 -4405 4909 -5489 6164 -6963 7923 -9111 10614 -12592 15313
56 15313 -19328 25845 -38206 69922 -316447 -555043 258202 206131 -202748 -142974 149540
67 149540 -77774 -237028 8846 151690 -142108 -264549 -37213 143959 74890 30256
77 30256 -758 -104264 -147119 -13627 61005 16372 -6243 -2375 -47570 -8672 72875 3078
89 3078 -121322 -81603 -16884 -26821 47449 145503 23686 -149827 -94681 45602 50850 11629
101 11629 -1042 -38021 -23460 93339 121860 -21051 -107868 -31686 11844 -20063 52790 141529
113A41529j40748j70340J25774J74852j13182j40561R2005O7909p3584L6863J03838
124A04355q9879j42224N3744J04592j1383j0378L6584l6420p1966L4275Q8408
135E9708p904q3841l4003L6794N1815L9121r333p2564m1652L8923K1009j1457
147a3384M7243K0518j06797m0128J40129N8536j29529n3010Q0314J158m0469P9360
159D3941N9714j08095r0617Q0139Q4828m6508n2284L4477J4439m5816J2612P0255
171E7085j6281q8416j6582N2015L2795J2389j2083n4512j9101N1838K1132l0481
183a0202J676R106l5897l487O1353K2058m9212l8793M591K3583K8539R332k7575
196d928l0486M867K5950J2595n031j1386k2289j8317L1706N3828j8281o0623J0864
$$ plain form
113 141529 781 -169559 -43785 131067 17885 -122676 -30671 37238 -36346 517 104355
124 104355 14476 -127748 -74004 30588 19205 8827 45411 8991 -62975 -28700 59708
135 59708 51804 -32037 -66040 -29246 22569 61690 52357 -20207 -61859 -22936 -1927 -13384
147 -13384 33859 54377 -52420 -92548 47581 106117 -23412 -76422 3892 5050 -35419 43941
159 43941 103655 -4440 -95057 -14918 69910 23402 -28882 5595 20034 -25782 -13170 57085
171 57085 40804 -47612 -64194 -12179 20616 33005 20922 -33590 -52691 -853 20279 -10202
183 -10202 -8526 580 -35317 -38804 22549 44607 -4605 -43398 -38807 -15224 13315 22647 -4928
196 -4928 -35414 -30547 -4597 7998 2967 -8419 -30708 -49025 -17319 36509 18228 -42395 -31531
209c1531L7783k8769q156O6764l438r3256K623R9353R225p3932r273L8904o521
222b24j7206K9235K3805l2726l7099J6844L5294L010j1665r066j8954p72L8860
235A9336J7537l3220j9445J2233K290O925K3521r167l2701M123K1057j841N876
248A6524J2772k4548l0983K0856L9584j542k9428j3946Q126J0826M737K966n420
261A0524j6961l838J6753Q089l354K679j2729k5501J5564M0824p192l5675q32
274a1649J3835n4Q820Q543j9890j6194J3841J1150m405K462K996j4068j3958J1635
288f936K4296J19k8082j3594J8554J6497k552o616r749p090J0923R194q417L238
302b15J1697j9799j9898K8095K5951k5029k4086J3251J2185l668L832L417j3576
$$ plain form
209 -31531 6252 -22517 -30673 36091 32653 -60603 -57980 41373 50598 -23334 -32607 6297 -224
222 -224 -17430 11805 35610 2884 -34215 -17371 17923 20933 9268 202 -18752 -19524 19336
235 19336 36873 3653 -15792 -3559 -1269 5656 29177 20010 -12691 -8568 12489 10648 16524
248 16524 29296 4748 -26235 -5379 34205 32663 3235 -10711 -2585 8241 12978 15944 10524
261 10524 -6437 -10275 6478 14567 11213 13892 1163 -24338 -8774 32050 24858 -10817 -11649
274 -11649 2186 2132 10952 19495 -395 -16589 -2748 8402 3997 6459 9455 -4613 -18571 -6936
288 -6936 17360 17479 -10603 -24197 -5643 10854 8302 1686 -8063 -15153 -4230 4964 -3453 -215
302 -215 11482 -8317 -28215 -120 25831 802 -23284 -10033 2152 -1516 2316 5733 -7843
315g843j2085J0419J7526k441j4545J93P336p742j895J9532K371k5799p605K0495
329b083J1309l641p020j0852j88J5639L217j1379J504N677q904l535J4466P415
343A1625j0209j2723j785J1558J2275k867j1755m115M178O888L181n196m208L906
357G53r09l962J0510Q549j4345j0930R846O278j070N804l249j6053K597J9308
371A3127L99j4811k050P583O07l660K632P105l116j3101p32J4440M696q403m644
386G2j363J016R678L709j2345n597Q309J145l582N968K149q693l151L243J646
401B204L891J396q999o261Q251R439k690r782m598O042N838l834k481N383k080
416A719q570K711Q215r03l532k869m729M147J1057l007j1999K68O433L9m07R61
$$ plain form
315 -7843 -19928 -9509 8017 5576 -8969 -8776 -1440 -9182 -11077 8455 10826 -14973 -22578 -2083
329 -2083 9226 5585 -1435 -12287 -12475 3164 6381 -4998 -3494 2183 -6721 -10256 4210 11625
343 11625 1416 -11307 -13092 -1534 10741 7874 -3881 -7996 -3818 3070 6251 1055 -3153 753
357 753 -156 -4118 6392 14941 596 -10334 -488 5790 4720 10524 7275 -8778 -6181 13127
371 13127 13526 -1285 -3335 4248 4855 1195 3827 10932 7816 -5285 -6017 8423 13119 4716 72
386 72 -1291 -275 9403 13112 767 -4830 3479 4624 1042 7010 9159 466 -2685 558 2204
401 2204 6095 7491 -1508 -7769 482 9921 7231 -2551 -7149 -1107 4731 897 -1584 3799 1719
416 1719 -6851 -4140 4075 3172 -360 -3229 -7958 -3811 7246 4239 -7760 -7492 -1059 -1020 -1427 -466
432d66k797j643J393k93J410L187k245n456p19M190N872R21r255n326Q379N801
448B953n187k357K376j412r2K890j245J9K887n154n620Q659Q874o996q629K628
464e406N388J620j600k544K56J475p91J127K932j723k731J111q62L84O335P22
480E693r789j642R051K660m318j916p49N92L743j13k995K122J476m377j233N146
496C351K655k573m380j588N323N046l964n951K278L066j72K74n03j745J475j59
512B433l508K771N609m025o189K600M405J7r81l030k654L709M105k855l302J614
528G19J170j117r62M45K560J88n695j431O884K456n769k555J763Q42J889K44m066
545b435n64L924r04l027K386J677k662j890O87J621K658j112n234j47M805J234
$$ plain form
432 -466 -3263 -4906 -3513 -3806 -2396 791 -1454 -6910 -7629 -3439 2433 3354 -5901 -11227 -2848 2953
448 2953 -2234 -4591 -2215 -3627 -3719 -829 -2074 -2055 832 -4322 -9942 -1283 7591 595 -8034 -5406
464 -5406 -18 1602 2 -2542 -2286 -811 -1602 -475 2457 734 -1997 -886 -1748 -1364 4971 5693
480 5693 -4096 -5738 3313 5973 1655 -261 -1010 -418 3325 3212 217 2339 3815 -562 -1795 3351
496 3351 6006 3433 -947 -2535 2788 7834 3870 -2081 197 3263 3091 3365 2862 1117 2592 2433
512 2433 -1075 1696 7305 3280 -2909 -309 4096 4113 3132 102 -2552 1157 5262 2407 -895 719
528 719 1889 772 -190 255 2815 3003 -2692 -4123 2761 5217 -552 -3107 -1344 -502 1387 1631 -2435
545 -2435 -2999 925 21 -3006 -620 1057 -1605 -3495 -2808 -1187 1471 359 -4875 -5022 -217 1017
561A017k525j719l31J782J796k415j500L614R8m450N46M702j07k602j468q41K677
578a726L714k523m383K075L308j336j253P00N37J75r84j250K509K817k954l104
594c678K096K356M64l39k803r61L992J706l501m97K670o10j770R60Q52Q57N02
611B296k976j362M517K217l929k351K215J917J46j213j489J274J834j987j019
626I0K357O30j922m75j1M99K503n53m449O86M517o62l031J68J194J12K74j145
644G82m10J970k00k946M96K775m9j711j313m19K339J971l140k515K745J680k007
661D8o55O92l4K00q69j092J864J985k807k551K069K029n81j185j071j57K093M69
679D47k410m7J788l91j440J27Q91J072m27k734O1L605M29l565m00K038L30k78
$$ plain form
561 1017 -1508 -3227 -3558 -1776 20 -2395 -3895 -281 -183 -4633 -4087 615 508 -2094 -3562 -4403 -1726
578 -1726 1988 -535 -4918 -2843 465 -871 -2124 -1424 -887 -712 -1696 -2946 -437 2380 -574 -3678
594 -3678 -1582 774 1238 899 -1904 -2865 1127 2833 -668 -1165 1505 895 -875 85 937 1794 2296
611 2296 -680 -2042 2475 4692 763 -1588 627 2544 2690 1477 -12 1262 3096 1109 90
626 90 2447 3077 1155 680 669 1168 3671 3118 -1331 -645 3872 3210 179 347 1541 1653 1927 782
644 782 372 2342 2142 -804 -308 2467 2418 707 -606 -1025 1314 3285 145 -2370 375 2055 48
661 48 -607 85 51 251 -618 -1710 154 2139 -668 -3219 -1150 879 298 -887 -1958 -2115 -22 447
679 447 -1963 -2010 -222 -613 -2053 -1926 -1035 37 -390 -3124 -3063 542 971 -2594 -2994 -956 -626 -904
697i04k05r15N81J478j441j171K177Q56j649r63N76J192J018j120k324J439K674
714A299j107j838Q19O81J36O4r18J75J905l82k473P56K394l09j441m79K25J467
732I74R17k004j058K397R72j796l85J036L48k20r90l62J767J075k162j318K005
749A196R67p79n75n47J28J842k65k179N58J860q08j383O01R12J55n86j343KK484
768B240k39k230j49J511L5n27l13m43O74P70j542n69J824L89j853l06N79N33O65
787A049j142j564J196J972j513j323Q12N10k80m20l48K19J332p80j632P50J610
804D48o35j096r7K82J032K67j661m59J905J79j654O6J075r0l99l50l23J243O43
823C76j444r41J436Q44r00n13r3N26R87n90j182Q09J312r91j024Q21P52J80n82
$$ plain form
697 -904 -1109 -2024 -1443 35 -1406 -2577 -400 456 -1193 -2156 -1580 -388 630 -490 -2814 -1375 1299
714 1299 192 -1646 -827 -146 -10 54 -864 -689 1216 834 -1639 -883 1511 1202 -239 -718 -493 974
732 974 1891 -113 -1171 1226 2198 402 17 1053 1401 1181 191 -171 1596 2671 509 -809 1196
749 1196 2163 1384 809 262 390 2232 1967 -212 346 2206 1398 15 616 1528 1683 1097 -246 -244 2240
768 2240 2001 -229 -378 1133 1168 641 328 -115 559 1329 -213 -782 1042 1431 -422 -728 -149 384 1049
787 1049 -93 -1657 -461 1511 -2 -1325 -513 -3 -283 -703 -1051 -832 500 -280 -1912 -1162 448
804 448 -187 -1283 -1380 -1098 -66 201 -1460 -1919 -14 165 -1489 -1423 -348 -438 -837 -1187 -1510 -267 376
823 376 -1068 -2009 -573 271 -629 -1142 -1235 -709 278 -312 -1494 -685 627 -364 -1388 -567 185 365 -217
842b17q79K72J837m60j612M44J156r3n56n3K2O05M08j041k97J456J61j247k49
861c43P22N99n2p22n95J196Q35j233o24J033K51m24l2j97K56O92n16j092P43J149
881A646o89r46K27N00M32j75j012O4J207k56j195L08Q35k56l77l46o5Q47L48j198
901a01m35J117L08r09k86J79K83M49n74p63P99O27q71p94Q47M61l00m60m44L97
921d70R71m63j227N37P27k27m46q4J00L84J34q61q2J215k20j112R3O79J66k4o11
942h21k71R99K30p90m64Q74Q8m06j78Q6L58L86m91q08Q14Q30p54m38J76N29J71
963A20j58o88K85R66m45p34K98P88k24k96j88J88O66J08r29j75J067Ko77p9K93
984A88K41K05m26l69O82N22q79l59O49L04j96k49k55L88N73n40p57O25P39o67
$$ plain form
842 -217 -1096 -824 1013 553 -1059 -615 541 448 -108 -161 -139 466 874 -167 -464 992 1153 -94 -343
861 -343 379 978 926 204 -391 805 1640 407 -217 816 1067 643 611 414 670 1362 846 -246 497 1646
881 1646 957 11 238 738 1170 995 -17 47 1254 998 -197 111 946 690 313 -33 -98 749 1097 -101
901 -101 -536 581 889 -20 -306 -127 156 605 31 -732 67 694 -177 -971 -124 337 37 -423 -867 -470
921 -470 501 38 -1189 -652 75 -152 -598 -682 -582 -198 -64 -925 -1007 208 -12 -1124 -1031 -352 -186 -210 -821
942 -821 -1092 -93 137 -653 -1117 -243 -155 -561 -739 -653 -295 91 -400 -1208 -394 436 -318 -756 -580 -51 120
963 120 -38 -726 -441 525 80 -654 -356 432 208 -88 -276 -88 578 686 -243 -418 649 651 -26 -105 188
984 188 429 634 208 -161 521 1043 164 -195 454 758 562 313 58 446 1019 479 -278 347 1086 419
1004D19j88J7K89K42k55n10J39P62k87p72J68N03J59l61k11j22O24J44p20k93
1024b53O94Q4n03r9K16J80K43p27k66O06M69p02m37L44K12L8k00k87J45O59l98
1045A8p39M82M08k62j53k70J90M16Jp84L5P70j34o44L7M06N0l6k15k72N79K61
1067A44p33j96O55L3k64j44j49L92K62l93m56L98N76l81k03J34J64K01k37l51
1087e48K39O63k95n79K29N11q7k81k23J36M87R7n98j01P01L3n23m4K22L07J51
1108D97m90o4K96M61o01l97N71K30r9k08j88L10K40k94l77M36K65j44l71Q3K40
1129C96P8r4m40J51M56j29l16k5L05o5O0l21r9M71J54o70L4L61J04k47j84q1L01
1152B00K53m47k35K78L39l21l29K78OJ48j10l28K25L54l51m19K62K86n3j43j64
$$ plain form
1004 419 231 248 537 779 524 14 153 915 628 -144 24 527 686 325 114 -8 616 760 40 -253
1024 -253 441 525 22 -77 139 319 562 -165 -431 175 644 -58 -495 -151 61 99 -101 -388 -243 416 18
1045 18 -721 -239 169 -93 -246 -516 -326 90 91 -693 -658 112 -22 -666 -629 -223 -173 -209 -424 -696 -117 144
1067 144 -589 -785 -130 -97 -361 -505 -654 -262 0 -393 -849 -451 125 -256 -459 -325 -161 40 -197 -548
1087 -548 -309 354 59 -520 -291 220 133 -148 -371 -235 252 349 -249 -350 351 384 -139 -183 39 346 497
1108 497 7 -57 239 700 99 -298 273 503 404 196 8 318 558 264 -113 323 588 444 73 156 396
1129 396 474 380 -60 91 547 418 102 77 382 317 377 56 -43 428 582 -88 -54 307 411 164 -20 -101 200
1152 200 453 6 -229 49 388 67 -262 16 22 170 60 -268 -43 311 -40 -459 -197 89 36 -107 -271
1173b71J9K32mm85J26M20L1n18Q1K60J57k39j64j54M67J04o17M9K97K08j73j77
1195c51j38M15J99m47k38K66L91l24j60J32J23J85mn66L15N49n01j40R0M08k08
1216dj20n3K16J10M1l81L2M29m8k43j62L18J09Lk71j97M58J49l62j43J87L50j66
1239B52j43j19J29L22j96l24K90K50k71j03n1J65J29Lm42J44M24j18m05R8J68
1260B02N1k5j69K0K74N4m44KL30Pj65q1P2J30L4k71j30L60R4m09k1Q1J46Q9l02
1285g1j18J52K02j17k59J37R4r5j00k6J42j8M9k67M8L56l1m05N4J73J84j71r9
1308a86o7J96J23l76M7J86Q5r9o4n3J13R9k51j55K43K67k25n1m3O4K95k95k23
1331c70K29K47rm05K73R5j00qk19J07K64j41j32N1K93q2j54o3J09J68n1j70k5
$$ plain form
1173 -271 -252 -20 -24 -509 -383 37 68 -450 -369 -109 48 -191 -355 -509 -42 62 -555 -506 -209 -1 -174 -351
1195 -351 -489 -74 125 -322 -560 -294 97 -227 -387 -255 -132 53 49 -517 -202 347 -154 -294 -204 204 -4
1216 -4 -124 -177 39 149 190 -191 -159 270 222 -21 -183 135 244 247 -24 -221 237 386 24 -119 68 418 252
1239 252 109 -10 119 441 245 -79 211 461 190 87 36 201 330 333 -109 35 459 341 -64 34 202
1260 202 253 228 59 79 353 407 -37 -35 295 302 137 56 128 258 292 21 -109 251 345 -64 -85 -4 142 231 -71
1285 -71 -189 -37 165 48 -211 -74 20 -75 -175 -201 -59 -77 -28 -295 -247 109 78 -327 -273 -100 84 -87 -186
1308 -186 -253 -57 66 -310 -263 -77 8 -91 -155 -208 -95 4 -247 -402 -159 108 -117 -168 -211 -147 148 -147 -370
1331 -370 -141 106 97 -308 -35 60 -40 -48 -267 -160 104 -37 -169 -118 175 93 -61 -124 -15 153 102 -68 -93
1354i3L07O5k31k04K92qP9p2p8J25N2r4k44K25J07o7j76J44j6K10j99j99J60K13
1378B98k8k36J0J42Q4r6r6K8K33j28j50j28L13j22j04jO9O9O2k76o2K16N2j82
1402c3O6N9k5J78k09j59J87k6p7j84K79N7j61n0l5J9J54l4j97J55l3N4k40P8Q8
1427h9jk2o2m8J72N5j40N0M0K7j23n0M9K10q6k09p0J69J70j3j49j30K14q3J13
1452fj61J23P6j36j24R8K31q6n5j29R5J75J8k74Q5K70k17m9P6l2J33kj41q9K19
1477I8J04l54N9J74j6M5J1q0NK85l59n2K42L1l8j48J2J33m7Q7j68l1L04j09k22
1502c4R8j2J42j79j0L6J60r2j47R0L3N9k65J52j4J20l1j46l3O5K07k45M2Q2l4
1527D4M7j24l2P8M7q9n3P9R7l3j2j35J56p2n3q6J36Rjj30l8J42K3r2N8l5l0J04
$$ plain form
1354 -93 214 279 48 -156 136 128 207 135 57 182 234 140 -104 121 228 161 -15 129 113 323 124 -75 85 298
1378 298 270 34 44 186 270 174 78 106 339 211 61 -67 246 124 20 19 88 157 219 -57 -119 97 149 -33
1402 -33 33 92 67 245 36 -123 64 38 -39 -223 56 113 -48 -98 -133 -114 40 6 -191 -36 -69 -15 -255 -177 -89
1427 -89 -90 -112 -174 -222 -50 5 -135 -85 -45 -18 -141 -191 -142 68 -18 -227 -297 -128 42 29 -120 -250 -36 -119 -6
1452 -6 -167 -44 32 -104 -228 -130 101 15 -40 -169 -74 101 119 -155 -70 200 -17 -66 10 -22 111 109 -32 -121 98
1477 98 202 -152 -93 81 65 110 121 41 46 331 -28 -80 162 193 155 7 19 152 105 192 24 -7 297 188 -34
1502 -34 64 52 194 15 5 41 201 109 -38 52 85 144 -121 31 17 137 106 -40 -73 -8 199 -46 -4 78 44
1527 44 91 -33 -65 13 60 -29 -82 -3 94 61 49 -86 70 -2 -55 -141 -5 4 3 -127 -165 -23 0 -92 -34 -69 -99 5
1555EK6m3L7p0qp5J04RL9lj78Q3J51j45p9L9o8P0L8j0R2j3m1j19J00m6J29p0r3
1584a39J84q9p7q6K00J15j20pQM4n1Ko4M6J76j36Q5p4LJ22mj66n5K15m4p1o1Q9
1612D5K9o9P8knL7p3n3J3K10k16RO3p8J24q8k3n0J98n4j94M6J18j49J69m7M6j
1640H3Q4r0l1N8o1p9J1RP7N8o7k9M8j19J1k1J32j12j3R6q5N9l6l6nJ6L8m5P2q6
1670f3OM0L9p6n9K32j47N8j00m2J25Kj16QJ57p0j44J31P3j1K6q5q5jJ31r3lN3
1698a4r7J1O1j5K3j7J11j76Q9P7j79J52Q5p3m8l6j02Q9J09L5j01j19J78p2m7Q6
1724A0M6rN2j68j9N1P6J8Jo1J31j50oK4J02P0j51j72J70M4q0J14M1j32K4K27k97
1751d4J19%m5k8J30j10L6J8j46J8K07q3Mn5J02L2j43P1rm6M1j16M0J64k46K06
$$ plain form
1555 5 31 -12 25 -45 -53 -128 -24 -15 24 21 -157 -74 77 -68 -147 -108 -176 -106 -68 -78 14 1 -40 -159 -59 -105 24 -46 -139
1584 -139 45 -44 -121 -207 -7 108 -12 -19 -11 33 -18 -16 -80 -34 142 6 91 17 20 142 138 -28 -83 132 88 17 -44 45
1612 45 74 5 83 81 76 113 40 -13 0 210 -6 3 66 -12 112 24 1 -49 149 95 -99 -53 65 -84 85 38 84 83
1640 83 167 77 46 104 43 -36 -25 -16 61 119 52 23 71 -48 -37 -58 74 -38 -51 45 -40 19 -17 -53 -58 -42 -4 -49 23 -63
1670 -63 -57 -17 22 -54 -113 119 -28 30 -70 -112 13 15 -101 -93 64 -6 -150 -19 54 43 69 -16 -101 -102 29 -64 -67 -14
1698 -14 -111 -100 -39 -54 -31 -48 63 -113 -24 53 -126 26 111 38 -10 -46 -148 -59 50 85 -16 -135 43 -29 -76 10
1724 10 56 47 99 -69 -88 -37 39 57 58 -3 128 -22 -28 -4 98 168 17 -155 15 59 -21 93 134 2 26 253 -44
1751 -44 75 75 30 2 132 22 58 76 -70 -52 155 72 76 21 123 155 12 83 74 28 69 -47 -7 157 -89 117
1777A17j36L8NO0q8j26K31j04O9j09L3j7P3j01O2o2J22j25O6j87J65L5J6o7J1
1802a9J13j10p4O9nJ06j92j5J39o1J9r6J08pJ01j45r3J45Q2m5j45K7J13N1n2k65
1828b51K40M6l0q1J00Rk4j09J05K7M8p3L2j39J16on8R0q8R0J8j9n9R4j03l1Q7
1855C1O3Mr9J52k1K9k01n4j9K42p0o4k2J1Qj5M9p8Q1O4q6L5J5%q2P4P1rq7n5J9
1886a4o0J33R5j45p7lP6J25m7j45J73l8L1j78J29p4OQ2q2O4n4J33k29M0O9NL6
1913E1j19nJ38n0l4K2J06n8j35Kj04J99N4j00K0N1q3l9rJ89j36q4J41r3M8Q4k49
1940a93J24M9n3K3J04j23nM4J3O2N2j06j6LJJ5J9Ln7O3k7N0p5N9j33J28P4j55
1968e7M2K8N6r1L3J3o4J19k3j36N8J51n5j29L9R8l5r8P2Ro0J8M6n4Q3k2kj46K25
$$ plain form
1777 117 -19 19 24 84 -4 -130 101 -3 66 -43 -10 -27 46 -55 7 -55 67 -58 8 -179 -14 21 37 -30 -19
1802 -19 94 -16 -90 -21 -26 80 -112 -127 12 -49 -30 -126 -18 -25 76 -69 -162 -17 65 20 -125 -98 15 66 14 -251
1828 -251 -11 35 5 -76 24 33 9 -100 5 32 80 7 39 -100 16 10 -48 42 -46 44 62 43 -16 78 -25 -56 31
1855 31 94 98 -1 151 130 159 -42 -96 -115 127 57 -7 -29 -18 -10 -25 24 -54 27 91 5 40 55 55 -27 47 118 109 22 -33 -14
1886 -14 -74 59 154 9 -68 -71 5 130 83 -62 111 73 104 -74 55 -19 -13 69 -13 51 -3 130 -99 -59 10 15 51
1913 51 -68 -73 65 15 -19 3 109 51 -84 -82 -186 13 67 -33 -13 38 -45 -84 -93 96 -40 -124 17 -76 -28 56 -193
1940 -193 -69 -20 -73 -50 54 -69 -74 -30 -17 45 97 -9 -25 -22 -21 -6 13 16 -41 22 -5 45 -30 29 -104 24 98 -57
1968 -57 -15 13 69 -22 11 24 -40 79 56 -80 -22 129 74 -55 -16 82 47 -51 21 30 -30 -12 34 -20 63 41 39 -107 118
1997A18j63M3M3n3J1O2j05P9O1o7Q8q8N4j9J4j82O2R1Q7j02p7J7P2lj8Q7r9k3
2025a0M8j42J50j07J75j45N1N6o4j40J34Q8q0r2N3J6M5N4j2o6k3MJ9j6n4J41j31
2052d8k5N2K5j6L2n9p7K42j48NOm5J48j03N1k4o5R2m0o4J20l1m1K2m2k5J73K7
2080A42j89J04kj38JM8Q0n8m4R2P5O8k19J06j15L6L8r4N9M0l1oN8j56P2M0p0J62
2108I9r8nMR2r4J77j70J6mJ06j31L2K4Kj34j30L69k14K3J22m7j5J0J3r9Q6l7J7
2136A4P5L4j34j3j1J09J3j65J17m0P5l3o8J4J3J25j68r9K39j15O6m3o8K9n5O4
2162b5L8K1p0J50k25J6R9Rj05l6J66p3N4j1J0m8J64r4j13mJ04p1L1K6%K4j54J19
2190Bl2N3j2l3O1K3o6n7N6M7o3R9m9m8J6L7J8rj84J64j6M5lj9j03j2J49P4j19
$$ plain form
1997 118 -45 -2 41 -12 -1 61 -44 35 96 29 117 29 83 64 78 -104 -42 49 136 34 -43 -26 46 43 25 112 13 -10
2025 -10 38 -104 46 -61 114 -31 20 76 12 -128 6 94 14 -78 -25 -9 36 90 78 12 -11 -7 12 -4 -58 83 -48
2052 -48 -73 -21 4 -12 20 -39 -116 126 -22 -17 -11 -56 92 -11 40 16 -49 43 3 -61 59 28 -13 9 -33 -58 115 142
2080 142 -47 57 55 -83 -82 -34 46 -12 -56 36 111 179 -40 66 -49 -13 25 -69 -10 30 -1 -7 51 -105 -33 7 -63 99
2108 99 1 -4 0 92 -2 175 5 21 17 123 -8 24 48 50 -84 -214 155 -59 -36 86 39 24 34 47 -52 34 -3 14
2136 14 89 123 -11 -24 -35 74 87 -78 39 -1 74 41 -27 -13 0 125 -43 -142 97 -18 48 5 -63 -34 -89 -25
2162 -25 13 34 -36 114 -111 -95 4 13 -92 -128 38 -35 19 8 18 -30 134 40 -73 -77 27 -44 -13 13 13 37 -117 2
2190 2 -30 23 11 -22 39 62 -4 -61 -5 42 -21 78 29 -19 -3 34 52 43 -141 23 7 52 49 30 -73 -85 64 138 19
2219A9j5l4R2L7q8r7J43o8N2p8P9l3N7J09j93L8K5j71P9j28K58j91J39m3L9J3
2245D0P2j30J4j17N5J39rj55J08L4n1l2l9J50p9o7P5Q6m6j02J68r6k1K0r9O8R5
2272H1j23m5Q1l1O6l3j75K17n3l3Q0o7M7n7N8q1n8K2K2k2O5L2L8p3J12j54Q8K1
2300B5R5j73m3M8o2OJ28N2l0Qr4r1J23K3J6p2J1O9j74J58j7K8o7J24p0p2J2O3
2328B4j44P0N3M0q2Q6J6K3j41Pl5Q2p2o1K26j29K7JO2p6L8R9j06j01J62n8m5P2
2356C8j41J84j25J13Lj51N6M5j9Q7m9K2Nr0O0j03L6J07m9p3M8k7Q3j01P4l3J1
2383A1l1m6J81j85L0K3J9O1o9L7j9j50J14K6j0j01Q6Kk5O8Rmj37J32O6l6J0l4
2411B8j14J15l1J24j68J53r5M1kj06O1p0Q1p9K3P0j56K1J11O8j31n0J5K9J74r1
$$ plain form
2219 19 4 -30 62 99 11 -86 57 -11 41 -37 42 9 66 175 -18 20 45 -126 -47 -175 83 -108 31 -12 27 40
2245 40 112 -18 -4 -121 -66 73 64 -91 17 51 0 -32 -71 79 0 -67 8 94 48 -54 114 18 -3 17 -82 -14 81
2272 81 -42 -87 -6 -37 29 -4 -179 38 -15 -48 32 -35 12 -45 13 -68 -126 -104 -82 -104 -39 -7 31 -42 70 -84 4 25
2300 25 120 -53 -96 -48 -110 -104 24 76 46 54 -40 -131 -8 15 31 -41 -30 39 -135 23 6 34 -33 91 21 -51 -39 24
2328 24 -120 -50 3 43 -39 47 63 86 -55 -48 -83 -1 -73 -134 92 -37 -10 -9 53 -23 15 114 8 -93 69 11 -34 38
2356 38 -103 81 -44 69 72 -79 -23 22 3 90 41 63 68 -22 38 -65 -29 78 29 -44 4 -23 60 -41 33 0 11
2383 11 -20 -66 115 -70 -40 -17 2 63 -6 31 12 -138 -24 2 -8 -109 -23 -21 -46 22 31 27 -110 22 88 52 62 28
2411 28 -86 29 -2 122 -46 107 12 53 51 -55 6 -64 17 -62 -39 31 -125 -104 7 75 -56 -106 -91 -62 112 21
2437B1m5oN3j08J15q5PJ40j24l0K2l8O6k7m4o0J62j59J26N4J9j22R1m8L6n7J13
2464G2O6q3Mj01K7J09j79R0O2q4pk1j30J33P4l6N5o6M1j01J14K0j21k0J02j56
2490a36K26j47p8J52r1p6J88m7j01R6m4l2Q0J49j24j03M9o5n7J24l6J42q5L5N7
2515G6j66J83k9m8J7l8M2q9J98j33o8M3O0L2j21l9N2%n4J30L6j19J2N1K1O8r5
2542B2L4R4k51J37m8M5K2j27O3m6M3l3M2K9LL4p7P8p0o9O2K7l2l2L4j9J28r7J68
2571A64n4j18R9Q1j02p1p5Q8l8m3O4J40k02R1p0J46j40o3J57K5Mq5m6J10p4P5
2597F3j41N9J05o0k8j4J34j27K9q6R1J8n5p1J35P7j24N1p9q0j9J50m4J9L5M4n9
2624B3P0r2O3pj61K04j87J10j19J28p0M9l4J2o9J58l5k4L5J7j50N8R6n6k0n3M0
$$ plain form
2437 21 -24 -30 23 -85 30 -55 -48 92 -32 -62 -40 -78 -12 -39 -83 -143 19 -140 -14 40 59 -63 28 -20 16 -41 72
2464 72 138 55 59 -42 -15 94 -85 5 67 -17 -24 -45 -175 -42 32 -4 51 -15 26 -75 39 59 -62 -82 20 -136
2490 -136 90 -57 -135 17 -74 -150 38 -9 -110 -14 -58 -90 -10 139 15 -88 -39 -104 -161 -37 -73 69 -16 19 76
2515 76 -90 93 64 16 33 -5 37 -52 146 13 -55 -12 48 80 -41 -80 -28 -28 -82 48 84 -35 -23 28 49 117 22
2542 22 56 150 -101 36 -12 33 55 -72 -9 -55 -12 -45 -3 26 29 63 -14 64 -6 -75 -13 14 -18 -50 -16 -35 93 -4 164
2571 164 110 -8 91 172 70 -1 -76 12 -26 -69 -5 135 -67 24 -46 100 -40 -103 54 79 83 -2 -48 62 -12 63
2597 63 -78 -19 86 26 -2 -16 118 -9 20 -66 25 43 -12 -83 52 129 5 56 -23 -103 -122 28 -16 3 38 82 23
2624 23 93 1 64 57 -104 100 -87 23 -96 32 -38 11 -23 -11 -80 78 43 19 54 71 -79 -21 75 19 -1 -54 -14
2651a4l7J04J5o5J8o5P1q4j9P0O1N0j13k5J0J0l4n2J86j69J3R3PN0n9%m7J6r2
2680a01J51k3J5p8M6p5R1o5M4j01J60J9k3p2O3p2q7J33j7M3j26R1m3J35j48NL4
2707an4J07r5Q9q9P4Np0R3N8j93R7l2o0Q3j0l2Q1j70K1J07l5ol9J08n6J45j57
2735c1K1L7L4j26N2M8LKl2J09j23J86j98MN2l4K2OJ0j08J4L9O8j56N7m0k6J38
2763B8p4m8J77j66O9j6J0r4J83m8j21J42m9J59l8j8p4L0%p2K9R3r3O2j10l0J05
2790C6l3R9j56N3Nj6J9NL7q1K18p6j59N1M9j32J32j3m8L5L5j10Q8Pj3Mm5j9lJ8
2820a3q2P2J6P1n4o4J22n2j36R1K2j8p7K1O4M2p2l6jJ8J32j8j39J21o6rO5r7J31
2849E4P0j48P3j03L9J4J09j84J53k4m4J0L9j4r0J18m5r4O8l8M6oPOp7p8P4N4r
$$ plain form
2651 -14 -51 53 68 3 21 -44 27 -57 -76 -6 55 105 -8 -33 -23 -13 -47 -99 87 -82 -69 24 31 81 22 22 -25 -9 -101
2680 -101 50 27 42 -36 10 -65 26 -39 5 -96 64 83 60 -12 51 -21 -108 25 8 51 -75 16 -27 108 -40 -35 -1
2707 -1 -55 52 -43 46 -43 31 36 -34 59 117 -76 21 -11 -71 12 2 -30 51 -119 -98 9 -26 -32 -71 37 -19 126 -31
2735 -31 -10 27 61 -65 -13 35 38 40 8 117 -6 180 -18 -14 38 4 26 32 42 -66 -52 -13 55 -101 -44 -84 -110 28
2763 28 -46 -94 83 -83 -14 -30 -20 -114 69 21 -100 42 -7 152 114 96 22 52 52 -20 9 102 9 71 -39 -69 36
2790 36 3 102 -54 -1 4 -12 7 12 49 -32 186 110 -49 2 51 -81 51 38 -10 25 60 -50 38 45 32 36 -9 -28 -31 -13
2820 -13 -95 -23 -7 64 10 -54 68 16 -120 -29 -7 -25 -102 -81 -17 25 -47 -83 -84 -66 66 48 -91 30 -36 -45 20 -77 54
2849 54 124 -24 49 -54 -15 -1 108 -76 77 53 9 19 58 44 -46 72 27 -67 1 -37 9 3 10 16 -61 -139 -65 -11 -20
2878b0K9oo5J14o5k6Pj25J23k9N2Q6o2o0J01r8J31j41O3l3J16j04p1lk8Q3j59
2905a90K62mj07J55j13J21p8k6o6J7l8R3N0N9j18j20Q8m3O0N0j66j3J30N3j03
2930d7R3k4N3l2M9j16J4N9J2j35J9J35j57O9l9Q3j88K6J10k5K8l7J2O4n9J03q9
2957a9M7l1J2J4p1J37j36%j0N4P8L2r9R9j64QK2M9mn3M0O3q7P3p5nn8J80n9j9
2987A8o8J19j03q6J43o1J4l0L3O8j39J6NK01j28r6R7N2J3o8M0n0M5J8j0Rp2J30
3015A10j02Q2m6o7N4P0q7O6j03Q8n6n7j5P2p1J34k6j84M3J02P6k0o5m4j4j11K53
3042H2k1j19K9L3k3m2J4M2J2J0O0p3j8P9j08O7K0n4j01N1J01p1k2J1N3m0L0l2
3070c0mM3q7%nN2oJ79k09R0O7o0m6J20k5r0j14K2K14j39L0N8k9J9n8J25j61K3
$$ plain form
2878 -20 9 3 -62 52 -13 -39 -32 -157 -34 -63 -11 75 13 -47 54 -44 87 -54 9 -24 92 -12 -83 -86 -114 -31 -190
2905 -190 72 68 -39 116 3 124 46 20 -46 -29 -67 26 76 135 17 -103 -15 -58 2 52 -114 -127 3 56 -47
2930 -47 46 22 75 43 92 -24 -10 49 61 -74 -55 80 -77 -8 -47 36 -152 -126 -16 -41 -13 -50 -38 26 -33 70 -19
2957 -19 28 -3 9 23 -48 89 -47 -47 -57 -3 75 107 8 107 -57 -49 -27 22 18 -35 5 68 -19 54 -21 -26 -84 96 37 18
2987 18 -50 69 -34 -120 23 -38 -24 -54 -21 47 -92 -76 -71 130 2 -94 3 55 68 0 40 -10 35 53 43 52 -20 110
3015 110 8 90 44 -23 31 101 14 80 -23 65 9 -48 -63 9 -62 72 46 -138 -95 7 83 63 -2 -46 -60 -171 82
3042 82 61 -58 -29 4 -19 -61 -47 -5 7 17 77 4 -14 65 -43 24 44 -10 -111 -60 41 -30 -52 -41 12 -28 2 -30
3070 -30 -34 9 -78 -78 -83 -31 -37 142 -67 23 90 30 -16 104 79 -11 -125 -103 111 -28 2 60 31 50 -8 117 -44 -21
3098b1J29r6j69J48L2M7m0o0l2n5J96q8n6K1l6M0L4N1j18J61J1j60K1L3N6kO2
3125A09j34L9R5p8Q7r0p4j04j4K57m8r4j7o0J12kn2k0R8l6Q9j68J68n1L7K7q0
3152dO0p1K2J9o3N4Rl2J5m8K4PN2n2j05J49O5r1Q1r9P2n5K2k0Q2n2j07K7J2M6
3182A9j48J07jl1k2j8J57k6q5l2R8O1j66O0P9l3J56r3n0j5j63J66m7O8j9mJ14
3209A32q4j20M6J35j67K6L0J19r8lPK3r0q8J36J0p7L1L0k1O0r1J07j11J08j08
3235e8R6K5j60L6J87J4k04J62j95J42j91J92k2o5Q5M1l3j56J7k5J4L9oJ9J5J06
3261G5L1j06r9J39M5Q1j30l0L6r4K8N3K8N0j33M0L9L2j24J56j50Q2l3j45Q0M5
3287dM7N2r1J10l4O3j63jm3Q1QJ3K0j52J82j37P6mq4P5p9J68r3J2J7o7O2j28P2
$$ plain form
3098 -21 108 12 -157 -9 23 70 30 -30 -62 -117 79 -9 -65 -44 -80 -40 -6 45 -73 88 99 -61 -40 -7 49 47 109
3125 109 -25 14 109 31 118 28 -46 -150 -164 93 45 -49 -66 -126 -14 -16 -68 -88 10 -26 63 -105 63 12 49 76 -4
3152 -4 56 -15 7 26 -37 17 26 -6 9 -39 -15 -8 44 -8 -113 36 101 10 91 -8 64 9 31 11 93 41 -66 -39 -27 19
3182 19 -129 -22 -23 -54 -76 -94 63 37 -48 -80 18 79 -87 -27 52 19 175 82 32 17 -146 20 -27 41 22 18 132
3209 132 48 -72 -26 109 -58 -32 -2 117 19 16 23 46 -44 -132 4 14 -63 -32 -2 -23 37 -54 53 -58 50 -58
3235 -58 38 63 -97 -61 126 140 -64 98 -97 45 -146 46 24 -41 44 85 52 -104 -87 -112 -98 -59 -65 -46 -31 75
3261 75 106 0 -99 40 85 166 36 6 42 -52 -24 29 57 107 -26 14 53 85 -39 117 -33 49 16 -129 -49 -4
3287 -4 43 95 4 114 80 143 -20 -21 -64 17 25 38 58 -94 88 -49 27 23 -61 14 -65 103 10 22 39 -28 34 -94 -22
3316b2M8nO3j78Q2l8R0mj38J57l9j54J95l2KM3j03J50k39J25J3Q7j15L6m0k8M6
3343Bp4K31k61J44j46O5J09J4j99oN5L7J39j27J11p1o3J6p6K13j28n9R3l5j1j
3369b8l7K7J8M6q7R5q2m4L5K6J9%N3L8j70J25j19m2J83q6l5L6l3J00Kl8O8L6r6
3398A0k7l3L8L4l7J07j53p9J91n5j1L1N6r4lj41K34p6N4P4q4j6K7k4o8P6P0p7
3426B4QKl2N8o4n2J20r9P9j2k4p5J02n2J47j62K0O4L1j0j04n5J70o6q5J1J51p3
3454B2j56R9l0O2PP4Qj67Q9l2J44p2m5L6o5P0n9Q0o2M2o5J56q8pL8q0l5l8K30
3483A56j93L4k8k5Q6K8j24O3P4o6p4M1Q3K3l4k6j9m2K3O6m8J9j35Q2O7n5K9r7
3511i2J84M1j56l2O0Om4J7L6l3L2J6m0Nk5pM5k3J42j15q1L1m4j0O3k3q8J44%K8
$$ plain form
3316 -22 26 21 84 -94 -12 -50 40 36 -102 55 16 -138 57 25 27 70 -33 117 -122 3 16 103 -12 24 -16 -44 2
3343 2 -72 159 -102 42 -104 -39 70 84 -115 -121 -66 -29 110 -17 94 23 -40 -24 -100 113 -15 -74 19 -16 -27 -28
3369 -28 -65 -38 -20 26 -61 34 -48 -92 -57 -31 -12 -12 41 79 -91 34 -85 -127 56 -30 -65 -29 -62 38 40 2 70 106 10
3398 10 -17 -50 -12 22 -15 92 -61 -140 51 -4 -15 16 72 -22 -25 -166 68 -8 46 120 36 20 47 23 -45 31 101 24
3426 24 32 34 2 60 -4 -56 64 -35 44 32 8 -67 35 -17 130 -32 -12 52 83 73 -31 -86 84 18 -67 -56 95 22
3454 22 -134 -35 -65 -3 4 78 86 -81 8 -24 120 48 3 39 -26 44 -15 65 3 45 -20 136 48 41 79 -1 -36 -74 156
3483 156 -37 -3 -31 -56 30 58 -66 -3 71 5 -69 -28 55 78 44 18 -1 -43 -20 46 -2 17 -118 -36 31 -24 5 -92
3511 -92 92 133 -23 -55 5 11 -33 -16 20 -13 19 35 -5 0 -25 -32 13 -10 132 17 -64 -33 -77 -87 -24 -47 -135 9 9 37
3541C7K1j95M9R5n1K8Qkl8J29j49kJ82j69K05o7qn0K4K2j09J01q4M5j85K09j61
3568a15J16L2n8L1N3o4q7J3P8o3J20m0Ok9j11P9k7%k7K49k26Q1J4L2j2J9n0m3
3596b9L7l9q6R4J13j04J9K6rJ7j02m6P2M3o7J57q2n7nK05k04N5o5L1n5J99j19
3623am4K44k47N4M4j01O2k09K12L7j2o4M8RO2j87O2K1l9k6P9M3P6p4k4k0n6L4
3651a7P1m3j17L8J36l0o2N9p3K7r5N0J43j65P9j5Ln3l6lM4Q8J3Nr7J9O3kp6J9
3681b7rN1j3o8K7j0R7j37O8j2k1O9N4o6m4M5N2J00j65P2m4L3qj28J8l7J15M3n7
3710bk0K2J1L7o5j5R6qM6k0j30Q5j2j6K9j71J35p6J44q3o3M4L9l6j9J7RN9o5K9
3740AK9M4p8M5j18J52k19J15N2qN1n1l6j6l5O3J31j44O4n7r8N5o9RJ55P9o8n3
$$ plain form
3541 37 58 -137 -88 7 -44 -16 -8 -10 -48 81 -68 -70 112 -57 148 81 73 23 47 69 -40 61 -23 22 -163 46 -115
3568 -115 1 33 -25 6 59 -5 -92 -79 -1 -64 56 16 22 -7 -118 -39 -66 -66 -93 156 -70 11 25 57 45 64 14 -29
3596 -29 8 -31 -117 -23 90 -14 5 31 22 39 -63 -109 -37 6 -61 96 14 -43 -48 157 -47 8 -57 -26 -81 118 -1
3623 -1 -45 199 -48 6 50 -51 11 -198 14 51 39 -25 23 32 94 -93 -31 -10 -49 -75 4 47 123 49 25 5 -51 -17
3651 -17 54 11 -106 -68 68 38 -24 35 -38 -11 -106 -56 87 -78 1 -14 -11 -64 -100 -103 -59 29 42 47 -50 -31 32 30 -46 -27
3681 -27 -36 15 2 -66 -39 -49 48 -89 -21 -33 -54 15 69 3 -41 4 56 156 -9 63 19 52 44 -84 -66 -103 12 55 -2
3710 -2 -22 0 11 48 -17 -32 64 56 102 82 -48 37 25 9 38 -133 2 -74 70 -13 -76 -32 7 -29 -48 -31 -22 37 -28 1
3740 1 30 74 -4 41 -77 75 -144 -29 23 15 66 15 -21 -37 -72 -9 122 -22 42 -15 -113 -58 -127 -118 37 116 48 -5
3768eN7j63L6M5k8k4J53j26L2pN4K8m7%QM1J1m2m0N7L2j41R8n3j9l4N8OK6Q5l9
3799E9j57n7K13r2K5K4J3PJ9Q6j83O2K1j6Ro4j7k2J05Kk9k5pJ11j56Q1%L1R8j55
3829a4J6k9l4j0M1MJ62r0l3N2j35K9P1p9J38j41J44j31p4R4o7J29q5n9J1Q5O0
3856E5j0m7jN9j28J8l3J03p4J36oj37j2J56o1L6m6J0K9q1J16o9n6L2qP8j21M8
3884a4Ro7J36j15K0M0K7m3r5M2Q1p7P0r6J03k2o5j7RM8Q5l8l1L6o4L4L2j40K4
3913h8J38n0n1J43o8Q9j90k7P4M2l7lM2q7Q9l2j3Oo2Q2k2O5l3LoN5k6p9J5j08
3943a39J24n7J03k4nj0J15o3k9n2n0k1R7oj1M8rP5kj57J37k11O2J09o0J6P0q9
3971c9kJ46j14P3j02K9J07o5q8J22n9l2L0o2P8M8l3j38O9R9m5q5J11j46J05Jk0
$$ plain form
3768 -5 52 -111 -75 -30 -58 -82 71 -55 -23 -30 24 52 5 5 13 54 65 23 -17 40 72 -69 29 -24 -43 -77 -19 -13 13 98 59
3799 59 -98 -155 58 -34 -9 15 28 35 54 140 -43 19 40 24 33 -31 -48 -70 35 37 8 -17 -24 87 -69 12 12 43 141 -14
3829 -14 2 -27 -61 -71 -30 -26 136 46 13 65 -70 -41 30 -49 89 -52 92 -39 -113 -19 -86 43 -42 -101 -90 -5 55
3856 55 45 -2 -3 56 -72 -54 -87 16 -58 78 72 -65 -77 79 18 54 8 18 47 -34 82 13 -43 -11 -19 59 -62 -14
3884 -14 -5 -72 64 -51 -31 9 36 -7 -102 -60 21 -56 14 -82 21 -1 -66 -83 -74 -26 59 21 -10 26 -38 -4 28 -112 -88
3913 -88 50 0 -51 92 24 113 -77 -104 -30 12 -25 -28 14 -73 16 -16 -29 -23 -85 -3 -25 40 7 10 4 59 33 -46 -31 -139
3943 -139 -15 -72 31 7 2 -8 107 44 15 -37 -87 -108 -11 -17 -28 20 11 86 84 -73 64 -147 -85 24 -36 -20 50 -39
3971 -39 -41 105 -9 64 -38 -9 98 33 -55 67 8 -24 6 -56 22 70 37 -101 -32 67 22 -63 48 -98 7 8 -12
3998a2K2P8K5j02K6On5l1J43Q4q3j08J24j15R3p8l0O6p2J5j33J87j2j15m4J49
4024B8lj0lJ8M3j74L9L1mP0o9j6L9j4M7O9j3j29J4M7Rn8Q2l1O0j00O5p2K4m8J5
4055d4O2j16J53M3p8m3N1m4O5j42J99q7j67J53o0k5qJ16m4J10o8k3o1J0Pj13J10
4082d4p7J07m9M3J03nj46J18l0K1M4p2L8nj27J03j12J92p5jm6J2l7R8l7K1J4j12
4110f1K4R3m1P4j81J04K6%j48J34p2Q8L5r6M6P7j30R9j06kP7qp9M1R5n1J0j99
4138a51J66Kk1k0jN5m9jR1n1j16O2J40m3r3Q5r9Q8j72J35O5p5nn6P6r8M9mj03
4167a44Q6P4%j15J5P6n0J62k3r9n1J51K3j90R5L3l3m6K4Q9j13m0kQ7K3N1r8j00
4195a15J86qj17M5k5r7N4QJ61l9p8J09k1O8o1r6q5J07m2R8k7o4l5R1q3N5O2j10
$$ plain form
3998 -12 10 88 113 11 37 43 -12 -43 100 184 101 -7 117 2 95 17 -13 53 -19 -4 -137 50 38 -77 -121 28
4024 28 25 15 12 30 73 -101 -62 -31 -35 35 -34 -50 -11 -25 22 91 78 -51 -37 10 19 -39 43 12 72 -28 37 -35 -11 -59 -44
4055 -44 18 -98 55 98 20 -23 28 -16 49 -93 106 19 -148 5 -55 -80 -88 28 -16 94 26 3 -58 -48 -41 -154 -44
4082 -44 -121 -14 -63 -20 83 78 -68 50 20 41 85 13 51 46 -81 22 -90 102 27 26 -20 -8 -45 53 16 37 51 -61
4110 -61 -37 56 15 89 -92 12 38 38 -110 24 -48 40 75 -21 25 102 -28 71 -35 -37 40 32 -47 -6 89 38 48 -151
4138 -151 15 17 -4 -24 -25 30 -19 -20 71 20 -96 -34 106 63 -30 55 -44 44 -128 7 72 -3 -8 -64 12 -86 -37 -41 -144
4167 -144 -58 16 16 -99 -84 -8 -58 104 81 -18 -69 82 105 -85 10 43 10 -36 -12 77 -36 -76 -78 9 32 83 -15 -115
4195 -115 71 63 -54 -9 -34 -131 -77 -69 92 53 -25 84 63 131 70 -26 -111 -4 -46 52 25 -39 -74 17 -66 -11 51 -59
4223e9Q3Qj4N4l6n8M2p6J43j07l6J91j37l0N6k9j5l1J11j16J8KO5l1P8j83L3N5
4251a9L6MR3j25n8k4K11n2j03J83q9j23j8P2J00l6j60K12r3Nj7r3J20p1mO5k1
4278el7M1j5Q9m7mj1Q3j25M0L3J01r9j3J6j44J95j50K9P1m3P7o7j0kl7J09k02
4306a27M8RoJ22m7M3R1q3n2r8J30l5k4Q0j5Jo2M3J5j0J23j11j60J62j02j6J33
4333E2j3j21m3J36l6K7j1N0k5J2j7LQ3j27J26j00l9J61j69q5J41m5P3l6j4N2k9
4360Fq1Q6M6l3R9j08NO7p7k3Q0p1Nj0n2O4L2K5m2n7JK17j89j4p7JK7N1M3L0M0
4391I1J6j29j15P6O0J15j77L6M0L8m7j58K26r7R9k9K7j18k1Kl1N5K6Q4p4JN9r
4419D6j04J03j10J15knj2K1r5J19L2j15J8oJ6M4n8j7M1N1j03k7O4j29O4K1J7j0
$$ plain form
4223 -59 24 32 18 72 36 -22 20 -56 87 -20 -56 135 -2 -32 24 -5 -20 -51 60 -56 -38 -36 29 -2 76 -107 -74 -19
4251 -19 17 21 114 -11 -69 -93 118 66 -37 146 57 -66 -84 -12 88 52 -108 104 11 16 -1 -94 26 -45 -49 16 -5
4278 -5 -42 -1 -16 73 26 22 11 94 -31 9 42 143 44 31 47 -97 98 -52 -23 48 5 82 15 5 3 -34 75 -127
4306 -127 -79 -70 -76 46 -1 42 133 50 -2 -100 30 -5 -29 51 36 37 -25 18 33 23 146 35 -125 37 -65 -81 52
4333 52 39 -82 -125 11 -25 2 -9 41 16 28 11 14 97 -30 96 -4 -43 118 -51 -136 5 -40 33 -3 -17 35 6
4360 6 -75 11 57 24 123 15 20 87 10 -13 67 -4 1 -9 -61 3 35 60 18 -39 -38 179 -10 -24 -101 -100 -73 -22 21 51 91
4391 91 107 -22 -137 -61 -1 114 -63 -27 13 51 4 -154 72 -25 74 45 72 -46 -67 -65 -96 -41 -15 69 -5 -4 55 46
4419 46 -58 45 -65 50 48 43 31 52 -43 76 108 -7 11 5 21 65 7 -10 31 82 -21 -48 16 -113 -49 -28 -11 -21
4447b1J6N4j9p0J27k01J39Nn2j1o2J40m6l9K3j1kN6p2J20k15L2J39mn7J01jj01
4475c2J26Mn1%j41M2rM4r0R6Lk2l9J08j38J25l8k0l0l4J06l8L3K1n7J22j83O6
4503b6J80j99K0r4J34Pp8R1Q1j48M7J1K2J0j33J15o8P6j15o2J97p3L9r7Q0k3j3
4530a9J1l1J32j00l9o7J10M3m%j10J15j4L2m6Q3q6k1P0n0k4N1J30j90L7o0J30
4557H3p5P9j5L6k27N4J18n3J9l3P6lj16K1L4K6K5mj06N1O7j42J09p7N7K2m8k5
4585d7J09j67J09k8L7Q3j06mj29J40k5J08J3q5J4m1l8J7lJ01n5KL7o5J7k9J4M7
4613B6j64J03J9j7P3j01K1N1K1L5K0q6O6j39M4J20j56R7N3j62J1L8K8J6j86J69
4639@q1OO0O1j02M9O2p9k1J17l4j6O5j90M0Q8qq6n7N9r0J93r5L9M9O4j77J76p7
$$ plain form
4447 -21 -5 49 30 -40 87 -114 25 30 -22 -33 -95 45 -1 -40 -17 -28 -30 26 -46 74 -141 -109 30 26 -31 70 69 -32
4475 -32 94 98 47 47 -94 -52 -61 -17 -107 -11 -8 -30 -69 39 -99 26 -12 -32 -62 -96 10 -28 5 26 -31 91 -92 -26
4503 -26 154 -45 -25 -119 15 22 -56 35 116 -32 15 26 48 58 -75 40 -28 48 -67 -129 68 -5 34 -63 17 -6 -19
4530 -19 -8 -39 93 -7 -46 -113 -3 40 36 36 -74 41 27 59 13 96 10 -11 59 9 -15 36 166 -24 13 -47 83
4557 83 8 87 72 108 -119 -65 53 0 19 -14 62 59 -57 -36 -2 24 49 45 -61 -10 57 -85 24 -53 4 26 -22 -47
4585 -47 62 -105 4 -24 13 96 -10 -14 -143 -3 -28 80 93 8 22 -19 -57 -40 -43 58 3 5 42 -23 -6 -35 -21 26
4613 26 -138 -35 -16 -33 40 -61 -40 11 32 67 87 1 67 -72 -28 92 -64 33 86 -76 -65 -27 1 17 -169 0
4639 0 -81 -75 -15 46 -56 -7 55 -24 -45 72 38 22 87 -103 -63 25 17 -69 -126 -67 -157 36 -59 -20 29 93 -84 92 15
4668A5j02M6k4L3K5m5L5N8j45K35j03J3j03J70l8p4QQ4j36J03QN6j34j6M6j47
4694a32N8pJ89j02Q2Pj78P4OP7j5o2J05n0Kk0N2j84R3p7O8m2q7K46q8K1Lj16L6
4723d1k7M6PJ60k54J03Ko3Q7o9O8L2K2j19j50K45r1N0M4L2p9K6j39NO8J44p3l6
4751@J0K4L4k28K16o1Mk8kJ6R2j26K1l2J07J8r1K0j12K15O2k10J38r4jJ24j43
4778b7N3o2j8P1k5k9J1M3l2k9N4J5Q4p7m5Q5j1n2k0j03k0J07R5l5l1o6J4J14m5
4807A9j27R5l3k2J67Lo5m6N4q1O0m5O9o4m2Q2j46J82j13O2J6p1M1Q8j04l7J85
4834A27j23Ok5L4M4k0l8p3J77j91M3O6K9r0J7J51r6K6j42R4R0j29oL9o5L4J1n4
4862f4J06j11M1Q1o5pj1P4p3P2L8p8jJ2P7n1o4K4l7P7j0J4n2J4L8l9k7n6r2J82
$$ plain form
4668 15 -87 -41 -65 -32 -7 -52 -17 41 -104 131 28 41 -62 108 70 -4 4 88 -48 55 63 119 -15 -31 15 -132
4694 -132 -74 -81 108 6 88 95 -83 -9 -3 74 59 -3 102 52 54 34 86 -98 -5 -82 -14 -56 -143 103 15 36 39 -77 -41
4723 -41 -68 -22 -15 145 -109 -6 -4 -67 20 -49 19 51 73 -46 -196 49 -42 8 52 84 5 31 -108 -103 -35 109 36 0
4751 0 10 34 68 -160 56 -5 -1 -29 -31 -15 77 -49 -28 -60 47 65 -26 -6 -118 97 159 -51 87 -7 -8 116 -27
4778 -27 26 -36 -54 17 -8 -37 -26 17 -15 -44 10 25 109 32 -13 72 61 9 -11 -114 -134 -27 68 33 2 -64 -50 64 19
4807 19 -108 -13 -46 -68 99 102 37 -9 45 -36 24 -21 48 -16 -58 24 -122 60 -53 9 25 -46 -5 83 -21 -58 127
4834 127 4 10 -15 19 63 43 5 -68 109 -82 -39 27 56 -34 -17 134 38 64 -78 16 106 -23 -29 10 -55 -21 -10 -64
4862 -64 42 -69 -28 53 -12 -19 -30 44 -29 43 81 3 2 14 91 40 -24 0 -37 40 30 44 -8 6 44 5 -22 -78 -170 12
4892A2qnL9o7Lj2n3J28j09O6J2OJ1q0M2J9k6P9j46J35J7P5p7j59R8r8L8L5J36
4921A11j58J00j00L7K9J9r3j3L2L2m3j1N8L0K1q9K5L5m2K8O4j30R2o4l5J66j25
4948b4j1L9K9n4L3J65j75n9Q8l8L3R7k21J65q7J8K0j01Q8R4k04Q2m7J9L0L2j07
4975i6J36Ol4o0m0J40j57N5O9j04J17j03J38n2J7J5o0ol4J1J06j0q4PjjlKOQ8
5005F8j29l0J24N7j01J13k13J90m3k3j5N3j03N1N3L4k0j15P8N5j65J18o0o7J47
5030E7J3m7j02O2O3j23P3n1m2P0q8N9n8P9J37j46j5rR0m4K1m4M3P3n3J14n4m6
5058C2k0j36K05r2K1o2N5M9k38J77J8kq9L8N2JJ04p6J6P4Lr3k4Jm7O7qJ4J7n0
5088Gl7O8r2M6k8M3o6P7J02k05P6o1L3ol3K16k12Q7n2J41j17K0r1K11n7q7j5P4
$$ plain form
4892 12 4 -1 38 -29 -26 -38 -91 37 -72 -6 6 12 23 -57 -15 4 -22 57 -89 46 63 138 61 -98 0 -98 -60 -25 111
4921 111 -47 53 -47 -10 19 38 -55 -68 -36 -4 -47 -58 0 30 51 -38 -13 22 -20 8 72 -58 34 -30 -65 101 -24
4948 -24 -35 4 33 -21 12 177 2 -57 31 -7 26 123 -98 67 -20 -2 18 -83 5 99 -105 -23 -70 -51 -21 11 -96
4975 -96 40 46 12 -48 -88 52 -105 -50 19 -85 32 -71 67 15 32 47 -13 -19 -53 -42 64 54 -30 -23 -24 -25 -28 -26 -20 68
5005 68 -61 -91 33 90 -11 102 -111 79 36 13 -2 51 -52 -1 52 86 66 -49 29 84 -81 37 -23 -90 57
5030 57 70 23 -79 -17 46 -77 -4 -55 -97 -27 -115 -56 -114 -35 102 -44 -59 -68 22 -22 -1 -45 -2 71 18 132 78 32
5058 32 12 -124 81 -11 10 -52 3 52 -186 -9 9 7 -82 -44 8 9 113 37 53 127 130 37 13 14 -33 34 26 40 57 7
5088 7 -30 38 -54 -8 -36 7 -59 18 120 -85 -9 -70 -37 -43 -76 140 -72 15 -37 104 -13 7 -84 127 70 -17 -32 42
5116D2p3l6P4pmK25j99j23J15n2K9r8L6K3J07k6k1k9m4J6M7M4n9j05J00j42K83
5143A23j71J56j82K6j3P4j08J96k7q0O3k2o0j5J77lj75K7R2o9j05M2j6N6K6J4
5169B6j1K7L1k6j21R5P4q8K0l7P5l7j3q0O8J24j44m4M4o4J13j4o3M1M4n4P2k21
5197a63J69M8j8lJ3Pq2NJ09jq3L7l2j2kR7j5mr2rN3k1J01j40L6N7K6k17J50l6
5227b2N5o1M7J1k7qP9K2m0nm8N1n4Q0j29J51j19J0J2Nj79J42l3R1m9oJ7rL4J00
5257A18j58k0J05p6Q8n0J4K5j07P6q6J15J9Rj61L2J30j72J10L4j44j9R7O0p7J15
5283G7m3m5N8MM1j00k3M0R0p9LL8j65J12Pj22J33j13J08N2n6p6N0J2o2k9R7O5
5311G4k6Mr9k6J72j45J8lkk3QM5J8m3j6J43n5p2j9N6K3L2n9jr9J5J48j09K3n4
$$ plain form
5116 42 -31 -67 7 0 -4 221 22 -101 14 -38 -9 -107 -71 -48 59 33 12 -17 -61 -45 2 46 -13 -118 -18 -160 123
5143 123 -48 108 -74 -48 -61 13 -95 101 74 -6 57 35 -25 -40 137 134 -41 -14 78 9 -96 -54 -70 -14 12 26
5169 26 15 42 73 47 -74 21 95 7 27 -10 65 28 15 -65 3 127 -17 -61 -17 -81 32 18 -45 -4 40 -14 58 -163
5197 -163 6 54 36 33 46 53 -29 -24 85 84 1 38 6 -6 -8 89 74 70 -22 -31 22 1 102 -38 -2 55 81 -136 14 -22
5227 -22 33 -28 19 30 3 -5 74 96 56 51 3 54 0 80 -49 102 -17 -7 5 10 -169 -27 -60 31 -18 -24 -7 -16 18 118
5257 118 -40 -60 45 -31 57 7 21 46 -61 15 -71 44 63 72 -89 -57 73 -99 11 45 -99 -118 -21 39 -38 77
5283 77 34 -11 47 51 92 -8 -31 9 99 20 23 61 -104 8 15 -107 26 -87 21 73 17 -59 -9 3 -59 -88 9 74
5311 74 48 52 -47 -73 99 -46 -28 -31 -33 -56 -48 -3 15 -28 -44 99 44 -28 -47 9 32 64 5 4 -95 -80 68 -41 -18 -72
5341g2K59j11q2M2q4n4O9QK3O6j88J10j14K57k25J73k5r0N5j17J19k8OR2j74P1
$$ plain form
5341 -72 187 76 -6 36 -48 -102 -33 -25 -2 64 -124 -14 -128 129 -96 77 52 -38 17 -100 19 -9 -3 89 -85 -14
$$ [...]
8191b5
##END NTUPLES=NMR FID
##END=
