##TITLE=1H_TG-2261-1
 CDCl3, 8 sc, 
 14.11.2019
##JCAMPDX= 6.0         $$ Bruker NMR JCAMP-DX V2.0
##DATA TYPE= NMR FID
##DATA CLASS= NTUPLES
##ORIGIN= UXNMR, Bruker Analytische Messtechnik GmbH
##OWNER= root
$$ XWIN-NMR		Version 3.5
$$ Thu Nov 14 14:09:11 2019 Russian Standard Time (UT+4h)  she@DPX200
##.OBSERVE FREQUENCY= 200.1315
##.OBSERVE NUCLEUS= ^1H
##.DELAY= (6, 6)
##.ACQUISITION MODE= SIMULTANEOUS
##.ACQUISITION SCHEME= undefined
##.AVERAGES= 8
##.DIGITISER RES= 18
##SPECTROMETER/DATA SYSTEM= spect
##.PULSE SEQUENCE= zg30
##.SOLVENT NAME= D2O
##.SHIFT REFERENCE= (INTERNAL, D2O, 0, 15.7039)
##AUDIT TRAIL= $$ (NUMBER, WHEN, WHO, WHERE, WHAT)
$$ ##TITLE= Audit trail, XWIN-NMR		Version 3.5
$$ ##JCAMPDX= 5.01
$$ ##ORIGIN= Bruker BioSpin GmbH
$$ ##OWNER= she
$$ F:/spectra/data/she/nmr/H-F/1/audita.txt
$$ ##AUDIT TRAIL=  $$ (NUMBER, WHEN, WHO, WHERE, WHAT)
(   1,<2019-11-14 14:07:54.35 +0400>,<she>,<DPX200>,
      <created by zg, POWCHK disabled, PULCHK disabled
       configuration hash MD5:
       00 E9 B6 7A A2 85 ED C7 34 08 36 98 17 FE 4E 26
       data hash MD5: 16K
       F5 56 BA 60 34 5A 96 43 43 8B D1 75 09 44 0B F7>)
$$ ##END=
$$ 
$$ hash MD5
$$ FE 28 24 FE DA 53 13 10 BD CB 3B 8E 04 D2 97 AA
##$RELAX= 
##$RELAX= 
##$RELAX= 
##$RELAX= 
##$RELAX= 
##$RELAX= 
$$ Bruker specific parameters
$$ --------------------------
##$DU= <F:/spectra>
##$EXPNO= 1
##$NAME= <H-F>
##$PROCNO= 1
##$TYPE= <nmr>
##$USER= <she>
##$AMP= (0..31)
100 100 100 100 100 100 100 100 100 100 100 100 100 100 100 100 100 100 
100 100 100 100 100 100 100 100 100 100 100 100 100 100 
##$AQSEQ= 0
##$AQ_mod= 1
##$AUNM= <au_zg>
##$AUTOPOS= <>
##$BF1= 200.13
##$BF2= 200.13
##$BF3= 200.13
##$BF4= 200.13
##$BF5= 200.13
##$BF6= 200.13
##$BF7= 200.13
##$BF8= 200.13
##$BYTORDA= 1
##$CFDGTYP= 0
##$CFRGTYP= 5
##$CHEMSTR= <none>
##$CNST= (0..31)
1 1 145 1 1 1 1 1 1 1 1 1 1 1 1 1 1 1 1 1 1 1 1 1 1 1 1 1 1 1 1 1 
##$CPDPRG= <>
##$CPDPRG1= <>
##$CPDPRG2= <>
##$CPDPRG3= <>
##$CPDPRG4= <mlev>
##$CPDPRG5= <mlev>
##$CPDPRG6= <mlev>
##$CPDPRG7= <mlev>
##$CPDPRG8= <mlev>
##$CPDPRGB= <>
##$CPDPRGT= <>
##$D= (0..31)
0 1.2 0 0 0 0 0 0 0 0.06 0 0.03 0 0 0 0 0.0002 0 0 0 0 0 0 0 0 0 0 0 0 
0 0 0 
##$DATE= 1573726073
##$DBL= (0..7)
120 120 120 120 120 120 120 120 
##$DBP= (0..7)
150 150 150 150 150 150 150 150 
##$DBP07= 0
##$DBPNAM0= <>
##$DBPNAM1= <>
##$DBPNAM2= <>
##$DBPNAM3= <>
##$DBPNAM4= <>
##$DBPNAM5= <>
##$DBPNAM6= <>
##$DBPNAM7= <>
##$DBPOAL= (0..7)
0.5 0.5 0.5 0.5 0.5 0.5 0.5 0.5 
##$DBPOFFS= (0..7)
0 0 0 0 0 0 0 0 
##$DE= 6
##$DECBNUC= <off>
##$DECIM= 24
##$DECNUC= <off>
##$DECSTAT= 4
##$DIGMOD= 1
##$DIGTYP= 9
##$DL= (0..7)
0 120 120 120 120 120 120 120 
##$DP= (0..7)
150 150 150 150 150 150 150 150 
##$DP07= 0
##$DPNAME0= <>
##$DPNAME1= <>
##$DPNAME2= <>
##$DPNAME3= <>
##$DPNAME4= <>
##$DPNAME5= <>
##$DPNAME6= <>
##$DPNAME7= <>
##$DPOAL= (0..7)
0.5 0.5 0.5 0.5 0.5 0.5 0.5 0.5 
##$DPOFFS= (0..7)
0 0 0 0 0 0 0 0 
##$DQDMODE= 0
##$DR= 18
##$DS= 0
##$DSLIST= <SSSSSSSSSSSSSSS>
$$ [...]
##$SUBNAM2= <"">
##$SUBNAM3= <"">
##$SUBNAM4= <"">
##$SUBNAM5= <"">
##$SUBNAM6= <"">
##$SUBNAM7= <"">
##$SUBNAM8= <"">
##$SUBNAM9= <"">
##$SW= 24.0689530833862
##$SWIBOX= (0..15)
0 0 2 0 0 0 0 0 0 0 0 0 0 0 0 0 
##$SW_h= 4816.95568400771
##$TD= 16384
##$TD0= 1
##$TE= 0
##$TE2= 300
##$TE3= 300
##$TEG= 300
##$TL= (0..7)
0 120 120 120 120 120 120 120 
##$TP= (0..7)
150 150 150 150 150 150 150 150 
##$TP07= 0
##$TPNAME0= <>
##$TPNAME1= <>
##$TPNAME2= <>
##$TPNAME3= <>
##$TPNAME4= <>
##$TPNAME5= <>
##$TPNAME6= <>
##$TPNAME7= <>
##$TPOAL= (0..7)
0.5 0.5 0.5 0.5 0.5 0.5 0.5 0.5 
##$TPOFFS= (0..7)
0 0 0 0 0 0 0 0 
##$TUNHIN= 0
##$TUNHOUT= 0
##$TUNXOUT= 0
##$USERA1= <user>
##$USERA2= <user>
##$USERA3= <user>
##$USERA4= <user>
##$USERA5= <user>
##$V9= 5
##$VALIST= <valist>
##$VCLIST= <CCCCCCCCCCCCCCC>
##$VD= 0
##$VDLIST= <DDDDDDDDDDDDDDD>
##$VPLIST= <PPPPPPPPPPPPPPP>
##$VTLIST= <TTTTTTTTTTTTTTT>
##$WBST= 1024
##$WBSW= 4
##$XGAIN= (0..3)
0 0 0 0 
##$XL= 0
##$YL= 0
##$YMAX_a= 555099
##$YMIN_a= -446932
##$ZGOPTNS= <>
##$ZL1= 120
##$ZL2= 120
##$ZL3= 120
##$ZL4= 120
##$ABSF1= 10
##$ABSF2= 0
##$ABSG= 5
##$ABSL= 3
##$ALPHA= 0
##$AQORDER= 0
##$ASSFAC= 0
##$ASSFACI= 0
##$ASSFACX= 0
##$ASSWID= 0
##$AUNMP= <proc_1d>
##$AZFE= 0.1
##$AZFW= 0.1
##$BCFW= 1
##$BC_mod= 2
##$BYTORDP= 1
##$COROFFS= 0
##$CY= 11.3945322036743
##$DATMOD= 1
##$DC= 2
##$DFILT= <>
##$DTYPP= 0
##$F1P= 16.9975609425685
##$F2P= -3.02152046262296
##$FCOR= 0.5
##$FTSIZE= 0
##$FT_mod= 4
##$GAMMA= 1
##$GB= 0.15
##$INTBC= 1
##$INTSCL= 1
##$ISEN= 128
##$LB= 0.24
##$LEV0= 0
##$LPBIN= 0
##$MAXI= 10000
##$MC2= 0
##$MEAN= 0
##$ME_mod= 0
##$MI= 1.114404
##$NCOEF= 0
##$NC_proc= 0
##$NLEV= 6
##$NOISF1= 3.799351
##$NOISF2= 2.8
##$NSP= 1
##$NTH_PI= 0
##$NZP= 0
##$OFFSET= 15.70392
##$PC= 1
##$PHC0= -9458.673
##$PHC1= 22.00088
##$PH_mod= 1
##$PKNL= yes
##$PPARMOD= 0
##$PSCAL= 0
##$PSIGN= 0
##$REVERSE= no
##$SF= 200.130013532006
##$SI= 16384
##$SIGF1= 3
##$SIGF2= 2
##$SINO= 400
##$SIOLD= 16384
##$SREGLST= <1H.CDCl3>
##$SSB= 0
##$STSI= 0
##$STSR= 0
##$SW_p= 3612.71676300578
##$SYMM= 0
##$S_DEV= 0
##$TDeff= 0
##$TDoff= 0
##$TI= <>
##$TILT= no
##$TM1= 0
##$TM2= 0
##$TOPLEV= 0
##$USERP1= <user>
##$USERP2= <user>
##$USERP3= <user>
##$USERP4= <user>
##$USERP5= <user>
##$WDW= 1
##$XDIM= 8192
##$YMAX_p= 0
##$YMIN_p= 0
$$ End of Bruker specific parameters
$$ ---------------------------------
##NTUPLES= NMR FID
##VAR_NAME=  TIME,          FID/REAL,        FID/IMAG
##SYMBOL=    X,             R,               I
##VAR_TYPE=  INDEPENDENT,   DEPENDENT,       DEPENDENT
##VAR_FORM=  AFFN,          ASDF,            ASDF
##VAR_DIM=   8192,          8192,            8192
##UNITS=     SECONDS,       ARBITRARY UNITS, ARBITRARY UNITS
##FACTOR=    0.0002076,     1,               1
##FIRST=     0,             0,               0
##LAST=      1.7004516,     0,               0
##MIN=       0,             -446932,         0
##MAX=       1.7004516,     555099,          0
$$ Real data points
##PAGE= N=1
##DATA TABLE= (X++(R..R)), XYDATA
$$ [...]
$$ plain form
1810 -200 6 -54 8 42 274 -95 -228 -42 -136 -145 142 -13 -169 -26 172 -88 -120 159 -174 -221 109 -188 59
1833 59 209 53 115 230 -45 -347 62 -249 -242 153 -155 -116 288 -84 19 49 96 -73 -134 -14 -7 159 303
1856 303 83 206 -62 214 132 87 -216 -210 22 -35 72 -245 148 -5 -237 42 215 236 -254 -131 40 -152
1878 -152 -120 -64 -112 -19 -53 -200 8 94 -168 -181 -24 -62 -54 273 -142 -45 127 304 -108 148 129 -138 -39 171
1902 171 90 -53 57 -107 -316 -127 82 -86 145 -62 -241 -270 -328 -256 167 -79 -314 85 -56 -344 -19
1923 -19 220 124 46 -131 -21 151 37 354 134 -104 58 -139 -106 136 218 108 396 204 -170 160 278 10
1945 10 -93 31 111 117 147 101 -174 93 -196 103 -46 61 299 202 256 133 -20 212 272 -123 301 149 107
1968 107 126 160 -140 -10 186 -112 -207 251 -103 88 172 -230 2 123 234 66 233 177 -40 -207 52 -160
$$ packed form
1810b00K06o0O2L4K32l69j33J86r4rK87j55j56J43J98k60l2K79l33m7L30k97K47
1833E9J50j56O2J15k75l02M09l11PL95l08L9M04l72J03L0M7j69o1J20PJ66J44
1856C03k20J23k68K76q2m5l03OK32n7J07l17L93j53k32K79J73K1m90J23J71j92
1878a52L2N6m8R3l4j47K08Q6k62j3J57l8QL27m15R7J72J77m12K56j9k67R9K10
1902A71q1j43J10j64k09J89K09j68K31k07j79k9n8P2M23k46k35L99j41k88L25
1923a9K39r6p8j77J10J72j14L17k20k38J62j97L3K42Q2j10K88j92l74L30J18k68
1945A0j03J24Q0OL0m6k75K67k89K99j49J07K38r7N4j23j53K32O0l95M24j52m2
1968A07J9L4l00J30J96k98r5M58l54J91Q4m02K32J21J11j68J67n6k17j67K59k12
$$ plain form
1990 -160 258 116 60 85 58 216 49 72 30 -186 21 221 14 35 -10 -156 -142 -104 -269 -36 -189 -27 -105
2013 -105 213 230 -67 -179 414 288 -36 256 280 -26 -63 37 -193 121 5 -176 73 103 -165 -50 246
2034 246 -19 23 -9 12 -82 82 84 -301 174 -81 64 67 -136 129 140 45 20 -122 348 38 194 244 133 236
2058 236 -77 -70 -2 115 -164 -217 130 208 82 -152 32 -208 -139 -83 2 123 -45 487 161 231 124 -240 94
2081 94 222 203 -295 -37 -326 98 287 -41 18 22 154 -56 16 -83 6 -1 -383 -211 -193 81 562 -64 -63 223
2105 223 146 -345 281 207 -20 -437 3 -162 6 -112 56 251 -39 188 -73 252 0 -28 -311 -126 296
2126 296 186 100 49 -25 220 -69 -18 73 -1 -13 154 -72 -188 -5 108 37 -20 -30 -123 274 257 -35 27 110 60
2151 60 102 77 -73 -96 -85 285 -44 -21 -23 -211 4 -185 21 36 -177 28 212 113 -62 55 -24 143 71 0
$$ packed form
1990a60M18j42n6K5k7J58j67K3m2k16K07K00k07K1m5j46J4L8j65K33j53J62p8
2013a05L18J7k97j12N93j26l24K92K4l06l7J00k30L14j16j81K49L0k68J15K96
2034B46k65M2l2K1r4J64Kl85M75k55J45Lk03K65J1r5k5j42M70l10J56N0j11J03
2058B36l13PO8J17k79n3L47P8j26k34J84k40O9N6Q5J21j68N32l26P0j07l64L34
2081I4J28j9m98K58k89M24J89l28N9MJ32k10P2r9Q9pl82J72J8K74M81o26JK86
2105B23p7m91O26p4k27m17M40j65J68j18J68J95k90K27k61L25k52k8k83J85M22
2126B96j10q6n1p4K45k89N1R1p4j2J67k26j16J83J13p1n7j0r3L97j7k92O2Q3n0
2151F0M2k5j50k3J1L70l29K3kj88K15j89K06J5k13K05J84r9j75J17p9J67p2p1
$$ plain form
2175 0 285 186 38 76 127 -84 -37 97 41 252 30 66 18 -19 61 49 -155 49 114 52 75 96 118 82 187 195 -57
2202 -57 -101 30 315 156 -43 242 -81 -147 96 -195 -193 53 104 -293 -14 283 13 78 142 119 -2 -23 57 -13
2226 -13 31 1 -512 202 -183 11 148 144 305 -96 289 -62 116 -7 -118 -127 102 12 -148 -17 -47 -77 -191
2249 -191 119 17 67 187 -55 272 93 -4 -32 396 271 110 -25 -43 101 -8 201 80 142 -94 99 -358
2271 -358 46 -62 -83 50 71 -128 -51 229 199 138 206 -216 -100 307 9 161 -57 -235 -128 -45 159 -37
2293 -37 31 31 65 -96 78 44 -179 149 222 -85 100 -197 -194 164 -13 166 -77 168 33 -170 104 252 80
2316 80 -110 250 129 141 -116 101 -59 280 68 56 240 61 101 97 -307 -169 350 71 -6 -107 -10 -220 -179
2339 -179 -134 39 -89 -89 -97 53 12 311 -67 179 193 -98 184 23 148 43 190 174 -376 35 -47 85 -105
$$ packed form
2175@K85r9j48L8N1k11M7J34n6K11k22L6m8l7Q0j2k04K04O5o2K3K1K2l6J05Qk52
2202e7m4J31K85j59j99K85l23o6K43k91KK46N1l97K79K97k70O5O4k3j21k1Q0p0
2226a3M4l0n13P14l85J94J37mJ61m01L85l51J78j23j11rK29r0j60J31l0l0j14
2249a91L10j02N0J20k42L27j79r7k8M28j25j61j35j8J44j09K09j21O2k36J93m57
2271c58M04j08k1J33K1j99P7K80l0o1O8m22J16M07k98J52k18j78J07Q3K04j96
2293c7O8%L4j61J74l4k23L28P3l07J85k97LL58j77J79k43K45j35k03K74J48j72
2316H0j90L60j21J2k57K17j60L39k12j2J84j79M0mm04J38N19k79p7j01R7k10M1
2339a79M5J73j28%qJ50m1K99l78K46J4k91K82j61J25j05J47j6n50M11q2J32j90
$$ plain form
2362 -105 254 -16 -26 102 235 76 -137 24 -407 -94 -225 91 -129 -328 -84 -117 10 150 -75 -230 -10
2383 -10 -97 116 142 98 -207 1 120 -213 -350 -250 -241 -199 -130 31 70 -49 -236 -238 170 -173 -191 119 -54 -15
2407 -15 13 -210 -181 70 -183 -253 -50 -146 -60 -79 -163 6 -166 -166 121 -131 156 -29 -190 213 88 -61 -249
2430 -249 203 146 253 23 -139 -75 57 40 -316 80 323 63 -188 -99 256 106 0 -159 24 336 -16
2451 -16 -79 26 50 -98 194 132 -74 140 -141 -174 -229 -122 -122 -39 -179 27 184 343 159 -50 427 397 -215
2474 -215 -176 -107 179 350 31 -32 301 -276 -38 209 155 198 -54 81 106 -100 -67 -78 -267 -202 -53 80 284
2497 284 114 78 -144 11 119 -10 8 -162 185 -295 -80 -21 8 -11 248 -84 -63 -66 -43 -9 -23 44 267 -127
2521 -127 -342 62 88 114 94 -110 86 319 -30 82 85 -66 -253 80 -43 -158 -111 92 56 -81 -72 -8 76 363
$$ packed form
2362a05L59k70j0J28J33j59k13J61m31L13j31L16k20j99K44l3J27J40k25j55K20
2383a0q7K13K6m4l05K08J19l33j37J00RM2O9J61L9j19j87kM08l43j8L10j73L9
2407a5K8k23K9K51k53p0K03r6Q6j9q4J69j72%K87k52K87j85j61M03j25j49j88
2430b49M52n7J07k30j62O4J32j7l56L96K43k60k51Q9L55j50j06j59J83L12l52
2451a6o3J05K4j48K92o2k06K14k81l3n5J07%Q3j40K06J57J59j84k09M77l0o12
2474b15L9O9K86J71l19o3L33n77K38K47n4M3k52J35K5k06L3j1j89O5J49J33K04
2497B84j70l6k22J55J08j29J8j70L47m80K15N9K9j9K59l32K1lK3L4j4O7K23l94
2521a27k15M04K6K6k0k04J96K33l49J12Lj51j87L33j23j15M7K03l6j37RO4Q4K87
$$ plain form
2545 363 184 -343 -86 -201 -6 203 90 93 20 -53 -57 120 77 -479 50 24 124 -157 255 204 70 2 -385
2568 -385 -20 -189 -58 57 -94 152 144 -26 -30 191 59 -105 125 100 -202 159 258 52 149 19 359 -110
2590 -110 -132 286 -123 0 3 -266 25 158 201 -97 -108 -89 -23 189 147 -223 225 -107 108 -75 -361 198 31
2613 31 9 -84 14 38 -67 -257 48 339 306 -40 -180 86 -85 -5 184 -49 -44 -134 -251 136 -267 -121 168
2636 168 -24 26 -167 -194 -63 1 51 25 -117 99 132 -6 -49 -28 -26 84 106 306 169 -191 -10 -162 170 59
2660 59 58 14 87 281 -105 24 225 57 34 -33 -149 -61 -44 58 146 -36 113 -160 -169 49 -195 50 -55 211
2684 211 -62 -15 -73 -2 -116 -195 -6 101 -34 -34 141 190 28 -77 161 -60 189 -87 -24 91 -240 -175 -102
2707 -102 -95 -113 262 237 -95 -242 134 309 102 317 203 68 42 -10 -175 177 -148 90 -51 116 157 24
$$ packed form
2545C63j79n27K57j15J95K09j13Lp3p3mJ77m3n56N29k6J00k81M12n1j34o8l87
2568c85L65j69J31J15j51K46qj70mK21j32j64K30k5l02L61R9k06R7j30L40m69
2590a10k2M18m09J23Lk69K91J33M3k98j1J9O6K12m2l70M48l32K15j83k86N59j67
2613C1k2r3R8K4j05j90L05K91l3l46j40K66j71Q0J89k33Nr0j17L87m03J46K89
2636A68j92N0j93k7J31O4N0k6j42K16L3j38m3K1KJ10K2K00j37l60J81j52L32j11
2660E9jm4P3J94l86J29K01j68k3o7j16Q8J7J02Q8j82J49k73rK18k44K45j05K66
2684B11k73M7n8P1j14p9J89J07j35%J75M9j62j05K38k21K49k76O3J15l31O5P3
2707a02Pj8L75k5l32j47L76J75k07K15j14j35k6n2j65L52l25K38j41J67M1j33
$$ plain form
2729 24 169 260 -228 97 -214 -100 49 78 88 -50 99 -149 -218 -17 104 24 -31 -278 58 182 0 -239
2751 -239 146 -31 72 47 -38 106 328 17 73 -162 144 -122 96 -111 -88 -345 -114 125 284 244 -47 128
2773 128 16 285 101 147 -55 36 -142 202 142 -58 86 177 -154 -25 61 -149 63 44 -237 -127 130 131 20
2796 20 -227 65 -113 -311 -99 264 162 -93 -85 -151 -10 -32 -51 1 243 321 -83 155 110 47 -185 124 -202
2819 -202 121 -155 -351 57 -98 10 118 -217 -124 -78 -89 43 165 170 8 -19 -225 76 287 159 -266 14
2841 14 2 237 -207 -133 31 -69 43 24 176 -198 -199 223 -12 -30 135 242 -94 -89 -10 -237 119 168 -444 -79
2865 -79 -144 67 129 135 153 -5 -204 150 57 88 -127 102 -12 26 -146 -76 -27 -177 126 55 28 51 -91 -135 -196
2890 -196 147 13 -35 -142 101 182 190 -82 38 -91 -158 203 -166 37 -85 5 317 -81 -81 -2 -236 -93 -162
$$ packed form
2729B4J45R1m88L25l11J14J49K9J0j38J49k48o9K01J21q0n5k47L36J24j82k39
2751b39L85j77J03k5q5J44K22l11N6k35L06k66K18k07K3k57K31K39J59m0k91J75
2773A28j12K69j84M6k02R1j78L44o0k00J44R1l31J29Q6k10K12j9k81J10K57Jj11
2796B0k47K92j78j98K12L63j02k55Qo6J41k2j9N2K42P8m04K38m5o3k32L09l26
2819b02L23k76j96M08j55J08J08l35R3M6j1J32J22Nj62k7k06L01K11j28m25K80
2841A4j2K35m44P4J64j00J12j9J52l74jM22k35j8J65J07l36NP9k27L56M9o12L65
2865g9o5K11O2OJ8j58j99L54r3L1k15K29j14L8j72P0M9j50L03p1k7K3j42m4o1
2890a96L43j34m8j07K43Q1Qk72J20j29o7L61l69K03j22R0L12l98%P9k34J43o9
$$ plain form
2913 -162 -54 -138 -241 -12 -4 39 25 -184 -270 -71 81 195 -86 -96 -114 311 -215 167 -186 18 -107 -117 158
2936 158 -203 -195 68 240 18 78 -15 98 -127 138 -37 -59 3 367 -386 -167 219 -123 178 -136 -159 99
2958 99 -7 10 -100 49 -166 -50 -11 1 -133 107 200 -79 159 -355 278 310 14 141 23 -210 286 23
2980 23 -71 63 11 28 27 78 35 217 141 -155 172 173 -64 111 55 50 243 93 -132 130 103 260 -45 -42 -294 139
3006 139 -3 -21 187 154 -62 262 141 -76 -85 67 -82 -67 -203 124 183 14 3 62 -122 -186 -79 -82 -40 236
3030 236 126 -32 192 -392 151 167 185 76 -199 82 207 222 -177 33 -185 -89 43 246 226 15 146 212
3052 212 -221 -78 -217 42 225 169 11 -57 -63 171 -176 9 236 55 175 63 14 -200 59 -84 13 -201
3074 -201 129 140 -35 32 -291 -18 -27 99 306 -38 3 -30 28 222 -7 -134 1 88 107 100 -18 -106 -248 166
$$ packed form
2913a62J08q4j03K29QM3j4k09q6J99J52J14k81j0j8M25n26L82l53K04j25j0K75
2936A58l61QK63J72k22O0r3J13k25K65j75k2O2L64p53K19L86l42L01l14k3K58
2958I9j06J7j10J49k15J16L9J2j34K40R3k79K38n14O33L2k96J27j18k33M96k63
2980B3r4J34n2J7jN1m3J82p6k96L27Jk37J75n6nJ93j50k25K62k7J57l05Lk52M33
3006A39j42j8K08l3k16L24j21k17rJ52j49J5j36L27N9j69j1N9j84o4J07lM2K76
3030B36j10j58K24n84N43J6J8j09k75K81J25J5l99K10k18R6J32K03k0k11J31O6
3052B12m33J43j39K59J83n6j58o8oK34l47J85K27j81J20j12m9k14K59j43R7k14
3074b01L30J1j75O7l23K73rJ26K07l44M1l3N8J94k29j27J35Q7J9pj18q8j42M14
$$ plain form
3098 166 -341 -89 -161 86 310 -335 95 169 190 -122 -54 160 372 86 62 -161 241 -48 -17 -118 134 88
3120 88 -54 28 121 35 -16 -24 -74 107 -181 142 12 -123 -193 94 -80 106 36 46 5 -34 253 -212 -136 -140 -306
3145 -306 -191 -12 176 -30 54 -20 -186 -73 -175 -140 -120 9 -64 172 -178 208 170 40 -94 -86 181 156 -117
3168 -117 -94 -125 116 -137 -69 182 96 -123 -317 -52 -124 131 50 123 -13 -225 74 160 -146 -360 85 -110 2
3191 2 38 219 110 -138 349 170 35 72 -101 71 -104 -208 134 29 11 -167 -15 -136 -49 -73 -370 177
3213 177 -169 -145 -75 -22 -69 -257 -277 187 -108 97 -184 -156 161 -140 246 -141 287 66 185 103 85 160 183
3236 183 25 -300 259 -19 45 -20 -108 -23 -96 -427 298 241 380 304 93 262 -95 118 -195 90 -57 33 157
3259 157 22 58 231 -7 163 -168 1 -95 10 15 20 79 26 -34 224 165 -59 221 225 -56 -184 291 78 -182
$$ packed form
3098A66n07K52p2K47K24o45M30P4K1l12O8K14K12k86k4k23M02k89L1j01K52m6
3120H8j42Q2R3q6n1qn0J81k88L23j30j35p0K87j74J86p0J0m1l9K87m65P6mj66
3145c06J15J79J88k06Q4p4j66J13j02L5K0J29p3K36l50L86l8j30j34QK67k5k73
3168a17K3l1K41k53O8K51q6k19j94K65p2K55q1P3j36k12K99Q6l06k14M45j95J12
3191BL6J81j09k48M87j79j35L7j73J72j75j04L42j05j8j78J52j21Q7k4k97N47
3213A77l46K4P0N3m7j88k0M64k95K05k81K8L17l01L86l87M28k21J19q2j8P5K3
3236A83j58l25N59k78O4o5q8Q5p3l31P25n7J39p6k11J69l57K13l13K85j47R0J24
3259A57j35L6J73k38J70l31J69r6J05NNN9n3o0K58n9k24K80Mk81j28M75k13k60
$$ plain form
3283 -182 -53 0 -71 -14 181 -143 -36 148 82 -18 122 149 101 -155 -54 -164 -99 -94 139 136 269 218 -116 270
3307 270 -52 -156 -13 229 -348 -266 23 7 -51 -84 31 270 125 39 -7 -156 10 85 -269 -156 333 -134
3329 -134 -132 -243 18 34 153 -127 104 114 -31 -22 73 50 -58 102 -131 140 284 -213 -49 -147 -238 22 9 160
3353 160 206 33 28 -239 256 -154 -224 -259 -43 323 95 109 -234 86 23 121 -41 -66 130 168 25 -75 272
3376 272 252 -31 151 116 17 50 -383 80 30 42 131 46 89 108 110 23 2 -173 381 -137 -166 -57 -137 38 -22 -88
3402 -88 -22 132 211 -172 -286 -187 163 111 -13 -9 -240 -9 -32 -148 122 -45 291 -156 -92 -2 -134 102 -124
3425 -124 -123 106 83 25 39 -32 -281 -117 -54 -23 0 -61 -265 -229 255 -248 17 -72 -62 141 47 132 135 -322 -224 69
3451 69 25 9 239 -5 88 34 -35 -120 265 86 158 58 -37 -35 -66 110 -203 11 -177 57 113 -133 173 233 -121
$$ packed form
3283a82J29N3p1N7J95l24J07J84o6j00J40K7m8k56J01j10O5NK33lJ33n1l34L86
3307B70l22j04J43K42n77Q2K89j6n8l3J15K39j45q6m6j49J66P5l54J13M89m67
3329a34Kj11K61J6J19k80K31J0j45RR5k3j08J60k33K71J44m97J64r8r1K60j3J51
3353A60M6j73nk67M95m10p0l5K16L66k28J4l43L20o3R8j62k5J96L8j43j00L47
3376B72k0k83J82l5r9L3m33M63n0J2Q9q5M3J9Kq7k1j75N54n18k9J09q0J75o0o6
3402h8O6J54P9l83j14R9L50n2j24Mk31K31k3j16K70j67L36m47O4R0j32K36k26
3425a24JK29k3n8J4p1k49J64O3L1K3o1k04L6M84n03K65q9J0K03r4Q5Lm57R8K93
3451F9m4j6K30k44R3n4o9q5L85j79P2j00r5Kl1J76l13K14j88K34N6k46L06O0l54
$$ plain form
3476 -121 98 217 -15 -68 154 95 -67 -150 -20 149 -226 115 306 81 -72 146 -1 -185 -140 -112 -25 116
3498 116 101 -153 -43 111 -78 71 72 7 55 -26 81 -56 152 -76 -26 -254 132 119 29 31 214 -16 -34 -22
3522 -22 -200 37 69 -153 -47 339 142 239 20 -66 -194 257 -144 136 -114 -193 70 -241 -77 12 82 24 398
3545 398 11 54 -84 -71 63 227 -316 -206 -291 -45 -267 323 240 251 45 68 -140 -13 68 138 -407 94 71
3568 71 -307 173 -183 -37 -150 -53 -81 38 -129 48 146 54 157 -81 251 364 -236 -43 112 -369 29 -190
3590 -190 136 -35 88 68 136 -64 130 233 -96 -242 -101 -83 -133 16 -39 -324 -55 190 168 44 40 166 -4
3613 -4 348 165 -102 -40 32 132 122 5 125 -227 227 180 157 -162 -160 57 175 -87 -414 207 91 -11 -153
3636 -153 -8 466 157 -5 216 64 150 271 -23 -2 -31 23 140 -33 90 79 -160 -173 -99 -265 -58 128
$$ packed form
3476a21K19J19k32n3K22n9j62q3J30J69l75L41J91k25j53K18j47j84M5K8Q7J41
3498A16j5k54J10J54j89J49Jo5M8q1J07j37K08k28N0k28L86j3r0KJ83k30j8J2
3522b2j78K37L2k22J06L86j97R7k19q6j28M51m01K80k50p9K63l11J64Q9P0n8L74
3545C98l87M3j38J3J34J64n43J10q5K46k22N90q3J1k06K3k08J27Q1P0n45N01k3
3568G1l78M80l56J46j13R7k8J19j67J77R8r2J03k38L32J13o00J93J55m81L98k19
3590a90L26j71J23k0O8k00J94J03l29j46J41J8n0J49n5k85K69K45k2j24mJ26j70
3613dL52j83k67O2P2J00j0j17J20l52M54m7k3l19KK17J18k62l27O21j16j02j42
3636a53J45M74l09j62K21j52Q6J21k94K1k9N4J17j73J23j1k39j3P4j66K07J86
$$ plain form
3658 128 -256 131 -16 139 -81 -104 379 -173 -143 -165 133 -64 235 -116 118 -154 56 -48 35 130 -2 -1
3680 -1 277 -63 -52 -245 144 -96 130 -326 117 160 141 4 -244 -14 18 167 91 177 -5 58 154 213 -51 -185
3704 -185 -193 268 141 -45 -89 46 -101 229 84 -321 202 -80 -156 -85 -155 119 -70 -14 20 4 338 2 -27
3727 -27 -316 -64 314 18 -80 119 57 210 191 116 30 59 177 158 -40 -143 148 113 22 -40 -32 -274 -236 178 100
3752 100 130 -195 67 71 176 212 268 62 -88 233 124 319 -37 -95 -130 86 89 47 -89 98 93 57 61 -3 -18 -388
3778 -388 -126 76 112 -140 -217 32 -37 -182 -74 225 -162 80 -214 229 263 -209 21 -45 -94 -122 187 130 -19
3801 -19 -287 105 -115 -64 -21 -176 -398 276 9 -202 -32 47 40 -53 -188 41 -15 -226 61 -162 143 285 240
3824 240 -116 -70 55 133 23 19 132 -224 -72 -145 -117 71 -186 356 -50 -57 86 -79 -16 140 -164 41 -178
$$ packed form
3658A28l84L87j47J55k20k3M83n52L0k2K98j97K99l51K34k72K10j04Q3R5j32J
3680aK78l40J1j93L89k40K26m56M43M3j9j37k48K30L2J49p6Q6j82O3R6N9k64j34
3704a85qM61j27j86m4J35j47L30j45m05N23k82p6P1p0K74j89N6L4j6L34l36k9
3727b7k89K52L78k96r8J99o2J53j9p5q6K9J18j9j98j03K91l5r1o2Qk42L8M14p8
3752A00L0l25K62MJ05L6N6k06j50L21j09J95l56n8l5K16Lm2j36J87nl6Mo4j5l70
3778c88K62K02L6k52p7K49o9j45J08K99l87K42k94M43L4m72K30o6m9k8L09n7j49
3801a9k68L92k20N1M3j55k22O74k67k11J70P9pr3j35K29n6k11K87k23L05J42m5
3824B40l56M6J25P8j10mJ13l56J52p3K8J88k57N42m06pJ43j65O3J56l04K05k19
$$ plain form
3847 -178 -87 -107 -191 -186 37 216 215 107 -134 -55 78 56 127 -117 92 -156 5 -189 -76 -95 28 -59 -65 -27 -26 75
3873 75 44 -33 -23 -184 49 16 -108 -101 -217 -18 114 -5 -177 37 17 184 47 135 84 101 -43 -253 -163 91
3897 91 -285 22 -317 -109 121 207 -107 -139 -51 -63 198 122 -69 171 -266 -171 217 -280 -45 -129 41 -178 -125
3920 -125 47 -88 -73 -90 -58 137 216 -44 -145 152 46 -127 49 -83 127 4 -110 -65 2 181 -150 101
3942 101 40 -129 261 253 57 -107 128 21 -3 85 35 -200 33 199 -25 -166 7 -201 -6 159 -87 -197
3964 -197 -12 155 -66 -214 -26 106 -72 -122 36 140 114 6 142 48 -47 -63 100 -86 -229 -59 -35 297
3986 297 -179 122 251 94 17 -187 109 -293 194 -118 -315 145 5 63 37 109 -119 108 -192 -186 113 112 -55
4009 -55 174 0 -120 16 113 118 65 152 -191 -114 -6 -165 -79 2 81 12 251 -379 169 -35 13 -19 -207 110
$$ packed form
3847a78R1k0q4NK23J79jj08k41P9J33k2P1k44K09k48J61j94J13j9J23q7oL8JJ01
3873G5l1p7J0j61K33l3j24Pj16J99J32j19j72K14k0J67j37Q8n1J7j44k10R0K54
3897I1l76L07l39K08K30Q6l14l2Q8j2K61p6j91K40m37R5L88m97K35q4J70k19N3
3920a25J72j35J5j7L2J95P9k60j01K97j06j73J76j32K10j23j14M5O7J79l31K51
3942A01o1j69L90qj96j64K35j07k4Q8n0k35K33J66k24j41J73k08J95J65k46j10
3964a97J85J67k21j48J88J32j78n0J58J04k6j08J36r4r5j6J63j86j43J70K4L32
3986B97m76L01J29j57p7k04K96m02M87l12j97M60j40N8k6P2k28K27l00OK99jj67
4009e5K29j74j20J36R7Nn3Q7l43P7J08j59Q6Q1P9o9K39o30N48k04M8l2j88L17
$$ plain form
4033 110 82 63 -158 -52 -52 -142 -29 -110 -326 -95 -10 69 161 120 87 82 -134 76 270 100 -198 -23 98 57 146
4058 146 -98 153 -18 33 184 222 4 -141 -6 19 -114 -98 84 -16 218 147 -56 -14 -37 145 52 -69 121
4081 121 126 -50 -159 -81 -132 -181 2 19 99 -98 25 53 -109 -60 -154 4 -128 -147 160 -169 46 -262 -116 130
4105 130 94 62 -166 148 -43 55 -187 120 -372 -52 -73 156 37 -121 77 -13 187 -446 288 51 37 69
4127 69 12 78 -37 -18 26 34 -43 -35 27 -6 397 205 -19 65 -25 91 8 -190 114 172 238 157 -54 184 -13 131
4153 131 140 75 -268 -156 79 30 23 325 -67 -125 233 73 -20 -332 -139 22 55 72 -50 -126 315 252 -275 -171
4177 -171 28 -92 101 269 -228 -99 119 -40 199 224 358 -91 -43 -11 144 -68 -263 -76 -59 221 180 -16
4199 -16 156 -122 -21 87 257 20 311 189 -208 210 254 89 243 -39 -139 -140 8 150 -178 -63 252
$$ packed form
4033A10k8j9k21J06%r0J13q1k16K31Q5P9R2m1l3nk16K10J94j70k98J75J21m1Q9
4058A46k44K51j71N1J51L8k18j45J35K5j33J6J82j00K34p1k03M2k3J82r3j21J90
4081A21Nj76j09P8n1m9J83J7Q0j97J23K8j62M9r4J58j32j9L07l29K15l08J46K46
4105A30l6l2k28L14j91R8k42L07m92L20k1K29j19j58J98r0K00o33P34k37j4L2
4127F9n7O6j15J9M4Qp7QO2l3M03j92k24Q4r0J16q3j98L04N8O6q1k11K38j97J44
4153A31Ro5l43J12K35m9pL02l92n8L58j60r3l12J93J61L3J7j22p6M41o3n27J04
4177a71J99j20J93J68m97J29K18j59K39K5J34m49M8L2J55k12j95J87J7K80m1j96
4199a6J72k78J01J08J70k37K91j22l97M18M4j65J54k82j00jJ48J42l28J15L15
$$ plain form
4220 252 -174 210 162 116 -83 66 -128 155 155 -251 403 139 146 -47 -26 -37 122 -126 82 -168 12 46 73
4243 73 60 -129 -54 139 186 -81 175 -4 -168 231 42 -233 -156 -6 39 18 109 20 -29 -36 -95 -53 -118 78 -228
4268 -228 12 -140 177 91 58 127 198 -101 192 -243 -179 -68 3 -64 -151 196 86 84 141 -10 71 -24 17 -204 -178
4293 -178 89 230 169 -98 54 -232 121 -198 21 21 -188 -63 58 77 8 33 73 94 -12 242 91 335 337
4316 337 8 115 18 -174 -18 155 -271 -175 7 33 -68 -271 220 27 -211 -51 -28 -275 215 -1 92 264
4338 264 -144 -37 33 164 -56 -131 -163 165 -30 200 5 269 -64 -84 70 -70 -39 10 99 141 142 212 -181 105
4362 105 -69 106 255 62 182 -92 59 13 -14 54 57 -109 -104 -239 -169 105 48 -98 102 131 29 -34 -72 100
4386 100 96 -65 -156 -139 -33 168 7 -124 -57 -25 -235 -1 257 87 203 19 -13 124 -170 109 -62 -95 -64
$$ packed form
4220B52m26L84m8m6j99J49j94K83%m06O54k64Pj93K1j1J59k48K08k50J80L4K7
4243G3j3j89P5J93M7k67K56j79j64L99j89k75P7J50M5k1R1q9m9pn9M2o5J96l06
4268b28K40j52L17q6l3O9P1k99K93m35O4J11P1o7q7L47j10kN7j51Q1r5M1k21K6
4293a78K67J41o1k67J52k86L53l19K19%k09J25J21J9o9K5M0K1j06K54j51K44K
4316C37l29J07r7j92J56J73m26R6J82K6j01k03M91j93k38J60K3k47M90k16R3J72
4338B64m08J07P0J31k20p5l2L28j95K30j95K64l33k0J54j40L1M9Q9M2JP0l93K86
4362A05j74J75J49j93J20k74J51m6k7O8Lj66Nj35P0K74n7j46K00K9j02o3l8J72
4386A00mj61r1J7J06K01j61j31O7L2k10K34K58j70J16j84l2J37k94K79j71l3L1
$$ plain form
4409 -64 -42 -151 -100 -135 173 158 -230 228 -206 -17 82 57 -104 276 314 131 -37 -122 68 102 -118 98 -69
4432 -69 144 81 -340 -15 -51 -126 -170 -122 -92 -12 48 33 -7 -132 125 -154 -84 61 -96 -84 407 -154 -26 -7 -154
4457 -154 -213 5 74 64 -110 -97 71 98 155 -138 -207 49 -83 273 -195 -89 -262 -116 101 -183 53 -213
4479 -213 216 179 -202 -81 93 -89 128 69 -89 28 109 -91 57 29 -84 -8 -69 113 -197 -95 -39 -23 319
4502 319 -168 -63 281 217 22 -35 -101 -150 -75 115 -18 60 73 218 -267 168 118 109 63 135 -99 -145 188 -99
4526 -99 158 -221 84 -291 323 171 -26 -55 27 -131 91 319 91 129 45 109 -29 -275 -82 -51 -107 -247 63
4549 63 -227 61 54 88 16 -219 248 195 275 63 85 -7 91 -148 -95 -134 -95 14 -320 -147 136 134 -253 235 -3
4574 -3 2 96 -2 91 98 178 125 65 -92 89 -43 -112 -137 -47 332 118 -201 -140 -197 113 263 25 158 56 -192 11
$$ packed form
4409f4K2j09N1l5L08j5l88M58m34J89R9k5j61L80L8j83j68q5J90L4k20K16j67
4432f9K13o3m21L25l6p5m4M8L0Q0O0j5m0j25K57k79P0J45j57J2M91n61J28J9j47
4457a54n9K18O9j0j74J3J68K7N7k93o9K56j32L56m68J06j73J46K17k84K36k66
4479b13M29l7l81J21J74j82K17n9j58J17Q1k00J48k8j13P6o1J82l10J02N6J6L42
4502C19m87J05L44o4j95n7o6m9P5J90j33P8J3J45m85M35n0rm6P2k34m6L33k87
4526i9K57l79L05l75O14j52j97k9Q2j58K22K28k28L8q4O4j38k46J93L1n6j40L10
4549F3k90K88pL4p2k35M67n3Q0k12K2r2R8k39N3l9L9J09l34J73K83kl87M88k38
4574cNR4r8R3PQ0n3o0j57J81j32o9k5R0L79k14l19O1n7L10J50k38J33j02k48K03
$$ plain form
4600 11 -244 342 97 136 5 87 -15 86 109 -172 -164 -157 -84 49 -30 190 141 222 42 50 68 -12 37 8 -39 82
4626 82 -68 -54 17 169 53 313 -92 -81 -37 -507 -26 78 227 -166 35 38 39 179 -8 147 93 -126 10
4649 10 76 -60 317 160 93 5 -71 -71 -134 185 -7 -50 181 -121 -136 75 -123 -158 -76 70 -373 18 106 5
4673 5 5 -77 242 23 28 30 -213 104 91 100 -136 -24 -7 49 -40 84 -103 53 -188 -24 236 -327 131 17 -185
4698 -185 -142 109 -20 107 28 23 -21 -71 93 -65 -153 -30 -61 174 -6 266 -154 398 9 -77 -18 77 -248 -81
4722 -81 113 -266 262 -168 -288 118 65 -159 155 180 93 76 -174 -59 -43 77 -92 -206 72 -90 16 44
4744 44 -55 -4 165 245 -111 -166 -146 -44 69 259 124 93 -85 158 39 122 95 -122 -76 50 255 -125 239
4767 239 -91 17 -30 -76 -59 52 -197 -142 171 233 -214 63 -51 -88 -37 -109 -6 -230 -2 -163 31 -278 -161
$$ packed form
4600A1k55N86k45L9j31Q2j02J01K3k81QPP3J33p9K20m9Q1j80QJ8q0M9k9m7J21
4626H2j50J4P1J52j16K60m05J1M4m70M81J04J49l93K01LJJ40j87J55n4k19J36
4649A0O6j36L77j57o7q8p6%o3L19j92m3K31l02j5K11j98l5Q2J46m43L91Q8j01
4673E%q2L19k19NKk43L17j3Rk36J12J7N6q9J24j87J56k41J64K60n63M58j14k02
4698a85M3K51j29J27p9nm4n0J64j58q8J23l1K35j80K72m20N52l89q6N9R5l25J67
4722h1J94l79N28m30j20M06n3k24L14K5q7j7k50J15J6J20j69j14K78j62J06K8
4744D4r9N1J69Q0l56n5K0J02J13J90j35l1j78K43j19Q3k7k17M6J26K05l80L64
4767B39l30J08m7m6J7J11k49N5L13O2m47K77j14l7N1p2J03k24K28j61J94l09J17
$$ plain form
4790 -161 15 152 -190 34 85 -80 -86 -149 -25 174 190 8 -170 -21 -220 230 -45 -51 -77 -167 56 0 29 -102
4814 -102 159 79 -69 -107 -37 163 -183 133 -76 -4 183 -42 27 -30 -103 -92 -31 -115 -119 -245 -8 16 290 107
4838 107 115 172 -8 -280 145 -24 -83 -36 49 46 165 -45 -28 142 -63 74 -61 -3 -94 -88 -253 28 -45 -129 108
4863 108 173 57 -218 -9 6 6 133 -27 -113 124 -359 208 -122 245 24 231 1 228 64 152 -143 -224
4885 -224 28 317 -110 -172 112 -61 242 -223 -89 10 209 -62 -52 257 167 -59 136 -72 -51 223 11 -118
4907 -118 -55 42 -142 -162 126 -100 108 -21 -387 7 -13 384 -220 -129 -44 351 -237 -71 40 -400 80 110
4929 110 -2 -65 255 -8 65 219 184 -237 -68 195 -139 5 -89 -104 -132 229 -23 51 179 -23 -229 -153 -29
4952 -29 -353 -92 -235 -172 -37 -111 -159 14 -218 -159 -277 8 -109 -102 -140 -112 4 -234 -79 -50 3 41 453 71
$$ packed form
4790a61J76J37l42K24N1j65oo3J24J99J6j82j78J49j99M50k75ok6r0K23n6K9j31
4814a02K61q0j48l8P0K00l46L16k09P2J87k25O9n7p3J1O1q4mj26K37K4K74j83
4838A07QN7j80k72M25j69n9M7Q5lJ19k10J7J70k05J37j35N8r1Oj65K81p3q4K37
4863A08O5j16k75K09J5%J27j60q6K37m83N67l30L67k21K07k30K27j64Q8k95q1
4885b24K52K89m27o2K84j73L03m65J34R9J99k71J0L09r0k26J95k08K1K74k12j29
4907a18O3R7j84k0K88k26K08j29l66L94k0L97o04R1Q5L95n88J66J11m40M80L0
4929A10j12o3L20k63P3J54l5m21J69K63l34J44r4j5k8L61k52P4J28k02k06P6J24
4952b9l24K61j43O3J35p4m8J73k32N9j18K85j17Pl8K8J16k38J55K9N3L8M12l82
$$ plain form
4976 71 5 146 -295 164 -10 22 367 -19 -55 155 141 -286 133 30 -52 126 5 121 110 -59 130 93 -127
4999 -127 144 -312 -235 -65 8 143 116 146 73 -51 -25 212 239 22 48 -100 -72 7 118 166 24 49 84 125 211
5024 211 -43 -237 -10 119 12 -12 -55 16 -295 -64 -188 243 -124 136 87 -121 -27 -122 -187 125 23 18 186
5047 186 59 384 -248 -128 -11 206 -369 254 156 43 -35 -133 268 -38 -335 -100 -257 -51 124 102 -20
5068 -20 130 290 -178 261 -43 26 188 132 109 -470 137 252 25 -33 -176 228 2 122 155 -83 -211 30
5090 30 -133 70 95 -24 20 -110 46 31 108 43 58 -6 -43 120 77 209 -83 51 -75 71 -254 -66 127
5113 127 -90 -101 298 -34 218 -59 -20 -14 -92 57 116 76 320 204 -230 169 -79 412 -39 173 2 -90 13
5136 13 161 -189 -122 -42 -81 -167 147 367 -106 -116 -115 -109 15 184 160 125 387 -176 -69 93 20 -199 85 -111
$$ packed form
4976G1o6J41m41M59j74L2L45l86l6K10j4m27M19j03q2J78j21J16j1j69J89l7k20
4999a27K71m56P7J70P3J35k7L0p3j24K6K37K7k17K6j48K8P9J11M8j42K5L5M1Q6
5024B11k54j94K27J29j07k4m3P1l11K31j24M31l67K60m9k08R4r5o5L12j02nJ68
5047A86j27L25o32J20J17K17n75O23r8j13p8r8M01l06k97K35j57K06J75k2j22
5068b0J50J60m68M39l04O9J62n6k3n79O07J15k27n8j43M04k26J20L3k38j28K41
5090C0j63K03K5j19M4j30J56j5P7o5J5o4l7J63m3J32k92J34j26J46l25J88J93
5113A27k17j1L99l32K52k77L9Op8J49N9m0K44j16m34L99k48M91m51K12j71r2J03
5136A3J48l50O7Q0l9q6L14K20m73j0JOJ24J69k4l5K62n63J07J62p3k19K84j96
$$ plain form
5160 -111 -4 -170 -12 29 -132 -69 108 89 -232 -19 -116 203 171 35 355 53 -62 -231 -38 -18 43 -145
5182 -145 88 6 -41 163 -87 -180 -18 207 196 -91 -56 -12 47 -89 141 249 -112 127 229 -80 20 -207
5204 -207 -123 56 -159 -104 116 218 -243 -245 -292 19 33 10 -358 -86 143 -26 82 268 -302 -122 -177 50 221
5227 221 -149 198 204 -188 308 12 -262 297 -177 -213 178 -71 -111 -110 -188 -21 201 -89 12 22 331 221 69
5250 69 231 -36 -169 -53 -50 182 159 -97 -100 212 172 -9 -145 -31 25 -178 -156 -222 89 -144 -7 -31 168 49
5274 49 6 1 -74 58 -101 10 266 228 -31 -61 -84 -76 66 -87 201 141 -61 212 186 24 -131 -90 -9 -141 -68
5299 -68 158 56 -177 273 41 103 -65 145 91 -10 -38 -39 -291 -76 144 -25 65 -98 -197 39 -134 213 14
5322 14 250 66 -271 -12 123 274 227 32 -190 137 238 143 213 -136 298 -98 87 -35 109 -55 6 139
$$ packed form
5160a11J07j66J58M1j61O3J77j9l21K13r7L19l2j36L20l02j15j69J93K0O1j88
5182a45K33q2m7K04k50r3J62K25j1k87L5M4N9j36K30J08l61K39J02l09J00k27
5204b07Q4J79k15N5K20J02m61km7L11J4k3l68K72K29j69J08J86n70J80n5K27J71
5227B21l70L47Ol92M96k96k74N59m74l6L91k49m0Jp8J67K22k90J01J0L09j10j52
5250F9J62k67j33J16LK32k3k56lL12m0j81j36J14N6k03K2o6L11k33J37k4J99j19
5274D9m3np5J32j59J11K56l8k59l0k3QJ42j53K88o0k02K73k6j62j55M1Q1j32P3
5299f8K26j02k33M50k32O2j68K10n4j01k8jk52K15K20j69R0j63r9K36j73L47j99
5322A4K36j84l37K59J35J51m7j95k22L27J01r5P0l49M34l96J85j22J44j64O1J33
$$ plain form
5344 139 203 31 -232 -133 -272 -105 -32 -66 92 219 36 90 14 101 22 92 67 -161 -61 -119 -224 72 331 -129
5368 -129 -168 156 -25 126 -88 63 226 -181 62 93 73 51 99 -123 -29 -14 -493 213 -158 -67 -173 67 -273
5391 -273 101 133 -52 56 49 -68 -217 112 126 243 -215 -118 -211 232 -222 52 103 96 -90 294 -50 -254 -149
5414 -149 95 137 67 -93 -153 -149 -127 -208 -171 142 178 35 -315 308 -74 -13 144 69 -47 99 33 256 -20 -82
5438 -82 113 -66 -187 32 71 -119 -175 -277 -23 -376 35 -70 229 89 121 85 68 421 -225 90 208 -22
5460 -22 -32 -65 157 -341 234 -112 257 -4 85 142 -255 66 140 34 28 -30 -94 179 -137 -75 -99 15 -30 227
5484 227 -158 -153 -225 110 121 -54 -121 65 -95 -85 -294 -28 -318 135 133 5 89 -58 209 -150 124 -11 -74
5507 -74 106 -49 24 9 -84 184 -169 -87 -83 40 -40 -6 -55 -132 63 205 12 127 -9 307 -60 -8 -54 -6 237
$$ packed form
5344A39O4j72k63R9j39J67P3l4J58J27j83N4p6Q7p9P0k5k28J00n8j05K96K59m60
5368a29l9L24j81J51k14J51J63m07K43L1k0k2M8k22R4J5m79P06l71R1j06K40l40
5391b73L74L2j85J08pj17j49L29J4J17m58R7r3M43m54K74N1pj86L84l44k04J05
5414a49K44M2p0j60o0MK2q1L7L13L6j43l50O23l82O1J57p5j16J46o6K23k76o2
5438h2J95j79j21K19L9j90n6j02K54l53M11j05K99j40L2l6j7L53o46L15J18k30
5460b2j0l3K22m98N75l46L69k61Q9N7l97L21P4j06on8o4K73l16O2k4J14m5K57
5484B27l85Np2L35J1j75o7J86j60J0k09K66k90M53kj28Q4j47K67l59K74j35o3
5507g4J80j55P3j5r3K68l53Q2MJ23q0L4m9p7J95J42j93J15j36L16l67N2m6M8K43
$$ plain form
5532 237 -83 130 93 75 -1 90 -37 243 -167 31 187 -191 -77 -356 96 -32 -147 -133 -35 228 -166 31
5554 31 -36 119 -212 259 -202 -58 -34 -206 89 -289 -143 -147 -104 168 198 39 -34 32 199 -41 -32 -296 -26 173
5578 173 -42 76 69 85 185 -19 78 -202 -200 -170 17 158 141 3 61 -3 -35 -125 -24 83 -114 -22 -119 -101 -312
5603 -312 101 103 -136 62 -84 159 51 16 -151 -252 -94 -48 61 -247 -29 208 77 -37 -1 19 -66 113
5625 113 -194 84 154 -66 148 74 155 45 118 39 260 -336 128 -28 -24 302 -31 162 301 -43 61 -138
5647 -138 98 -116 -11 -114 -45 213 211 24 36 344 -66 -4 42 33 -166 133 -207 -156 -160 -78 -234 -85 -39 -52 -112
5672 -112 -125 155 -35 -71 -31 96 118 -166 70 -217 28 168 -88 209 131 -2 289 -38 -28 -35 69 174 14
5695 14 -36 72 176 -61 286 92 202 -135 -198 -11 260 37 -176 -24 3 -216 82 -184 -99 -56 -24 -198
$$ packed form
5532B37l20K13l7j8p6R1j27K80m10J98J56l78J14k79M52j28j15J4R8K63l94J97
5554C1o7J55l31M71m61J44K4j72K95l78J46mM3K72L0j59p3O6J67k40Rk64K70J99
5578A73k15J18pJ6J00k04R7k80KL0J87J41j7j38N8o4l2r0J01J07j97R2r7J8k11
5603c12M13Kk39J98j46K43j08l5j67j01J58M6J09l08K18K37j31j14L6K0q5J79
5625A13l07K78P0k20K14p4Q1j10P3p9K21n96M64j56ML26l33J93J39l44J04j99
5647a38K36k14J05j03O9K58kj87J2L08m10O2M6rj99K99l40N1mQ2j56J49M6j3o0
5672a12j3K80j90l6M0J27K2k84K36k87K45J40k56K97p8j33K91l27J0pJ04J05j60
5695A4n0J08J04k37L47j94J10l37o3J87K71k23k13J52K7k19K98k66Q5M3L2j74
$$ plain form
5717 -198 69 17 124 -14 -100 -40 42 6 -81 -146 -29 -58 47 -112 -119 -11 -223 -35 152 -37 178 369 -77
5740 -77 51 -23 -116 -49 145 -285 53 -88 74 -196 -77 19 -100 23 1 128 -63 128 -190 206 114 180 31
5763 31 70 -14 -48 31 136 -106 -380 -177 52 -215 -282 -216 127 207 -105 318 -88 -49 -90 -176 165 -156 218 -103
5787 -103 -121 20 -116 -129 251 -151 116 177 52 133 21 -65 -74 40 -28 -89 151 205 -22 127 -122 26 -43 293
5811 293 69 85 88 196 -7 107 242 -153 131 -2 8 -77 -126 -51 -17 -110 300 25 -162 159 -159 94 -68
5834 -68 153 -134 -130 76 104 -42 -4 -9 184 -78 52 35 -170 238 64 -75 73 -134 180 188 -115 -144 60 1
5858 1 52 140 -128 2 143 -141 193 205 257 -35 -104 121 13 -115 -72 167 -29 103 79 277 140 84 119 -78
5882 -78 31 -20 205 178 111 -204 -189 -89 88 15 -258 13 -3 149 -33 106 63 183 -114 -328 -81 -24 -100
$$ packed form
5717a98K67n2J07j38q6O0Q2l6q7o5J17k9J05j59pJ08k12J88J87j89K15J91m46
5740g7J28p4r3O7J94m30L38j41J62k70J19R6j19J23k2J27j91J91l18L96r2O6j49
5763C1L9q4l4P9J05k42k74K03K29k67o7O6L43Q0l12M23m06L9m1q6L41l21L74l21
5787a03j8J41j36j3L80m02K67O1j25Q1j12q6rJ14o8o1K40N4k27J49k49J48o9L36
5811B93k24J6LJ08k03J14J35l95K84j33J0q5m9P5L4r3M10k75j87L21l18K53j62
5834f8K21k87MK06K8j46L8nJ93k62J30j7k05M08j74j39J48k07L14Ql03k9K04n9
5858AN1Q8k68J30J41k84L34J2N2k92o9K25j08j28M3K39j96J32k4J98j37n6L5j97
5882g8J09n1K25k7o7l15J5J00J77p3k73K71j6J52j82J39m3J20k97k14K47N7p6
$$ plain form
5905 -100 -19 -38 86 130 -55 19 32 -14 -13 -123 -162 -161 52 281 -168 287 -4 216 -63 78 -158 -142 218 150
5929 150 141 79 275 37 -47 -79 186 177 82 -173 298 -228 30 49 26 -31 -84 73 -85 -70 -264 332 226 7
5953 7 113 -89 -162 -160 -248 -92 -229 -118 -161 -36 -146 73 38 26 -154 164 -226 -182 -30 264 266 111 -210 79
5977 79 -267 -261 -48 -99 -51 137 -41 45 -87 159 178 66 -122 -29 221 -267 -6 -96 26 -267 26 -264 -263 164
6001 164 285 -4 121 132 72 10 -194 -193 -131 201 114 -238 -68 304 -117 -68 -493 205 -43 29 25 -136 -4 -159
6025 -159 53 6 54 -198 -54 94 -44 69 328 60 -55 60 37 101 -80 -105 -43 173 -6 90 156 167 -85
6048 -85 206 -22 -28 -298 201 -96 -350 121 -235 259 -31 -29 22 -206 -5 -85 189 187 -30 120 -9 205 6
6071 6 21 88 7 -270 155 228 -329 -62 -11 -57 146 -181 186 -19 -43 117 80 -204 186 -181 26 100 100 -9
$$ packed form
5905a00Q1j9J24M4j85P4J3m6Jj10l9JK13K29m49M55k91K20k79J41k36J6L60o8
5929A50ro2J96k38q4l2K65rr5k55M71n26K58J9k3n7n3J57j58J5j94N96j06k19
5953GJ06k02p3Kq8J56j37J11m3J25j10K19l5j2j80L18l90M4J52K94Kj55l21K89
5977G9l46OK13n1M8J88j78Q6j32K46J9j12j88R3K50m88K61r0J22k93K93k90JM27
6001A64J21k89J25J1o0o2k04JO2L32q7l52J70L72m21M9m25O98k48P2mj61J32j55
6025a59K12m7M8k52J44J48j38J13K59k68j15J15k3O4j81k5O2K16j79R6O6J1k52
6048h5K91k28ok70M99k97k54M71l56M94k90KN1k28K01q0K74kk17J50j29K14j99
6071FJ5O7q1k77M25P3n57K67N1m6K03l27L67k05k4J60l7k84L90l67K07P4%j09
$$ plain form
6095 -9 157 -136 76 92 75 -40 -42 294 154 -25 -21 -28 -151 -122 56 -195 191 -30 1 131 274 215 -112 -66 116
6120 116 -151 87 -29 -33 -45 -62 -78 -246 95 13 -121 -162 39 41 -174 121 -35 -2 4 32 39 -267 76 45 109 -41
6146 -41 4 236 -31 -28 -78 180 -21 -79 263 -229 -58 -155 -2 75 132 258 -67 74 -118 198 114 14 -106
6169 -106 78 -143 -67 -168 -1 -180 -288 159 -87 -108 68 -207 21 179 -75 -164 147 -32 -26 -14 35 -237
6191 -237 -154 175 -18 191 33 0 -162 -333 62 338 -98 -20 19 263 221 57 6 -141 187 116 79 -229 -459
6214 -459 47 23 46 -31 -35 -23 -65 121 -82 -243 -53 196 -277 -182 163 -35 -77 -175 160 126 99 -50 -339 -22
6238 -22 -67 -71 50 -46 -155 -90 -137 -53 154 95 -207 -212 -257 -323 -256 80 -58 17 46 19 86 16 -135 -68 -9 137 -46
6265 -46 79 -301 249 -119 123 220 99 -101 43 66 95 -275 -156 -244 -51 21 17 178 -208 9 -8 -81 -271
$$ packed form
6095iJ66k93K12J6j7j15kL36j40j79Mpj23K9J78k51L86k21L1J30J43n9l27M6J82
6120A16k67K38j16mj2j7j6j68L41q2j34m1K01Kk15K95j56L3OK8Pl06L43l1O4j50
6146d1M5K32k67Ln0K58k01n8L42m92J71r7J53P7N7J26l25J41j92L16q4j00j20
6169a06J84k21P6j01J67j79j08M47k46k1J76k75K28J58k54q9L11j79OJ2M9k72
6191b37Q3L29j93K09j58l3j62j71L95K76m36P8L9K44m2j64n1j47L28p1l7l08k30
6214d59N06k4K3p7mJ2m2J86k03j61J90K49m73R5L45j98m2r8L35l4k7j49k89L17
6238b2m5mJ21r6j09O5m7Q4K07n9l02nm5o6O7L36j38P5K9k7O7p0j51O7N9J46j83
6265d6J25l80N50l68K42R7j21k00J44K3K9l70J19q8J93P2mJ61l86K17j7p3j90
$$ plain form
6288 -271 306 -106 125 -149 -99 238 29 137 -159 -175 47 -46 314 199 -227 -156 -184 -162 144 -36 34 -169
6310 -169 132 -21 66 101 -171 -130 101 50 289 37 86 -35 -52 -143 260 43 -17 -143 -36 -500 -294 240 -115
6333 -115 48 -246 -21 -9 63 32 -417 -337 -252 127 -73 254 -24 -198 14 -95 17 96 -140 6 -157 -150 78
6356 78 23 -82 -111 -30 -164 -99 -89 -206 -50 -90 2 271 -286 57 -353 -222 227 211 -354 -68 177 244 -60
6379 -60 -158 -50 -8 -13 48 261 80 75 130 209 -67 50 -91 77 -24 101 163 -47 123 -95 -16 -30 162 -255
6403 -255 4 43 -41 195 146 -316 162 25 -151 28 -145 -23 -58 140 86 -130 -21 -179 -93 -87 63 -11 -319
6426 -319 -91 -111 107 38 118 -151 -32 -49 139 34 139 120 -159 123 -19 13 24 -86 -177 128 -147 -48 -156
6449 -156 71 -97 13 210 -142 85 144 29 3 34 -24 -40 -146 88 31 -123 -155 -224 -77 -153 -31 -64 22 315
$$ packed form
6288b71N77m12K31k74N0L37k09J08k96j6K22r3L60j15m26P1k8K2L06j80P0k03
6310a69L01j53Q7L5k72M1K31n1K39k52M9j21j7r1M03k17o0j26J07m64K06N34l55
6333a15J63k94K25J2P2l1m49Q0Q5L79k00L27k78j74K12j09J12P9k36J46j63PK28
6356G8n5j05k9Q1j34O5J0j17J56m0R2K69n57L43m10J31M49j6n65K86K45O7l04
6379f0r8J08M2nO1K13j81nN5P9k76J17j41J68j01J25O2k10J70k18P9j4J92m17
6403b55K59L9q4K36m9m62M78j37j76J79j73J22l5J98n4k16J09j58Q6OJ50p4l08
6426c19K28k0K18o9Q0k69J19j7J88j05J05j9k79K82j42L2J1j10r1L05k75R9j08
6449a56K27j68J10J97l52K27N9j15k6L1n8j6j06K34n7j54l2o9J47p6J22l3Q6K93
$$ plain form
6473 315 -100 108 -57 248 -12 -215 14 -259 10 144 276 -101 -422 -6 203 -37 -287 -393 30 262
6493 262 20 83 120 -150 -111 44 -164 -130 -41 -61 34 143 -268 -172 -138 93 17 -206 141 -94 33 -195 47
6516 47 -26 -118 204 -37 33 209 -324 226 180 222 -369 -104 274 -117 125 160 17 158 -179 38 -224 39
6538 39 342 -92 238 -85 -88 84 183 -69 -11 -287 -120 -26 255 -60 -110 226 14 -102 -87 -236 -156 62 70 177
6562 177 -257 -121 37 -334 95 -171 -112 -58 -108 46 27 142 266 309 182 -194 -163 17 78 -9 115 -220 -65
6585 -65 178 222 89 -158 -64 -83 -153 124 44 163 -96 14 -19 188 -18 -42 -250 13 56 190 18 -139 315
6608 315 -226 179 -154 66 -38 131 65 -94 -70 -60 113 -111 17 262 402 18 -21 36 235 -34 -152 -32
6630 -32 20 -123 165 -81 80 -139 137 -83 69 418 245 -69 -248 82 -187 -229 -9 -77 91 123 -32 -179
$$ packed form
6473C15m15K08j65L05k60k03K29k73K69J34J32l77l21M16K09k40k50j06M23K32
6493B62k42O3L7k70L9J55k08L4Q9k0R5J09m11R6L4K31p6k23L47k35J27k28K42
6516D7p3r2L22k41P0J76n33N50m6M2n91K65L78l91K42L5j43J41l37K17k62K63
6538C9L03m34L30l23lJ72R9k52N8k76J67R4K81l15n0L36k12j16J5j49Q0K18QJ07
6562A77m34J36J58l71M29k66N9N4n0J54j9J15J24M3j27l76L1J80O1q7J24l35J55
6585f5K43M4j33k47R4j9p0K77q0J19k59J10l3K07k06k4k08K63M3J34j72j57M54
6608C15n41M05l33K20j04J69o6j59K4J0J73k24J28K45J40l84l9N7J99k69j18J20
6630c2N2j43K88k46J61k19K76k20J52L49j73l14j79L30k69m2K20o8J68L2j55j47
$$ plain form
6652 -179 12 -120 -141 55 -236 118 -91 -228 -7 99 66 -22 -68 309 50 -101 -23 193 -1 74 -196 -332
6674 -332 -160 -160 40 -209 116 -1 142 -44 -124 208 -256 -49 99 -6 51 156 -70 9 293 160 -326 -210
6696 -210 -233 -41 39 26 101 38 64 14 134 -183 -203 -25 234 -26 167 74 41 -49 1 49 -158 -87 -49 46 -58
6721 -58 -98 107 -119 -105 104 162 119 67 20 -7 -97 -9 -145 -92 -47 196 -76 -57 96 105 7 -275 -56 -29 -174 103
6747 103 108 5 212 -209 365 8 40 -59 -273 92 27 -122 105 10 77 -86 112 114 -465 34 101 -134 -65 -106
6771 -106 168 4 -9 151 32 3 -289 131 39 -54 -134 -103 -50 94 -87 -349 124 -227 -87 127 40 202 -100
6794 -100 -77 101 -93 -22 183 -95 -133 -132 181 368 -21 -148 71 -30 -77 51 -108 60 1 69 -183 -163 105
6817 105 -200 49 248 -117 69 54 -29 -242 157 86 -262 0 152 199 -68 -40 0 105 -81 68 -37 -4
$$ packed form
6652a79J91j32k1J96k91L54k09j37K21J06l3q8m6L77k59j51P8K16j94P5k70j36
6674c32J72%K00k49L25j17J43j86q0L32m64K07J48j05N7J05k26P9K84j33m86J16
6696b10k3J92Q0j3P5o3K6n0J20l17k0J78K59k60J93r3l3r0N0M8k07P1L8R5j04
6721e8m0K05k26J4K09N8m3n2m7k7r0Q8j36N3M5K43k72J9J53Rr8k82K19K7j45K77
6747A03Nj03K07m21N74l57L2r9k14L65o5j49K27r5O7j63J98Kn79M99O7k35O9m1
6771a06K74j64j3J60j19k9k92M20r2r3q0L1N3J44j81k62M73l51J40K14q7J62l02
6794a00K3J78j94P1K05k78l8JL13J87l89j27K19j01m7J28j59J68n9O8k52K0K68
6817A05l05K49J99l65J86j5q3k13L99p1l48K62J52M7k67K8M0J05j86J49j05L3
$$ plain form
6839 -4 4 259 31 -241 84 -190 -82 -124 16 133 -77 -238 -182 123 79 -172 -4 -205 -44 -51 128 26 -23
6862 -23 60 27 92 -184 -222 75 17 -17 96 18 -279 301 -88 -150 149 29 -65 -47 -229 -13 248 203 141 -209
6886 -209 -17 -346 82 -22 185 -11 -105 -51 42 42 132 -98 166 -42 -242 5 -243 52 -58 -42 -226 -37
6908 -37 113 49 225 242 -8 176 178 145 110 71 40 -93 -196 22 -56 461 -80 11 93 283 204 15 16 -133 -50
6933 -50 10 230 -148 209 -110 -285 -62 38 91 109 182 -50 -258 -36 -237 -40 -62 180 -76 -123 -59 65 9
6956 9 -24 10 3 177 -280 104 203 -38 -146 -53 -15 125 -250 -119 -179 115 -88 122 27 -31 222 -125 -56 -48 -6
6981 -6 -133 88 49 -67 152 143 -58 -16 -19 19 126 -64 5 35 -209 -118 -206 -25 -309 -16 248 110 55 -228 184
7006 184 -86 -50 -267 -106 -215 131 -102 -35 -41 -23 -41 47 15 -184 -146 84 219 -120 99 -46 135 -80 -66
$$ packed form
6839dQK55k28k72L25k74J08m2J40J17k10j61N6L05m4k51J68k01J61pJ79j02m9
6862b3Q3l3O5k76l8K97n8l4J13p8k97N80l89o2K99j20r4J8j82K16K61m5o2l50
6886b09J92l29M28j04K07j96r4N4R3%R0k30K64k08k00K47k48K95j10J6j84J89
6908c7J50o4J76J7k50J84Kl3l5l9l1j33j03K18p8N17n41R1Q2J90p9j89Jj49Q3
6933e0O0K20l78L57l19j75K23J00N3J8P3k32k08K22k01J97k2K42k56m7O4J24n6
6956Il3L4pJ74m57L84R9k41j08R3L8J40l75J31o0K94k03K10r5n8K53l47O9QM2
6981fj27K21l9j16K19rk01M2lL8J07j90O9L0k44R1q8J81k84K93K64j38n5k83M12
7006A84k70L6k17J61j09L46k33O7oJ8j8Q8l2j99L8K30J35l39K19j45J81k15J4
$$ plain form
7029 -66 -180 180 -85 39 140 38 260 214 -48 18 -170 -88 87 65 -32 142 -18 95 -62 -15 19 -177 -14
7052 -14 132 108 33 23 -127 -31 -57 -50 -76 -300 185 33 -169 -198 -37 -75 -218 97 4 -232 -190 114 -14 -48 79
7077 79 -71 -59 39 -249 -87 73 -100 55 241 105 -21 191 -223 171 -115 257 -73 226 -3 85 169 -212
7099 -212 -20 246 -71 -141 -83 -280 -250 -104 176 -44 -234 -49 32 -313 110 39 -301 231 -112 289 -174 276
7121 276 21 200 -100 6 244 186 75 91 5 -25 -84 212 -83 42 -111 -3 67 -127 26 -18 57 50 -99
7144 -99 187 -41 7 -137 206 -43 -98 -146 15 222 161 -37 -275 204 -104 398 -157 -218 -54 102 -213 203
7166 203 -114 -210 -29 -4 -50 -173 -438 282 -80 -72 -96 48 285 -199 -44 39 -216 100 -44 44 402 235 -220
7189 -220 290 -41 35 -28 -106 -111 -51 -188 -90 44 -199 18 28 -38 249 -62 -8 389 131 -12 28 -56 152 -160
$$ packed form
7029f6j14L60k65J24J01j02K22m6k62O6j88Q2J75k2r7J74j60J13j57M7L4j96J63
7052a4J46k4p5j0j50R6k6Pk6k24M85j52k02k9J61l8j43L15r3k36M2L04j28l4J27
7077G9j50J2R8k88J62J60j73J55J86j36j26K12m14L94k86L72l30K99k29Q8Q4l81
7099b12J92K66l17p0N8j97L0J46K80k20j90J85Q1l45M23p1l40N32l43M01m63M50
7121B76k55J79l00J06K38n8j11J6q6l0n9K96k95J25j53J08P0j94J53m4P5pj49
7144i9K86k28M8j44L43k49n5m8J61K07o1j98k38M79l08N02n55o1J64J56l15M16
7166B03l17r6J81K5m6j23k65P20l62Qk4J44K37m84J55Q3k55L16j44Q8L58j67m55
7189b20N10l31P6o3p8nO0j37R8J34k43K17J0o6K87l11N4L97k58j43M0q4K08l12
$$ plain form
7213 -160 225 -21 98 -9 -62 18 -342 -25 -275 431 -17 -98 145 -65 -5 -366 -102 -270 -197 77 -198 -126
7235 -126 258 98 -5 44 -74 1 61 405 13 192 -42 -46 126 -211 -288 -217 57 -227 186 165 -99 -44 65
7258 65 -80 189 73 20 -112 -67 40 -98 96 -68 272 181 316 -109 46 270 -83 -15 75 1 -53 -50 -150
7281 -150 -281 100 57 -93 64 92 -41 175 22 -94 -356 20 109 29 -11 -62 -126 -128 -111 143 59 25 -172 -118
7305 -118 -111 -15 104 125 125 -36 171 165 159 193 211 228 -58 -4 198 -51 -48 113 173 234 -87 -163 -35 37 -143 129 44
7332 44 -34 39 148 103 -102 -4 -235 -208 -53 108 -238 112 128 234 109 -68 -15 12 -144 28 -67 -85 -70 72
7356 72 109 -126 9 -424 -35 69 195 -214 111 105 -128 99 -193 -25 108 40 -45 198 12 146 12 -208
7378 -208 -35 -96 159 2 -6 259 79 -137 140 253 58 -44 111 -267 -203 45 76 -38 88 74 107 139 179
$$ packed form
7213a60L85k46J19j07n3Q0l60L17k50P06m48q1K43k10O0l61K64j68P3K74k75P2
7235a26L84j60j03M9j18P5O0L44l92J79k34mJ72l37p7P1K74k84M13k1k64N5J09
7258F5j45K69j16n3j32M5J07j38J94j64L40r1J35m25J55K24l53O8R0p4n4Lj00
7281a50j31L81m3j50J57K8j33K16j53j16k62L76Q9q0m0n1o4kJ7K54q4l4j97N4
7305a18PR6J19K1%j61K07ooL4J8J7k86N4K02k49LJ61O0O1l21p6J28P2j80K72q5
7332D4p8P3J09m5k05R8k31K7J55J61l46L50J6J06j25j77N3K7j56J72r5j8J5J42
7356G2L7k35J35m33L89J04J26m09L25ok33K27k92J68J33o8q5K43j86J34j34k20
7378b08J73o1K55j57qK65j80k16K77J13j95j02J55l78O4K48L1j14J26j4L3L2M0
$$ plain form
7401 179 -131 -144 -20 -153 -99 -66 46 383 -10 -2 -64 -130 159 -125 -210 -30 -1 -122 -27 7 133 -41 -84 -268
7425 -268 245 248 -66 -23 98 49 -169 -77 73 -77 -29 -29 157 6 -192 56 146 27 -251 -178 168 -108 159
7448 159 58 -85 0 2 -100 -185 -101 -312 82 492 -134 -224 -48 -99 293 176 -24 -280 239 364 433 -229 3
7471 3 -166 -15 106 -16 -345 158 -30 114 59 48 218 -295 13 -32 349 197 -139 -69 163 -81 -47 82
7493 82 36 39 -58 -153 -16 81 115 314 18 -322 64 154 44 -114 217 -214 22 -244 -63 87 -34 3 -38 -291
7517 -291 -65 -25 54 -12 76 -150 -169 -156 151 40 -293 -185 -108 -85 290 120 279 22 -85 -80 335 207 309
7540 309 -148 -50 -99 6 110 -97 -317 54 322 -39 66 174 233 -239 68 -344 -30 2 116 66 214 329
7562 329 -87 36 -211 -152 -250 -267 8 -56 91 262 -99 66 -196 299 -94 -126 -124 122 -337 -119 164 43
$$ packed form
7401A79l10j3J24j33N4L3J12L37l93Qo2o6K89k84q5J80K9j21R5L4J26j74m3j84
7425b68N13Ll14M3J21m9k18R2J50j50M8%J86j51j98K48R0j19k78P3L46k76K67
7448A59j01j43Q5Kj02q5Q4k11L94M10o26r0J76n1L92j17k00k56N19J25O9o62K32
7471Cj69J51J21j22l29N03j88J44n5j1J70n13L08m5L81j52l36P0K32k44L4J29
7493H2m6Lr7r5J37R7L4J99k96l40L86R0j10j58L31m31K36k66J81J50j21L7m1k53
7517b91K26M0P9o6Q8k26j9J3L07j11l33J08P7K3L75j70J59k57j07NM15j28J02
7540C09m57R8m9J05J04k07k20L71K68l61J05J08N9m72L07m12L14L2J14n0J48J15
7562C29m16J23k47N9r8j7K75o4J47J71l61J65k62M95l93l2KK46m59K18K83j21
$$ plain form
7584 43 29 121 -13 -177 -189 -363 60 2 214 21 -40 -37 136 218 42 120 106 -87 159 -29 -62 -125 9 -47 -134
7609 -134 -204 244 37 -125 -54 -15 -15 -142 293 148 193 -3 -81 -240 42 30 -91 -109 167 240 53 -77 1 -5
7633 -5 -156 -133 134 -199 169 -8 -221 53 82 297 68 -113 -19 149 78 129 -257 -274 -208 -60 -113 -401 -6
7656 -6 -162 6 60 227 264 -139 -221 9 203 117 90 -101 -63 -253 -34 13 -123 -98 -141 -191 -25 35 164 114 -6
7681 -6 -287 -156 -2 -87 12 -61 101 174 151 -302 -347 148 -80 166 105 -422 219 283 33 -142 26 171 -199
7704 -199 40 -101 47 -324 65 54 93 -221 -324 -113 -143 -26 163 278 -111 207 50 -208 -5 -122 54
7725 54 96 -219 -18 -11 -41 -132 111 -198 -4 -272 -40 187 24 104 -55 -170 194 -183 193 75 -10 -154 353
7748 353 266 212 -60 -36 277 82 -238 168 -83 -12 10 -62 99 27 70 128 -235 -25 -130 216 -83 -84 -32 -113
$$ packed form
7584D3j4R2j34j64j2j74M23n8K12j93o1LJ73Q2j76P8j4j93K46j88l3o3J34n6q7
7609a34p0M48k07j62P1L9%j27M35j45M5j96p8j59K82j2j21j8K76P3j87j30P8o
7633ej51K3K67l33L68j77k13K74K9K15k29j81R4J68p1N1l86j7O6J48n3k88L95
7656fj56J68N4J67L7m03q2K30J94q6k7j91L8j90K19M7j36K5m3n0J66O0J29n0j20
7681fk81J31J54q5R9p3J62P3k3m53m5M95k28K46o1n27O41O4k50j75J68J45l70
7704a99K39j41J48l71L89j1L9l14j03K11l0J17J89J15l89L18j57k58K03j17J76
7725E4M2l15K01Pl0r1K43l09J94k68K32K27j63Q0j59j15L64l77L76j18q5j44N07
7748C53q7n4k72K4L13j95l20M06k51P1K2p2J61p2M3N8l63K10j05L46k99jN2q1
$$ plain form
7772 -113 -80 144 168 257 -9 74 62 32 -255 192 -74 16 130 24 -181 50 201 -253 99 201 194 48 107
7795 107 -175 63 -66 79 -85 -61 -20 126 50 -5 29 195 225 121 -67 -71 -54 -16 -109 -104 -19 75 46 21 -54 35
7821 35 -114 108 77 -231 -51 373 44 -130 77 133 138 -46 262 156 -105 -177 -76 93 224 180 -10 143
7843 143 -197 137 72 -10 -62 -1 117 9 27 96 -208 72 64 91 52 44 -206 189 83 8 -65 -187 -23 -70 -339
7868 -339 73 -74 -7 148 81 161 2 168 47 -10 -50 141 11 -138 -306 -162 0 206 -143 109 49 45 170
7891 170 428 -24 8 -122 -52 217 153 -29 -180 -109 -171 -1 -206 95 123 278 -205 181 75 19 323 60
7913 60 -182 -24 -227 179 -9 -253 233 -113 -171 453 -3 46 -160 -291 -75 94 -22 245 178 26 76 134
7935 134 -7 -3 -44 144 118 73 -135 -25 -129 10 270 -236 158 -99 -270 90 -82 173 218 121 150 53 65
$$ packed form
7772a13L3K24K4Q9k66Q3j2l0k87M47k66R0J14j06k05K31J51m54L52J02pj46N9
7795A07k82K38j29J45j64K4M1J46p6n5L4J66L0j04j88mJ7L8r3NQ5R4k9k5p5Q9
7821C5j49K22l1l08J80M24l29j74K07N6Nj84L08j06k61p2J01J69J31m4j90J53
7843A43l40L34o5q2n2O1J18j08J8O9l04K80qK7l9qk50L95j06p5p3j22J64m7k69
7868c39M12j47O7J55o7Q0j59J66j21n7m0J91j30j49j68J44J62K06l49K52o0mJ25
7891A70K58m52L2j30P0K69o4j82j51P1o2J70k05L01K8J55m83L86j06n6L04k63
7913F0k42J58k03M06j88k44M86l46n8O24m56M9k06j31K16J69j16K67o7j52N0N8
7935A34j41Mm1J88k6m5k08J10j04J39K60n06L94k57j71L60j72K55M5r7K9r7J2
$$ plain form
7958 65 -55 -168 100 -136 87 -134 -186 -13 -63 -99 -148 34 -133 113 -74 -39 142 40 -72 -153 -277 275
7980 275 291 226 28 -222 61 -44 -113 -163 -131 150 -68 -30 -220 315 -24 -147 -190 46 117 -20 6 -92 74
8003 74 -136 62 -88 -288 -339 135 176 -128 399 136 67 122 -215 134 -42 -178 -95 -281 -82 -131 -31 166
8025 166 22 -88 309 -162 203 5 -90 49 -76 -186 -130 124 -90 -19 -242 65 157 124 -153 -108 89 -36
8047 -36 89 -68 -45 -58 157 -155 -24 -183 -137 94 320 51 -98 86 -35 -66 13 -84 99 -291 -192 -30 35
8070 35 280 177 6 241 -126 13 108 53 20 -127 -89 -210 219 43 -313 -7 -310 -230 -101 -221 57 -182
8092 -182 -148 145 -24 144 16 178 -251 -11 109 -132 257 37 210 -95 120 15 -88 -39 196 -43 13
8113 13 -67 -30 -244 137 -22 -223 72 105 51 90 76 0 179 -62 115 65 1 84 224 147 151 -48 -43 145 122 -163
$$ packed form
7958F5j20j13K68k36K23k21n2J73n0l6m9J82j67K46j87L5J81j02j12q1j24N52
7980B75J6o5j98k50K83j05o9n0L2K81k18L8j90N35l39j23m3K36P1j37K6r8J66
8003G4k10J98j50k00n1M74M1l04N27k63o9N5l37L49j76j36Q3j86J99m9J00J97
8025A66j44j10L97m71L65j98r5J39j25j10N6K54k14P1k23L07R2l3k77M5J97j25
8047c6J25j57K3j3K15l12J31j59M6K31K26k69j49J84j21l1P9r7J83l90R9J62O5
8070C5K45j03j71K35l67J39R5n5l3j47L8j21M29j76l56L06l03Q0J29j20K78k39
8092a82L4K93j69J68j28J62m29K40J20k41L89k20J73l05K15j05j03M9K35k39N6
8113A3q0L7k14L81j59k01K95L3n4L9j4p6J79k41J77n0o4Q3J40p7Mj99NJ88k3k85
$$ plain form
8139 -163 110 23 28 154 98 -137 -84 93 42 -86 79 202 314 -112 110 173 -154 56 158 -107 150 -66
8161 -66 -76 279 90 225 6 75 -25 -316 133 -37 -91 33 153 57 6 -121 -44 -384 30 -129 -68 -51 19
8184 19 -166 112 -208 -26 77 105 183
$$ packed form
8139a63K73q7NJ26n6k35N3J77n1j28J65J23J12m26K22O3l27K10J02k65K57k16
8161f6j0L55j89J35k19O9j00k91M49j70n4J24J20r6n1j27P7l40M14j59O1J7P0
8184A9j85K78l20J82J03K8P8
8191A83
$$ Imaginary data points
##PAGE= N=2
##DATA TABLE= (X++(I..I)), XYDATA
$$ plain form
0 0 0 0 0 -8 8 -8 8 -16 24 -32 40 -48 64 -73 88 -112 136 -160 184 -219 256 -299 347 -400 460 -526 603
27 603 -683 772 -875 985 -1107 1241 -1385 1546 -1724 1918 -2128 2362 -2619 2900 -3209 3553
43 3553 -3934 4360 -4839 5377 -5988 6691 -7510 8477 -9637 11061 -12859 15209 -18423
56 -18423 23114 -30622 44574 -79189 338825 337733 -446932 73207 446589 -61434 -425959
67 -425959 113642 361435 21524 -131033 169542 198108 -74136 -158229 43516 74055 -14498
78 -14498 52642 163947 73838 22078 53491 -40482 -125744 5966 30622 -85667 17479
89 17479 166542 -2146 -110330 53495 41814 -147800 -58733 116927 32517 -34362 80243
100 80243 68151 -64505 -54647 3036 -60609 -81497 38348 88372 -23664 -46947 94594
$$ packed form
0@%%%qJ6j6J6k4M0n6P2q8J12j37J61k00K48k96L44m03M75n55O46p47Q60r86J129
27F03j286J455j647J860k092K348k626K931l270L642m046M490m981N519o109O762
43C553p487Q294r199J0216j1365J2679j4201J5987j8114K0698k3920K8068l3632
56a8423M1537n3736P5196j23763M18014j092p84665N20139L73382n08023l64525
67d25959N39601K47793l39911j52557L00575K8566k72244q4093K01745L0539q8553
78a4498O7140J11305r0109n1760L1413r3973q5262J31710K4656j16289J03146
89A7479J49063j68688j08184J63825j1681j89614Q9067J75660q4410o6879J14605
100H0243j2092j32656R858N7683o3645k0888J19845N0024j12036k3283J41541
$$ plain form
111 94594 73352 -143257 -100939 153866 74138 -156478 22788 238258 -5468 -180708 55916
122 55916 117951 -116530 -91330 120070 71363 -48491 33466 89015 -5386 -43025 20132
133 20132 39411 609 3601 55446 58411 1796 -7829 15802 -11215 -17456 26300 186 -15783
146 -15783 86071 73997 -81283 -22573 139081 -3563 -158935 47168 173046 -54899
156 -54899 -121960 103386 109584 -107642 -96099 81904 61042 -77487 -39797 95176 59119
167 59119 -71078 -31432 76536 5683 -83407 8870 67702 -21263 -30337 38321 4327 -32953
179 -32953 11424 -2902 -35444 28346 41388 -33768 -6440 63451 3118 -51993 8689 32395
191 32395 -13954 -12191 14885 11716 10797 8245 -11358 -9321 14373 19553 -3303 -18957 22055
$$ packed form
111I4594k1242k16609M2318K54805p9728k30616J79266K15470k43726j75240K36624
122E5916O2035k34481K5200K11400m8707j19854Q1957N5549r4401l7639O3157
133B0132J9279l8802K992N1845K965n6615r625K3631k7017o241M3756k6114j5969
146a5783J01854j2074j55280N8710J61654j42644j55372K06103J25878k27945
156e4899o7061K25346O198k17226J1543J78003k0862j38529L7690J34973l6057
167E9119j30197L9646J07968p0853q9090R2277N8832q8965r074O8658l3994l7280
179c2953M4377j4326l2542O3790J3042p5156K7328O9891o0333n5111O0682K3706
191C2395m6349J763K7076l169r19k552j9603K037K3694N180k2856j5654M1012
$$ plain form
204 22055 63430 -5352 -68516 33825 92077 -55504 -90937 89535 89795 -95810 -49805 116491
216 116491 32998 -100866 -3851 89828 -1862 -59888 19685 61334 -4428 -43216 11156 42455
228 42455 -16787 -39849 24474 32380 -26056 -11176 29425 -4273 -17250 16352 -5346 -21380
240 -21380 27084 14187 -40761 4684 45648 -25792 -44090 30954 21044 -41283 -10504 32425
252 32425 -1452 -23094 4580 12880 -8180 -14518 3975 12770 -10194 -15810 19438 12173 -32425
265 -32425 -6266 34588 -14179 -36458 27855 24780 -36382 -3104 39299 -14619 -28460 28487
277 28487 13568 -32646 3628 31225 -9989 -19622 14755 14500 -9962 -10228 7819 14536 -2315
290 -2315 -10750 11887 14691 -10764 -1344 16847 -7362 -7987 25346 -838 -27670 24245 31700
$$ packed form
204B2055M1375o8782o3164J02341N8252j47581l5433J80472K60j85605M6005J66296
216A16491q3493j33864R7015R3679r1690n8026P9573M1649o5762l8788N4372L1299
228D2455n9242k3062O4323P906n8436J4880M0601l3698j2977L3602k1698j6034
240b1380M8464j2897n4948M5445M0964p1440j8298P5044r910o2327L0779M2929
252C2425l3877k1642K7674Q300k1060o338J8493Q795k2964n616L5248p265m4598
265c2425K6159M0854m8767k2279O4313l075o1162L3278M2403n3918j3841N6947
277B8487j4919m6214L6274K7597m1214r633L4377k55k4462k66J8047O717j6851
290b315q435K2637K804k5455R420J8191k4209o25L3333k6184k6832N1915P455
$$ plain form
303 31700 -37671 -17398 52860 5007 -50987 15410 50814 -19702 -34955 28429 30936 -23765
315 -23765 -23389 24511 26010 -22006 -23194 30109 24388 -33394 -14928 38501 5710 -33428 8893
328 8893 26266 -12950 -8177 15609 -3717 -6809 14302 -4005 -15312 14956 11665 -18759 -2405
341 -2405 18671 -2823 -12581 4715 6143 -2190 -1913 -805 3399 2885 -5527 -736 5387 -7228 -3477
356 -3477 12556 -5196 -15627 16314 11439 -27827 -3477 31433 -10916 -30710 21112 22505 -28264
369 -28264 -13169 26821 2448 -24735 -436 17270 -1333 -15933 -1498 15360 784 -19378
381 -19378 906 19127 -8657 -18365 13560 9789 -17661 -945 13679 -9702 -7503 12488 -4121
394 -4121 -12544 12314 5550 -16435 2702 14772 -9711 -10467 11258 4403 -10302 -841 7483 1401
$$ packed form
303C1700o9371K0273P0258m7853n5994O6397L5404p0516j5253O3384K507n4701
315b3765L76M7900J499m8016j188N3303n721n7782J8466N3429l2791l9138M2321
328H893J7373l9216M773K3786j9326l092K1111j8307j1307L0268l291l0424J6354
341b405K1076k1494r758J7296J428q333K77J108M204n14q412M791O123j2615L751
356c477J6033j7752j0431L1941m875l9266K4350L4910m2349j9794N1822J393n0769
369b8264J5095L9990k4373k7183K4299J7706j8603j4600J4435J6858j4576k0162
381a9378K0284J8221k7784r708L1925l771k7450J6716J4624k3381K199J9991j6609
394d121q423K4858o764k1985J9137J2070k4483p56K1725o855j4705R461Q324o082
$$ plain form
408 1401 -5189 -3707 7036 6195 -10486 -4525 16511 1075 -17479 7641 16122 -12748 -8502 16218
422 16218 805 -12794 7645 7269 -9569 2168 8802 -6946 -2792 10188 -1084 -6862 5519
435 5519 4843 -3219 -402 1620 2095 1959 -3539 -1238 8165 -458 -8496 6561 7338 -9673 -899 11071
451 11071 -5842 -6988 11895 734 -12766 7621 10126 -13618 -4260 15612 -1424 -13198 5853
464 5853 9765 -6061 -7199 4126 6420 -2403 -8597 2348 11275 -5543 -12932 9381 10078 -14375
478 -14375 -5618 14485 -1902 -12303 6174 5590 -8816 -171 5117 -5472 -1964 5325 -4283 -4717
492 -4717 5495 -425 -6091 1568 1862 -3530 -462 -72 -2072 1516 -874 -4430 2482 2143 -7207 -55
508 -55 6499 -5766 -4888 7993 -1308 -9080 5657 4518 -10239 -513 9149 -5539 -7413 7078
$$ packed form
408A401o590J482J0743q41j6681N961K1036j5436j8554K5120Q481k8870M246K4720
422A6218j5413j3599K0439l76j6838J1737O634j5748M154J2980j1272n778J2381
435E519o76q062K817K022M75j36n498K301R403q623q038J5057P77j7011Q774J1970
451A1071j6913j146J8883j1161j3500K0387K505k3744R358J9872j7036j1774J9051
464E853L912j5826j138J1325K294q823o194J0945Q927j6818p389K2313O97k4453
478a4375Q757K0103j6387j0401J8477n84j4406Q645N288j0589L508P289r608m34
492d717J0212n920n666P659K94n392L068L90k000L588k390l556O912l39r350P152
508e5O554j2265Q78J2881r301p772J4737j139j4757R726R662j4688j874J4491
$$ plain form
522 7078 2149 -8080 661 4798 -2059 -3215 516 1448 912 -2820 -2662 4964 1136 -7744 1775 7722
538 7722 -6147 -5501 8504 864 -8547 4431 5541 -7167 -731 7397 -3507 -3766 6733 671
552 671 -5314 2987 3716 -3758 -275 3307 188 -175 -43 38 3074 225 -4298 3168 5665 -5876
568 -5876 -2712 8864 -107 -8154 4732 5978 -6509 -1152 6643 -2103 -3459 4437 207 -3878
582 -3878 3044 1868 -3670 1119 2379 -2419 -516 2042 -709 54 572 -2105 1143 2403 -4030 -1160
598 -1160 5388 -2328 -5684 4380 2152 -7093 756 5230 -4787 -3202 5529 -1641 -5656 3480 1941
613 1941 -5518 -78 3365 -2392 -2415 1020 591 -689 -1185 -2028 2252 1166 -5271 -638 5395 -3312
629 -3312 -6102 5329 2801 -7743 -230 6318 -3410 -4202 4337 467 -4384 1392 1517 -2841 551
$$ packed form
522G078m929j0229Q741M137o857j156L731R32n36l732J58P626l828q880R519N947
538G722j3869O46J4005p640r411J2978J110j2708O436Q128j0904k59J0499o062
552F71n985Q301P29p474L483L582l119l63J32Q1L036k849m523P466K497j1541
568e876L164J1576q971q047J2886J246j2487N357P795q746j356P896m230m085
582c878O922j176n538M789J260m798J903K558k751P63N18k677L248J260o433K870
598a160O548p716l356J0064k228r245P849M474j0017J585Q731p170m015R136j539
613A941p459N440L443n757k3L435m29j280m96q43M280j086o437M633O033q707
629c312k790J1431k528j0544P513O548r728p92Q539l870m851N776J25m358L392
$$ plain form
644 551 1332 -1907 -42 1511 -1888 -142 1283 -2103 -92 1978 -1847 -1121 3598 -1325 -2948 3527
660 3527 1320 -4898 1656 4192 -3574 -1812 4921 -1098 -3589 3272 2000 -3558 1032 2731 -1889
675 -1889 -487 2003 -479 -211 1587 -817 302 1712 -1431 -33 3205 -1414 -2462 3572 1365
690 1365 -3930 1571 3777 -3242 -1564 4373 -669 -3187 3059 1534 -2865 1091 2115 -1966 -36
705 -36 1908 -1247 -259 1678 -806 -719 1238 -759 -454 2181 -923 -2006 2809 252 -3730 1732 2909
722 2909 -3493 -1403 3955 -777 -3468 2321 1191 -2911 229 1245 -1793 39 710 -1702 166
737 166 1575 -1792 -843 2040 -1008 -1614 1611 -145 -2372 1147 425 -2569 141 1666 -2501 -346
753 -346 2413 -1720 -2076 2311 43 -2651 1524 909 -2718 129 1772 -2103 -653 2010 -1062 -1440
$$ packed form
644E51P81l239J865J553l399J746J425l386K011K070l825P26M719m923j623O475
660C527k207o218O554K536p766J762O733o019k491O861j272n558M590J699m620
675a889J402K490k482K68J798k404J119J410l143J398L238m619j048O034k207
690A365n295N501K206p019J678N937n042k518O246j525m399L956J024m081J930
705c6J944l155R88J937k484Q7J957j997L05K635l104j083M815k557l982N462J177
722B909o402K090N358m732k691N789j130m102L140J016l038J832O71k412J868
737A66J409l367R49K883l048o06L225j756k227L519p22k994K710J525m167K155
753c46K759m133l56M387k268k694M175o15l627K847J643l875J450K663l072l78
$$ plain form
769 -1440 1556 105 -1191 925 344 -901 1019 142 -1937 1037 1133 -2531 21 2893 -1658 -1695 2980
786 2980 238 -2672 1534 1549 -2277 -93 1846 -1222 -558 2068 -710 -522 1815 -293 -1156 1594
802 1594 838 -1751 952 1340 -1230 862 1227 -1259 321 2017 -1461 -620 2389 -398 -2078 2224
818 2224 1202 -2321 823 2201 -1815 -681 2314 -387 -1451 1659 448 -1297 944 232 -1253
833 -1253 763 490 -998 537 820 -1474 71 1452 -1411 -783 1949 -612 -2075 2034 586 -2269
849 -2269 499 1700 -1616 -863 1742 -814 -1511 1282 278 -1429 319 748 -1538 38 391 -1316
865 -1316 258 460 -1157 220 913 -1856 -848 1868 -649 -2373 1849 648 -2380 203 2070 -1707
881 -1707 -1064 1750 -692 -1393 1016 463 -897 416 306 -1156 675 145 -1029 632 919 -1254 64
$$ packed form
769a440K996j451j296K116n81j245J920q77k079K974R6l664K552K872m551l7M675
786B980k742k910M206J5l826K184J939l068O64K626k778J88K337k108q63K750
802A594p56k589K703L88k570K092L65k486J580J696l478Q41L009k787j680M302
818B224j022l523L144J378m016J134K995k701j064L110j211j745K241p12j485
833a253K016k73j488J535K83k294J545J381k863O28K732k561j463M109j448k855
849b269K768J201l316P53K605k556o97K793j004j707J748M29k286J576L53j707
865a316J574K02j617J377O93k769J008K716k517j724M222j201l028K583J867l777
881a707O43K814k442p01K409n53j360J313j10j462J831n30j174J661K87k173J318
$$ plain form
898 64 1383 -1006 -757 1890 -357 -1396 1630 603 -1896 752 1417 -1196 -474 1880 -402 -1131 1517
915 1517 337 -1021 660 558 -619 539 616 -592 283 690 -649 164 852 -855 -199 1207 -556
932 -556 -826 1650 913 -1777 867 1651 -1418 -192 1729 -535 -1123 1050 606 -882 620 479 -668
949 -668 567 558 -758 656 1089 -1117 127 1353 -735 -568 1079 -251 -992 1055 107 -1235 769
966 769 948 -1126 -90 1401 -798 -887 1160 -139 -1132 514 429 -999 36 150 -916 171 628
983 628 -988 54 927 -952 -1049 1270 -506 -1416 941 364 -1028 241 935 -1209 -389 987 -635
1000 -635 -857 782 -441 -920 581 485 -924 415 485 -1293 192 818 -749 -606 630 -832 -866 941
1018 941 -356 -910 566 239 -971 674 646 -1038 -69 1337 -461 -653 820 143 -1223 834 474
$$ packed form
898F4J319k389K49K647k247j039L026j027k499K648O65k613P22K354k282p29K648
915A517j180j358J681j02j177J158P7j208Q75M07j339Q13O88j707O56J406j763
932e56k70K476p37k690K644P84l069J226J921k264n88K173m44j488J502j41j147
949f68J235rj316J414M33k206J244J226k088J67J647j330p41K047r48j342K004
966G69J79k074J036J491k199q9K047j299r93J646q5j428J035J14j066J087M57
983F28j616J042Q73j879r7K319j776r10K357n77j392J269O94k144Q20J376j622
1000f35k22J639j223m79J501r6j409J339P0j778J485O26j567J43J236j462l4J807
1018I41j297n54J476l27j210J645k8j684R69J406j798j92J473o77j366K057l60
$$ plain form
1035 474 -677 304 483 -718 155 818 -693 -94 720 -236 -661 1235 94 -820 732 443 -811 319
1053 319 839 -732 53 1186 -647 -418 811 -372 -590 899 162 -809 576 596 -692 -29 914 -438
1071 -438 56 754 -333 -473 793 -89 -567 696 221 -555 454 506 -692 247 1172 -652 -313 1101
1089 1101 -332 -950 646 296 -1080 430 395 -835 -83 563 -535 -443 677 -73 -506 866 -263
1106 -263 -712 315 546 -986 187 427 -861 -135 572 -542 -372 387 -275 -558 715 218 -973 479
1124 479 468 -1080 -161 544 -720 -551 388 -311 -372 508 -153 -597 679 330 -1007 318 385 -1157 156
1143 156 696 -803 -587 729 -237 -816 427 264 -849 245 402 -502 100 840 -484 -496 972 -95
1161 -95 -642 781 83 -869 622 589 -709 50 63 -685 9 751 -342 -121 658 -116 -560 810 333
$$ packed form
1035D74j151R81J79j201Q73O63j511N99Q14r56m25J896j141r14J552k89j254J130
1053C19N20j571P85J133j833K29J229j183k18J489p37r71J385K0j288O63R43j352
1071d38M94O98j087j40J266q82m78J263m75p76J009N2j198R39R25j824L39J414
1089A101j433o18J596l50j376J510l5j230P52O46j098R2J120p50m33J372j129
1106b63m49J027K31j532J173K40j288P26P07j114J70P59o62k83J273m97j191J452
1124D79j1j548R19P05j264J69R39o99o1Q80o61m44J276l49j337J325O7j542J313
1143A56N40j499K16J316r66n79J243j63j113J094J57r04O02P40j324j2J468j067
1161i5n47J423o98r52J491l3j298P59J3p48O94P42j093K21P79p74m44J370m77
$$ plain form
1180 333 -753 326 502 -432 -57 817 -374 -235 531 61 -362 630 196 -125 405 46 -363 55 552
1199 552 -484 -49 741 -449 -317 931 -184 -543 460 208 -462 548 197 -559 -234 287 -459 -250
1217 -250 538 91 -246 270 235 -505 315 329 -552 274 365 -735 122 483 -474 -361 801 -224 -445 292
1237 292 149 -633 109 418 -483 -220 447 -462 -441 310 -134 -390 317 -22 -480 726 47 -410 235 595
1257 595 -542 -157 279 -411 -365 408 -182 -615 354 228 -390 89 328 -481 71 406 -484 -295 240 49
1277 49 -365 403 -16 -343 265 16 -282 14 350 -218 -116 473 -474 -390 484 -135 -188 370 43 -349 41
1298 41 415 -479 -324 549 -415 -144 520 -82 -309 99 141 -234 397 73 -674 267 290 -164 -149 363 -192
1319 -192 -179 334 -202 -430 471 123 -257 230 393 -793 192 328 -656 -98 318 -271 -131 559 -9 -328
$$ packed form
1180C33j086J079J76r34L75Q74j191J39P66m70m23R92m34l21N30l59m09M18M97
1199E52j036M35P90j190J32J248j115l59J003k52o70J010l51p56L25N21p46K09
1217b50P88m47l37N16l5p40Q20J4q81Q26R1j100Q57L61r57J13J162j025k21P37
1237B92j43p82P42L09r01K63O67r09K1P51m44k56P07l39m58J206o79m57O45L60
1257E95j137L85M36o90M6P73n90m33R69j26o18M79K39q09N52L35q90J89N35j91
1277D9m14P68m19l27O08k49k98K96L36n68J02N89r47Q4Q74o19n3N58l27l92L90
1298D1L74q94J55Q73r64K71O64o02k27M08M2l75O31l24p47R41K3m54J5N12n55
1319a92J3N13n36k28R01l48l80M87J63j186R85J36r84N58M16n89J40O90n68l19
$$ plain form
1339 -328 333 -46 -408 197 518 -359 62 503 -55 -10 369 17 -346 511 143 -159 198 55 -654 139
1359 139 271 -320 -55 397 -437 -321 641 -57 -748 254 104 -614 -245 360 -435 -45 136 -324 -246 227
1379 227 -198 -532 74 103 -573 -92 110 -335 -60 403 -254 92 420 -269 -222 303 -193 -279 190 -2 -282
1400 -282 445 671 -24 -55 276 -246 -211 273 132 -428 311 144 -421 148 443 -404 -15 270 -321 -13 520
1421 520 -9 -210 463 35 -358 553 26 -369 55 433 -295 209 413 111 214 228 29 -279 540 -59
1441 -59 -222 316 80 -138 298 319 -316 -115 79 -165 -13 178 149 -325 22 130 -382 110 217 -219 43
1462 43 477 -62 -114 446 23 -254 24 -127 -314 141 -52 -260 143 410 -380 120 254 -146 -218 64 -9
1483 -9 3 52 331 -368 200 154 -95 -116 383 -171 14 80 -88 -112 89 -63 -303 89 40 -65 -15 -372 -290 -233
$$ packed form
1339c28O61l79l62O05L21q77M21M41n58M5L79l52l63Q57l68l02L57j43p09P93
1359A39J32n91K65M52q34J16R62o98o91J002j50p18L69O05p95L90J81m60P8M73
1379B27m25l34O06K9o76M81K02m45K75M63o57L46L28o89M7N25m96q6M69j92k80
1400b82P27K26o95l1L31n22L5M84j41n60P39j67n65N69K95q47L89K85n91L08N33
1421E20n29k01O73m28l93R11n27l95M24L78p28N04K04l02J03J4j99l08Q19n99
1441e9j63N38k36k18M36K1o35K01J94k44J52J91k9m74L47J08n12M92J07m36K62
1462D3M34n39n2N60m23k77K78j51j87M55j93k08M03K67p90N00J34m00p2K82p3
1483iJ2M9K79o99N68m6k49k1M99n54J85O6j68k4K01j52k40L92m9j05N0l57Q2N7
$$ plain form
1507 -233 -5 -206 -470 175 -10 -71 20 134 -186 -184 172 -349 -6 151 27 8 182 -43 -257 401 -100 -551
1529 -551 354 1 -371 -120 305 -125 -127 337 -221 -3 60 231 -8 111 304 -505 205 227 -233 75 66 77
1551 77 74 483 -34 -159 225 220 -218 53 400 22 -89 348 -58 -60 170 -39 -57 297 -282 -370 220 -152 -181
1574 -181 105 188 -44 -216 93 -404 -63 111 -212 -136 276 25 -350 179 222 -270 -70 288 71 16 97 -262
1596 -262 -45 316 -74 -229 207 163 43 287 -257 -305 -147 68 -347 -164 116 -452 -225 -79 -31 -200 230
1617 230 64 -304 -16 251 -192 -70 558 -78 -91 180 -20 70 -17 -124 -207 165 227 -226 -51 -38 -269 -81
1639 -81 200 72 -65 330 247 -213 64 77 -319 -165 -60 -16 32 -57 -355 -17 -200 99 -90 -60 58 -238
1661 -238 -66 -47 -105 68 187 -68 75 -24 136 -45 59 -85 -117 224 207 -265 -65 13 -9 7 -101 -205 64
$$ packed form
1507b33K28k01k64O45j85o1R1J14l20KL56n21L43J57j24j9J74k25k14O58n01m51
1529e51R05l53l72K51M25m30kM64n58K18O3J71k39J19J93q09P10K2m60L08rJ1
1551G7lM09n17j25L84nm38K71L47l78j11M37m06kK30k09j8L54n79q8N90l72k9
1574a81K86Q3k32j72L09m97L41J74l23P6M12k51l75N29M3m92K00L58k17n5Q1l59
1596b62K17L61l90j55M36m4j20K44n44m8J58K15m15J83K80n68K27J46M8j69M30
1617B30j66l68K88K67m43J22O28o36j3K71k00R0q7j07q3L72O2m53J75J3k31J88
1639h1K81j28j37L95q3m60K77J3l96J54J05M4M8q9k98L38j83K99j89L0J18k96
1661b38J72J9n8J73J19k55J43r9J60j81J04j44l2L41j7m72K00P8k2J6j08j04K69
$$ plain form
1684 64 214 -33 62 -13 -66 -201 23 58 45 -153 56 -236 19 448 136 -34 302 135 -316 216 182 -322
1706 -322 -139 34 -5 12 -19 179 -288 125 -333 -359 120 30 -21 146 36 -200 201 229 -256 -32 232 90
1728 90 24 15 -27 -123 174 -45 17 -74 91 111 -326 47 4 97 -295 62 -278 87 -88 -194 -285 60 -230 -91
1752 -91 -17 -503 -35 155 -21 26 154 36 -166 244 102 -184 143 349 -126 -75 -25 -145 69 -81 -290 -303
1774 -303 223 -380 153 322 128 -40 -121 284 -253 -345 151 -164 28 -232 -44 -160 -16 -177 -334 85 92
1795 92 -381 -221 -127 -309 97 37 -201 -29 369 -53 130 301 68 -331 184 427 168 -127 137 129 -388 59
1817 59 -145 -118 3 -180 -17 53 81 -141 34 177 -20 -185 -172 -66 100 -208 5 27 -32 -8 -185 -180 -51
1840 -51 -68 59 271 35 -101 -54 -69 50 226 284 -179 -175 66 -154 -162 58 117 24 -212 163 -358 -232 -119 -170
$$ packed form
1684F4J50k47R5p5n3j35K24L5j3j98K09k92K55M29l12j70L36j67m51N32l4n04
1706c22J83J73l9J7l1J98m67M13m58k6M79r0n1J67j10k36M01K8m85K24K64j42
1728I0o6rm2r6K97k19O2r1J65K0m37L73m3R3l92L57l40L65j75j06r1L45k90J39
1752i1P4m86M68J90j76M7J28j18k02M10j42k86L27K06m75N1N0j20K14j50k09j3
1774c03N26o03N33J69j94j68q1M05n37r2M96l15J92k60J88j16J44j61j57M19P
1795I2m73J60R4j82M06o0k38J72L98m22J83J71k33l99N15K43k59k95K64qn17M47
1817E9k04K7J21j83J63P0K8k22J75J43j97j65J3J06J66l08K13K2n9K4j77NJ29
1840e1j7J27K12k36j36M7j5J19J76N8m63MK41k20qK20N9r3k36L75n21J26J13n1
$$ plain form
1864 -170 -18 -72 -99 -136 -15 1 257 230 -298 -226 80 -130 -291 94 -190 2 -191 247 -420 146 357 35
1886 35 64 28 -60 -113 -3 -76 -86 195 232 170 17 -133 -54 -19 -96 -54 31 -52 -97 -153 169 39 -371 67 101 -161
1912 -161 72 191 -158 182 228 -95 91 166 103 -421 109 136 -130 -8 349 56 -187 -69 -70 -21 -22 286 -229
1935 -229 255 301 35 278 -265 23 -313 74 -325 55 -8 93 -46 -32 -399 196 149 85 152 -278 -202 -15
1957 -15 -180 -149 -19 -215 262 -35 175 158 -93 -233 131 208 -243 -109 94 46 -92 -44 -18 -203 -139 106 55
1980 55 23 23 108 80 125 115 -123 -158 192 171 84 -120 -34 56 -247 311 47 96 -176 -2 47 -105 -215 -186 11
2005 11 229 -126 -26 -10 -34 -16 44 273 151 -249 -162 439 284 159 26 117 -140 -32 -189 -217 86 -107 -316
2028 -316 75 66 5 -182 243 246 84 43 154 228 -133 85 153 -54 -111 59 -164 132 -54 -3 -4 -127 -324 261
$$ packed form
1864a70J52n4k7l7J21J6K56k7n28P2L06k10j61L85k84J92j93M38o67N66K11l22
1886C5K9l6q8n3J10p3j0K81L7o2j53j50P9L5p7M2Q5q3m5n6L22j30m10M38L4k62
1912a61K33J19l49L40M6l23J86P5o3n24N30K7k66J22L57k93k43J18jM9jL08n15
1935b29M84M6k66K43n43K88l36L87l99L80o3J01j39J4l67N95m7o4O7m30P6J87
1957a5j65L1J30j96M77k97K10j7k51j40L64P7m51J34K03m8j38M8K6j85O4K45n1
1980E5l2%Q5k8M5j0k38l5L50k1q7k04Q6R0l03N58k64M9k72J74M9j52j10K9J97
2005A1K18l55J00J6k4J8O0K29j22m00Q7O01j55j25j33R1k57J08j57k8L03j93k09
2028c16L91ro1j87M25Lj62m1J11P4l61K18O8k07n7J70k23K96j86N1jj23j97N85
$$ plain form
2052 261 54 -224 159 -48 -43 -248 100 -75 -180 100 22 -128 173 31 184 243 -317 218 80 -24 -34 108
2074 108 -71 116 187 -29 -46 -48 -189 -5 -272 61 -30 28 -131 -84 87 -34 256 172 25 207 -307 199 79
2097 79 -155 135 -118 8 3 42 171 220 -80 -7 -33 -295 6 115 -244 -22 -357 0 -223 -5 -185 -74
2119 -74 46 -61 -216 -156 256 73 219 -94 -63 -53 -159 -2 247 309 -199 86 232 83 -31 -153 -210 -319
2141 -319 -41 -145 371 163 170 -222 -48 -187 -28 -311 53 -303 -149 40 184 31 -242 -11 67 7 63 -148
2163 -148 -262 -39 -128 0 59 92 -99 -257 123 -70 36 194 -145 268 251 -209 -148 90 102 -87 -245 -11
2185 -11 29 174 -162 -99 -66 37 -246 -55 21 -93 -119 104 -171 -40 23 -169 -56 52 264 -293 -208 31 -176
2208 -176 -355 -88 227 82 -38 55 7 -146 -279 -33 8 39 148 128 45 227 -118 86 -84 146 -82 -80 72
$$ packed form
2052B61k07k78L83k07Nk05L48j75j05K80p8j50L01j42J53N9n60N35j38j04j0J42
2074A08j79J87P1k16j7kj41J84k67L33r1N8j59M7J71j21K90q4j47J82n14N06j20
2097G9k34K90k53J26nL9J29M9l00P3k6k62L01J09l59K22l35L57k23K18j80J11
2119g4J20j07j55O0M12j83J46l13L1J0j06J57K49O2n08K85J46j49j14j22n7j09
2141c19K78j04N16k08Pl92J74j39J59k83L64l56J54J89J44j53k73K31P8o0N6k11
2163a48j14K23q9J28N9L3j91j58L80j93J06J58l39M13j7m60O1K38J2j89j58K34
2185a1M0J45l36O3L3J03k83J91P6j14k6K23k75J31O3j92J13J08K12n57Q5K39k07
2208a76j79K67L15j45j20R3m8j53j33K46M1L1J09k0q3J82l45K04j70K30k28KJ52
$$ plain form
2231 72 129 -36 49 -93 171 -223 -101 -51 -51 -86 -148 134 -124 -236 -26 20 -57 182 -199 -10 109 26 -114 68
2255 68 101 -59 267 -144 59 57 38 -35 -78 -389 31 -274 -159 -42 26 237 -199 -214 137 99 -89 81 204
2278 204 -91 -6 -45 54 -215 -10 -117 -90 169 -109 -86 40 51 -310 -167 -102 -100 260 295 -56 146 -32 174
2301 174 171 28 270 -215 47 115 112 112 -138 69 -100 60 70 -443 -71 -34 -67 309 165 -62 -59 263 -96 -82
2325 -82 -164 -53 82 -156 -125 -132 124 110 261 12 246 -122 61 -305 -100 79 -101 77 75 -53 -37 293 -73
2348 -73 21 50 -124 -19 345 -58 203 -42 31 -166 32 17 -188 -19 -240 -31 195 106 119 -196 16 264
2370 264 -58 -188 -227 148 321 65 171 98 -35 -141 37 194 112 -44 101 114 -74 345 187 117 85 -115
2392 -115 129 131 96 -143 95 101 10 39 251 53 74 63 65 98 -86 15 284 -84 -134 17 99 -68 -350 182 -280
$$ packed form
2231G2N7j65Q5j42K64l94J22N0%l5o2K82k58j12K10M6p7K39l81J89J19q3j40J82
2255F8L3j60L26m11K03kj9p3m3l11M20l05J15J17O8K11m36j5L51l8j88J70J23
2278B04k95Q5l9R9k69K05j07K7K59k78K3J26J1l61J43O5KL60L5l51K02j78K06
2301A74lj43K42m85K62O8l%k50K07j69J60J0n13L72L7l3L76j44k27LL22l59J4
2325h2q2J11J35k38L1pK56j4J51k49K34l68J83l66K05J79j80J78kj28J6L30l66
2348g3R4K9j74J05L64m03K61k45P3j97J98j5k05J69k21K09K26q9J3l15K12K48
2370B64l22j30l9L75J73k56J06p3j33j06J78J57q2j56J45J3j88M19j58p0l2k00
2392a15K44Kl5k39K38Or1K9K12j98K1j1KL3j84J01K69l68n0J51Q2j67k82N32m62
$$ plain form
2417 -280 -180 -25 32 -87 -10 92 -65 -194 -396 80 -304 -168 -20 -124 -121 -212 -142 184 -97 -79 -237 -185 -22
2440 -22 -111 214 218 126 -82 -239 -224 -14 -66 -85 177 -111 -102 -147 5 34 2 -7 17 -30 116 -70 -93 -26 -210 81
2466 81 -71 280 202 -68 245 290 216 -3 36 11 95 257 -314 -45 137 80 -64 -136 -84 171 -3 -28 -7 -65
2490 -65 -75 -49 189 252 -59 -288 103 -144 -7 -36 160 -112 -129 17 -191 -219 -147 147 -289 83 136 224 -82
2513 -82 169 163 -162 184 345 -97 -170 5 8 13 -230 223 -77 -53 17 -71 320 -99 60 -85 80 -7 -134 22
2537 22 123 -108 -20 46 -100 150 -178 -153 -209 -87 104 -146 133 -70 8 2 121 -209 -292 305 -138 -13 -199
2560 -199 -61 65 -38 -192 196 -149 63 33 16 -10 21 203 -50 226 -35 -137 -27 -325 -302 117 8 140
2582 140 -79 158 21 -123 -81 39 -172 -87 111 -168 -153 -183 69 -140 17 -412 279 92 -10 -111 -47 -121
$$ packed form
2417b80J00J55N7j19P7J02j57j29k02M76l84J36J48j04Lr1P0L26k81J8j58N2J63
2440b2q9L25Mr2k08j57J5K10n2j9K62k88Rm5J52K9l2rK4m7J46j86k3O7j84K91
2466H1j52L51p8k70L13M5p4k19L9k5Q4J62n71K69J82n7j44p2N2K55j74k5K1n8
2490f5j0K6K38O3l11k29L91k47J37k9J96k72j7J46k08k8P2K94m36L72N3Q8l06
2513h2K51ol25L46J61m42p3J75LNk43M53l00K4P0q8L91m19J59j45J65q7j27J56
2537B2J01k31Q8O6j46K50l28K5n6J22J91k50K79k03P8oJ19l30q3N97m43J25j86
2560a99J38J26j03j54L88l45K12l0j7k6L1J82k53K76k61j02J10k98K3M19j09J32
2582A40k19K37j37j44M2J20k11Q5J98k79J5l0K52k09J57m29O91j87j02j01O4p4
$$ plain form
2604 -121 240 -50 244 320 39 -113 104 76 76 98 -186 93 304 -170 -230 -70 -250 -65 28 -7 -17 121 -146
2627 -146 -68 165 -89 32 -53 -210 -228 73 200 -51 -39 -61 -100 -144 167 59 -8 110 122 45 50 -49 -96 -284 4
2652 4 1 -26 48 -10 -17 148 -133 -105 -65 -134 -187 -237 224 328 62 277 -163 -97 2 12 58 28 -120 -166 196 27 -128
2679 -128 -19 135 -60 -97 145 147 161 -33 16 -193 -12 -91 -23 40 28 171 -37 146 -130 -89 326 26 -166
2702 -166 -98 -107 -30 32 50 -27 -62 -203 117 -345 -269 404 -137 17 -47 152 -144 163 -15 -119 -47 69 -262 133
2726 133 -100 71 -25 -305 74 -164 -2 395 -81 -6 310 84 -124 -162 73 407 -227 255 135 -83 -171
2747 -171 116 -2 -332 53 -69 13 28 -63 -114 -134 -5 -53 162 -161 174 -192 33 36 62 50 -322 409 -123
2770 -123 207 -68 -118 -129 161 174 -119 -341 -312 29 178 -58 -157 168 -231 -145 184 -12 60 -141 111 -35
$$ packed form
2604a21L61k90K94P6k81j52K17k8%K2k84K79K11m74o0J60j80J85R3l5j0J38k67
2627a46P8K33k54J21q5j57j8L01J27k51J2k2l9m4L11j08o7J18J2p7Nr9m7j88K88
2652Dlk7P4n8pJ65k81K8M0o9n3n0M61J04k66K15m40O6R9J0M6l0j48m6L62j69j55
2679a28J09J54j95l7K42KJ4j94M9k09J81p9O8O3j2J43k08J83k76M1M15l00j92
2702a66O8rP7O2J8p7l5j41L20m62P6O73n41J54o4J99k96L07j78j04P2J16l31L95
2726A33k33J71r6k80L79k38J62L97m76P5L16k26k08l8K35L34o34M82j20k18q8
2747a71K87j18l30L85j22Q2J5r1n1k0J29m8K15l23L35l66K25LK6j2l72P31n32
2770a23L30k75n0j1K90J3k93k22K9L41J49k36r9L25l99Q6L29j96P2k01K52j46
$$ plain form
2792 -35 161 -24 -111 -74 -36 161 -23 109 -270 -117 -216 15 137 -312 -227 -104 105 16 -219 162 -65 191
2814 191 28 128 -100 53 152 108 160 20 -97 141 299 -97 -67 -151 125 -91 -14 3 -85 -329 -89 -62 -107
2837 -107 -117 51 -161 -72 131 -95 -9 -141 153 -49 20 -120 101 -105 63 54 171 18 -289 -17 68 100 55
2860 55 63 -30 -1 252 -125 169 -78 54 53 -64 107 -118 -163 -6 -133 -159 -105 115 -117 4 -126 -48 -297 22
2884 22 -162 -107 -52 -37 -181 2 246 -178 56 43 63 -28 16 66 129 -345 16 -55 138 -261 58 -16 -10 39 -51
2909 -51 -86 144 -79 -15 -57 -118 -111 70 -265 1 19 -244 -19 230 165 -79 36 -126 57 8 174 76 16 -248
2933 -248 -29 -19 208 -8 60 -89 63 23 -154 66 132 13 -29 -27 -140 -415 94 -54 -187 18 -63 -131 -58
2956 -58 173 49 88 -16 -294 2 -131 72 197 63 74 150 141 84 166 157 145 145 87 -42 240 -245 -112 95 -104
$$ packed form
2792c5J96j85q7L7L8J97j84J32l79J53r9K31J22m49Q5J23K09q9k35L81k27K56
2814A91j63J00k28J53R9m4N2j40j17K38J58l96L0q4K76k16P7J7q8k44K40K7m5
2837a07j0J68k12Q9K03k26Q6j32K94k02O9j40K21k06J68rJ17j53l07K72Q5L2m5
2860E5Qr3K9K53l77K94k47J32jj17J71k25m5J57j27k6N4K20k32J21j30P8k49L19
2884B2j84N5N5J5j44J83K44m24K34j3K0r1M4N0O3m74L61p1J93l99L19p4OM9r0
2909e1l5K30k23O4m2o1PJ81l35K66J8k63K25K49o5k44J15j62J83m9J66r8o0k64
2933b48K19J0K27k16O8j49J52m0j77K20O6j19m2Kj13k75N09j48j33K05q1o8P3
2956e8K31j24L9j04k78K96j33K03J25j34J1P6rn7Q2rj2%n8j29K82m85J33K07j99
$$ plain form
2981 -104 101 7 -264 22 -98 61 -251 -70 182 -201 -24 215 146 58 25 198 79 86 44 170 -102 97
3003 97 -135 17 -68 -40 212 -253 57 -49 -68 61 -170 -75 -283 -134 63 197 148 -255 -141 42 5 87 159
3026 159 -138 52 137 -2 -22 57 -124 -19 85 -52 -46 111 -90 34 204 -81 -191 36 76 95 -106 415
3048 415 135 209 133 125 -40 193 -134 -236 228 -207 22 105 123 -64 146 -39 -278 186 45 -185 92 -228
3070 -228 -85 -1 -293 -87 -217 0 -316 -299 133 -143 18 83 22 321 28 -150 -47 -105 -333 101 51 76
3092 76 131 97 149 169 153 -63 64 -155 -80 -52 157 -99 -188 15 292 92 10 37 -271 -19 84 -311 87 -205
3116 -205 -125 -205 13 -23 160 -108 -6 -136 -282 -21 124 187 33 -69 -9 -17 -248 -187 -156 -340 210 -124 133
3139 133 11 -165 34 -106 114 -68 82 60 -212 235 199 142 60 43 -129 310 -246 -63 -37 -274 220 137
$$ packed form
2981a04K05r4k71K86j20J59l12J81K52l83J77K39o9q8l3J73j19Pm2J26k72J99
3003I7k32J52q5K8K52m65L10j06j9J29k31R5k08J49J97J34m9m03J14J83l7Q2P2
3026A59k97J90Q5j39k0P9j81J05J04j37OJ57k01J24J70k85j10K27M0J9k01N21
3048D15k80P4p6qj65K33l27j02M64m35K29Q3J8j87K10j85k39M64j41k30K77l20
3070b28J43Q4k92K06j30K17l16J7M32k76J61O5o1K99k93j78J03n8k28M34n0K5
3092G6N5l4N2K0j6k16J27k19P5K8K09k56q9K03K77k00q2K7l08K52J03l95L98k92
3116b05Q0q0K18l6J83k68J02j30j46K61J45O3j54j02O0qk31O1L1j84N50l34K57
3139A33j22j76J99j40K20j82J50k2k72M47l6n7q2j7j72M39n56J83K6k37M94q3
$$ plain form
3161 137 38 -104 192 384 326 -30 112 -467 -144 15 44 81 -317 -25 -50 -43 -109 30 81 134 191 47 162 -233
3185 -233 64 -297 220 -49 277 108 -88 -39 -159 216 -89 121 -37 -250 209 12 -189 256 166 -57 39
3206 39 171 147 146 204 124 207 -159 168 78 52 67 -113 -177 -191 -134 30 -281 -163 211 75 267 81 152 -135 -36
3231 -36 -106 433 -33 -19 183 -118 173 -193 -72 295 62 -159 54 379 95 -93 194 -8 99 -236 75
3252 75 62 134 0 313 -195 171 -61 -1 111 11 27 172 130 -187 -30 -206 283 -180 -290 124 98 -293
3274 -293 106 151 -46 -153 -109 90 -64 -177 -6 52 -211 -154 145 149 67 -31 -78 121 164 -15 -31 85 84 -115
3298 -115 65 -258 130 -255 -34 107 -161 150 76 -84 23 279 63 92 -199 -189 27 -236 -44 72 37
3319 37 126 36 -224 20 55 -20 -66 131 22 26 64 -145 -97 -7 -12 35 124 -224 39 113 81 -64 233 130 209 40
$$ packed form
3161A37r9j42K96J92n8l56J42n79L23J59K9L7l98K92k5Po6J39N1N3N7j44J15l95
3185b33K97l61N17k69L26j69j96M9j20L75l05K10j58k13M59j97k01M45r0k23R6
3206C9J32k4jN8q0Q3l66L27r0k6J5j80o4j4N7J64l11J18L74j36J92j86P1k87R9
3231c6p0N39m66J4K02l01K91l66J21L67k33k21K13L25k84j88K87k02J07l35L11
3252G5j3P2j34L13n08L66k32O0J12j00J6J45m2l17J57j76M89m63j10M14k6l91
3274b93L99M5j97j07M4J99j54j13J71N8k63N7K99Mq2r8m7J99M3j79j6J16jj99
3298a15J80l23L88l85K21J41k68L11p4j60J07K56k16K9k91J0K16k63J92J16l5
3319C7Q9r0k60K44L5p5m6J97j09ML8k09M8R0nM7Q9l48K63P4l2j45K97j03P9j69
$$ plain form
3345 40 -147 169 -207 145 180 -47 259 -6 153 0 -5 46 -223 -180 -105 -92 -10 190 -158 90 -171 51 -7
3368 -7 199 -75 28 36 -48 -81 399 225 138 127 -273 -182 -6 -70 -227 -164 -265 -18 175 144 189 143 195 -116 163
3393 163 27 -121 -58 -168 35 111 87 -147 -178 -23 95 70 23 -165 -116 -44 17 -83 -59 88 -37 -4 -59 -49
3417 -49 289 -103 332 -242 44 236 243 212 271 175 -162 204 -72 58 -298 -112 86 -129 158 77 84 59 90 -91
3441 -91 137 -95 -33 191 240 266 -101 -114 69 -87 -60 -100 7 -48 368 -20 270 -8 -145 206 140 -206 -129
3464 -129 263 -15 50 -130 -214 273 58 188 478 -75 168 -7 -241 18 142 98 204 91 69 -19 -153 -75
3486 -75 39 263 -95 -4 -41 130 -189 -160 -99 246 99 59 185 102 53 -201 27 -79 359 -204 -37 160 -144
3509 -144 -179 56 -121 -228 115 -170 -338 266 -92 -77 243 -120 -17 145 5 190 -14 -26 -144 226 18
$$ packed form
3345D0j87L16l76L52L5k27L06k65J59j53nN1k69M3P5J3Q2K00l48K48k61K22n8
3368gK06k74J03Qq4l3M80j74q7j1m00R1J76o4j57O3j01K47J93l1M5m6N2l11K79
3393A63j36j48O3j10K03P6k4k34l1J55J18k5m7j88M9P2O1j00K4J47j25L3n5J0
3417d9L38l92M35n74K86J92Pl1N9r6l37L66k76J30l56J86J98k15K87q1Pk5L1j81
3441i1K28k32O2K24M9K6l67j3J83j56K7m0J07n5M16l88K90k78j37L51o6l46P7
3464a29L92k78O5j80q4M87k15J30K90n53K43j75k34K59J24m4J06j13k2q8j34P8
3486g5J14K24l58R1l7J71l19K9O1L45j47m0J26q3m9k54K28j06M38n63J67J97l04
3509a44l5K35j77j07L43k85j68O04l58J5L20l63J03J62j40J85k04j2j18L70k08
$$ plain form
3530 18 13 -12 234 -41 -137 121 293 21 -53 25 -289 -32 -8 216 148 -139 14 74 173 50 75 74 -234 199 -43
3555 -43 124 196 80 163 157 0 -278 -277 21 23 -182 -155 -337 93 -411 341 129 -75 106 -62 -148 -234 -107 -275
3579 -275 113 -125 -30 -64 0 -57 306 127 256 -363 -115 -290 234 -121 159 -153 30 90 -8 90 -197 -161 74
3602 74 110 -149 209 51 -199 60 308 -600 -76 251 119 -54 -112 11 -112 -140 -185 -126 -156 29 -8 -66 112
3625 112 -75 151 -10 290 292 -14 190 16 -199 -267 333 -18 63 -54 58 -134 -13 -76 -44 288 -168 48
3647 48 293 192 -62 -23 -79 223 -116 -36 -66 -37 90 33 48 61 203 124 -176 46 102 145 -27 93 -416 117
3671 117 200 -357 63 289 -270 37 168 -18 -11 386 -91 -352 -46 -82 44 48 -319 198 -61 -22 55 -54 69
3694 69 -121 -40 -42 -121 -320 -367 69 -176 -39 9 -404 95 155 74 -63 262 37 44 -1 -176 34 4 35 113 52
$$ packed form
3530A8nk5K46k75r6K58J72k72p4P8l14K57K4K24o8k87J53O0R9j23K5jl08M33k42
3555d3J67P2j16Q3oj57k78JK98Kk05K7j82M30n04P52k12k04J81j68q6q6J27j68
3579b75L88k38R5l4O4n7L63j79J29o19K48j75N24l55K80l12J83O0r8R8k87L6K35
3602G4L6k59L58j58k50K59K48r08N24L27j32j73n8J23j23k8m5N9l0J85l7n8J78
3625A12j87K26j61L00Kl06K04j74k15o8O00l51Q1j17J12j92J21o3L2L32m56K16
3647D8K45j01k54L9n6L02l39Q0l0K9J27n7J5J3J42p9l00K22N6M3j72J20n09N33
3671A17Q3n57M20K26n59L07J31j86PL97m77k61L06l6J26Ml67N17k59L9P7j09J23
3694F9j90Q1kp9j99m7M36k45J37M8m13M99O0q1j37L25k25Pm5j75K10l0L1P8o1
$$ plain form
3719 52 -299 -294 51 -81 140 -183 -226 78 48 57 -10 76 139 25 -35 43 158 -62 9 -210 -90 385 143 -25
3743 -25 29 -9 -171 149 11 136 -84 -43 -234 251 52 -32 -47 -28 -59 -136 -22 41 -171 -68 -251 -318 -107 164
3767 164 53 -14 183 -50 -67 72 7 -199 171 33 242 74 -101 -16 -184 131 -72 135 -97 -46 171 129
3789 129 160 118 -192 259 107 -298 -274 78 25 -94 -235 196 -94 -76 -100 -1 106 77 -11 53 170 132 275 -14
3813 -14 77 50 57 55 123 100 -77 174 -46 110 55 -76 196 25 -53 48 362 -254 -141 -298 -115 -89 -79 -119 -123
3838 -123 -25 -24 -128 -355 46 -66 -59 -122 -16 115 112 193 -148 -24 238 51 144 -99 -140 62 -14 -16 104 -233 -148
3863 -148 -98 -20 105 -185 62 240 -122 -15 172 -156 -167 19 -4 -259 95 -2 216 -196 -90 -255 -64 -259
3885 -259 128 -36 -206 142 -168 -26 77 90 322 201 -73 -42 18 -6 157 11 -149 90 -293 14 -73 29
$$ packed form
3719E2l51NL45j32K21l23m3L04l0Ro7Q6O3j14o0P8J15k20P1k19J20M75k42j68
3743b5N4l8j62L20j38J25k20M1j91M85j99q4j5J9l1p7J14O3k12J03j83o7K11K71
3767A64j11o7J97k33j7J39o5k06L70j38K09j68j75Q5j68L15k03K07k32N1K17m2
3789A29L1m2l10M51j52m05K4L52n3j19j41M31k90J8k4R9J07k9q8O4J17l8J43k89
3813a4R1k7PkO8k3j77K51k20J56n5j31K72j71p8J01L14o16J13j57J83K6J0m0m
3838a23R8Jj04k27M01j12Po3J06J31lQ1l41J24K62j87R3k43m1K02p6kJ20l37Q5
3863a48N0P8J25k90K47J78l62J07J87l28j1J86k3k55L54r7K18m12J06j65J91j95
3885b59L87j64j70L48l10J42J03J3K32j21k74L1O0k4J63j46j60K39l83L07q7J02
$$ plain form
3907 29 -80 -498 -358 71 -310 95 523 -1 170 -85 244 -366 -277 -57 29 66 362 -106 153 284 36
3928 36 131 249 -18 227 185 124 -110 215 17 -39 95 -10 263 -47 -21 -47 -8 -237 -342 -239 -196 -228 -40
3951 -40 -190 303 -241 -283 -149 93 149 -50 118 16 92 -56 254 -76 182 65 192 -28 189 -78 77
3972 77 -163 -106 -108 -160 132 -107 1 -117 -83 -440 -160 -34 -98 134 327 -176 -102 66 70 173 100 -294 -216 -187
3996 -187 122 181 -224 49 104 -96 63 -127 -227 58 79 117 -54 -195 72 -90 111 -137 -33 -168 -51
4017 -51 38 -109 86 -229 160 208 31 -86 112 -11 122 110 83 -125 -123 29 -53 -60 202 113 13 -129 264 -117
4041 -117 -93 -94 34 -195 166 -182 -92 -61 171 8 -11 116 158 107 187 77 -77 -76 -164 -39 -90 119 72 -54 18
4066 18 192 -14 -157 160 59 -44 -96 71 -64 -215 105 19 166 -197 -174 54 -28 -6 -155 -207 -367 78
$$ packed form
3907B9j09m18J40M29l81M05M28n24J71k55L29o10Q9K20Q6L7K96m68K59J31k48
3928C6R5J18k67K45m2o1k34L25j98n6J34j05K73l10K6k6L9k29j05J03M3l2J88
3951d0j50M93n44m2J34K42N6j99J68j02P6j48L10l30K58j17J27k20K17k67J55
3972G7k40N7kn2K92k39J08j18L4l57K80J26o4K32J93n03P4J68MJ03p3l94P8K9
3996a87L09N9m05K73N5k00J59j90j00K85K1L8j71j41K67j62K01k48J04j35J17
4017e1Q9j47J95l15L89M8j77j17J98j23J33j2k7k08KJ52q2pK62q9j00j42L93l81
4041a17K4jJ28k29L61l48R0L1K32j63j9J27M2n1Q0j10j54Jq8J25n1K09m7j26P2
4066A8J74k06j43L17j01j03n2J67j35j51L20q6J47l63K3K28q2K2j49n2j60M45
$$ plain form
4088 78 -84 217 -238 -282 -25 -150 166 79 153 -126 69 -183 -339 -55 -171 -46 -45 -26 -7 105 -208 163 -109
4111 -109 0 65 -28 62 19 -171 -45 2 -75 -12 84 -137 101 82 209 191 -57 111 32 -136 138 140 -46 -25 -33
4136 -33 186 -316 -182 -164 -49 -138 -92 81 11 112 -175 124 -103 -61 101 -180 -43 -206 112 125 71 91 -116
4159 -116 -72 -10 -6 128 22 190 6 144 -243 98 92 246 -146 -49 -188 -219 -156 -75 138 -44 249 -100 216
4182 216 81 5 43 38 -177 138 -80 -84 68 -271 -114 -15 -256 -17 240 156 87 141 204 -119 -232 -100 25 -209
4206 -209 187 93 -141 79 -30 -33 -66 -87 89 13 114 119 172 -96 -7 80 103 -139 -52 -88 -42 97 112 109 18 -166
4232 -166 -96 -105 114 3 160 152 13 -129 -108 163 18 108 78 186 -72 -169 205 135 188 -75 -197 69 -7 60
4256 60 27 -256 -188 -35 -14 20 -146 -3 5 -219 117 155 10 -23 27 157 -119 79 27 -252 -108 8 -281 76
$$ packed form
4088G8j62L01m55m4K57j25L16q7P4k79J95k52j56K84j16J25JJ9J9J12l13L71k72
4111a09J09O5r3R0m3j90J26M7p7O3R6k21K38j9J27j8k48J68p9j68K74Kj86K1q
4136c3K19n02J34J8J15q9M6J73p0J01k87K99k27M2J62k81J37j63L18J3n4K0k07
4159a16M4O2MJ34j06J68j84J38l87L41oJ54l92R7j39l1O3Q1K13j82K93l49L16
4182B16j35p6L8nk15L15k18mJ52l39J57R9k41K39K57q4o9N4O3l23j13J32J25k34
4206b09L96r4k34K20j09ll3k1J76p6J01NN3k68Q9Q7K3k42Q7l6M6J39J5lr1j84
4232a66P0rK19j11J57qj39j42K1K71j45R0l0J08k58r7L74p0N3k63j22K66p6O7
4256F0l3k83O8J53K1L4j66J43Qk24L36L8j45l3N0J30k76J98n2k79J44J16k89L57
$$ plain form
4280 76 -117 268 94 146 345 -313 -4 91 83 59 -9 -152 70 2 103 285 152 147 49 29 -403 -140 77 -9
4304 -9 -65 -74 -305 -117 42 -136 213 136 19 387 108 27 -23 -136 -147 192 -126 -98 -109 -20 270 -144 148 142 3
4329 3 -116 -46 59 2 120 179 -42 -46 112 -21 -322 80 58 -46 -128 63 158 -191 370 346 -50 130 -107 -108
4353 -108 -120 -31 200 103 33 -81 254 0 62 -161 134 9 -8 136 -232 -120 -166 239 116 -176 5 237
4375 237 141 -5 -159 186 118 197 197 173 -364 8 95 28 -150 68 -42 333 -252 60 20 -68 97 -116 105
4398 105 47 -334 30 77 -133 299 169 127 231 -192 -54 10 69 -277 70 -174 203 93 -107 -43 -98 -157 10
4421 10 -8 -67 40 -523 -25 -107 54 -109 25 189 -27 316 -191 -242 -74 14 -107 -171 25 26 83 295 -170
4444 -170 -69 -242 -3 -223 100 185 -2 198 -255 -281 -2 -367 -37 85 -233 103 126 2 116 -64 4
$$ packed form
4280G6j93L85j74N2J99o58L09R5qk4o8j43K22o8J01J82j33nr8k0m32K63K17q6
4304in6rk31J88J59j78L49p7j17L68k79q1n0j13j1L39l18K8j1Q9K90m14K92oj39
4329Cj19P0J05n7J18N9k21mJ58j33l01M02k2j04q2J91R5l49N61k4l96J80k37j
4353a08j2Q9K31r7p0j14L35k54O2k23K95j25j7J44l68J12m6M05j23k92J81K32
4375B37r6j46j54L45o8P9%k4n37L72Q7o7j78K18j10L75n85L12m0q8J65k13K21
4398A05n8l81L64M7k10M32j30m2J04m23J38O4N9l46L47k44L77j10k00O4n5n9J67
4421A0j8n9J07n63M98q2J61j63J34J64k16L43n07n1J68Q8j21o4J96JN7K12m65
4444a70J01j73K39k20L23Q5j87K00m53k6K79l65L30J22l18L36K3j24J14j80O8
$$ plain form
4465 4 90 -167 -130 36 85 -150 5 81 199 128 -187 -144 -187 3 -15 33 239 -47 216 -82 -30 -94 145 42
4489 42 -12 -380 -116 102 240 82 -26 48 43 -291 -1 99 106 50 96 -190 49 -13 268 -30 157 -92 56
4512 56 32 253 -12 -13 -74 242 -21 -35 300 -16 178 64 -220 -235 7 -176 -153 97 192 -179 74 65 66 -141
4536 -141 -200 -113 113 -95 210 196 -209 69 119 33 -47 317 -81 92 119 -254 -106 -341 105 140 -83 47 -3
4559 -3 -317 -189 419 92 83 154 217 -88 -130 -106 -30 17 176 8 76 173 -108 211 111 19 271 -194 50 -175
4583 -175 6 150 132 95 99 -148 195 96 118 -75 -249 127 330 159 266 -163 227 29 -28 -17 124 -128 -85
4606 -85 -138 11 -82 319 109 -37 80 -357 -24 35 -90 -250 17 -191 13 77 -76 -273 -167 -113 -159 -129 -266
4629 -266 16 97 161 212 -103 26 -29 -94 228 204 -128 -35 -240 -55 76 -2 -123 -60 300 74 288 -136 -336
$$ packed form
4465DQ6k57L7J66M9k35J55P6J18p1l15M3m3J90j8M8K06k86K63k98N2o4K39j03
4489D2n4l68K64K18J38j58j08P4nl34K90J00Pn6M6k86K39o2K81k98J87k49J48
4512E6k4K21k65jo1L16k63j4L35l16J94j14k84j5K42j83K3K50R5l71K53rJk07
4536a41n9Q7K26k08L05j4m05K78N0q6q0L64l98J73K7l73J48k35M46L5k23J30n0
4559cl14J28O08l27rP1O3l05m2K4P6M7J59j68O8R7k81L19j00r2K52m65K44k25
4583a75J81J44j8l7Mk47L43r9K2j93j74L76K03j71J07m29L90j98n7J1J41k52M3
4606h5n3J49r3M01k10j46J17m37L33N9j25j60K67k08K04O4j53j97J06N4m6L0j37
4629b66K82Q1O4N1l15J29n5o5L22k4l32R3k05J85J31p8j21O3L60k26K14m24k00
$$ plain form
4652 -336 -289 50 116 -150 -241 -60 -39 -251 202 10 51 -197 37 318 -40 14 17 -22 -246 172 49 136 -368
4675 -368 192 17 61 -209 -20 -138 214 165 -145 61 -188 233 -86 192 -228 181 199 59 154 42 -85
4696 -85 -23 -2 466 10 83 103 -168 -90 -119 -41 -166 -6 163 -17 -6 -134 -54 -204 -64 178 255 -191 -27 25
4720 25 1 286 -275 86 -37 -137 65 280 281 160 96 44 146 80 238 -24 -3 12 28 -8 193 132 -134 21
4744 21 228 41 105 -17 258 37 273 8 -7 16 130 279 -170 82 224 113 277 -18 3 -49 82 -20
4766 -20 -55 61 248 -61 27 133 33 79 115 276 189 -19 120 -59 85 200 -35 -8 -115 76 -233 186
4788 186 -5 -185 -86 99 90 200 10 84 -41 107 -40 39 247 -71 219 -21 -78 68 142 -354 62 -6 79
4811 79 -33 473 78 -54 123 -89 -50 44 -134 -159 108 -212 125 -101 134 179 -469 -276 127 -310 -39 -247
$$ packed form
4652c36M7L39O6k66r1J81K1k12M53j92M1k48K34K81l58N4Ll9k24M18j23Q7n04
4675c68N60j75M4k70J89j18L52m9l10K06k49M21l19K78m20M09J8j40R5j12j27
4696h5O2K1M68m56P3K0k71P8k9P8j25J60J69j80J1j28Q0j50J40K42P7m46J64N2
4720B5k4K85n61L61j23j00K02K15Jj21o4n2J02o6J58k62K1J5J6l6K01o1k66J55
4744B1K07j87O4j22K75k21K36k65j5K3J14J49m49K52J42j11J64k95K1n2J31j02
4766b0l5J16J87l09Q8J06j00M6L6J61q7k08J39j79J44J15k35K7j07J91l09M19
4788A86j91j80R9J85rJ10j90P4j25J48j47P9K08l18K90k40n7J46P4m96M16o8Q5
4811G9j12N06l95j32J77k12L9R4j78k5K67l20L37k26K35M5o48J93M03m37K71k08
$$ plain form
4833 -247 99 -302 -182 -312 -4 431 107 -53 306 -143 -10 162 -137 159 -172 82 46 238 25 -211
4853 -211 -306 -33 -124 -27 10 -235 -155 86 -49 -175 18 -262 -11 -37 93 -86 112 122 250 65 34 155 -134
4876 -134 3 48 17 -14 -155 -126 -177 96 112 201 91 356 85 -46 -22 72 -196 124 -115 -185 100 44 -40 139
4900 139 98 136 -177 -124 -113 243 -180 295 50 -79 -487 -7 -68 -42 -71 -226 138 82 -70 -114 161 -195 -270
4923 -270 11 -240 88 6 -66 -74 38 147 -35 -116 362 -178 39 -126 62 419 48 -195 -140 172 -203 162
4945 162 79 100 -86 88 84 -220 172 87 -122 99 7 -292 -52 -1 53 219 14 -30 50 -14 277 9 170 -91
4969 -91 -65 -74 24 -36 38 75 78 -199 -79 21 -150 5 -383 255 -160 -165 -291 -177 15 -260 -90 129 120 98 -55
4994 -55 216 -33 -463 68 102 -66 44 122 -2 86 114 -286 167 -24 65 -272 113 94 -132 -51 -7 56 -66
$$ packed form
4833b47L46m01J20j30L08M35l24j60L59m49J33J72k99K96l31K54l6J92k13k36
4853b11r5K73r1R7L7k45Q0K41j35j26J93k80K51k6J30j79J98J0J28j85l1J21k89
4876a34J37M5l1l1j41K9n1K73J6Q9j10K65k71j31K4R4k68L20k39p0K85n6q4J79
4900A39m1L8l13N3J1L56m23M75k45j29m08M80o1K6k9j55L64n6j52m4K75l56p5
4923b70K81k51L28q2p2qJ12J09j82q1M78n40K17j65J88L57l71k43N5L12l75L65
4945A62q3K1j86J74ml04L92q5k09K21r2k99K40N1N4J66k05m4Q0o4K91k68J61k61
4969i1K6rR8o0P4L7Lk77J20J00j71J55l88O38m15nj26J14J92k75J70K19rk2j53
4994e5K71k49m30N31L4j68J10P8j24Q8K8m00M53j91Q9l37L85j9k26Q1M4O3j22
$$ plain form
5017 -66 159 -84 391 -62 98 217 -72 -84 125 33 -140 111 122 -162 -198 -107 173 -309 85 136 58 193 -146
5040 -146 -183 -254 51 -24 296 -240 -377 -301 37 -232 116 375 40 228 -66 -79 248 -38 4 -350 -212 -151
5062 -151 -183 -7 42 -115 244 148 122 -41 168 300 -256 -111 246 -149 -137 -225 217 -35 -18 12 167 22 -21
5085 -21 3 2 5 69 214 60 134 -141 110 194 192 -158 -19 -149 231 68 67 98 144 -181 188 -326 -234 -51 -75 -149
5111 -149 -56 -15 -88 112 20 49 0 -156 154 -105 -107 199 -78 87 49 158 138 184 193 -299 -216 -1 119 73 26
5136 26 -349 125 216 102 483 -66 69 170 64 130 35 219 -58 109 -105 294 124 -406 14 134 -131
5157 -131 209 181 0 80 218 -260 -139 -68 200 -220 59 -92 55 143 -35 94 -178 42 -251 99 167 77
5179 77 151 192 269 262 39 106 -117 57 -47 -2 0 195 160 -51 196 -92 -221 -51 -51 149 72 -6 -141 59 -127
$$ packed form
5017f6K25k43M75m53J60J19k89j2K09r2j73K51J1k84l6R1K80m82L94N1p8J35l39
5040a46l7p1L05p5L20n36j37P6L38k69L48K59l35J88k94j3L27k86M2l54J38O1
5062a51l2J76M9j57L59r6k6j63K09J32n56J45L57l95J2q8M42k52J7L0J55j45m3
5085b1K4jLO4J45j54P4k75K51Q4kl50J39j30L80j63jL1M6l25L69n14R2J83k4p4
5111a49R3M1p3K00r2K9m9j56L10k59kL06k77J65l8J09k0M6Rm92Q3K15J20m6m7
5136B6l75M74R1j14L81n49J35J01j06O6r5J84k77J67k14L99j70n30M20J20k65
5157a31L40k8j81Q0J38m78J21P1K68m20K79j51J47Q8j78J29k72K20k93L50O8r0
5179G7P4M1P7pk23O7k23J74j04M5KJ95l5k11K47k88j29J70%K00p7p8j35K00j86
$$ plain form
5204 -127 114 -22 28 154 30 85 -172 -144 126 250 -90 -60 -87 7 -133 -54 -64 122 -106 294 87 -22 -96
5227 -96 -13 -128 60 17 -177 80 -228 229 320 19 -250 -198 -204 33 -20 204 142 41 30 -42 -44 -43 41 -139 49
5252 49 74 -58 122 -58 306 -325 -2 -20 79 -75 74 166 194 111 178 84 -39 138 67 -8 54 52 -85 -166 -49
5277 -49 -189 123 -140 176 139 -202 200 32 -52 -331 61 -18 -113 -82 22 112 37 77 166 112 94 88 104 -13 105
5302 105 42 -228 116 45 59 -86 -89 -26 -77 314 -102 109 -262 87 175 -140 28 413 -163 -151 212 -27 -20 41
5326 41 -131 2 371 69 9 83 125 62 444 -184 135 152 -277 60 121 -6 -20 57 -8 -22 153 -93 52 -269
5350 -269 11 102 34 69 -175 179 -125 -119 -85 -44 30 180 159 171 -148 -152 -102 -152 353 -81 -12 -63 282 68 186
5375 186 145 -191 37 123 10 148 -425 42 -140 -87 41 -361 236 -85 77 -278 -66 -279 84 -101 232
$$ packed form
5204a27K41j36N0J26j24N5k57K8K70J24l40L0k7R4j40P9j0J86k28M00k07j09p4
5227i6Q3j15J88m3j94K57l08M57R1l01k69N2oK37n3K24o2j01j1p2kJQ4j80J88
5252D9K5j32J80j80L64o31L23j8R9j54J49R2K8q3O7r4j23J77p1p5O2kj37q1J17
5277d9j40L12k63L16l7l41M02j68q4k79L92p9r5L1J04R0p5M0Q9n4j8oJ6j17J18
5302A05o3k70L44p1J4j45lO3n1L91m16K11l71L49Q8l15J68L85n76J2L63k39PO1
5326D1j72J33L69l02o0P4M2o3L82o28L19J7m29L37O1j27j4P7o5j4J75k46J45l21
5350b69K80R1o8L5k44L54l04OL4M1P4J50k1J2l19mN0n0N05m34O9n1L45k14J18
5375A86m1l36K28Q6j13J38n73M67j82N3J28m02N97l21J62l55K12k13L63j85L33
$$ plain form
5396 232 111 -15 296 8 -21 -69 224 382 10 -3 -99 130 -19 -114 -88 16 -202 -98 57 72 44 -50 269
5419 269 76 124 -91 -120 129 210 81 159 129 -64 177 219 85 -71 -45 -29 401 134 176 58 -204 -101 2
5442 2 114 114 229 51 -409 135 4 -110 0 -100 274 -142 -92 -260 54 -376 138 231 92 -160 -62 283
5464 283 -195 -155 -200 294 147 -173 45 126 -74 45 196 136 61 134 84 41 26 45 24 3 108 -105 27 282
5488 282 269 47 -260 -259 -41 -125 -155 -283 -82 -274 -63 230 113 53 -47 78 -114 -246 -37 132 -128 -20
5510 -20 -75 -261 110 254 -109 -260 -294 151 67 -5 129 7 -178 -174 50 -121 -56 122 -48 60 -86 -55 34
5533 34 71 -153 -79 202 -256 292 222 193 -155 -25 175 -47 30 -21 202 259 39 -360 23 135 83 50 -49 -7
5557 -7 -42 -145 -125 -197 259 -133 -241 39 -63 -95 128 5 79 147 258 -289 -59 18 -425 -265 -133 109 -20
$$ packed form
5396B32j21j26L11k88k9m8K93J58l72j3r6K29j49r5K6J04k18J04J55J5k8r4L19
5419B69j93M8k15k9K49Q1j29P8l0j93K41M2j34j56K6J6M30k67M2j18k62J03J03
5442BJ12%J15j78m60N44j31j14J10j00L74m16N0j68L14m30N14R3j39k52R8L45
5464B83m78M0m5M94j47l20K18Q1k00J19J51o0p5P3n0m3j5J9k1k1J05k13J32K55
5488B82j3k22l07JK18q4l0j28K01j92K11K93j17o0j00J25j92j32K09J69k60J08
5510b0n5j86L71J44l63j51l4M45q4p2J34j22j85MK24j71O5J78j70J08j46L1Q9
5533C4L7k24P4K81m58N48p0k9l48J30K00k22P7n1K23N7k20l99L83J12n2l3r9M2
5557gl5j03K0p2M56l92j08K80j02l2K23j23P4O8J11n47K30P7m43J60J32K42j29
$$ plain form
5580 -20 -174 -31 76 -52 -80 -70 22 -178 -161 428 9 -44 29 14 258 14 -76 -124 84 157 13 12 -84 -46 388
5605 388 253 -53 -91 23 -30 109 -3 -194 -36 -41 -110 59 -48 88 56 62 462 28 -243 -221 -100 211 -155
5628 -155 48 48 -3 45 -139 37 25 -11 25 -103 -11 99 -89 74 94 255 76 0 -125 -71 43 297 76 74
5652 74 -7 -67 15 -117 176 -33 92 -51 159 -40 -6 -16 -184 -97 -83 -3 -64 -96 25 174 -77 -154 55 -13
5676 -13 194 101 126 127 73 -69 -54 -82 -62 31 -102 -59 39 258 -19 -54 58 -204 -282 270 165 -252 47 -120 266
5701 266 -128 47 210 -133 -149 -232 -53 112 -80 -202 -260 96 -246 53 45 190 -248 -93 2 56 -177 -220 -11
5724 -11 80 -219 -152 -75 -175 -165 -109 45 24 246 197 -9 -85 138 -123 19 -96 -11 -64 70 -237 -125 -118 270
5748 270 -200 -122 77 78 194 364 171 -105 336 -175 -93 248 -129 76 -204 86 42 -6 35 137 -167 -42
$$ packed form
5580b0j54J43J07j28k8J0R2k00J7N89m19n3P3j5K44k44r0m8K08P3j44jr6L8M34
5605C88j35l06l8J14n3J39j12j91J58no9J69j07J36l2OM00m34k71K2J21L11l66
5628a55K03%n1M8j84J76j2l6L6j28R2J10j88J63K0J61j79p6j25N4J14K54k21k
5652G4q1o0Q2j32K93k09J25j43K10j99L4j0j68Q7J4Q0o1l2J21J49k51p7K09o8
5676a3K07r3K5Jn4j42J5k8K0R3j33M3R8K19k77l5J12k62p8N52j05m17K99j67L86
5701B66l94J75J63l43j6q3J79J65j92j22n8L56l42K99qJ45m38J55R5N4k33m3K09
5724a1R1k99O7P7j00J0N6J54k1K22m9k06p6K23k61J42j15Q5n3J34l07J12PL88
5748B70m70P8J99JJ16J70j93k76M41n11Q2L41l77K05k80K90m4m8M1J02l04J25
$$ plain form
5770 -42 160 -246 -271 86 69 -123 1 -278 10 -222 -23 72 52 28 65 86 44 367 24 -51 213 10 -102
5793 -102 -47 139 8 157 187 237 125 -181 -103 -187 -167 -125 217 -284 162 -111 -403 12 -109 38 141 -61
5815 -61 225 105 -127 -19 214 -57 -281 -197 253 -85 174 231 109 -36 134 -99 76 85 -298 420 -58 -107
5837 -107 68 193 200 102 -67 -142 239 -57 -160 -265 -84 -18 116 -135 59 -2 82 -91 -155 -44 -111 -55 -76 1
5861 1 -145 107 -373 -23 19 89 32 -250 33 144 49 -105 -86 -164 21 -367 54 -95 45 21 202 -79 197
5884 197 72 187 -65 -25 258 -54 -45 40 211 -73 -105 -105 42 213 31 83 119 -43 225 48 8 -69 -87 182
5908 182 75 154 89 177 15 -85 -102 -13 211 157 98 -38 -95 216 136 -49 141 2 -73 -54 -155 -2 -217 -332
5932 -332 -49 56 -103 57 -18 87 115 141 -150 403 -132 -99 -86 33 125 -226 93 376 54 -87 -20 71 21
$$ packed form
5770d2K02m06k5L57j7j92J24k79K88k32J99R5k0k4L7K1m2L23l43p5K64k03j12
5793a02N5J86j31J49L0N0j12l06P8q4K0M2L42n01M46k73k92M15j21J47J03k02
5815f1K86j20k32J08K33k71k24Q4M50l38K59N7j22j45J70k33J75Rl83P18m78m9
5837a07J75J25Pr8j69p5L81k96j03j05J81O6J34k51J94o1Q4j73o4J11o7N6k1P7
5861Aj46K52m80L50M2P0n7k82K83J11r5j54J9p8J85l88M21j49J40k4J81k81K76
5884A97j25J15k52M0K83l12RQ5J71k84l2%J47J71j82N2L6j62K68j77m0p7j8K69
5908A82j07P9o5Q8j62j00j7Q9K24n4n9j36n7L11q0j85J90j39p5J9j01J53k15j15
5932c32K83J05j59J60p5J05K8K6k91N53n35L3J3J19R2l51L19K83l22j41O7R1n0
$$ [...]
8191B85
##END NTUPLES=NMR FID
##END=
