##TITLE=1H_TG-2258
 CDcl3, 8 sc, 
 23.10.2019
##JCAMPDX= 6.0         $$ Bruker NMR JCAMP-DX V2.0
##DATA TYPE= NMR FID
##DATA CLASS= NTUPLES
##ORIGIN= UXNMR, Bruker Analytische Messtechnik GmbH
##OWNER= root
$$ XWIN-NMR		Version 3.5
$$ Wed Oct 23 17:09:12 2019 Russian Standard Time (UT+4h)  she@DPX200
##.OBSERVE FREQUENCY= 200.1315
##.OBSERVE NUCLEUS= ^1H
##.DELAY= (6, 6)
##.ACQUISITION MODE= SIMULTANEOUS
##.ACQUISITION SCHEME= undefined
##.AVERAGES= 8
##.DIGITISER RES= 18
##SPECTROMETER/DATA SYSTEM= spect
##.PULSE SEQUENCE= zg30
##.SOLVENT NAME= CDCl3
##.SHIFT REFERENCE= (INTERNAL, CDCl3, 0, 15.7039)
##AUDIT TRAIL= $$ (NUMBER, WHEN, WHO, WHERE, WHAT)
$$ ##TITLE= Audit trail, XWIN-NMR		Version 3.5
$$ ##JCAMPDX= 5.01
$$ ##ORIGIN= Bruker BioSpin GmbH
$$ ##OWNER= she
$$ F:/spectra/data/she/nmr/H-F/1/audita.txt
$$ ##AUDIT TRAIL=  $$ (NUMBER, WHEN, WHO, WHERE, WHAT)
(   1,<2019-10-23 17:08:05.96 +0400>,<she>,<DPX200>,
      <created by zg, POWCHK disabled, PULCHK disabled
       configuration hash MD5:
       00 E9 B6 7A A2 85 ED C7 34 08 36 98 17 FE 4E 26
       data hash MD5: 16K
       20 6A 2E 93 89 24 60 06 5E 9E 47 D8 EE 8F F0 A7>)
$$ ##END=
$$ 
$$ hash MD5
$$ D0 95 7F ED 2E 81 22 F8 61 3E 2A A9 25 A9 00 27
##$RELAX= 
##$RELAX= 
##$RELAX= 
##$RELAX= 
##$RELAX= 
##$RELAX= 
$$ Bruker specific parameters
$$ --------------------------
##$DU= <F:/spectra>
##$EXPNO= 1
##$NAME= <H-F>
##$PROCNO= 1
##$TYPE= <nmr>
##$USER= <she>
##$AMP= (0..31)
100 100 100 100 100 100 100 100 100 100 100 100 100 100 100 100 100 100 
100 100 100 100 100 100 100 100 100 100 100 100 100 100 
##$AQSEQ= 0
##$AQ_mod= 1
##$AUNM= <au_zg>
##$AUTOPOS= <>
##$BF1= 200.13
##$BF2= 200.13
##$BF3= 200.13
##$BF4= 200.13
##$BF5= 200.13
##$BF6= 200.13
##$BF7= 200.13
##$BF8= 200.13
##$BYTORDA= 1
##$CFDGTYP= 0
##$CFRGTYP= 5
##$CHEMSTR= <none>
##$CNST= (0..31)
1 1 145 1 1 1 1 1 1 1 1 1 1 1 1 1 1 1 1 1 1 1 1 1 1 1 1 1 1 1 1 1 
##$CPDPRG= <>
##$CPDPRG1= <>
##$CPDPRG2= <>
##$CPDPRG3= <>
##$CPDPRG4= <mlev>
##$CPDPRG5= <mlev>
##$CPDPRG6= <mlev>
##$CPDPRG7= <mlev>
##$CPDPRG8= <mlev>
##$CPDPRGB= <>
##$CPDPRGT= <>
##$D= (0..31)
0 1.2 0 0 0 0 0 0 0 0.06 0 0.03 0 0 0 0 0.0002 0 0 0 0 0 0 0 0 0 0 0 0 
0 0 0 
##$DATE= 1571836085
##$DBL= (0..7)
120 120 120 120 120 120 120 120 
##$DBP= (0..7)
150 150 150 150 150 150 150 150 
##$DBP07= 0
##$DBPNAM0= <>
##$DBPNAM1= <>
##$DBPNAM2= <>
##$DBPNAM3= <>
##$DBPNAM4= <>
##$DBPNAM5= <>
##$DBPNAM6= <>
##$DBPNAM7= <>
##$DBPOAL= (0..7)
0.5 0.5 0.5 0.5 0.5 0.5 0.5 0.5 
##$DBPOFFS= (0..7)
0 0 0 0 0 0 0 0 
##$DE= 6
##$DECBNUC= <off>
##$DECIM= 24
##$DECNUC= <off>
##$DECSTAT= 4
##$DIGMOD= 1
##$DIGTYP= 9
##$DL= (0..7)
0 120 120 120 120 120 120 120 
##$DP= (0..7)
150 150 150 150 150 150 150 150 
##$DP07= 0
##$DPNAME0= <>
##$DPNAME1= <>
##$DPNAME2= <>
##$DPNAME3= <>
##$DPNAME4= <>
##$DPNAME5= <>
##$DPNAME6= <>
##$DPNAME7= <>
##$DPOAL= (0..7)
0.5 0.5 0.5 0.5 0.5 0.5 0.5 0.5 
##$DPOFFS= (0..7)
0 0 0 0 0 0 0 0 
##$DQDMODE= 0
##$DR= 18
##$DS= 0
##$DSLIST= <SSSSSSSSSSSSSSS>
$$ [...]
##$SUBNAM2= <"">
##$SUBNAM3= <"">
##$SUBNAM4= <"">
##$SUBNAM5= <"">
##$SUBNAM6= <"">
##$SUBNAM7= <"">
##$SUBNAM8= <"">
##$SUBNAM9= <"">
##$SW= 24.0689530833862
##$SWIBOX= (0..15)
0 0 2 0 0 0 0 0 0 0 0 0 0 0 0 0 
##$SW_h= 4816.95568400771
##$TD= 16384
##$TD0= 1
##$TE= 0
##$TE2= 300
##$TE3= 300
##$TEG= 300
##$TL= (0..7)
0 120 120 120 120 120 120 120 
##$TP= (0..7)
150 150 150 150 150 150 150 150 
##$TP07= 0
##$TPNAME0= <>
##$TPNAME1= <>
##$TPNAME2= <>
##$TPNAME3= <>
##$TPNAME4= <>
##$TPNAME5= <>
##$TPNAME6= <>
##$TPNAME7= <>
##$TPOAL= (0..7)
0.5 0.5 0.5 0.5 0.5 0.5 0.5 0.5 
##$TPOFFS= (0..7)
0 0 0 0 0 0 0 0 
##$TUNHIN= 0
##$TUNHOUT= 0
##$TUNXOUT= 0
##$USERA1= <user>
##$USERA2= <user>
##$USERA3= <user>
##$USERA4= <user>
##$USERA5= <user>
##$V9= 5
##$VALIST= <valist>
##$VCLIST= <CCCCCCCCCCCCCCC>
##$VD= 0
##$VDLIST= <DDDDDDDDDDDDDDD>
##$VPLIST= <PPPPPPPPPPPPPPP>
##$VTLIST= <TTTTTTTTTTTTTTT>
##$WBST= 1024
##$WBSW= 4
##$XGAIN= (0..3)
0 0 0 0 
##$XL= 0
##$YL= 0
##$YMAX_a= 383606
##$YMIN_a= -546056
##$ZGOPTNS= <>
##$ZL1= 120
##$ZL2= 120
##$ZL3= 120
##$ZL4= 120
##$ABSF1= 10
##$ABSF2= 0
##$ABSG= 5
##$ABSL= 3
##$ALPHA= 0
##$AQORDER= 0
##$ASSFAC= 0
##$ASSFACI= 0
##$ASSFACX= 0
##$ASSWID= 0
##$AUNMP= <proc_1d>
##$AZFE= 0.1
##$AZFW= 0.1
##$BCFW= 1
##$BC_mod= 2
##$BYTORDP= 1
##$COROFFS= 0
##$CY= 11.3945322036743
##$DATMOD= 1
##$DC= 2
##$DFILT= <>
##$DTYPP= 0
##$F1P= 20.1720416913024
##$F2P= 0.152960286110954
##$FCOR= 0.5
##$FTSIZE= 0
##$FT_mod= 4
##$GAMMA= 1
##$GB= 0.15
##$INTBC= 1
##$INTSCL= 1
##$ISEN= 128
##$LB= 0.24
##$LEV0= 0
##$LPBIN= 0
##$MAXI= 10000
##$MC2= 0
##$MEAN= 0
##$ME_mod= 0
##$MI= 1.114404
##$NCOEF= 0
##$NC_proc= 0
##$NLEV= 6
##$NOISF1= 3.799351
##$NOISF2= 2.8
##$NSP= 1
##$NTH_PI= 0
##$NZP= 0
##$OFFSET= 15.70392
##$PC= 1
##$PHC0= -9594.394
##$PHC1= 48.8008
##$PH_mod= 1
##$PKNL= yes
##$PPARMOD= 0
##$PSCAL= 0
##$PSIGN= 0
##$REVERSE= no
##$SF= 200.130013532006
##$SI= 16384
##$SIGF1= 3
##$SIGF2= 2
##$SINO= 400
##$SIOLD= 16384
##$SREGLST= <1H.CDCl3>
##$SSB= 0
##$STSI= 0
##$STSR= 0
##$SW_p= 3612.71676300578
##$SYMM= 0
##$S_DEV= 0
##$TDeff= 0
##$TDoff= 0
##$TI= <>
##$TILT= no
##$TM1= 0
##$TM2= 0
##$TOPLEV= 0
##$USERP1= <user>
##$USERP2= <user>
##$USERP3= <user>
##$USERP4= <user>
##$USERP5= <user>
##$WDW= 1
##$XDIM= 8192
##$YMAX_p= 0
##$YMIN_p= 0
$$ End of Bruker specific parameters
$$ ---------------------------------
##NTUPLES= NMR FID
##VAR_NAME=  TIME,          FID/REAL,        FID/IMAG
##SYMBOL=    X,             R,               I
##VAR_TYPE=  INDEPENDENT,   DEPENDENT,       DEPENDENT
##VAR_FORM=  AFFN,          ASDF,            ASDF
##VAR_DIM=   8192,          8192,            8192
##UNITS=     SECONDS,       ARBITRARY UNITS, ARBITRARY UNITS
##FACTOR=    0.0002076,     1,               1
##FIRST=     0,             0,               0
##LAST=      1.7004516,     0,               0
##MIN=       0,             -546056,         0
##MAX=       1.7004516,     383606,          0
$$ Real data points
##PAGE= N=1
##DATA TABLE= (X++(R..R)), XYDATA
$$ [...]
2775F370p176m672L814M849J48n219m074N779O657n027p990M060O739o94n707
2790b143k732L871O013k197q098R46Q916j6p376j810M636M261j373o410j391P679
2806B776L655q159m018N762M653k310m892k024N584N507n786p107M956P422l139
2821B880o454K26M344L757k815o868J808Q411n99q209p28O039K876l017n081m10
2837c840P268K565q079l794P331M100m851m586J238M997K801n542n906N725P288
2852F715m719o628J913N360J222l774n076K635P733j509q321K5P551J140n067
2867h00l250J608N924O00p444k181P743L400o427m066L235M487N27m865m107N470
2883a46O002n160o579L534O156q54m827k423L230N870j958p951J356P472K01o607
$$ plain form
2775 6370 -806 -5478 -1664 3185 3333 -1886 -5960 -181 6476 1449 -6541 -2481 4258 3564 -2143
2790 -2143 -4875 -1004 5009 2812 -5286 -4340 4576 4560 -2816 -4626 10 4271 2898 -3512 -4903 2776
2806 2776 6431 -1728 -5746 16 4669 2359 -2533 -4557 1027 6534 748 -6359 -1403 6019 2880
2821 2880 -3574 -3348 996 4753 1938 -4930 -3122 5289 4690 -3519 -4247 1792 4668 1651 -3430 -3840
2837 -3840 3428 5993 -2086 -5880 1451 5551 700 -3886 -2648 2349 5150 -392 -6298 -573 6715
2852 6715 1996 -4632 -2719 2641 3863 89 -4987 -2352 5381 3872 -4449 -4424 3127 4267 -800
2867 -800 -4050 -2442 3482 4082 -3362 -5543 2200 5600 -827 -4893 -1658 2829 3356 -1509 -5616 -146
2883 -146 5856 696 -5883 -2349 3807 2953 -1874 -4297 -1067 4803 2845 -5106 -3750 3722 3923 -2684
2899b684j545L291M158n22o235j513P611L024p359l586N010L858j587m508k007
2914d594N348M880n693o099M809O380k760n284m41M190L504k806o668K201P918
2929D885j057p322l64M991K549k411m719k35O831K043p649k584O504L762m390
2944H34m090N19M619K872n241n004N221O090m246n693J912M434J355l076n235
2959d729K631P574k014p392J09O723J214m299l213J369N517R38p098k218P342
2974B454K774n934l441K881M200P88n020l717N374N751n181o155L631N110o85
2989B830l916k961K993N857k411p729J963P164k23n680j958L514M176r97o099
3004c477r87O938K545o785l014M707L465j686m138k075N256M681n538n426M348
$$ plain form
2899 -2684 -4229 -938 3220 2698 -3537 -5050 2561 5585 -1774 -5360 -350 3508 1921 -2587 -4594
2914 -4594 754 5634 -59 -6158 -1349 5031 2271 -3013 -3454 736 4240 1434 -5234 -3033 4885
2929 4885 3828 -3494 -3858 1133 3682 1271 -3448 -3683 3148 5191 -2458 -5042 1462 5224 834
2944 834 -3256 -2737 1882 4754 -487 -5491 -270 5820 1574 -4119 -2207 2227 3582 506 -4729
2959 -4729 -2098 5476 3462 -3930 -3821 2902 4116 -183 -3396 -2027 3490 4428 -2670 -4888 2454
2974 2454 5228 -706 -4147 -1266 2934 3722 -1298 -5015 359 6110 929 -5226 -1595 3515 2830
2989 2830 -1086 -4047 -1054 4803 2392 -5337 -3374 3790 3567 -2113 -4071 -557 3619 2622 -3477
3004 -3477 -4464 2474 5019 -1766 -4780 -73 3392 1706 -2432 -4507 749 5430 -108 -5534 -1186
3019a186N593k637m484o55L403M328l016o527K406P250j298o444m40M842J933
3034C068j843m841n1O512J702o994k226N490L004l159l740L52M240L080n240m691
3050e337N377N436m467m661J727L490J939l074m607K306O672j670p108R65N492
3065B480Q09l165l321R45N761O74p089j713O824K460m943l158K096M021R06n054
3081a467l073M774M919m543m780K800M435k24l565k928K968N574k782o534J540
3096b886O415j41m709j699K360M195n33o096o10O663J715o501j903L883K857j044
3112A966m059j814M964M154n218m953M422M503k160m022j130L454L758k662o014
3127d811K319O646j391n713m20M275K174k136m766N13O642Q39o554k015N225K612
$$ plain form
3019 -1186 4407 1770 -2714 -3369 34 4362 1346 -5181 -2775 4475 3177 -3267 -3707 1135 3068
3034 3068 1225 -3616 -3667 2845 4547 -2447 -4673 817 3821 662 -3078 -2726 1514 4594 -646 -5337
3050 -5337 40 5476 1009 -3652 -1925 1565 3504 430 -4177 -1871 4801 3131 -3977 -3012 2480
3065 2480 3289 124 -3197 -2252 3509 4183 -2906 -4619 2205 4665 -278 -3436 -1340 2681 3587 -1467
3081 -1467 -4540 234 5153 610 -4170 -1370 3065 2841 -724 -3652 -684 4890 2108 -4426 -2886
3096 -2886 3529 3388 -1321 -3020 -660 3535 3002 -3094 -3704 2959 4674 -1827 -3730 153 3010 1966
3112 1966 -2093 -3907 1057 5211 -7 -4960 -538 3965 1805 -2217 -3347 107 3865 1203 -4811
3127 -4811 -2492 4154 2763 -2950 -3370 905 3079 943 -3823 -3310 3332 4171 -2383 -4398 827 3439
3143C439l077l356O1M192K672m974m223N064M672l374m588J171L380K257l356
3158d0m535K816N864j970n677N94M916P42k857l155J103N285L78o304j424O215
3174A951K019m275k922J470M023J144m647l280N084M169m213m526K559M153k82
3189B427l265k449K679M925k103n998J673N278M1m376j498J811M060r17n202q87
3205c801O725J227n378j945K971L165p08m055k131M928L913m911m076L659L926
3220C509j805l435j278L240L926k829n662K368O294j459n206n25L467K374j400
3235A579m823L07N869Q35o102j209M190K379k407l214l42M606K505n049l791M830
3251A63L737l181l502R88L093J846k750m910K884N622k134n376J063M000J106
$$ plain form
3143 3439 362 -2994 -2933 1259 3931 -1043 -5266 -202 4470 1096 -3492 -2321 1059 3316 -40
3158 -40 -4575 -1759 4105 2135 -3542 -2948 1968 2710 -147 -3302 -2199 3086 3464 -2840 -4264 1951
3174 1951 3970 -305 -3227 -1757 2266 3410 -1237 -4517 567 4736 523 -4003 -1444 2709 2427
3189 2427 -838 -3287 -608 4317 2214 -3784 -2111 3167 3208 -1168 -2666 -855 3205 2288 -2914 -3801
3205 -3801 2924 4151 -1227 -3172 -201 2964 2256 -1799 -3930 998 4911 0 -4076 -417 3509
3220 3509 1704 -1731 -3009 231 4157 1328 -4334 -1966 4328 2869 -2337 -2862 605 2979 1579
3235 1579 -3244 -2937 2932 3767 -2335 -3544 646 3025 618 -2596 -2938 1668 4173 -876 -4667 163
3251 163 3900 719 -2783 -1795 1298 3144 394 -4516 -1632 3990 1856 -3520 -2457 1543 2649
3266B649k682l228J113N134j36o002n18N453J374l429k620J288L392J279m630
3281a563l144N310L655m175l835K449L343J32l049k674K675M793k567n422J886
3296b186N049n72l543j645K014L896l42n833l30O164J036m939j609K854K450k83
3312B181m060j684M890K826m522l568L783L281j482k976j208K772L486k586m960
3327c827K213N301j543m090o16K988K446j293m600K89N859L19n367r29L640K014
3343B804j749l095k73M085K106m888k990M150L606k845l354M75K986K036k581
3358D73m289K334N298j851m806Q31L392R01k090k960R92M751K1n654q18N357Q35
3375B717l242j882Q25L082J412m176k620M756L247m237k898J810K980P40l166
$$ plain form
3266 2649 -33 -3261 -2148 2986 2850 -3152 -3670 1783 3157 -272 -2892 -1604 1788 3067 -1563
3281 -1563 -4707 603 4258 83 -3752 -1303 2040 2172 -877 -3551 -876 3917 1350 -4072 -2186
3296 -2186 2863 2291 -1252 -2897 -883 3013 2671 -3162 -3492 2672 3708 -1231 -2840 14 2464 2181
3312 2181 -1879 -3563 1327 4153 -369 -3937 -154 3127 1645 -1331 -2539 233 3719 1133 -3827
3327 -3827 -1614 3687 2144 -1946 -2562 426 2872 1579 -3021 -2732 3127 3446 -1921 -2850 790 2804
3343 2804 1055 -2040 -2313 1772 3878 -1010 -4000 150 3756 911 -2443 -1968 1018 3054 473
3358 473 -3816 -1482 3816 1965 -2841 -2010 1382 2283 193 -2767 -1775 2976 2997 -2657 -3475 1882 2717
3375 2717 -525 -2407 -1582 1500 2912 -1264 -3884 872 4119 -118 -3016 -1206 1774 2514 -652
3390f52l182K902M561k058n080J706M126j96l221j822J989L527m44n135k75N216
3406A962J258m574j657K331K845k08l472k051M678K527m217l032L110L111j045
3421A566l041j275L053L098k790m297K224M679j488l508o46K691K443j093m519
3436b903L71N316J3m480j507M055J545j432k780m23L757K196m642k658L823L133
3452C384k509l016M41K457K641k898m094K600M612j983m217P92K886J398k159
3467C35k871Q49M741l30n245m0M324P08k558k092M43L469J233m367k136M455K633
3484C551l528k814J736K774L87k584l025K737M356k472m245J302L887J06k892
3499g24j661J385L976j241m452n4M871N67l696j791K244K794j45l658j784M352
$$ plain form
3390 -652 -3834 -932 3629 1571 -3509 -1803 2323 2127 -1094 -2916 -927 2600 2156 -2979 -3254 1962
3406 1962 3220 -1354 -3011 -680 2165 1957 -1515 -3566 1112 3639 -578 -3610 -500 2611 1566
3421 1566 -1475 -2750 303 3401 611 -3686 -1462 3217 1729 -1779 -2425 266 2709 1616 -2903
3436 -2903 -2532 2784 2797 -1683 -3190 865 2410 978 -1802 -2225 1532 3728 -914 -3572 251 3384
3452 3384 875 -2141 -1700 757 3398 500 -3594 -994 3618 1635 -2582 -1790 1096 2494 335
3467 335 -2536 -1687 3054 2724 -2521 -2561 1763 2471 -87 -2179 -1736 1733 2966 -1401 -3537 918 3551
3484 3551 23 -2791 -1055 1719 2106 -478 -3503 -766 3590 1118 -3127 -1825 2062 2168 -724
3499 -724 -2385 -1000 2976 1735 -2717 -2771 2100 2667 -1029 -2820 -576 2218 2073 -1585 -3369 983
3515I83K506m071k593K815K720r91k574j676K905L321l202l634K348L676j025
3530A508l158o05K213K719j592l917L74M707L31m652p66L068K180j501k928k50
3546b269L576K065m329k466L775K590k317k496o8K786K065k862l353K541M141
3561C379k055l718J119K288J241j538l512P59M889o50m378j25L573J129k208k043
3577a850O71K827R26l774k037M166K362l238k460J447K366R07k797k541K910L699
3593C584k519l678J563L082J50k516k102J569L746p83m722K97M342M41l397j027
3609a970J356K423J89l661j383M239J970l630k452K542K452m19k734j655K901
3624A68L001k751l894K589L379q32k849o38J795K537j284l929O88M523l72l776
$$ plain form
3515 983 3489 -582 -3175 -360 2360 1369 -1205 -2881 24 3345 143 -3491 -1143 2533 1508
3530 1508 -1650 -2255 -42 2677 1085 -2832 -2458 2249 2580 -2072 -2838 230 2410 909 -2019 -2269
3546 -2269 1307 3372 -957 -3423 352 2942 625 -1871 -1939 847 2912 50 -3303 -762 3379
3561 3379 1324 -2394 -1275 1013 2254 716 -2796 -2037 2852 2202 -2176 -2301 1272 2401 193 -1850
3577 -1850 -1179 1648 2574 -1200 -3237 929 3291 53 -2407 -960 1406 2313 -484 -3025 -115 3584
3593 3584 1065 -2613 -1050 2032 2182 -334 -2436 -867 2879 2096 -2626 -2329 2013 2454 -943 -1970
3609 -1970 -614 1809 1998 -1663 -3046 1193 3163 -467 -2919 -377 2075 1656 -1078 -2733 168
3624 168 3169 418 -3476 -887 2492 1660 -1189 -1827 -32 2505 1221 -2708 -2020 2503 2131 -1645
3640a645l50K178J781j007k792o59L733J702m383j634L271K111j735k119k77K356
3656E31K442l135l341K676L966k105l339O43K192J708j709l466J529M063n17m165
3672b027q3L480O00j718k241M16L275P64l989j570L691K275k695k043O38K163
3688I36J043k502k254K409L636k507l053J313K353M09k014j984J152L381m40m315
3704b437L65M244ok657j303J124K633j55l259j076L778J383l326j472J995K003
3720A834k38k346j479K434K842k740l359K670K735o32k546j047J871K637j348
3735A288m006O72M224j60l545n43K428J411l73k955r75L794J448l604j918L015
3751B01J800j432k141k93K557K003k805l221K958K951k156k160K55K189J476j804
$$ plain form
3640 -1645 -1995 183 1964 957 -1835 -2494 1239 2941 -1442 -3076 195 2306 571 -1548 -1825 531
3656 531 2973 -162 -3503 -827 3139 1034 -2305 -1662 530 2238 529 -2937 -1408 2655 2138 -2027
3672 -2027 -2110 1370 1970 252 -1989 -1573 1702 2466 -1523 -3093 598 2873 178 -1865 -1227 936
3688 936 1979 -523 -2777 -368 3268 761 -2292 -979 1374 1783 -231 -2215 -1063 2318 1878 -2437
3704 -2437 -2072 2172 2166 -491 -1794 -670 1963 1808 -1451 -2527 1251 2634 -692 -2164 -169 1834
3720 1834 1596 -750 -2229 205 3047 307 -3052 -382 2353 1721 -825 -1872 -1 2636 1288
3735 1288 -2718 -2046 2178 2018 -1527 -2070 358 1769 1396 -1559 -2534 1260 2708 -896 -2814 201
3751 201 2001 569 -1572 -1865 692 2695 -110 -3331 -373 2578 422 -1738 -1483 706 2182 378
3767C78k949J313L743q87l859K54L352L35j556j828k61L057J486l974j578L609
3783F35J941k552k276J194K140Q69k350k470K667L126k480k882J373K147O09j651
3799D0j943P78L517j038l753N53L239M07k452r31R07K019O47l562o70L108J658
3816B524k753j631J654J711j61j922j929K601K971k781k863J860K827q82k102
3831h76p49J451K322r66l398J042L444j80l273l57J642J410l30k720k50L190J234
3848B636l544j346K522J508j115k089j44K416J653k636k568K217K647j266k424
3863a533Q3K082J257j132l068J130L443n40l383k7K564Q94j416j764n4K850O67
3880B053l405j240L158J827k487j578O59J979R10k188k542K606K888k103k559
$$ plain form
3767 378 -2571 -1258 2485 1598 -2261 -2007 1345 1680 124 -1704 -1965 1092 2578 -1396 -2974 635
3783 635 2576 24 -2252 -1058 1082 1951 -399 -2869 -202 2924 444 -2438 -1065 1082 1691 40
3799 40 -1903 -1125 2392 1354 -2399 -1846 1393 1800 -652 -1583 -676 1343 1990 -1572 -2242 866 2524
3816 2524 -229 -1860 -206 1505 1344 -578 -2507 94 3065 284 -2579 -719 2108 1226 -876
3831 -876 -1625 -174 2148 1182 -2216 -1174 2270 2090 -1183 -1540 102 1512 1182 -1538 -1788 1402 2636
3848 2636 -908 -2254 268 1776 661 -1428 -1572 844 2497 -139 -2707 -490 2157 891 -1533
3863 -1533 -1450 632 1889 757 -2311 -1181 2262 1722 -1661 -1688 876 1770 354 -1410 -1464 1386 2053
3880 2053 -1352 -2592 566 2393 -94 -1672 -1013 966 1876 -312 -2854 -248 2640 537 -2022
3895b022R96J838K39q93k373J178L414q63l501K04L296J73k222j026N79K634j00
3912A551l116q47L117J596k918j326J507J796K8j959j494K249K800k734k632J454
3928i28K607q16j298j118J067K515q89l468Q84L360k49k797k57J550J355j91k482
3945a155p06L191Q69l368j110K502J361o17j602j155K411K137l012k332K487K006
3961A907j082k254J80J766J269j080l069J407L365j219k630n3K173Q13p66k155
3977a428j94K899N49k938r42K868J060j649j568K34J793J322k423j983K529K074
3993B203j991j975J231J461M67j320k034J166K834p24l300P05K488N3j573j188
4009a497P19K233m3k899p69L492N29k213j312J273J672M2k005j292K334K199k368
$$ plain form
3895 -2022 -1026 812 1051 158 -2215 -1037 2377 1514 -1987 -1783 1513 1686 -536 -1562 -983 1651 1551
3912 1551 -1565 -2412 705 2301 -617 -1943 -436 1360 1388 -571 -2065 184 2984 250 -2382 -928
3928 -928 1679 863 -435 -1553 -486 2029 1140 -2328 -1444 1916 1667 -1130 -1387 163 1518 1327 -1155
3945 -1155 -1861 1330 2199 -1169 -2279 223 1584 967 -635 -1790 621 2758 -254 -2586 -99 1907
3961 1907 825 -1429 -1249 517 1786 706 -2363 -956 2409 1190 -1440 -1493 680 1493 727 -1428
3977 -1428 -1622 1277 1826 -1112 -2054 814 1874 225 -1343 -1109 684 2006 -417 -2400 129 2203
3993 2203 212 -1763 -532 929 1396 76 -1958 -792 2042 1318 -1982 -1277 1211 1264 -309 -1497
4009 -1497 -778 1455 1412 -1487 -2256 1236 1765 -448 -1760 -487 1185 1227 -778 -2070 264 2463 95
4026I5k628J870J952k27j581j223J224K507j268k891N65L276n34k187l18J149
4042b19J733k88k689j35K996N54k978r92K310R91n42j872p35K344J966k462k393
4059b411K041K197j205j800L52J011J443q61k605R28K742n48k860O93J519Q50
4075A486r97j741P4K821L79l047r73K728J098j814r58l10J894R84k195j572K382
4092B39K104j947k046Q28J662M00r35k227J322K718j008l084J140J960K17j568
4108b25r11M78K014J70k843n06K746Q98j864j249O33J741N43j966j714K400J940
4125B285k527j649J301J798j50j492j100J107K689j404k631O08K791m17j865m30
4141a086O65J679k4k786j5K598N22k693l37J332J335k62k081n98K102J833k670
$$ plain form
4026 95 -2533 -663 1289 1062 -519 -1742 -518 1989 721 -2170 -1605 1671 1137 -1050 -1368 -219
4042 -219 1514 1226 -1463 -1598 1398 1952 -1026 -2018 292 1283 741 -1131 -1866 478 2444 -18 -2411
4059 -2411 -370 1827 622 -1178 -826 185 1628 767 -1838 -910 1832 1284 -1576 -883 636 1486
4075 1486 489 -1252 -1178 1643 2022 -1025 -1998 730 1828 14 -944 -1254 640 1624 -571 -2143 239
4092 239 2343 396 -1650 -822 840 1240 305 -1922 -600 2118 1110 -1974 -834 1126 1343 -225
4108 -225 -1136 -658 1356 1526 -1317 -1823 923 1821 -43 -1292 -659 1082 1625 -341 -2055 345 2285
4125 2285 -242 -1891 -590 1208 1058 -434 -1534 -427 2262 858 -1773 -1165 1626 1209 -656 -1086
4141 -1086 -421 1258 1234 -1552 -1567 1031 1553 -1140 -1477 -145 1190 928 -1153 -1751 351 2184 -486
4158d86j815K231J784r28j823k17J380J638j239k620J306K701j292j970N7J777
4174D84R00o84k260L70K774Q4k891k14K218M61p97j346n4J723R59k266j628K600
4192D33J454j904j283N15J367J066j363k351J725K675j395k557P13K095l3j323
4208a66j068L88K019M59l033k5K471P67k248q25N11J623O15k266j022K177J676
4225B053j892j763J160J768k24j507j204J255K283j310k433J180J799k06j523
4240e64n25P78J709l27k378jK891J49k736k35J206J134k09j575r56K423J424k503
4258b95j797K161J387j062r35p01J383J467j463k128J307K307q20k037N4J054
4274a18J092m18j957J41K653j43k700J5J874N72o85q81n47J617J270k457j588
$$ plain form
4158 -486 -2301 -70 1714 786 -1037 -1254 126 1764 525 -2095 -789 1912 620 -1350 -1293 484
4174 484 1384 700 -1560 -1190 1584 1668 -1223 -1437 781 1242 445 -901 -955 768 1727 -539 -2167 433
4192 433 1887 -17 -1300 -785 582 1648 285 -2066 -341 2334 939 -1618 -905 1190 1157 -166
4208 -166 -1234 -846 1173 1632 -1401 -1426 1045 1812 -436 -1261 -750 873 1488 -778 -1800 377 2053
4225 2053 161 -1602 -442 1326 1102 -405 -1609 -354 1929 619 -1814 -634 1165 959 -564
4240 -564 -1089 -311 1398 1071 -1307 -1308 1583 1732 -1004 -1239 -33 1101 892 -683 -1639 784 2208 -295
4258 -295 -2092 69 1456 394 -541 -1242 141 1608 145 -1983 -676 1631 811 -1226 -1172 -118
4274 -118 974 556 -1401 -1260 1393 1250 -1450 -1435 439 1011 326 -555 -1102 515 1785 -672 -2260
4291b260K416J611j777j164L97J177O58j054j930J183K501j009k481R57J442L25
4307I92q23j511K55K476l02k371k16K581L05j658o50L34J385N12k250r43K405
4324E21J230k271n56J022J131l09p82j533J002K618j645k320J077K149n95j012
4340b73p71P46J523l62k382l2K510R5j917m74J414Q29L17k107r40K465J052j946
4358b53j820K057J204n43j152p99J384J492j148k356J433K093p93j798K84R07
4374A92R63k98k202Q6K589j5k482k55J966L74o25j107m76K138P78k148j577K126
4392B7J764j533j101P5J329R46j310k251J804J892j259j851O22J814N4o46j808
4409a432P80J774o4k140j16K261L62j936m41L35J238P27k283p99K088J170j773
$$ plain form
4291 -2260 156 1767 -10 -1174 -777 400 1058 4 -1926 -743 1758 749 -1732 -775 667 992
4307 992 169 -1342 -1087 1389 1087 -1284 -1500 1081 1386 -272 -922 -588 797 1309 -941 -1884 521
4324 521 1751 -520 -1076 -54 1077 768 -14 -1547 -545 2073 428 -1892 -815 1334 739 -273
4340 -273 -1044 -298 1225 863 -1519 -1551 959 1054 -863 -1337 77 906 1223 -884 -1824 641 1693 -253
4358 -253 -2073 -16 1188 645 -507 -1306 78 1570 422 -1934 -501 1592 799 -999 -715 192
4374 192 1155 857 -1345 -1259 1330 1315 -1167 -1422 544 918 293 -814 -1290 848 1626 -522 -2099 27
4392 27 1791 258 -843 -768 561 1507 197 -2054 -250 1642 383 -1468 -846 968 1022 376 -1432
4409 -1432 -652 1122 1058 -1082 -1198 1063 1425 -511 -952 -617 621 1348 -935 -1734 354 1524 -249
4426b49j143J112J114J45j094j403J194K237j464k176R35J941m54j043q19O00
4442e67K011l52k714K10K567o0j900j25P65Q67L48j716p74K113J282k445r87J586
4460A09R23k73j160o53J369J521j480k402J662J740q79j463K4J146R46l89j870
4477a129L41K208m36k100O2J429R08q45j385k65J688J035k076q04J830P70r43
4494B88j274K15R09J456j338j840J274K023j354j807J156P95L98p86j400N01K142
4511A358q1k628J86J927K08j099q77L74J413N94j846j161K220J021j877q55O76
4528d47Q15O12j434j152J482J655j065j935R91J669k56j222n71K14K060n54k422
4545a560N21K115M3j616n47J091P02P3j265r66K009R93k106q04J455P27k34r65
$$ plain form
4426 -249 -1392 -280 834 979 -115 -1518 -324 1913 449 -1727 -792 1149 695 -348 -1167 -567
4442 -567 1444 1092 -1622 -1412 1155 1095 -805 -930 -165 702 1050 -666 -1440 673 1955 -490 -1477 109
4460 109 1032 759 -401 -1054 315 1836 356 -2046 -384 1356 477 -986 -962 184 1130 741 -1129
4477 -1129 -788 1420 984 -1116 -1054 375 1283 438 -947 -1212 476 1511 -565 -1369 461 1231 288
4494 288 -986 -771 138 1594 256 -1584 -310 1713 359 -1448 -292 503 901 115 -1285 -784 1358
4511 1358 1277 -1351 -1165 762 970 -129 -1006 -632 781 1375 -471 -1632 588 1609 -268 -1123 -447
4528 -447 368 980 -454 -1606 -124 1531 466 -1469 -478 1191 935 -287 -858 -644 1416 862 -1560
4545 -1560 -1039 1076 1119 -497 -1044 47 749 822 -443 -1409 600 1593 -513 -1317 138 865 631 -334
4563c34p89J354J339j418j859J526J298q22r49mO41J046m8k138K96K318k48k129
4581i20r3J154Q57m34j213n07K225N00j980j245J762J160j148r93M8J216R90j286
4599I3j918J723J586j210j288O80Q20M18m36j779N19K118l05k261K56J807J34
4616I57q00r56P1J401M38j737r23K235O61j510q81P04J036L82j297j304J755J272
4634A504j648j084Q25J192j00p29j059Q36J333k28k216M82J880k81j076n72N79
4651c62J141K7j553q04K211P47k065l95J180J045o74q64r35J700Q70j164j598
4668a493J375J194q47q81J6O74J127p12j854M86K083m73j569k64J373M72m39j058
4686g90m23J790J104k279p66J577P32q47o19j95Q16J261j718j074J267J245o69
$$ plain form
4563 -334 -1123 231 1570 152 -1707 -181 1117 295 -654 -658 -17 1029 981 -1157 -861 1457 1209 -920
4581 -920 -1013 141 998 564 -649 -1156 1069 1569 -411 -1656 106 1266 118 -875 -827 389 1379 93
4599 93 -1825 -102 1484 274 -1014 -334 486 904 468 -1311 -792 1326 1021 -1240 -984 823 957
4616 957 157 -799 -728 673 1111 -626 -1549 686 1347 -163 -1044 -340 696 1078 -219 -1523 232 1504
4634 1504 -144 -1228 -403 789 689 -40 -1099 -263 1070 842 -1374 -892 988 707 -369 -941 -362
4651 -362 779 806 -747 -1551 660 1407 -658 -1053 127 1172 498 -366 -1301 399 1269 105 -1493
4668 -1493 -118 1076 229 -652 -636 38 1165 453 -1401 -915 1168 695 -874 -1138 235 707 268 -790
4686 -790 -1213 577 1681 -598 -1364 213 945 98 -521 -716 100 1361 -357 -1431 -164 1081 412
4703D12j332M58O64N68m93j432J81K470o65j853K78J698l64n99n15o4J492N76
4721A480k187n41J876O9r02p43P52P06O82j347q97J260J208j318j244P96J043
4738F93L42r98j205Q31J474k30k085N44J765l55j312k83M45J476k11j776k58J966
4756H23L81j832o03R02J047j73r61p76J335J144j301j297R91J224n80p52k75N48
4774a55J282p70j769Q92J550k99j562l7R78O39m57j098m12K275J56j788o61J283
4792D7P92o01j043J60Q41J049j479j179J476J193p12j539L59Q33Q27o04j737O73
4810f44J761l39j875L94J074M39n56r17l0J315N67j782m18J566N80j319o64K88
4828e60J023N21j269r03J308P79r74q41O38P23J16o79p39M12J785m62k119R22
$$ plain form
4703 412 -920 -462 202 770 277 -1155 -974 1496 831 -1022 -744 954 590 -9 -524 -588 904 1480
4721 1480 -707 -1248 628 697 -205 -948 -196 510 1192 -155 -1052 208 1416 98 -1146 -350 693
4738 693 1035 37 -1168 -337 1137 907 -1178 -634 1131 776 -536 -819 -374 1102 891 -885 -1143 823
4756 823 1204 -628 -1231 -329 718 545 -416 -1192 143 1287 -14 -1311 -320 904 324 -428 -703 -155
4774 -155 1127 357 -1412 -520 1030 731 -831 -868 110 749 292 -806 -1218 1057 1213 -575 -1236 47
4792 47 839 238 -805 -645 196 1245 -234 -1413 63 1256 544 -995 -636 197 1024 420 -1317 -644
4810 -644 1117 778 -1097 -703 371 810 254 -663 -693 622 1189 -593 -1011 555 1135 -184 -848 -560
4828 -560 463 984 -285 -1188 120 899 -75 -916 -278 445 561 -118 -857 -445 1340 878 -1241 -319
4846c19R34K04j141l62N58O65M63j598l70J705N59j809k24P98O73L3j048o52J010
4865G9J201j493j157J451O57k78o36o35R10P54l79j455L12J435R9j636MN41J170
4884I44l4j943O6K023M6j737k52J251K88o55l99o34J450Q29j300j090J064J395
4902A312j267j100N12P40N73p23j029N19J638o54j476M38J080N6n04q62J08J371
4920G32K56j693l13J265M66o58q03K52Q58O25j235j105J411J120r11j101N48O55
4938C69J18m45q60N34J426n47j594L28J536k10j160l35O68J022j63j587j38K009
4956I71k44r91m93O81O91o7q10o96J266J033j649q88J517N46n73n31l87M02J495
4975A273q67j721N66J956q18q45k97P84Q50l66j322J70J209M65j800k7J527K35
$$ plain form
4846 -319 615 819 -322 -684 -126 539 1002 -596 -966 739 1298 -511 -735 63 736 769 -279 -931 79
4865 79 1280 -213 -1370 81 738 460 -176 -811 99 853 474 -981 -669 766 865 -771 -767 -226 944
4884 944 910 -1033 -967 1056 1102 -635 -887 364 652 -3 -402 -1036 414 1243 -57 -1147 -83 1312
4902 1312 45 -1055 -543 197 770 47 -982 -463 1175 521 -955 -517 563 619 115 -747 -639 732
4920 732 988 -705 -1018 247 713 55 -748 -496 362 987 -248 -1353 58 1178 267 -834 -286 369
4938 369 487 42 -818 -284 1142 595 -999 -671 865 655 -505 -840 -172 850 687 -900 -1038 971
4956 971 727 -264 -757 -76 615 548 -262 -958 308 1341 -308 -1196 321 867 294 -237 -624 -222 1273
4975 1273 406 -1315 -749 1207 389 -456 -753 31 881 515 -807 -637 572 1037 -763 -790 737 972
4993I72n53r69l06J075R37j220q58J461L22p46o69PP11Q01o71j631Q87J768o77
5012F41j460K70J119R9n54r36K17J500L82k181k16J748K51r14o26O7J233O5j180
5031d75q07J639Q77j504p02Q08M87K09n66j163J146J335n85j768M11J361O1q15
5049e1p12M81J175k40j356j87J652K4r75m74L02J088j47r38p97J647P54j711n17
5068i82J125M71k22m37p83N21J180n47j300M68J598n86r76o4O08P99m16j107l2
5087f82J686P5j924K5J156K40j27q69l52J049J031j714n74J133N17k75j087J75
5105e17P35M07l43j249Q27J332p00j507M38Q33K43J17j625M10J660r3j604l23
5123i59J307K44q00l47L3R45M42j170o10J259O58r17n16L51N78L65r65p89Q76
$$ plain form
4993 972 419 -550 -856 219 1156 -64 -922 539 861 115 -554 -547 164 965 294 -1337 -450 1318 641
5012 641 -819 -549 570 669 115 -821 -604 896 1278 -903 -1119 629 880 -34 -660 -593 640 705 -475
5031 -475 -1282 357 1234 -270 -972 -164 323 532 -34 -1197 -51 1284 699 -1069 -658 703 764 -51
5049 -51 -763 -282 893 653 -703 -890 762 786 -189 -663 -361 727 580 -358 -1155 492 1246 -465 -982
5068 -982 143 614 392 -45 -828 -307 873 326 -974 -506 1092 506 -470 -534 74 873 457 -650 -682
5087 -682 1004 1079 -845 -820 336 576 449 -420 -772 277 1308 -406 -980 153 670 395 -692 -517
5105 -517 218 625 282 -967 -140 1192 492 -1015 -577 256 499 616 -1009 -599 1061 968 -636 -959
5123 -959 348 592 -208 -555 -522 423 865 -305 -915 344 1002 85 -431 -80 498 863 -102 -891 -15
5142a5J143q21j121M05Q89J10n23r98N82J028k69j365J42J375J26j091m45M40
5160d08N88K80r74q66J585R07j198q29P37P70k4o75p77O25J209o44j358N45J336
5179H29p93m70m7N04N89j07j444L42J418J00j830M18O81M85k46r72j78J181Q51
5198A311j179r44R67P93m69r10r1N91Q61q71j343Q33J268o21r34O09J91L88r2
5217C58j111L63J007J42j358l8J002K16m45n38p1P88M98j258l12P18J075j112
5235g6p23M28P75L80p25j146J030J242o38j322O14N60J97o57n61K66J026k30j431
5254i91L29J557k98r20n54M11R26J91q02r67J598Q43j482n00N65M84J25p03o14
5273h02O50J363r16j124O39J347r75o91K6L61O29J31j298q1J550o8j453Q6P15
$$ plain form
5142 -15 1128 307 -814 -409 480 590 67 -931 -349 679 410 -955 -813 562 688 -403 -848 -408
5160 -408 180 460 -514 -1380 205 1112 -86 -915 -178 592 568 -107 -884 -259 950 306 -1052 -507 829
5179 829 36 -434 -481 23 612 505 -939 -597 821 921 -909 -491 190 675 429 -543 -721 460 1311
5198 1311 132 -812 155 948 479 -431 -522 69 930 59 -1284 -451 817 196 -738 -129 62 450 358
5217 358 -753 -390 617 759 -599 -637 365 581 136 -402 -473 315 813 -445 -757 -39 1036 -76
5235 -76 -799 -371 404 784 59 -1087 -57 1185 547 -775 -161 399 596 -61 -622 -356 670 440 -991
5254 -991 -662 895 597 -323 -877 -466 460 651 -151 -1118 480 1323 -159 -659 -94 390 515 -188 -802
5273 -802 -152 1211 295 -829 -190 1157 182 -509 -483 -122 507 638 -660 -741 809 741 -712 -626 89
5292H9Q04p70n79j2O86P14j123n12R03N68p80m63J7N01P49o39j486J109J189o24
5312C41p20k82P53K39j62p44K6J310j54j459M34Q43J68l64q40q2J473Pj215l44
5332g72J267K60n25q25L27M66L99o19p69O44J112r11r15O32O47l9m55m23J20J357
5352I78j91j542Q2J610l79o16n78O22K12J84p53o52J477O45j282o54N15O98p8
5371B98n20n71P66R73j050p71R63N99n12q33j1P06N27p8j246L11J071J8r55j06
5391d21M34N50k61o17j49Q34K51j258p0O63O90m87p30j50J118L16p92r76J114
5410E9M31l9q75J25K20Q14m37j064K65J109K07j237p2R34k08k15l35j91J075m8
5430E18j115k07J274k3n07m78K65K73P13p31q60Q35Q29n69r15L48N49j24P4p22
$$ plain form
5292 89 893 123 -456 -468 218 932 -191 -703 200 768 -12 -475 -458 43 792 153 -1333 -224 965 341
5312 341 -379 -661 92 331 169 -575 -549 761 607 -852 -418 425 593 229 -611 -693 780 787 -428 -772
5332 -772 495 755 230 -595 -268 198 597 -22 -791 -147 965 54 -861 -229 418 379 -76 -499 -379 978
5352 978 787 -755 -673 937 558 -58 -636 -14 198 382 -371 -1023 454 1099 -183 -837 -322 376 298
5371 298 -222 -793 -27 946 -104 -875 88 687 175 -658 -669 37 564 486 -760 -449 622 640 -315 -421
5391 -421 13 563 302 -315 -464 370 621 -637 -707 -44 646 159 -571 -721 397 713 -79 -1055 59
5410 59 490 451 -424 -299 -79 735 298 -766 -501 608 815 -422 -494 440 232 17 -318 -509 566 518
5430 518 -597 -804 470 447 -60 -538 -273 0 713 -18 -878 -43 786 217 -698 -350 199 75 149 -573
5450e73N02O90j06j168K68R91k93n23k84N2J187k38r66m48J464K73j121k33K96
5469b30N60J46r42l27O96R51j016q01P74Q04k48m25n47P52N92j37j231K50R31
5488E52J1o07l83O05L34oj065j84J154M20j307j59R39J89j54l31p75N95J213j069
5508b8q00O60J055n46p75R6P57k12P6r75m4J122L5j213K69R69j64l2o76j14J231
5529F91J93j840k3J379K44o51m50N1M51O90o56j010J120L56q24l16N50L17Q6l3
5549C25j372P05J137n26q32P7J057j01m03n09J70P82L5j267J67R99J46j001j72
5568e83P32m0L77m89o85R04M25j009k51L51J058l47p65j82K54J003l94j279P02
5587b18P80m6o35j40J10O24J7r63J3Q20K07j121N8N70M82j05q76m49J105O74p96
$$ plain form
5450 -573 -71 619 513 -655 -387 604 311 -212 -496 -444 743 505 -461 -909 555 828 -293 -526 -230
5469 -230 330 476 -466 -793 -97 854 -162 -963 -189 615 367 -58 -605 147 739 602 -629 -379 552
5488 552 563 -44 -427 178 512 506 -559 -743 411 831 -476 -635 304 493 339 8 -767 -172 1041 -28
5508 -28 -828 -168 887 341 -434 -338 419 207 283 -692 -736 386 421 -792 -523 446 282 250 -426 -540 691
5529 691 884 -956 -979 400 644 -7 -457 -406 45 735 79 -931 189 545 -279 -595 -45 272 358 325
5549 325 -1047 -342 795 269 -563 -486 571 470 67 -442 -272 510 545 -722 -555 444 590 -411 -583
5568 -583 149 109 486 -3 -688 216 641 -368 -619 -268 790 443 -322 -504 -250 753 359 -920 -218
5587 -218 562 516 -119 -259 -149 475 492 -471 -458 362 569 -552 -494 76 558 453 -423 -872 233 907 111
5608A11j081Q69N91m68m31P5K08K60J76q62J7J094n73n40J22M94L78k35l44l93
5628e32Q79L45q44l18R13J15o82l31rO22M40n86p67P39O64p97l94O27k32K85l
5649A34r06O44Q79n30r40K19Q29n1l54j45q0N97L50j185p8R27L62r71k52M50M12
5670C11J44m81o94P27Q90j109l72M19P17k94m36k88K28Q26k76r56M13J028l99
5689C98n49m8J16M03K30j143j56J397J7j135J18P07l6l49mj62J91J152j141n26
5709e20N58N84m89n08j28O35L79n23q07O24P05N9r65K28L0N75l90n22j74J122
5729D73J20j070J03P11K68m94l47j56P12K80r35l35K68J386j144m24M90L55j51
5748A10j7l50J29J009p39q43N13L95K89n53l33K5O94J74j238J67J076J70r71q8
$$ plain form
5608 111 -970 -101 490 22 -409 -334 -126 134 310 -552 -535 559 -14 -554 -432 62 440 205 -139 -532
5628 -532 347 692 -152 -470 443 558 -124 -455 -464 158 598 12 -755 -16 648 -149 -543 84 -148 137 134
5649 134 -772 -128 751 221 -719 -500 329 278 -76 -221 -301 296 646 -539 -617 310 672 -299 -551 -101 311
5670 311 455 -26 -720 7 897 -212 -584 -165 552 258 -178 -466 -238 588 312 -644 -231 797 398
5689 398 -151 -199 -83 320 550 -593 -749 648 665 -470 -352 355 319 -30 -34 -196 -5 1147 6 -520
5709 -520 38 622 133 -375 -503 132 511 -12 -819 -195 510 569 -396 -168 -138 437 47 -475 -649 473
5729 473 593 -477 -374 337 605 111 -236 -392 320 600 -335 -670 -402 984 -160 -584 -94 261 110
5748 110 93 -257 -128 881 142 -701 -188 207 496 -57 -390 -365 329 503 -735 -568 508 678 -293 -381
5768c81J17O28L12q40m03N21Q31q97m18M29M27J85n51m25J96P75j54r98K62R80
5788E96j21n66k72P6O33j24o48L61N60n6j115K39L63J34K11n84r9N96J51m03n35
5809f03L39P68k58m39M7M6M67k49q34L62Q13n34l44J72N27J27k29n91p4P66L96
5830F75r62p7M19K60j40l53q9N74M43o58o08J009Ql66m48J15J70N77k41q44K89
5851b47R95n88o98K28P49k47k66j08n3P98o9j232J56Q49J83n84q7J14L46J86p00
5872b75l21Q27K39m62o68N09K78l7M9n62O36M16l74r13M78P55l72J91q47K12P05
5893D64J09j049J69R67k28q64K55L69k72K88m29n26Q12P45r18l03O76J64j75k64
5913a0j84J00O86n42r56M07R09j72o51K58L3J93N09j060K10P34Mp36k92Q22J33
$$ plain form
5768 -381 -264 364 676 -164 -567 -46 785 -112 -530 -101 326 511 -40 -465 -269 506 352 -646 -384 596
5788 596 475 -91 -363 -287 346 222 -426 -65 495 439 -676 -437 -74 60 271 -313 -412 184 335 -68 -603
5809 -603 -264 504 246 -193 -146 -100 367 118 -716 -354 459 -75 -419 -247 280 407 178 -413 -487 279 675
5830 675 -287 -364 55 315 175 -178 -267 307 750 92 -516 493 501 135 -313 -198 -28 549 308 -536 -247
5851 -247 748 160 -538 -310 439 192 -74 -182 -235 563 494 -738 -582 267 450 -134 -221 -107 239 425 -275
5872 -275 -596 231 470 8 -660 -151 127 90 139 -423 213 629 255 -658 -180 575 203 394 -453 -241 464
5893 464 573 -476 -307 660 432 -432 -177 192 -80 208 -221 -747 65 810 -108 -411 265 429 254 -10
5913 -10 -194 -94 592 50 -906 -499 410 238 -413 -155 -122 71 580 -480 -270 464 468 -268 -560 262 395
5934C95n6n30l64P78M81r30l51Q72N3K73j275K22M94L85l02j025N51J061m30j045
5954g43P46J60K32n06j96n5O96J90q82J18M74L02l34l69J60L87L13r54k80N83
5974D2M82m02o22M29K30J48o49M9J68N89l88o58L93M24K37n66m13N67M26k80m94
5995b88j37R44l42m45J00J80L76n2n75l64N64P79q93m29Q08m2Oj99n92M76O76
6016E51n89n58O46L72N1q01q7N71J08K3p33m1J064j41q53N1N98J42k10m19o01
6037h56R39N46q51m83Q75L41m01n19j66N34N22m77p40J98R76m01m41K22L18J94
6057C30j31k64n06P36K78j064J62O78q0Mn51K97M54J01n61l82N26M52m89l15P3
6078b52J85N10j67j065P00P54k82j075M56L23J33o7m31N0N72P7q39k11J041q4
$$ plain form
5934 395 339 -191 -555 223 704 -226 -577 295 348 621 -654 -432 62 447 145 -880 -329 732 302 -743
5954 -743 3 163 395 -111 -307 -362 334 524 -358 -240 234 536 202 -167 -7 380 693 -261 -541 42
5974 42 524 122 -500 -71 159 307 -342 -293 -125 464 76 -582 -189 235 472 -94 -507 60 486 206 -288
5995 -288 -425 519 177 -268 -168 12 388 336 -239 -603 -39 740 -153 -582 226 184 190 -9 -601 -125 551
6016 551 -38 -596 50 422 473 -328 -415 156 264 287 -446 -487 577 436 -417 -366 232 374 164 -255 -856
6037 -856 83 629 -222 -705 170 511 110 -409 -575 -41 481 4 -736 -538 438 37 -404 -182 136 330
6057 330 199 -65 -571 165 443 -621 -459 219 139 143 -408 -111 343 444 -117 -499 27 479 -10 -325 -252
6078 -252 -67 443 276 -789 -89 665 383 -692 -236 87 220 153 -278 -228 344 421 -418 -629 412 328
6098C28l54n35L90L94Q1m92m59R62M81q79k62K92K71m2j72j67K41N08n36n07J20
6119c37R49o10l68K86j7L73M4o47j31J086l93l97o2M10J2R3n56k49R04L87j080
6140c03j10O03N3k7l20l66M51L66q2p87M90M51m25l56J96K01K02k23m73J73Q20
6161E34k06q28R3O64P3q9l59k21N61J19p71j44Q42J05o94k12K21N61k59J06p81
6182f85N16P97l43m66K58J62n7m34j21J35N19n4o97N2N70J65n82k1L35KK61n61
6204b49l37Q46J29m25j82R3L69r6l56l34P21N00n06r20N41N64J39o58J63J4PJ52
6226A75p10K00P20K57r37L15j21K03L28p70q8N37K70o24j43M93K46k38j84j62
6246b33K56L84l32n59M60J83k50k85L76M36k55m7n42R6Q20j90q10j24Q68l78N6
$$ plain form
6098 328 -26 -561 -171 223 304 -188 -647 315 796 -83 -345 -53 218 176 4 -163 78 586 50 -457 -337
6119 -337 612 2 -366 -80 -97 276 320 -327 -458 628 235 -162 -224 186 198 291 -265 -514 390 777 -303
6140 -303 -413 190 243 216 -104 -470 -19 347 265 -522 -32 419 -6 -362 -166 35 237 14 -459 -286 534
6161 534 328 -500 -407 257 330 241 -118 -339 222 341 -430 -574 268 373 -321 -533 -312 249 -10 96 -685
6182 -685 -169 628 285 -181 77 239 182 -252 -373 -238 281 227 -470 -418 152 317 -265 -286 49 51 312 -249
6204 -249 -586 260 389 -36 -218 -125 244 148 -208 -542 179 679 173 -747 -206 358 497 -161 2 16 23 175
6226 175 -535 -335 385 642 -295 20 -101 102 430 -340 -428 109 379 -245 -388 105 351 113 -71 -233
6246 -233 23 407 75 -484 -24 159 -91 -376 0 436 181 134 -408 -312 508 318 -492 -616 252 -126 -70
6267g0j52J90K24L75p27m01P08K48m82j32j93O09O3j76m36O50L73o36m69J61N94
6288C21j96J2n49K68N52k04n74P8N08K19m80j86rL94J8k5n34R24lp52q8K25L66
6311B85R2m30l97O26M30n95n68N09Q8J6l92K3L39J9N5k67k60J031k52p62L58n5
6333a07R1K62l99j99K82K95j62n67O07K32r8j86r6nN26r0r20N50L39l84k96j55
6355d80M12K67j48o93M06N82J3n14k44Q88m22J72m68J30N62J41q41j80N16K67
6375C66m85k73L59J39J74l38k74N3O68k57n63L64K57j81l03l97M17N48M1q31j79
6396f95R92L23o14k51QN38m41j9m30R22n7r5m94K34K45pj7m66L97N10k72n82L79
6419A08K04l71j79q9L05M14k45n95L14K69K25n76J02J23K59p2p17K2P04J55n93
$$ plain form
6267 -70 -222 -32 192 567 -160 -561 147 395 -87 -219 -412 197 260 84 -352 298 671 35 -434 -273 321
6288 321 125 137 -412 -144 408 204 -370 -292 216 435 -45 -231 -240 154 172 147 -387 537 534 -218 -306 -81 285
6311 285 377 -53 -450 176 606 11 -557 -48 40 56 -336 -313 26 45 100 -167 -427 604 352 -410 -52 -107
6333 -107 -16 246 -153 -352 -70 225 63 -504 103 335 237 51 -45 -50 476 386 -534 16 355 -29 -325 -480
6355 -480 -68 199 51 -642 -236 346 359 -155 -399 489 67 239 -229 -99 463 604 -237 -417 99 366
6375 366 -119 -392 -33 106 280 -58 -332 -279 389 132 -431 -67 190 9 -294 -691 -274 274 315 -516 -695
6396 -695 297 620 6 -245 -237 301 -140 -159 -589 333 276 181 -313 -79 166 159 142 -324 73 583 311 -271 108
6419 108 312 -59 -238 -327 -22 392 147 -448 -134 135 360 -216 -114 9 268 196 -521 -499 205 360 -233
6440b33k24M44K15j29k97j48J68Q28p37m69M49N25n16j80L71j96L70p6n91R7K94
6461c5R4l96R9L55j41p8K0N3K97J89p13n9L25K50o7k36j92L15K26k65l43L09O76
6484F83o74l24N75r3j03k40J6R1K31j58l23n9L78J46n12K00M25m40J68k81l5O18
6506B89Q1n71J17J41J84J78o00l15N01J12J59l41j6M64l78j78J3J45J92n6k90
6527a69P1K24%q0k84j21O56n3k50n3J7M57m97k89M93J53L8j79m98m0O62m59k50
6550d51L81J08l9O1n8j76M81L5o86P2N84j76m26R1M10p3K55j94p27O74K76n74
6572a52k25J71M65l56o5J11j4L28m35j96K72N46m68k33L42J8N6j39k89m1P23n18
6594i9l23J73N18M7k89l31o6N06J06m67K24mQ3k75j89J13K78L62J07n17P2L43
$$ plain form
6440 -233 -457 -13 202 73 -224 -372 -204 624 -113 -582 -133 392 -124 -304 67 -129 241 165 -426 -329 -35
6461 -35 59 -337 -238 117 -24 -102 -82 -29 268 457 -256 -315 10 260 193 -43 -235 80 306 41 -302 7 683
6484 683 9 -315 260 167 64 -176 -160 -69 162 4 -319 -378 0 146 -366 -166 259 -181 -13 -294 -329 289
6506 289 370 -201 -84 57 241 419 -181 -496 5 117 276 -65 -81 383 5 -173 -160 -15 177 121 -169
6527 -169 -98 126 126 46 -238 -359 297 244 -6 -59 -42 415 -82 -371 122 275 313 134 -364 -404 258 -201 -451
6550 -451 -70 38 -1 60 2 -174 307 342 -344 -272 312 136 -290 -199 211 138 393 199 -528 146 422 -152
6572 -152 -377 -206 259 -97 -162 -51 -65 263 -172 -368 -96 450 -18 -251 91 109 165 26 -263 -304 419 -99
6594 -99 -422 -249 269 316 27 -304 -370 136 242 -225 -1 -5 78 -197 -386 -273 5 367 474 -43 29 372
6616C72k37q56O41J91j01K59l71K7J97L01p04K34N32m40m16K18J2M47J82o17N7
6637g2J57J37k93j76K31M20l40k31o9N46K19p14n84P02K99L6n02Q1M8P06l99n52
6659c50K06M48j28m65J23P6L15K8n34L1L33M04q81l5N17J48l50j47QJ89O11o76
6681a29M0K77K47m33j97N6J57L05m17j55o0P16l76n10K08N37k87r8j89J71M68
6702C31j90k80p2M60p0k22m51N19K5K39k18n28N88K17m40l39K32O37k77l55L73
6723A79k17L92l18k41l4N20R7o76J27R4K14R0j38l97N70j2m61JL9K19N3k97k30
6746d26M66O7k75m26M74M09j43j89q2M23o6j48k95N6O12k32l41j58J0O37j4m21
6768f2k61O08m3k25j76K66K15k15m27L14KM57n94k76N27K2j74k13J26L30r5k31
$$ plain form
6616 372 135 -721 -80 111 10 269 -102 -75 122 423 -281 -47 485 45 -371 -153 -141 306 488 -129 -72
6637 -72 85 222 -71 -247 -16 404 64 -167 -236 310 529 -185 -769 -67 232 268 -234 -153 -105 601 202 -350
6659 -350 -144 304 176 -289 -166 -90 225 253 -281 -250 83 487 -394 -429 88 236 -114 -261 -253 -64 547 -129
6681 -129 -89 188 435 2 -195 -139 18 323 -94 -249 -309 407 31 -479 -271 266 -21 -119 -308 -137 331
6702 331 141 -139 -211 249 179 -43 -494 25 50 289 71 -457 131 348 -92 -431 -199 438 161 -194 179
6723 179 -38 354 36 -205 -239 281 378 -298 -171 -77 137 227 89 -308 262 250 -211 -210 -171 48 101 -196 -426
6746 -426 40 107 -168 -594 -120 289 146 -43 -125 298 232 84 -211 -155 457 225 -116 -274 -264 373 359 -62
6768 -62 -323 285 242 17 -159 107 322 107 -320 -6 -4 453 -141 -417 110 132 -42 -255 -129 201 106 -125
6790a25R8q5L24j26k18p8N88k46j0m44L41K85pm22k34N49J23j11l46J17J02J16
6812A91m98k6J26K90L1o60O47l40J69J60k97K63L49k23m60R6K09Q1l76J91P0K41
6834B34j75l85R0M75q7k97q1L57P0j24j93o3K90J55l04m37M84J44J69m63O8l3
6856a06J28K8k12K35K59k12j92k69L14J14om82j52P76Q8n53K5L66k44Rj06o2L45
6879I1M9k37m25O19K8qj02l08K28K58N1o07K52L66k78l28J68N9m2L0L1j92N29
6902B32k7m30p7M56o3j06r1M9K57K35m95k69L48L14o41j93M61p2L07l33j84J49
6924a73M10q3n56L85K36j04j65o6j88O05l55R0l55Q03l01j29l30M26j83K21l14
6945a26j6pM03j54l15J08K66n8l68J74j49M21j03k61L02L14p8q09M17J75k69K11
$$ plain form
6790 -125 -27 -112 212 86 -132 -210 378 132 122 -322 19 304 297 -125 -359 190 313 202 -144 -27 75 191
6812 191 -307 -333 -207 83 114 -546 101 -239 -70 90 -207 56 405 182 -278 -182 27 108 -268 -77 -7 234
6834 234 59 -326 -236 239 152 -145 -226 131 201 77 -116 -179 111 266 -38 -475 9 153 322 -141 -73 -106
6856 -106 22 50 -162 73 332 120 -72 -341 -27 87 81 -401 -553 223 311 -242 -217 149 -95 -86 -192 -254 91
6879 91 140 -97 -522 97 125 117 15 -293 -65 193 244 -363 -111 255 -23 -351 -183 -124 -166 -136 -105 -297 232
6902 232 205 -225 -302 154 91 -15 -106 -57 200 435 -60 -329 19 333 -308 -501 -40 -112 195 -138 -322 -173
6924 -173 237 154 -402 -17 219 115 -50 -116 -304 301 -54 36 -319 484 183 54 -276 150 -33 188 -126
6945 -126 -142 -149 254 100 -215 -107 159 101 -267 -93 -242 179 76 -185 117 431 353 -456 -39 136 -133 78
6967G8m9k01J12O3k59j0O86j90l00K18m64L26K29k33k85K27K34n3k3m77K27J67
6989B3p0l83K66K19j69Q3l21M85ll51qK6K51K24j40k06L50k40j16O1l11K41L21
7012B32j82m73M34R5k91k38K53K23p0M7k92M3L43Ll00J97K40l00J8R2j73M06k19
7035H8k99K7N90l19l08K35K31l49M27j15o64Q71j72j02l04J01J25nj3k20J14M72
7057D11j62l67k75N00N4m72J84k6K74K45k51l04J97J10m05P3L53K73l86j5N0J2
7079G3K74k10j82j02K82k68j10M31r3k52n9l1N11M9m92Q8j7K10r2K86l92N1J34
7102H9m4l73J76L58k39j02K12k94L1N07k39m52L63K5j37J00K1j59L41q2m97K38
7124a57J07J71n62R4P65k63k86N3J75J00O8m94j47P99k19l9j11p7k2K48j25j67
$$ plain form
6967 78 29 -172 -60 3 -256 -266 420 230 -70 148 -316 10 239 6 -279 -52 182 129 106 -371 -144 23
6989 23 -47 -430 -164 55 -114 -31 -352 133 130 -221 -229 -203 48 272 132 -74 276 36 -80 -19 -330 -89 232
7012 232 50 -423 11 106 -185 -423 -170 53 -17 30 -262 -219 124 127 -173 24 264 -36 -18 74 -99 307 88
7035 88 -211 -184 406 87 -221 14 245 -104 323 208 -456 415 243 141 -163 -62 63 58 45 -175 -61 411
7057 411 249 -118 -393 107 161 -311 -127 -153 121 366 115 -189 8 118 -287 -214 139 412 26 11 61 73
7079 73 347 137 -45 -147 135 -133 -243 188 95 -157 -216 -247 264 313 -179 -91 -108 102 10 296 -96 -45 89
7102 89 45 -328 -152 206 -33 -135 77 -217 -186 321 82 -370 -7 18 -119 -19 2 -157 184 102 -395 -157
7124 -157 -50 121 -441 -347 418 155 -131 -78 97 197 265 -229 -376 423 204 165 54 -23 -45 203 78 -89
7146h9M80n42J60p6K9J22n3Kk14Q9J53j87l83M57J25P2o02L57K53M2j57o74M50
7169a86M09j92k17J01Q2J81j16p5p6J26n9M3j83J98J83j68K37r2l90M53K7o91
7191d05K75N41n58j78N11k30K50M9n75PM45Q5l63J5M54l87J54k14q3K38M06m13
7213B4l42L39L35n05L3K29j79M69l04k34K27K40l67l4J29J64r9p1j08j35M63J51
7235D25p87J59O36n39O3L06k08N2M25m83j97K92k7q4k83L71j29K13r9j92J8L29
7257B61j89m80N20p2k5j79P9r5K82j14j56jL55km19J38Q8Rl1J68n53M08K81m57
7281a84j21N74j52k17J88j26n8M08l65j15pR5j1L0K6N0j4O4l74J30L79m8n29M79
7305A02j38q2N32m06n0J47J16j10n33N33j45K09k46k9L17P0l34m6l9N32k51m96
$$ plain form
7146 -89 391 -151 9 -67 -38 84 31 33 -181 -92 61 -126 -509 -52 73 145 -457 -100 153 195 38 -636 -186
7169 -186 223 31 -186 -85 -3 178 62 -13 -89 37 -22 21 -162 36 219 51 288 196 -194 259 286 -405
7191 -405 -130 411 -147 -325 186 -44 206 255 -320 -313 132 217 -146 -131 323 -64 90 -124 -207 31 437 24
7213 24 -318 21 356 -149 -116 113 -66 403 99 -135 92 332 -35 -69 60 224 125 54 -54 -189 274 425
7235 425 -362 -203 433 -106 -43 263 55 107 532 49 -148 144 117 33 -250 121 -8 205 106 -86 -68 261
7257 261 72 -408 112 40 15 -164 -85 -180 102 -12 -168 -169 186 184 -235 -97 -9 0 -31 137 -416 -8 273 -184
7281 -184 -305 269 117 -100 88 -38 -96 312 -53 -168 -175 -80 -91 -61 -35 15 1 65 -309 -179 200 152 -377 102
7305 102 -36 -118 414 8 -42 105 221 111 -422 111 -34 175 -71 -100 217 287 -47 -93 -132 400 149 -347
7327c47K75K4L2K11m27L37J26l20m9j47M18J7q1j73K9K27M0j86k29L23J62l25
7349f3j36M97l32jl3J18J73m1l97k4M16K12n51M9j27r0N45k22k21L01K18j48k57
7372a14N19m41L5K33m32K2J65J85m26L32k40K69j11p2j71L86K09l39l4j58M73
7393B90l79k9K71n5J98K1l22m1K86Jm04q7J37n4J43M27l49JK19j07l02m4L95k05
7417A1l3k20K38j00L41k94n9N35o09J39R7K34l14M5l99L06K04j43k30J65K68p5
7439A07j44o8l7L31J48k99m61L99K77l03J4k63M41O3j04m59P27p3l94N9n6K12
7461A17l5r7k40q6L33K55n15L5N09j18j99q1j47L53j99p3O6L72N0n64L45j00M19
7484D00m73k6q6J4L04l10k36M23N81o92O2J20N4k86N12n21J16J74%k19lL28k78
$$ plain form
7327 -347 -72 -48 -16 195 -232 105 231 -89 -138 -285 133 150 69 -104 -75 152 192 6 -223 100 262 -63
7349 -63 -199 298 -34 -35 -68 50 223 182 -215 -239 177 389 -162 -113 -240 -330 215 -7 -228 73 291 143 -114
7372 -114 405 -36 -1 232 -200 -178 -13 172 -254 78 -162 107 -4 -76 -247 139 348 9 -25 -183 290
7393 290 -89 -118 153 98 296 317 -5 -46 240 241 -163 -250 -113 -167 -24 403 54 55 274 167 -135 -179 216 11
7417 11 -22 -242 -4 -104 237 -57 -116 419 -190 -51 46 280 -34 11 -388 -82 122 -21 -251 -86 182 107
7439 107 -37 -105 -142 189 337 38 -423 -24 253 -50 -36 -299 142 205 101 -358 369 296 -98 -39 -95 117
7461 117 82 -15 -255 -341 -8 247 -268 -233 276 158 -41 -122 -269 84 -115 -188 -122 250 300 -264 81 -19 400
7484 400 -73 -99 -185 -171 133 -177 -413 10 591 -101 -39 81 135 -151 361 -160 -44 130 130 -89 -92 236 -42
7507d2J74k27r6J20K20l11K6K56j62Kj4o5k19K64K26l37J19M8O5J30j75j01P3
7530b6j01J27J5K71l60r7J05J67j00J03m9k71L45K35m38l18N00k05R8nj99K53
7552E0K16j89l46J36L66l50K8J85K0J74k66l57K61K3K82m58q9O55k23l18K38n6
7574a8j05MK59n15N59m3l21o9N04k06m7j44K66l70L73k55l9L12m1Kj22J57n13
7597c72P22l31j68j78L58j18m7J47q7J49kk29M7K20j13l12R1M05j74p3r2J03K51
7620A97R5l68l18M94l01K94J75m61L80K6k6m34k15P04k34K5k49P4K28m56L97n8
7642c1L2M67m51q1oJ65Q4l22j52L45J5K67m47L33j34l72P9J40J58k58Q9P3k21
7665b28J98J91l94l3M10l8p1j90K40N1K54n75o4L53j17q0R7K16j55O9q4J87k87
$$ plain form
7507 -42 132 -95 -191 -71 149 -162 -136 120 -42 -40 -54 -119 -338 -74 152 -185 -66 -18 47 177 2 -99 -26
7530 -26 -127 0 15 286 -74 -171 -66 101 1 104 55 -216 129 364 -74 -392 108 -97 1 -4 -203 50
7552 50 266 77 -269 -133 233 -117 -89 96 116 290 24 -333 -72 -49 233 -225 -314 341 118 -200 38 -18
7574 -18 -123 -119 140 -375 184 141 -180 -249 255 49 2 -142 124 -246 127 -128 -167 145 104 106 -16 141 -372
7597 -372 350 19 -149 -327 31 -87 -134 13 -74 75 73 -156 -109 111 -2 -314 -223 182 8 -65 -157 -54 197
7620 197 292 -76 -394 100 -201 93 268 -193 187 213 187 -247 -462 242 8 33 -216 -142 86 -370 27 -31
7642 -31 1 468 17 -64 -70 95 179 -143 -295 50 65 332 -115 218 84 -288 -209 -69 89 -169 -80 -7 -228
7665 -228 -30 161 -233 -266 144 106 35 -155 85 136 390 -185 -249 104 -13 -93 4 220 65 134 50 237 -50
7688e0L45l75L42l82K46l85K76j55J07k9J04j15R4J49l38j7j76L65j68K29r5m
7710c2j16J22k03l0K41J32N8k32Q0m0L07j78l06K71q3m0Jn1O1O7J33o2l3Q0k21
7735g4j31M0M60k34j44L0j75J84O9j40n9R4K77m81K18Q5K92j52k10r4L80N1q9
7758A97o86L42O8L21j80l19J99J06o9m23L65R6P4k10K57j92J8j9J68l66L11K00
7780B58l64OL64l72J21J23j93Q4J36m0m8M8J22k27J32r6O9j50K35j93j70L91l7
7803A99k29L2oJ15N1k01J0j06K6L20l50k7J13J71p2N8j6N6l56Q6n4K74n2k28M58
7828B72m28K72j20j00j54L20j51J30k55L61j94ol5J51j41J00k21K78k9K51l31
7849c0QR8j49K51j85p8P7J16k9Mk74K36L20j31m48q2L96m0k07L25k29J75j73R6
$$ plain form
7688 -50 295 -80 262 -120 126 -259 17 -138 -31 -60 44 -71 23 172 -166 -183 -359 6 -162 67 -28 -32
7710 -32 -148 -26 -229 -259 -18 114 172 -60 20 -20 287 109 -197 74 -9 -49 -48 -99 -38 29 162 100 67 147 -74
7735 -74 -205 -165 295 61 -83 -53 -228 -44 25 -115 -174 -80 197 -284 -66 19 311 159 -51 -145 235 286 197
7758 197 -489 -147 -79 242 62 -257 -58 48 -21 -444 -79 17 91 -119 138 -54 -36 -55 113 -253 58 258
7780 258 -106 -100 264 -108 13 136 -57 27 163 123 75 123 245 18 150 54 123 -27 208 15 -155 236 199
7803 199 -30 2 -4 111 162 -39 -29 -135 -109 211 -139 -166 -53 118 46 104 88 144 -212 -126 -180 94 42 -186 272
7828 272 -156 116 -4 -104 -258 62 -89 41 -214 147 -47 -53 -88 63 -78 22 -199 79 50 301 -30
7849 -30 -22 76 -73 178 -7 -85 -8 108 79 83 -191 45 365 234 -214 -296 100 60 -147 178 -51 124 -49 47
7873D7l5K42o3j83l6J12Q2m09M31On48M81k11Q8L4M17l67j69J59k01J98J21l45
7896a49O1K43l93J87R6J26k47j46J31l21M87jl41N6L13K89l86L9j2J02j31J5J87
7919B05k14j20K04j42j02K70Lj31n1J25K77l15q4P3N2p2J76m02M09J26k52j1j60
7942a36J0J11K1j38L60j6n83L39J83j74J00M6k71R7L17j54k35j02K57k35J45P3
7964A5nK9J37j49j45Kk5J09K02k1j79J2k71L01L74l12q5k00R8K0J72l23j60N59
7988A55l77L10m20M78K7m15L74%k07L52m6j81l3J93r1j04n5J58J41j21n9j64P4
8011a1K1j44j86K25JL67l29nj44L22k90N4N6ok2J29k11J16J43J2j04J81j66J61
8035A70m61K31J49O0q6r8K01l36L03k74K18N3o5k77J73j82J99L6m1J55k96N12
$$ plain form
7873 47 12 254 191 8 -28 84 166 -243 188 194 -354 127 -84 4 38 455 88 -81 78 -123 75 196 -149
7896 -149 -88 155 -238 -51 45 171 -76 -222 -91 -412 75 74 -267 -211 102 391 5 44 32 134 3 18 205
7919 205 -9 -129 75 -67 -169 101 104 -27 -78 47 324 9 -75 -2 50 -22 154 -248 161 287 35 24 -136
7942 -136 -126 -15 6 -132 228 212 -371 -32 151 -23 77 123 -148 -51 266 112 -123 -225 32 -203 -58 15
7964 15 10 39 176 27 -118 -116 -141 -32 170 149 -30 -18 -289 12 386 74 -11 -211 -113 -93 79 -244 -404 155
7988 155 -222 88 -332 146 173 -242 132 132 -75 277 231 50 17 210 119 15 -40 118 259 138 79 -85 -11
8011 -11 10 -134 -320 -95 -94 273 -56 -61 -205 117 -173 -119 -63 -69 -91 38 -173 -57 86 98 -6 175 9 170
8035 170 -291 -60 89 149 63 -35 166 -170 133 -141 77 130 65 -212 -39 -221 -22 14 -27 128 -168 344
8057C44k73j04L33n79L10J36k46J36L25m60j20K69K39k60L6k99K30P5Pl60L35
8078G4J48J33m20q4J98Q8r8r4m9J08M6Q2l64L67J40m3J1k13o8j64J38M4j07K78
8102A51M9k24N3J73k7k15Lk12L45J62l80N1L0J37L5l6n33M98r1j8j44K00k7l7
8126e7p8K11j40K25o7k08J08L4P8l21M7J62O5J55m42J5N80j19m10j52L69p1n7
8149g3R0m90M17M6o8m9L77j97l33L85k6k73L96j88n5j12K99j21m5j07J52J10k0
8172A15j6k14K54J61l38K01j33J16m1Ql40L65k83O5Q0j00L51j67j38
$$ plain form
8057 344 71 -33 300 -279 31 167 -79 57 382 -78 -198 71 310 50 86 -213 17 92 99 -261 74
8078 74 222 355 -65 -149 49 137 39 -55 -104 4 50 132 -232 135 275 232 243 30 -38 -202 -64 -20 -127 151
8102 151 200 -24 29 202 175 -40 -37 -249 96 258 -122 -71 -41 96 131 95 -438 60 -31 -49 -193 7 -20 -57
8126 -57 -135 76 -64 161 94 -114 -6 28 106 -215 -168 -6 59 214 -228 -213 367 248 -162 -314 55 -16 -73
8149 -73 17 -473 -56 -10 -78 -127 250 53 -280 105 79 -194 202 14 -41 -153 146 25 -20 -127 25 135 115
8172 115 99 -115 139 300 -38 163 30 146 105 113 -227 138 -145 -80 0 -100 251 84 -54
8191e4
$$ Imaginary data points
##PAGE= N=2
##DATA TABLE= (X++(I..I)), XYDATA
0@%%%%%%%Qj6J6j6K4l2L4m2N6o4P2q8J04j22J44j67J90k18K51k86L22l64M12m63
31b45N19n82O51p24Q06q97R95j104J223j352J496j657J837k035K259k514K802
48A478l134L525l993M556n253O147p328Q970j1421J5446k3151M2891j77556l97233
62e46056N32415L97247l60281l61643K49069L04181j21877k72121L0625K29820
72H1379N9894j78113j18604O8452J37569N3348r9559j54897N2930K02888j0806
83I4481k06531j3279J74278M1756j25496q4104O0982J44217K0197j80677r7659
94a71835J68579J42454j10243j49596L1088J33214N1365j10823j16287R5910J72142
105A35968o5558k08359J444K11731Q9967j78301j79136J30073K46492q1220k72809
$$ plain form
0 0 0 0 0 0 0 0 0 8 -8 8 -8 16 -16 18 -24 32 -32 40 -48 56 -66 78 -89 101 -117 134 -152 170 -194 218 -245
31 -245 274 -308 343 -381 425 -472 523 -581 642 -710 786 -871 966 -1069 1190 -1324 1478
48 1478 -1656 1869 -2124 2432 -2821 3326 -4002 4968 -6453 8993 -14158 28733 -148823 -546056
62 -546056 -13641 383606 23325 -338318 -89249 214932 93055 -179066 -148441 81379
72 81379 141273 -36840 -155444 -86992 50577 103925 4366 -150531 -97601 105287 94481
83 94481 -112050 -125329 48949 90705 -34791 -118895 -57913 86304 106501 -74176 -171835
94 -171835 -3256 139198 28955 -120641 -89553 43661 95026 -15797 -132084 -36174 135968
105 135968 70410 -137949 -136505 75226 165193 -13108 -192244 -62171 184321 103101 -169708
116a69708M9241K64588k0349k26126j7733J62619O9110p3090j06931j6183J14527
127B9965Q4727q4916j22219L0774J39217L6993j46022j00829J56537J62567j52661
138C4133k07996J15111K17392m9005j88904k4923J42329R4194r4349j41644N8419
149d5243J66620l0728j70173q893J40975O2293q1915j07584J1720J30391M3498
160A10961j26180p5917R4981Q2722n2570q7149L272R8917N2238j05198j01281
171a05204Q7420J18873n0083j03328o055N6604N8311l937r5335l5059J19481O0462
183A02150j31531r5574J12940J37078o6285j80248L37K06258O3562k04140j03925
194a59378J73943J13036j32891j16625P7222J21870q485j26827n9588J17666J11698
$$ plain form
116 -169708 -120467 144121 123772 -102354 -120087 42532 111642 38552 -68379 -84562 29965
127 29965 114692 29776 -92443 -61669 77548 114541 -31481 -132310 24227 186794 34133
138 34133 -173863 -58752 158640 109635 -79269 -104192 38137 132331 37982 -103662 -45243
149 -45243 121377 90649 -79524 -88417 52558 114851 32936 -74648 -62928 67463 110961
160 110961 -15219 -91136 3845 86567 33997 -53152 -49880 49037 101275 -3923 -105204
171 -105204 -17784 101089 51006 -52322 -58377 -1773 56538 52601 -42734 -77793 41688 102150
183 102150 -29381 -124955 -12015 125063 58778 -121470 -121133 85125 148687 -55453 -159378
194 -159378 14565 127601 -5290 -121915 -44693 77177 68692 -58135 -117723 -57 111641
205A11641q7383j31786L5335J13341J8759p8844o4612M8882J03328k6386j28451
216h6176K650J31276K9471j04955o7933N3421J01655P408j13799m9794J05723
227H947O7773q1516p1085M2462P2613J3539p3057p2858O9848J27351m8520j53760
239i8263J1076J45903L3497j15263p4477Q3446J13760n3767j39917K9189J48420
250H3604J861j29302l8380Q1670P4773j6569r4350l9360J00853P5615r1834r5233
262h6652O4154J07445j8586j14274l8886J17732J01011j03696j42898P2012J51943
273A09305l3189j36652j2242J10028N9979q1129j01925N5164J33020k5370j39544
284f2555j4155J11452N2090o2411q2552R575J02686L1987j11441n8742J02724
$$ plain form
205 111641 24258 -107528 -72193 41148 59907 -18937 -83549 -34667 68661 42275 -86176
216 -86176 -83526 47750 77221 -27734 -95667 -42246 59409 66817 -46982 -96776 8947
227 8947 76720 -4796 -75881 -33419 39194 52733 -20324 -93182 -23334 104017 55497 -98263
239 -98263 -87187 58716 92213 -23050 -97527 -14081 99679 45912 -94005 -64816 83604
250 83604 85465 -43837 -82217 -547 74226 57657 -36693 -76053 24800 100415 8581 -86652
262 -86652 -22498 84947 66361 -47913 -86799 30933 131944 28248 -114650 -42638 109305
273 109305 76116 -60536 -72778 37250 97229 16100 -85825 -30661 102359 76989 -62555
284 -62555 -76710 34742 86832 24421 -58131 -48556 54130 86117 -25324 -84066 18658
295A8658P3466p7695q6863L0594R4298K6428q9639p2947P1244R1967m5354q8422
307e4265P971O5675L2417m0089p6107J6206J14733J1037j34412m5039J20954P5914
319I4995q3459j05594L3021J26342J3608j37645m7107J36625O8866j18747q8006
330a07101P6169R9801j6829j01720m0836R2774Q1776p4263r9085M5034R5001r674
342D1047q0783l4038O5469Q2602m3362j17262J6463J26640J1746j08748l9728
353g9954P1359O5186k8497q3428n186R7300L2391r4702n4346O9996O9652k2700
365C7071p6261l0762P5758P8686o4936j03966M8424J08744k3361j00733j1392
376f2728Q6077N6536o3521r4347L9932J14933j2681j08585j5033P9065L8931l8444
$$ plain form
295 18658 92124 14429 -72434 -41840 52458 78886 -10753 -83700 -12456 79511 34157 -54265
307 -54265 -46294 19381 51798 11709 -64398 -48192 66541 77578 -56834 -101873 19081 94995
319 94995 11536 -94058 -61037 65305 78913 -58732 -105839 30786 99652 -19095 -107101
330 -107101 -30932 68869 52040 -49680 -90516 2258 84034 9771 -89314 -44280 50721 41047
342 41047 -39736 -73774 -8305 74297 30935 -86327 -69864 56776 68522 -40226 -79954
353 -79954 -8595 56591 28094 -55334 -60520 36780 69171 -25531 -79877 -9881 59771 37071
365 37071 -39190 -69952 5806 84492 19556 -84410 -35986 72758 49397 -51336 -62728
376 -62728 23349 79885 16364 -77983 -38051 76882 64201 -44384 -59417 19648 58579 20135
388B0135n9876J435Q1299L1599q9931n7984P9035P6249m6049q7686k187R0188
400C6227N2446q4571q5528P3415J01218n7237j02416K6445R2594J4498p5156n8053
412f6118N2510R2643k6299j04765j903R1241K4933o3749n0047L0826P5573J288
424E6133r5375k9697R9040N0751q3609o6452M5648P1781o50o9854l8139O3747
436C324O2112n3873p2831L1970O7996L77n5820m1785L6448Q0095j1885j01764
448e5636j2992J00332L2492q1752n4810N1290P6355j7163r5815j3632J06722L9265
460G4656r9381n8443O9124O6475k6590o7318j7353O6482N2591n8884p4564M4405
472b8800Q1910j9853p7573j7502O4496N8456m3414q7461K2974J00579l470r4318
$$ plain form
388 20135 -39741 -38306 42993 74592 -15339 -73323 5712 81961 35912 -51774 -53961 36227
400 36227 88673 4102 -81426 -8011 93207 35970 -66446 -40001 52593 67091 -8065 -66118
412 -66118 -13608 79035 52736 -52029 -53932 37309 62242 -1507 -51554 -20728 54845 56133
424 56133 -39242 -68939 30101 80852 -2757 -69209 -23561 48220 47570 -22284 -60423 3324
436 3324 65436 11563 -61268 -29298 38698 39075 -16745 -58530 -22082 58013 46128 -55636
448 -55636 -68628 31704 64196 -17556 -72366 -21076 55279 38116 -57699 -71331 35391 74656
460 74656 -24725 -83168 -14044 52431 25841 -41477 -58830 7652 60243 1359 -73205 -28800
472 -28800 53110 33257 -44316 -61818 2678 61134 17720 -69741 -46767 53812 50342 -43976
484d3976j6656P2635L8122m2998n9416J2579P9204J7815q2262m0156O6912N3676
496E5479l5655n9506l041O2573M0900o0284o8007N4793Q3643l7608q6194Q170
508d4737P6773K8932n8112o0971L8489Q2839j8714q5975j081P3408K1838m9403
520C286m5489J8376O9258J4769q0558m1200P5661N8778n5256o8562K1606P2127
532D2796J5114p2777m6439O9985O9807n9417q0766L4517P6275r13o1967l5142
544d8927M3192O4635k4319p9703N642P7779J1932o4825l5040L9461O0302r872
556D0257p8933j7532Q5168L7062p6251n0311N0158N5092j8882n8817j3686O1168
568A4493M1635n6541n9877L9861O3817j3295n8084k1003M2601N3349k5148p5520
$$ plain form
484 -43976 -60632 12003 50125 7127 -52289 -39710 39494 57309 -24953 -65109 1803 55479
496 55479 19824 -39682 -42723 19850 60750 466 -67541 -12748 70895 33287 -52907 -44737
508 -44737 32036 60968 2856 -58115 -19626 63213 44499 -41476 -42557 30851 52689 3286
520 3286 -42203 -23827 45431 60200 -20358 -61558 14103 72881 17625 -50937 -29331 42796
532 42796 57910 -14867 -61306 8679 78486 19069 -61697 -27180 49095 48182 -13785 -48927
544 -48927 -5735 58900 34581 -45122 -39480 38299 50231 -14594 -49634 -10173 50129 40257
556 40257 -38676 -56208 28960 66022 -10229 -60540 -10382 44710 25828 -32989 -46675 14493
568 14493 56128 -413 -60290 -20429 43388 30093 -27991 -48994 -6393 46956 21808 -53712
580e3712R747Q4144N766q0090k5740O0557M8449l3847o9361O164Q1736J9985p9911
593b6113l6859O1989M5179l4168n1597N82N6765L2617n5954n6649M8314O9848
605E3954k8559p0877j283O0867L4002m5584o0931L2079P8775j6614q2007l09P1529
618B5042K0242m8734m2775K2539O2212M503o8965k4374O3305L6872m3989m5454
630c9576J5460N2968J7149n6401m4619N6195O3845m5291o9968K3279O4693N094
642D2828n2925l3182M0154N7558k6359o8602J0762O5896Q042n1443l0219K7046
654a0444N2152m75o6248k0853P0191L6342o1067m7739L8110N4792r179n9897k1589
667d5904O2436M6929n6056o0861L9059O0566j5272n3610j4583M2349M2424k9735
$$ plain form
580 -53712 -43965 40179 45945 -34145 -59885 672 49121 15274 -54087 -47923 33813 53798 -26113
593 -26113 -62972 -983 44196 10028 -41569 -40987 15778 48395 -7559 -64208 -15894 53954
605 53954 25395 -45482 -46765 14102 48104 2520 -58411 -26332 52443 35829 -46178 -46487 25042
618 25042 45284 -3450 -46225 -23686 38526 43029 -25936 -50310 12995 49867 5878 -39576
630 -39576 -24116 28852 46001 -10400 -55019 1176 65021 19730 -50238 -26959 37734 42828
642 42828 -10097 -43279 -3125 54433 28074 -40528 -29766 36130 44172 -7271 -37490 -10444
654 -10444 41708 41233 -25015 -45868 24323 60665 -402 -48141 -10031 44761 35582 -24315 -45904
667 -45904 16532 63461 7405 -53456 -14397 46169 30897 -22713 -37296 5053 47477 17742
679A7742o2201J5941O9694K27o4252k1520M3950M2336j9161o0882l420P1665K1158
692E1277p1381l3809N7302M0730l3836m8373L140N3084K5201n1071m4894M1769
704a0861N2333k3796n0731k163M1482L0427l2189n5119K2567P0758r381p3480
716d0153o643O0715K5502m0207m3999J6238N9753M428o4637j9234N8733L0237
728D0733m1838l9545J4451M7373J5492m9864m0003M7850N5380l5318n8867J4368
740b9788N3674J1584m4822l7545L5605O0124k3660o9467R043O6489Q091n1291
752a1963k6519K9176M4716n781n5773j1351N7789K5416m8413l6336K7129M4931
764C3021L98n0516k6318N3186M6955m7285n6064L3320N5188j2942m8679j2290
$$ plain form
679 17742 -44459 -28518 41176 41403 -22849 -44369 -419 41917 22756 -38126 -41546 30119 51277
692 51277 -20104 -53913 3389 44119 10283 -38090 -34950 18134 43335 -7736 -52630 -10861
704 -10861 41472 17676 -33055 -35218 6264 36691 4502 -50617 -28050 42708 33327 -40153
716 -40153 -46796 13919 39421 -786 -44785 -28547 31206 35634 -29003 -48237 10496 40733
728 40733 -1105 -40650 -26199 21174 36666 -13198 -53201 -5351 50029 14711 -44156 -29788
740 -29788 23886 35470 -9352 -46897 -11292 48832 25172 -44295 -35252 31237 39328 -11963
752 -11963 -38482 -9306 35410 29629 -26144 -37495 20294 45710 -2703 -39039 -11910 33021
764 33021 33419 -17097 -43415 9771 56726 9441 -46623 -13303 41885 28943 -19736 -32026
776c2026L9168L7401k7747n3377J5738N8054q96n0656j8263L3390L6457j2428
788B4815n2440n519O1559K0879o0355l2142M5673M0019k3122m7093m453N0807
800A8628K8813m8962m4221M0876M9298k5044m8192P24M0246K4406l0838m6255
812d0521K0250N8790p266n8642r247M6025K6950k9125m5344R852N9450P247o4901
825b6482k0000N7943K9273m0644l7804J5073M2296J0633m3232l1120L9818M3269
837C9023k8644m6995Q963M3454J4620l7091l8532K8966N6457j7807o2398N442
849c4542N6101R853m2426k6666K3250M3140m870n2545j0287N4410K2479m4195
861f298l1574K3660L7833J211m1975k2988M3315M0025l7153m7074K3597M7147
$$ plain form
776 -32026 7142 44543 16796 -36581 -20843 37211 36315 -14341 -32604 786 37243 24815
788 24815 -27625 -33144 28415 49294 -11061 -43203 2470 42489 19367 -27726 -32179 18628
800 18628 47441 -1521 -45742 -4866 44432 19388 -28804 -28080 12166 36572 5734 -40521
812 -40521 -20271 38519 31253 -27389 -36636 9389 36339 7214 -38130 -28278 31172 38419 -26482
825 -26482 -46482 11461 40734 90 -37714 -22641 19655 30288 -12944 -44064 -4246 39023
837 39023 10379 -36616 -27653 15801 30421 -6670 -45202 -16236 40221 22414 -39984 -34542
849 -34542 21559 31412 -11014 -37680 -14430 28710 23840 -28705 -38992 15418 37897 -6298
861 -6298 -37872 -14212 23621 24832 -17143 -40131 3184 43209 6056 -41018 -17421 29726
873B9726k972m3324k0726L6178M3621k6917n5216J6525N7011l176m8326j2807
885c0403L1621L0245j2985m4050l186N2115J8034m8480k9488L4066L8083j2843
897B2729m4913r994M8769K9912m6919m0745L8475M4558k2328m2950l01L6000K4155
910C6448k7945m1976J8566N1463o844m9734p718L7705K3453k2121m0028O220N1492
923B8981R168n4296k0329M6006K8544k9604l6615O841M1900J4241m4407k9852
935c9422M1421L8097l0469l9862J1050L5340J0954k9271l2820K1536M7963j2007
947B2510n2765M17M6305J4145l4692l1206J8128M6414l496n4279q183N2831J7572
960C3701m1139k6058K0688L1923J960l7061k1452L8586L5651l3336m0931J9150
$$ plain form
873 29726 26754 -16570 -37296 -1118 42503 15586 -39630 -23105 33906 30730 -17596 -30403
885 -30403 1218 31463 18478 -25572 -28758 23357 41391 -7089 -36577 -2511 35572 22729
897 22729 -22184 -32178 16591 46503 -416 -41161 -2686 41872 19544 -23406 -23707 12293 36448
910 36448 8503 -33473 -14907 36556 29712 -20022 -27740 9965 33418 11297 -28731 -22511 28981
923 28981 38149 -16147 -36476 9530 38074 8470 -28145 -21304 20596 34837 -9570 -39422
935 -39422 1999 40096 9627 -30235 -19185 16155 27109 -2162 -34982 -13446 34517 22510
947 22510 -30255 -29838 16467 30612 -4080 -35286 -17158 29256 25760 -28519 -36702 16129 33701
960 33701 -7438 -33496 -12808 19115 21075 -15986 -37438 1148 36799 3463 -37468 -18318
972a8318M0424N77l7119k2383L0794M1103k2417n0569J3422N0620n68m2128j5355
985c1917K7327L1818j1625m3957j926N0235J2858m4533k1380K9810K8006r363
997A5353l4444j0823L8718K8314l7157l7726K9409M1032j4243l8946o155L3898
1009G230K6444k7287m0484K0808M7373j1167m2902k942L1629J8393j6873l3684
1021b3462K401M5257R877m6320j9215L8717K6507k2891l3827L096L9139J6070
1033C5349m1653k8880L8225L5799k7121l6471Q740L2494J2053k7807l0627K1660
1045h239M3256j3579m6235K909L9218J0793k7286k7562J2681M1074Q33m8309j1129
1058c1575M6724J9149l6122k6442J7139L3070J146l7561j8094L8413K8870l2160
$$ plain form
972 -18318 22106 22683 -14436 -36819 -6025 35078 12661 -37908 -24486 26134 25566 -16562 -31917
985 -31917 -4590 27228 15603 -28354 -30280 19955 32813 -11720 -33100 -3290 24716 15353
997 15353 -19091 -29914 8804 37118 -39 -37765 -8356 32676 18433 -20513 -26668 7230
1009 7230 33674 6387 -34097 -13289 34084 22917 -19985 -22927 8702 27095 10222 -23462
1021 -23462 -21061 24196 34073 -12247 -31462 7255 33762 10871 -22956 -19860 19279 35349
1033 35349 -6304 -35184 3041 38840 11719 -24752 -16012 16482 28535 728 -29899 -8239
1045 -8239 35017 21438 -24797 -21888 17330 28123 837 -26725 -14044 27030 27863 -20446 -31575
1058 -31575 15149 34298 -1824 -28266 -11127 21943 23089 -14472 -32566 5847 34717 2557
1070B557l3003J8651L1116l04k8460k0154K3630L6212j6557m5114R046M4203K080
1083B3903l6688j6737K3432L1064j0114m1783j640M6246J0702m0471j8345K6229
1095d202K4624q285l0912j0439L5198K4926l2992l2983K5625L4654j0679l2952
1107a8417q879K8804K7226k3857l9742J7989M5290q492m0766m176L0166J9109
1119B4255j7990l2697N345M2581N235m1971j3806L4010K0897j8291k8122l58L4349
1132A3437J6721l6042k8079L3851L3224k2183l4093N975L1012J2479k6718k8233
1144b8649K1668L8661j4306l9149L875L2347R629k2048k3657R379L6262J817m1617
1157a5788j0351L9067J8154k8490k5126J1991L0670M809l4699j8739L5382K7385
$$ plain form
1070 2557 -30446 -11795 19321 19017 -9443 -29597 -5967 30245 13688 -31426 -22380 21823 23903
1083 23903 -12785 -29522 -6090 24974 14860 -26923 -28563 17683 28385 -12086 -30431 -4202
1095 -4202 20422 12137 -18775 -29214 5984 30910 -2082 -35065 -9440 25214 14535 -18417
1107 -18417 -27296 1508 28734 4877 -34865 -16876 28414 19922 -20844 -25020 5146 24255
1119 24255 6265 -26432 -21087 21494 26729 -15242 -29048 4962 25859 7568 -20554 -20912 13437
1132 13437 30158 -5884 -33963 -112 33112 10929 -23164 -17189 13823 26302 -416 -28649
1144 -28649 -6981 31680 17374 -21775 -17900 14447 24076 2028 -21629 -12250 24012 25829 -15788
1157 -15788 -26139 12928 31082 2592 -22534 -10543 20127 24936 -9763 -28502 6880 34265
1169C4265k9181l0187J6421K8420P97k6247j9038K1815L3171j6445l9089Q393
1181a6905L7478K525k9793j6970J7917L0300o820m0380k689M3694J0193l7273
1193h723j7864K4019K4131p629l0826q594L3837K0859l2224k6464K3322K7717
1205B1561q813k7143r078K3744K5483k0278l5909J4397L9660n668l5175o876K5657
1218A562K0193j5387l1949M978L8736M072l7656j0700K8432J7907j4400k5065
1230a9277k231L0454J6112l1584k4730K7857K9155j6946k9398J266K7311J5043
1242B3032k4222k8504K0308L6351j2928l6150L325K9717R757k0214k3088R670
1254a2946L3687L01l7796p235L4035J4493k2758k1770Q018K8350O961l2640j8569
$$ plain form
1169 34265 5084 -25103 -8682 19738 20535 -5712 -24750 -2935 30236 13791 -25298 -16905
1181 -16905 20573 23098 -6695 -23665 -5748 24552 17732 -22648 -25337 18357 28550 -8723
1193 -8723 -26587 -2568 21563 13934 -16892 -25486 8351 29210 -3014 -29478 -6156 21561
1205 21561 12748 -14395 -23473 271 25754 5476 -30433 -16036 23624 17956 -17219 -24095 1562
1218 1562 21755 6368 -25581 -20603 18133 22205 -15451 -26151 2281 20188 5788 -19277
1230 -19277 -21508 8946 25058 -6526 -31256 -3399 25756 8810 -20588 -19322 7989 23032
1242 23032 -1190 -29694 -9386 26965 14037 -22113 -18788 10929 20686 472 -22616 -12946
1254 -12946 20741 21042 -16754 -23989 10046 24539 1781 -19989 -11971 16379 23340 -9300 -27869
1267b7869L3114K5886k6399k7999J3948K7110K052k5247j7980K2020L0177j7671
1279A1142l3477R640L1204J605k3760j5233J3614K7624l874l6024l688L7625J0601
1292B6999l1360j6804J8304K3130l943k8924r917L1711J9686k9123k3700K0218
1304c723K4108o174k3916r768K0943K4200j8257l2559J2886L4403m378k9342q048
1317a9625K0470K0345j1368l1929L142L7240M374l5269j0848K6959J6191j3692
1329E990k3351j182K8523J3106k9941k0709K5889K3397j4497k4111n43K2041J5771
1342B0383k0580k8077J7850L4420j1761l3079K149K6653R898j7745k2873Q679
1354a4083L1957p04l4777m995L0063J1673j8983j8538M875K4965Q160k9145j7459
$$ plain form
1267 -27869 5245 31131 4732 -23267 -9319 17791 19843 -5404 -23384 -1364 28813 11142
1279 11142 -22335 -12695 18509 20114 -3646 -18879 -5265 22359 18485 -17539 -21227 16398 26999
1292 26999 -4361 -21165 -2861 20269 16326 -12598 -22515 9196 28882 -241 -23941 -3723
1304 -3723 20385 14211 -9705 -19473 1470 25670 7413 -25146 -12260 22143 17765 -11577 -19625
1317 -19625 845 21190 9822 -22107 -18965 18275 22649 -12620 -23468 3491 19682 5990
1329 5990 -17361 -18543 9980 23086 -6855 -27564 -1675 21722 7225 -16886 -17429 4612 20383
1342 20383 -197 -28274 -10424 23996 12235 -20844 -18695 7958 17856 111 -22762 -14083
1354 -14083 17874 17170 -17607 -22602 7461 19134 151 -18387 -13512 11453 19613 -9532 -26991
1367b6991K8923K3218k2064k4624R987K3828M989k2295j9167K0309K8942j5736
1379I319l1649R099K8159K036k1113j4445J2526K5368m033l2459k179L2864Q860
1392B2353k5620j5009J4153K1095o86k7069j1523L0490J8755k7467k1816J9313
1404c031K2245n867k1901r009K0376K1139j7354k8091J2781K9125m236k4315p508
1417a5646J6518J9247q533k9397J522L4244M297l1389r950K2524J6177j0722k2825
1430a3933k730K7277J2635k7796j8255K2945K0954j2771k1276j228J9723J4493
1442B0038j8308k5170J5469K9965r201k8431l82K2258J1569j4877k3130P047L1016
1455A7863o28l2943m480K7951J0124j7693j6823M577K2508O776k5849j5478K5302
$$ plain form
1367 -26991 1932 25150 3086 -21538 -11551 12277 17266 -5029 -24196 -3887 25055 9319
1379 9319 -22330 -13231 14928 16964 -4149 -18594 -6068 19300 15267 -17192 -19371 13493 22353
1392 22353 -3267 -18276 -4123 16972 16286 -10783 -22306 8184 26939 -528 -22344 -3031
1404 -3031 19214 13347 -8554 -17563 2813 23952 6598 -21493 -8712 20413 16177 -8138 -15646
1417 -15646 872 20119 11586 -17811 -16289 17955 22252 -9137 -19087 3437 19614 8892 -13933
1430 -13933 -16663 10614 23249 -4547 -22802 143 21097 8326 -12950 -14178 5545 20038
1442 20038 1730 -23440 -7971 21994 12793 -15638 -16020 6238 17807 2930 -20200 -13153 17863
1455 17863 17235 -15708 -20188 7763 17887 194 -16629 -12052 10456 17232 -8617 -24095 1207
1468A207J9571j7866k1228O429K1108O360j9838j9546J8522K7029j4110k8683
1480b1045P342K5950J915j8869j3758J0813K3824m250k9181j642K9357P820k2777
1493d501j2994J0699J9894P61k4748j0584K6726J7480k3438k0621J5459K1296
1505A5429k832k0708j0891J9524K1362j7092k6246J2374K6438l792k1471p008
1517a4913J4606J7475p338k5970J081K9990M439k6628r668J8056J5978o625k2703
1530a2220l786K6013J2465k6210j6422K1271J8383j1276j8598j698J7892J3680
1542A9494j6770k2297J3709K5947p568k3711j229J7912J2178j2188k2346N829
1554a1040K8517k12k9276m597K3784J0731j4459j7463L383K2022O603k5092j3334
$$ plain form
1468 1207 20778 2912 -18316 -11887 9221 15581 -4257 -23803 -5281 21748 7638 -21045
1480 -21045 -13703 12247 14162 -4707 -18465 -7652 16172 11922 -17259 -18901 10456 18276 -4501
1493 -4501 -17495 -6796 13098 13859 -10889 -21473 5253 22733 -705 -21326 -5867 15429
1505 15429 12597 -8111 -19002 522 21884 4792 -21454 -9080 17358 13566 -7905 -14913
1517 -14913 -307 17168 9830 -16140 -15059 14931 19370 -7258 -16926 1130 17108 10483 -12220
1530 -12220 -16006 10007 22472 -3738 -20160 1111 19494 8218 -10380 -12078 5814 19494
1542 19494 2724 -19573 -5864 20083 12515 -11196 -12425 5487 17665 5477 -16869 -11040
1554 -11040 17477 17265 -12011 -16608 7176 17907 3448 -14015 -10632 11390 17993 -7099 -20433
1567b0433K3371J6834j6283j8147M995J7999P389j7769j8224J5748K4443j2016
1579G907k5382N171K2083M774j6953j5899J0713K4046n048k8292p5K7143N104
1592A5292j9398j1540R182J7444J362k2971r625K4074J5509k0696j7129J1650
1604f846J8497l07j8732j1930J8115K0807j6282k4213J1474K3594l522j8521p242
1617a5108J2782J7261o968k4619K298K6383L327k3048q046J4690J4320m334k0322
1630a1384m967K4176J1299k3134j5179J8456J7136q466j8068l314J7850J3846
1642A8251j6818k0643J4340K2709p890k0735m12J5554J1241j0473k0486M996K5881
1655A5515K61k6088m381K0610J0454j1291j7089J969K1826N987k4356j1508K2567
$$ plain form
1567 -20433 2938 19772 3489 -14658 -9663 8336 15725 -2044 -20268 -4520 19923 7907
1579 7907 -17475 -12304 9779 14553 -2400 -18299 -7586 16460 11412 -16880 -16955 10188 15292
1592 15292 -4106 -15646 -6464 10980 12342 -10629 -20254 3820 19329 -1367 -18496 -6846
1604 -6846 11651 11344 -7388 -19318 -1203 19604 3322 -20891 -9417 14177 10655 -7866 -15108
1617 -15108 -2326 14935 7967 -16652 -14354 12029 15356 -7692 -15738 -1048 13272 8938 -11384
1630 -11384 -16351 7825 19124 -4010 -19189 -733 16403 7937 -10131 -13445 4405 18251
1642 18251 1433 -19210 -4870 17839 9949 -10786 -11198 4356 15597 5124 -15362 -10366 15515
1655 15515 15776 -10312 -14693 5917 16371 5080 -12009 -10040 11786 17773 -6583 -18091 4476
1668D476J4452j5134j5561M331J5601P419j6279j6521J4751K1465j1109k1834
1680a3943M636J8176N110j3562j4895P827K2775l794k6074k49K3931N397j7070
1693a735j1130P433J6800J373k1770q572K2454J2627j8344j4115R903J5268Q18
1706A1010j6245j1890J5873J9368j4605k1946R677K1164k017j6908p874J1963
1718b430J6790p275k3332L128K4321J578k0446o423J2189J2902l383j8899m868
1731a6148K2171J0738k1228j3889J6018J5587o421j6701m041J6749J3220j6115
1743f0j9029J3249K0952p253j8602m04J3695J0596r432j9003M960K3124k78k2422
1757i907l538J7142R618q780j5555j7K0254O656k2293j0927J9887J3912j2766
$$ plain form
1668 4476 18928 3794 -11767 -7436 8165 15584 -695 -17216 -2465 19000 7891 -13943
1680 -13943 -9307 8869 13979 417 -14478 -6651 16124 12330 -13744 -13993 9938 15335 -1735
1693 -1735 -12865 -5432 11368 12741 -9029 -17601 4853 17480 -864 -14979 -5076 10192 11010
1706 11010 -5235 -17125 -1252 18116 3511 -18435 -8758 12406 10389 -6519 -14393 -2430
1718 -2430 14360 7085 -16247 -13119 11202 12780 -7666 -14089 -1900 11002 7619 -11280 -16148
1731 -16148 6023 16761 -4467 -18356 -2338 13249 6828 -9873 -13914 2835 16055 -60
1743 -60 -19089 -5840 15112 7859 -10743 -11147 2548 13144 3712 -15291 -10331 12793 12515 -9907
1757 -9907 -13445 3697 13315 4535 -11020 -11037 9217 15873 -6420 -17347 2540 16452 3686
1770C686j4747K752J5255P463j5718j5150J4690J8973j0580j8627M000J6016M500
1783A2513j1215j4228O599K1092k893k3096j249K1377N435j4610j1232O264J7153
1796A1910J187k1400o747K0999J1100j6771j2528Q460J3832J303j4866j1111J4747
1809A15J7254j2958j9337Q339J7969k63j5099q608J0465J6591o487k2152L172
1822a0999K2048J811j8448o759J1275J2211l447j7448l912K0200Q191j8274j1202
1835a4753J2869J3075m296j4543n275J4836J2929j4117j8165J1745J8743n722
1847G326j6515k327J2969J0595q930j7939N083K1008j474j9409k852J4534Q550
1860A0619p346j4395j65J8579N938j9648r844J7149J2650j0533j3729J329J5027
$$ plain form
1770 3686 -11061 -8309 6946 14409 -1309 -16459 -1769 17204 6624 -12003 -8003 8013 12513
1783 12513 1298 -12930 -6331 14761 11868 -11228 -12477 8900 14335 -275 -11507 -5243 11910
1796 11910 13097 -8303 -15050 5949 17049 278 -12250 -3790 10042 11345 -3521 -14632 115
1809 115 17369 4411 -14926 -6587 11382 11119 -3980 -12588 -2123 14468 7981 -14171 -10999
1822 -10999 11049 12860 -5588 -12347 -1072 11139 7692 -9756 -13668 6532 14723 -3551 -14753
1835 -14753 -1884 11191 6895 -7648 -12923 1913 14842 725 -17440 -5695 13048 7326
1847 7326 -9189 -11516 1453 12048 3118 -14821 -9738 11270 9796 -9613 -12465 2069 10619
1860 10619 3273 -11122 -11287 7292 13230 -6418 -16262 887 13537 3004 -10725 -9396 5631
1873E631P338j5609j4118J4363J7328j0260j6303L212J3944N252j0269j3710O871
1886f330J9189l665k0221k58J7925N327j1453j1206M525J6166K028j9599o605
1899a4177J9133R984j4787j1444P056J3164J873j4140r823J3875J5032j2102j6269
1912a2625P504J4716L45j1740q793Q251J6094n781j9870K019K0176J800j5397
1925c301o939R107J2285k330j7580l147J8979P201j6706r980J1589J1052l120
1938G110j2659n497J3650J2314j3821j5627J0629J5577m211j3825l528J1179J1079
1951A2370q250j7737N308J9800j957j7637k378J2368Q344o307j4065J87J7234
1964G280M949j7979q101J4712J0166p864j1948j65J3161P973j4206j3338J2367
$$ plain form
1873 5631 12969 -2640 -16758 -2395 14933 4673 -11630 -8418 5526 10778 509 -13201 -6330
1886 -6330 12859 9194 -11027 -11285 6640 11967 514 -10692 -6167 9999 12027 -7572 -14177
1899 -14177 4956 14940 153 -11291 -4235 8929 10802 -3338 -13161 714 15746 3644 -12625
1912 -12625 -5121 9595 9940 -1800 -10593 -2342 13752 7971 -11899 -9880 10296 12096 -3301
1925 -3301 -10240 -1133 11152 8822 -8758 -11905 7074 14275 -2431 -12411 -822 10230 7110
1938 7110 -5549 -11046 2604 14918 1097 -14530 -3901 11676 7465 -6360 -9888 1291 12370
1951 12370 4120 -13617 -8309 11491 9534 -8103 -10481 1887 10231 3924 -10141 -9954 7280
1964 7280 12229 -5750 -13851 861 11027 3163 -8785 -8950 4211 12184 -2022 -15360 -2993
1977b993J5962q545j5179K394J2629N412r334j3176O412J7473l619j7890L0J4995
1991D571M768r343j0061K945J4782K741j8077n956J7182Q820j2792j0297N625
2004e092J1688L043j3354r338J3180J3459j1102j4441O425J2903J188j0479q651
2017a0571P995J4681n647j7566K683J6729K031j2961o698P369J1948j421j6429
2030g857l524J7753O703j5397q579R616J0743k517j1880m876J2637J1073j2474
2043A421j3702R264J3533l139j2003l769R603J0505p156j6065M581J7874j629
2056I318j5546k559J1111P743n665j2775k89J6027M352j6440o691J2832Q913o541
2070C790j0416j196J1810P700j3054j1780J1127J3821p434j3113J618J0725O135
$$ plain form
1977 -2993 12969 4424 -10755 -8361 4268 9680 346 -12830 -6418 11055 7436 -10454 -10424 4571
1991 4571 9339 -4 -10065 -7120 7662 10403 -7674 -13630 3552 12372 -420 -10717 -5092
2004 -5092 6596 9639 -3715 -13053 127 13586 2484 -11957 -5532 7371 8559 -1920 -10571
2017 -10571 -2576 12105 6458 -11108 -8425 8304 10335 -2626 -9324 -1955 9993 8572 -7857
2030 -7857 -11381 6372 13075 -2322 -10901 -1285 9458 6941 -4939 -9815 2822 13895 1421
2043 1421 -12281 -3017 10516 7377 -4626 -8395 1208 11713 4557 -11508 -6927 10947 9318
2056 9318 -6228 -8787 2324 10067 4402 -8373 -8662 7365 11717 -4723 -11414 1418 10331 3790
2070 3790 -6626 -7822 3988 11688 -1366 -13146 -2019 11802 4368 -8745 -7127 3598 9733
2083I733q819j2575O185J6336l971j6552L86J3689M316q481r372K777J3849J740
2097I241j6096n400J5262P156j0399r279M047J1157L390j2831r123J2254J2475
2110A1854j0438j3022N886J1971R52r518p847P235J3397n304j5708K271J4861
2123F590J603j0807o723N931J1619r89j5023k759J5692N770j3320p611Q262R680
2137G915j319j1089n625J2334R803j1588j1675P868J2046k431j0390m083Q614
2150C80J0417o466j4721M023J5440m99j3715k916R410P838m513j2013m87J5201
2164G379L493j5108n777J1568P504n249r581r79J1135O992j1898j0715J0297J1498
2178A0559n912j1124L49R606O510q269j2208O454J5018l972j4761M39J1599M491
$$ plain form
2083 9733 914 -11661 -5476 10860 6889 -9663 -9277 4412 8728 247 -9125 -6348 7501 9241
2097 9241 -6855 -12255 3007 10163 -236 -9515 -5468 5689 9079 -3752 -12875 -621 11854
2110 11854 1416 -11606 -5720 6251 7203 -2315 -10162 -2927 10470 5166 -10542 -8271 6590
2123 6590 8193 -2614 -9337 -3406 8213 7224 -7799 -10558 5134 10904 -2416 -10027 -1765 7915
2137 7915 6596 -4493 -10118 2216 12019 431 -11244 -3376 8670 6239 -4151 -8234 380
2150 380 10797 4331 -10390 -6367 9073 8574 -5141 -8057 1353 9191 4678 -7335 -7822 7379
2164 7379 10872 -4236 -10013 1555 9059 3810 -5771 -6750 4385 11377 -521 -11236 -939 10559
2178 10559 4647 -6477 -6128 3478 9988 1719 -10489 -4035 10983 7011 -7750 -7311 4288 8779
2192H779p252r407K696J2645J489j4890m164J3136O503r129q080K802J0083L228
2206H439j1023r023J1660J0805q956j1530M427J0544J719q666q575P321J2616
2219I758n208j4246K354J3123J550r196o183M763J0692j222j3558k433J4036M848
2233I078j1385p078O742Q966k37j0878n339J1831Q836j1182j0326P615J0482k551
2247D574q717l844P317R701o265j2823M155J3525j219j1155k934P771P530l110
2261D506j2077o09J4583K609j3174m998J0161O910m111r156j848J1081O421j1242
2275i44r582R453J0355n471r411K0Q455O142o799j1447N041J3541l046j2689k64
2290f646J0096M384n405r374J950J2669J262j4021l544J2122M748o981p273J710
$$ plain form
2192 8779 1527 -7880 -5184 7461 8950 -5940 -10104 3032 9535 406 -7674 -4872 5211 8439
2206 8439 -2584 -11607 53 10858 1902 -9628 -5201 5343 7062 -1604 -10179 -2858 9758
2219 9758 4550 -9696 -7342 5781 7331 -1865 -8048 -3285 7407 6185 -7373 -9806 4230 9078
2233 9078 -2307 -9385 -2643 6323 6086 -4792 -10131 1700 10536 -646 -10972 -3357 7125 4574
2247 4574 -4143 -7987 -670 9031 2766 -10057 -5902 7623 6404 -4751 -7685 86 7616 4506
2261 4506 -7571 -8180 6403 9012 -4162 -9160 1001 7911 3800 -5356 -7204 3877 10298 -944
2275 -944 -10526 -1073 9282 3811 -5600 -5580 2875 9017 2218 -9229 -4188 9353 6307 -6382 -6646
2290 -6646 3450 7834 2429 -6945 -4995 7674 8936 -5085 -8629 3493 8241 1260 -6013 -4303
2304d303R366M012j0979p607J0072R686q026r899L595Q781K717q105p819O660
2318a849J1866n223j3483K963J1159J313p843o106M506R919p10j2808k214J2853
2332D343M147j0228n813N213Q177K30j0051n293J0873Q095j0111r103O778Q933
2346F190j778p712m304P064R178o102j2042M070J2006j273r747k287O125P466
2360F854k697j1437l89J2943K623j1853m885Q860O585l679q289j897J0322N816
2374H877j0774q180Q799Q928m913q183p6O920O022o078j0158N201J1710k931j1287
2389f123L8Q270M510n064q370J868J1531N87j2430k738J0738M741o801o146J010
2404d379Q966L102r988o502R601Q336p373q203K846P892K764p163p615N954J1198
$$ plain form
2304 -4303 5063 9075 -1904 -9511 561 10247 2221 -7678 -4083 4698 7415 -690 -8509 -1849
2318 -1849 10017 4794 -8689 -5726 5433 6746 -1097 -7203 -2697 7222 6512 -6296 -8510 4343
2332 4343 8490 -1738 -7551 -2338 5839 6069 -3982 -9275 1598 9693 -418 -9521 -2743 6190
2346 6190 4412 -3300 -7604 -540 8638 2536 -9506 -5436 6570 5297 -4450 -6737 -612 6854
2360 6854 4157 -7280 -7669 5274 7897 -3956 -8841 19 6604 2925 -5364 -7261 3061 8877
2374 8877 -1897 -10077 -1278 7650 2737 -5446 -5522 1398 7420 1342 -8816 -3615 8095 5164 -6123
2389 -6123 -6085 2185 6695 1631 -6739 -4871 6660 7247 -5183 -7921 2817 7558 757 -5389 -4379
2404 -4379 4587 7689 -2299 -8801 800 9136 1763 -6440 -3594 4298 7062 -101 -7716 -1762 9436
2419I436m875j1942K255J0418J227p149n345L650R627j030j2126r70J1531L094
2433G801r227m570M317P004Q04q948n083R824P508r483p702N729Q006j047p220
2448b287m356O580Q447n715j1022M103J0604j172q662k552N687O780k526j0395
2462f486oJ1289K298j0648l913P182N757k291p892j903R027N703r973p371Q252
2477i75P532l922p308j088P037N847o323r310N269J0471l380r314j96O824M553
2492E717l727q573J375J1013N22j1642k319R626M080n285o410Q21Q842L218r861
2507b603o070R331O726o417o632J878O742L170o205p729N774J0043m470j0314
2521f776K361Q238J910n843n859L200R290p03j1225j224J0657K891p614m667L423
$$ plain form
2419 9436 4561 -7381 -5126 5292 6519 -630 -5975 -2325 7302 6272 -5854 -6824 4707 7801
2433 7801 -1426 -5996 -1679 5325 6129 -2819 -7902 1922 9430 -53 -7755 -2026 5980 4933 -2287
2448 -2287 -6643 -63 8384 2669 -8353 -4250 6354 5182 -3480 -6032 -345 6435 3909 -6486
2462 -6486 -6492 4797 7095 -3553 -7466 -284 5473 3182 -4710 -6613 2414 8117 -1856 -9227 -975
2477 -975 6557 2635 -4673 -5761 1276 7123 800 -8510 -3241 7230 3850 -5464 -5660 1164 5717
2492 5717 1990 -6583 -5208 5805 6327 -5315 -7634 1992 6072 787 -5623 -4802 4040 7258 -2603
2507 -2603 -8673 658 7384 967 -5665 -3787 2955 6125 -80 -7809 -2035 8008 3538 -6776
2521 -6776 -4415 3823 5733 -110 -5969 -2769 6521 5818 -5407 -6631 4026 6917 -697 -5364 -1941
2536a941P003P65q757m295R587N631p815o893M742O840ko287m905O335Q359n676
2552B691j0090L903R477j159p139k644M903O415k260r676K96J0612J559r429l804
2567f345O426N288j363p788k217Q851N153r103o838P366O749l315o582j539O912
2582A655N573o059r087N555R238l510q155R5N809M316l647p842J146J0584Mj0365
2598d690j760Q058L825m544n729Q0Q361L041r381n393Q778O006n695o214J646
2613c611N757L399o148o887N505Q869m134r123J827P332J500m325n933K855R095
2628E978r98j0489n95R247K606o792m317K664O751J310q610l675R047M989p552
2643d36n747M493N549M8n289m700N574P968n321q800L583Q134n68o486k632M026
$$ plain form
2536 -1941 5062 5827 -2930 -7225 2362 7993 178 -6715 -1973 4867 4865 -1422 -6327 8 8367 2691
2552 2691 -7399 -3496 5981 4822 -2317 -4961 -58 6357 4097 -5579 -5283 5329 6888 -2541 -6345
2567 -6345 81 5369 4006 -3782 -5999 2852 8005 -1098 -7936 -570 6179 2864 -3718 -5257 1655
2582 1655 7228 1169 -7918 -2363 6875 3365 -4790 -4695 1114 5430 1783 -6059 -4913 5671 5675 -4690
2598 -4690 -6450 1608 5433 889 -4840 -4760 3601 6642 -2739 -8132 646 6652 957 -5257 -3611
2613 -3611 2146 5545 -603 -7490 -1985 6884 2750 -6373 -4546 2786 4286 -39 -5972 -3117 5978
2628 5978 4980 -5509 -6104 3143 5749 -1043 -5360 -2696 4055 5365 -3245 -6920 2127 7116 -436
2643 -436 -6183 -1690 3859 3907 -1382 -6082 -508 7460 2139 -6661 -3078 5056 4488 -1998 -4630 -604
2659f04O696k129r415N11R810J172q249k680M691M877r26p063k521Q739M525q377
2675i43n585O084N916k392n705k264N899O279o020q404M812Q554k593p370j17
2690c849N301L983l263p470J296R616k50r537j344P075L274l153n567n31P798
2705C379L225q733m772P709N457n348n274Q68N918K950n734o855N731Q046m474
2720B093p662J844O523J400l898n601K243Q287q79r470o18Q388K083n445m242
2735d954K109O311J433q093l683Q533M307o807n045L937N235N05n200m560N217
2750g55P352n086p817L509O618k68n442l141L666O437j475r335O14R432O13p193
2766b271k377M075M756q20o881k206Q279L975p534n078N511N043j957m855k382
$$ plain form
2659 -604 6092 3963 -5452 -4941 4869 6041 -2208 -4888 -197 4680 3754 -3309 -5830 2909 7434 -943
2675 -943 -6528 -444 5472 3080 -2625 -4889 1010 7289 1269 -7135 -2323 6231 3638 -3732 -3849
2690 -3849 1452 5435 2172 -5298 -4002 5614 5364 -4173 -5517 1558 4832 1679 -3888 -4419 3379
2705 3379 6604 -2129 -6901 808 6265 917 -4357 -3489 2429 5379 -355 -7210 -1479 6567 2093
2720 2093 -5569 -3725 2798 4198 300 -5301 -3058 5229 4350 -5120 -5738 2650 4733 -712 -4954
2735 -4954 -2845 3466 4899 -3194 -6877 1656 5963 -844 -5889 -1952 3283 3788 -1412 -5972 -755
2750 -755 6597 1511 -6306 -2797 3821 3553 -1889 -5030 -1364 5073 3598 -5737 -5123 4309 4922 -2271
2766 -2271 -4648 -573 4183 3363 -3518 -5724 2555 6530 -1004 -6082 -571 4472 2515 -2340 -4722
2781d722N507N883n652p455M652P446k390o617m88M716M110k818p220J342Q993
2796E287k91q531q31N904K952k594n373k68P396K250p534m353P059M680m416m852
2812c515L37N563L099n528o051N052P160l923o851J793N535J595l701n652K593
2827b494P803j144q591l28P652J641m893l777J648N772J515p697l108P705L947
2842E651n985m421L010M638J117n514m412N914O305n113o996L276N873m82m117
2857a256l387L593O013k283q024Q62Q109M95o407k639L870M471k81o909j949Q099
2873B377L330p520l811M992M203j244m574k287N149N245n269o748M259O764k104
2888B762n552j091L928M843k965p241J755Q092l97p908m75N263K895j998n436
$$ plain form
2781 -4722 785 6668 1016 -6439 -1787 5659 3269 -3348 -3836 880 4990 2172 -5048 -3706 5287
2796 5287 4996 -3535 -4366 1538 4490 1896 -3477 -3745 3651 5901 -1633 -5986 1073 5753 1337 -3515
2812 -3515 -3178 2385 5484 -44 -6095 -1043 6117 2194 -4657 -2864 2671 4266 565 -5087 -2494
2827 -2494 5309 4165 -4426 -4754 2898 4539 -354 -4131 -2483 3289 4804 -2893 -6001 1704 5651
2842 5651 -334 -4755 -1745 2893 4010 -1504 -5916 -2 6303 1190 -5806 -2530 3343 2861 -1256
2857 -1256 -4643 -1050 4963 2680 -5344 -4482 3627 4122 -2285 -4924 -1054 3417 3136 -3773 -5722 2377
2873 2377 5707 -1813 -5624 -632 3571 2327 -2247 -4534 615 5860 591 -6157 -1898 4866 2762
2888 2762 -2790 -3881 47 4890 1925 -5316 -3561 4531 4134 -3774 -4249 1014 3909 1911 -3525
2903c525n22O956K555p527l180O409L681l485m440k05N260L278n144n917N391
2918d15O416m117n912J279M878K155l348n440K670P243j767p470J9O312J350l684
2934A69l599J213N752J198o964k943P040L558n810l686K022M746J223n078m187
2949e346N665N453m876n909L496M851o67l606l169L118N684j779p736J041P555
2964C775k5n368k193K783M514k23o738j418P431K498o561l401M436L727j148m265
2980b176k205N047M798n371n854M427N413k055m611j134L755M287k416p015K178
2995b932P236q02o960n26M366K817j587n133l60O825K081p435k546N796K962k980
3011H22l719n1M205L672n010n482M895N602l619n108J202M101K253l337m916K467
$$ plain form
2903 -3525 -4047 2909 5464 -2063 -5243 1166 4847 1362 -3078 -3283 1977 5255 111 -5806 -415
2918 -415 6001 1884 -4028 -2749 2129 4284 936 -4504 -1834 5409 3642 -3828 -3809 2503 3853 169
2934 169 -3430 -2217 3535 4733 -2231 -5174 1866 5424 -386 -4072 -2050 2696 3919 -1159 -5346
2949 -5346 319 5772 896 -5013 -1517 3334 2667 -939 -4108 -990 4694 2915 -4821 -3780 3775
2964 3775 3750 -1618 -3811 -1028 3486 3263 -3475 -4893 2538 5036 -1525 -4926 -490 3237 2089 -2176
2980 -2176 -4381 666 5464 93 -5761 -1334 4079 2024 -2587 -3721 34 4321 1905 -5110 -2932
2995 -2932 4304 3502 -3458 -3984 382 3199 1612 -3521 -3881 2944 5025 -2410 -4956 840 3802 822
3011 822 -2897 -2948 1257 4929 -81 -5563 -668 4934 1315 -3793 -2591 1510 3763 426 -4490 -2023
3027b023O877j566p168M20N832J022l389l254J036N657J117p039k438O975K819
3042D878n283k900J645M373J467n404l649N157N305m621n322K954M170J76l648
3057g02k902K540N750j894p174J229O709J01m987k102K643M064J64o477j204O988
3073B746K137o450k736M181L013m43m310k196M957M338n218n085M257M460j805
3088A846m058j096L501M186l110o226K134P026j512n732k94L848K684j738m978
3103c519l23O821J171o597j983N103K965k833l692j41M481K932n108m561N030
3118b54M618l177m463Q83L566K070k832m986K625O388j916o092M03M637J304k665
3134A09l453N37N980Q16o866j188N876K337m657k505J204L699J675m773l602N194
$$ plain form
3027 -2023 4854 3288 -3880 -3460 2372 3394 5 -3249 -2213 3444 4561 -2478 -4916 2059 4878
3042 4878 -405 -3305 -1660 2713 4180 -1224 -4873 284 5589 968 -4354 -1400 2770 2946 -702
3057 -702 -3604 -1064 4686 2792 -4382 -3153 3556 3657 -1330 -3432 -789 3275 3439 -3038 -4242 2746
3073 2746 4883 -1567 -4303 -122 2891 2448 -1862 -4058 899 5237 19 -5066 -809 3651 1846
3088 1846 -2212 -3308 193 4379 1269 -4957 -2823 4203 2691 -3041 -3335 513 3197 1459 -3519
3103 -3519 -3842 2979 4150 -2447 -4430 673 3638 805 -2887 -3028 1453 4385 -723 -5284 -254
3118 -254 4364 1187 -3276 -2393 1173 3243 411 -4575 -1950 4438 2522 -3570 -3167 1470 2774 109
3134 109 -3344 -2807 3173 3989 -2877 -4065 1811 4148 -509 -3014 -1810 1889 3564 -1209 -4811 383
3150C83M865m588m734K654L736O54l194l726L072N345k170o315J318N724j71l955
3166a102k096K315M335m13o200p46O469J669n398k169K702L604n02m192k027M981
3182A230L950n245m310L578M436j164m154j387L118M121k753n658K147N844j008
3197B745m804r31L138K790j206m902K1O392R29n987k053M753K307k083l494n07
3213b892M451K765m926m010M472L974l021l755K15L873K165k754m764K415N924
3228D132k270n390Q04L967J407k165l636P86N381L15o358j044N632K018m147k597
3244c165J162L724J927n060l203N140L798m113l921K058L596M80l079l332L112
3259h76N293k483n752J397N355n81l078k217J853M163m06n690m49N660J379m653
$$ plain form
3150 383 5248 660 -4074 -1420 2316 2970 -224 -3950 -878 4467 2297 -4018 -2700 3024 2853 -1102
3166 -1102 -3198 -883 3452 3039 -3161 -3907 2562 4231 -1167 -3336 -634 2970 2468 -1724 -3751 1230
3182 1230 5180 -65 -4375 -797 3639 2475 -1679 -3066 52 4173 1420 -4238 -2091 3753 2745
3197 2745 -2059 -2990 148 2938 1732 -3170 -3149 3243 4172 -1815 -3868 885 3192 1109 -2385 -2892
3213 -2892 1559 4324 -602 -4612 -140 3834 813 -2942 -2727 1146 3311 557 -4207 -1792 4132
3228 4132 1862 -3528 -2724 1243 2650 485 -3151 -2365 3016 3331 -3027 -4071 1561 3579 -568 -3165
3244 -3165 -2003 1721 3648 -1412 -4615 525 4323 210 -3711 -1653 1943 2423 -656 -3988 -876
3259 -876 4417 1934 -3818 -2421 2934 2353 -725 -2942 -1089 3074 2668 -3022 -3471 2189 3568 -1085
3275a085j941K260L297q4m165k160M866L737n008l741L401L542q39l552j648L194
3291G4M085l044n147K445M900r54m396m49K609K914j310m816M97N439R76n916
3307b093j459M200K141j597k922j147M511K716n196l361M462L291k389l205j4
3322b062K994K301k299m634K413N134j717m871L78L773J487k470l265K94N770
3337C226j77n643q03M896J533l084k709P42L728J475m535k557M669L014l536l294
3353c055J747K631J181l113l178K870M639k292n214J685M306l14k645k057J619
3368a190L849k00n471k93N491J077m567j336J519L073K43l952j797M528K970l980
3384c6l614L065L123j025l219j143K627M029k782m884K287M733j280l945m22K395
$$ plain form
3275 -1085 -3026 -766 2531 2447 -1718 -3878 988 4725 -283 -4024 -623 2919 2080 -1472 -3120 74
3291 74 4159 1115 -4032 -1587 3313 2359 -2037 -2486 123 3037 1727 -3089 -2592 2847 3823 -2093
3307 -2093 -3552 648 2789 1192 -1730 -2877 1634 4350 -846 -4207 255 3546 1157 -2048 -2062
3322 -2062 932 3233 934 -3700 -1287 3847 2130 -2741 -2363 1410 2897 427 -2838 -2544 3226
3337 3226 3049 -2594 -3397 1499 3032 -52 -2761 -2019 1709 3184 -1351 -3908 761 3775 239 -3055
3353 -3055 -1308 1323 2504 -609 -3787 -917 3722 1430 -3784 -2099 2207 1893 -752 -2809 -1190
3368 -1190 2659 2459 -3012 -3305 2186 3263 -1304 -2640 -1121 1952 2195 -1757 -3554 974 3944 -36
3384 -36 -3650 -585 2538 1513 -1706 -2849 -222 3807 1025 -3859 -1572 3161 1881 -2064 -2486 -91
3400i1K627j160l975l83N780N94n120j093L543K030j559l285o22M148K599m801
3416g68k885L876L059k232l155Q9K966K393k661l997K148M986j987m392M81L291
3432A212J143j508l407P59M883p4n043p36M413J052k384k053P1L362J658m632
3448a284k534M419L088l285k992J422K605R33k467l351K849M199k260m396J486
3463a568L407M48k612k347J645L941n93n338N3M990Q60l945j594J752K656M16
3479B171m065j686M791K590m121k745K443K858m87k847j862K712L632k443m658
3494c717K343M201r59l554r75K568K429q12m263L10M973R8m084j020K635J847
3510B020p39k888r65M140J999m325k366L335K398j813k911K1K778K415k753l905
$$ plain form
3400 -91 2536 1376 -2599 -2982 2798 3392 -1728 -2821 722 2752 1193 -2092 -2714 1434 4033 -768
3416 -768 -3653 223 3282 1050 -2105 -2016 950 3343 682 -3315 -1167 3819 1832 -2560 -2079 1212
3432 1212 2355 847 -2560 -1801 3082 3008 -2035 -2771 1642 2694 310 -1743 -1672 1690 3348 -1284
3448 -1284 -3818 601 3689 404 -2588 -1166 1439 2372 -95 -3446 -597 3602 1342 -3054 -1568
3463 -1568 1839 2287 -325 -2672 -1027 2914 2321 -3017 -2964 2026 2886 -1059 -2653 -901 1755 2171
3479 2171 -1894 -3580 1211 3801 -320 -3065 -622 2236 1749 -1098 -2960 -248 3384 941 -3717
3494 -3717 -1374 2827 1868 -1686 -2661 -93 2336 1524 -2739 -2429 2544 2642 -1442 -2462 173 2020
3510 2020 1281 -1607 -2572 1568 3567 -758 -3124 211 2609 796 -2115 -2094 684 3099 346 -3559
3526c559K651M478k009l922O82K731J181j582l513J371M053Q5m819j08L729Q47
3542B296k094j909r9L440J338m462j954M304K379l124k557J469K287J484k835
3557c7k924K828L654k316l719J182L270j6j903k372Q97M100m72m679o5M599P47
3574B774l564j251R52K835P50m045j463M297J969l673k374K221K774j41k998j926
3590b863K796L394k466l974J883L540n71k799r92J908K805j111m132J96M788o0
3606B342l654j110K892J452o20l174q96L970J787m365j712L094K151j285k399
3621a527m13K226K778k870l722K834L444j702l216N37K102J839j749l233R76M389
3637B693m54m360m29L821P06j542k064j19L463P74l724j793L594K370k712k342
$$ plain form
3526 -3559 -908 3570 1561 -2361 -1679 1052 2233 651 -2862 -1491 2562 2647 -2172 -2280 1449 2296
3542 2296 202 -1707 -1806 1634 2972 -1490 -3444 860 3239 115 -2442 -973 1314 2798 -37
3557 -37 -2961 -133 3521 1205 -2514 -1332 1938 1922 19 -2353 -1456 2644 2172 -2507 -2572 2027 2774
3574 2774 -790 -2041 -1089 1746 2496 -1549 -3012 1285 3254 -419 -2793 -572 2202 2061 -937 -2863
3590 -2863 -67 3327 861 -3113 -1230 2310 1739 -1060 -2052 -144 2661 1550 -2582 -2386 2402 2342
3606 2342 -1312 -2422 470 1922 1302 -1872 -2768 1202 2989 -1376 -3088 6 2157 872 -1527
3621 -1527 -1940 286 3064 194 -3528 -694 2750 1048 -2168 -1631 471 2310 561 -2672 -1696 2693
3637 2693 2239 -2121 -2550 1271 1977 435 -1629 -1748 1715 2489 -1235 -3028 566 2936 224 -2118
3653b118O91K320J445k858k698L085L641k662l359J162K802L08j666k483J063
3668a327L730l27m194J53L593N76k588j332Q09L162j22l789j132L953K001l741
3684e75j636J574K472l59j994j579K213K986k472l461J946L202r06k277j102J438
3700e30K879j005l887M56M422k72l168r20K048J880n81l046o20L945J261l790
3716i28j651K889J885j541j998r49K644K219k524k851K226L454j829k800L82J906
3732E34J444j454l068J035M157p76l490n60K988R26j439k046k90L216Q92l504
3748a435j269L279J904k324k092O16J992J587k422k807K526L339k254k931J256
3763a035K159L88j493k501J288L743r20l665K5L325O31k343j271Q66K527K33l221
$$ plain form
3653 -2118 -1427 893 2338 -520 -3218 -133 3508 846 -2513 -1351 1451 1759 93 -2390 -1327
3668 -1327 2403 2076 -2118 -1965 1628 2204 -384 -1716 -907 2255 2133 -1656 -2788 1165 3166 -575
3684 -575 -2211 -637 1835 1476 -518 -2097 116 3102 630 -2831 -885 2317 1411 -866 -1968 -530
3700 -530 2349 1344 -2543 -2087 2335 2063 -1105 -2025 23 1903 1322 -1724 -2344 1601 2862 -928
3716 -928 -2579 310 2195 654 -1344 -2293 351 2570 46 -2805 -579 2875 1046 -1754 -1372 534
3732 534 1978 524 -2544 -1509 2648 1872 -1618 -2178 810 1736 297 -1749 -2039 1177 2069 -1435
3748 -1435 -2704 575 2479 155 -1937 -1321 671 2258 -164 -2971 -445 2894 640 -2291 -1035
3763 -1035 1124 1512 19 -2482 -1194 2549 1629 -2036 -2011 1314 1945 -398 -1669 -803 1724 1957 -1264
3780a264j366L677J528k881j936J827J802J54j862k273K662K990k714k697J400
3795i53K831n68j944j089J134L042j120l555P85L585q6l197o49J558J854m51k543
3812a366q63L620J137l451j123K170K017j048j937p26K059K256k603k969K589
3827b38K781j748k151k66J759J837j350k991J022L567p25l101j18K267J198j375
3843C68k126p6L333P50l414j035L066J134j721j795N63J499J373k088k387K263
3859b93K896k139k421Q65K121M21j513k085J256L051j058l046M92K981k15j676
3875c63j176N26K312K73l063r53L435J321k478j451J047J838K48k013j828K392
3891F7K565k434k430J606K333m31j560j454J132K586p43l735J262K980k23k504
$$ plain form
3780 -1264 -2630 1047 2575 -306 -2242 -415 1387 1541 -321 -2594 68 3058 344 -2353 -953
3795 -953 1878 1310 -634 -1723 -589 2453 1333 -2222 -1437 2148 2062 -1135 -1784 -226 1628 1177 -1366
3812 -1366 -2229 1391 2528 -923 -2046 124 2141 1093 -844 -1570 489 2745 142 -2827 -238
3827 -238 2543 795 -1356 -1622 137 1974 624 -2367 -1345 2222 1497 -1604 -1722 545 1743 368
3843 368 -1758 -1834 1499 2249 -1165 -2200 866 2000 279 -1516 -953 546 1919 -169 -2556 -293
3859 -293 2603 464 -1957 -1092 1029 1450 -63 -2148 -892 2159 1101 -1945 -1453 1528 1313 -363
3875 -363 -1539 -1013 1299 1572 -1491 -2444 991 2312 -166 -1617 -570 1268 1516 -497 -2325 67
3891 67 2632 198 -2232 -626 1707 1276 -284 -1738 -606 1980 1237 -2498 -1236 1744 1521 -983
3907i83l39J077J861l33k790n50L223J077l097j090K001J454m73j948r13K175
3923C52K145k391k706K393K468j003k028n19J493J432p59l091J130L303n32l055
3939a368j73J928J367j202k077o8L100O35l350o94K840J049j349j511o23K019
3955E23J832k989j793K704K157j825k217Q27J735O15j396k295J333L234j269l000
3971a824N49K454J57j348j794Q86K310L41l495m47L074J328k641j183J005J665
3987A037N11k257j509K366K066k191k190J461J625m1j361j598J580K395j014l079
4003b199Q18K767K7k423p50J379J425kk601n65L462N64k665j366K145J242j23
4020A135j871j176K315J920k649k034K103J840o65j820l30J358J792j216k816
$$ plain form
3907 -983 -1322 -245 1616 1283 -1507 -2057 1166 2243 -854 -1944 57 1511 1038 -910 -1823 352
3923 352 2497 106 -2600 -207 2261 1258 -770 -1289 204 1636 877 -2214 -1084 2219 1687 -1368
3939 -1368 -1541 387 1754 552 -1525 -1593 1507 2142 -1208 -1902 938 1987 638 -873 -1496 523
3955 523 2355 -634 -2427 277 2434 609 -1608 -781 954 1569 173 -2122 -789 2445 1176 -1824
3971 -1824 -1275 1179 1336 -12 -1806 -920 1390 1731 -1764 -2211 863 2191 -450 -1633 -628 1037
3987 1037 1548 -709 -2218 148 2214 23 -2167 -706 919 878 -483 -2081 -501 1894 880 -2199
4003 -2199 -1381 1386 1413 -1010 -1760 -381 1044 1042 -1559 -2124 1338 1902 -763 -2129 16 1258 1135
4020 1135 -736 -1912 403 2323 -326 -2360 -257 1583 918 -902 -1232 126 1918 702 -2114
4035b114J401K479m34k569o3K052N31p53j972o7K797O30l138j054L003J052j308
$$ plain form
4035 -2114 -713 1766 1332 -1237 -1300 752 1283 530 -1442 -1509 1288 1918 -1220 -2274 729 1781 473
$$ [...]
8191A03
##END NTUPLES=NMR FID
##END=
