##TITLE=1H_TG-2258-0
 DMSO, 8 sc, 
 24.10.2019
##JCAMPDX= 6.0         $$ Bruker NMR JCAMP-DX V2.0
##DATA TYPE= NMR FID
##DATA CLASS= NTUPLES
##ORIGIN= UXNMR, Bruker Analytische Messtechnik GmbH
##OWNER= root
$$ XWIN-NMR		Version 3.5
$$ Thu Oct 24 14:26:26 2019 Russian Standard Time (UT+4h)  she@DPX200
##.OBSERVE FREQUENCY= 200.1315
##.OBSERVE NUCLEUS= ^1H
##.DELAY= (6, 6)
##.ACQUISITION MODE= SIMULTANEOUS
##.ACQUISITION SCHEME= undefined
##.AVERAGES= 8
##.DIGITISER RES= 18
##SPECTROMETER/DATA SYSTEM= spect
##.PULSE SEQUENCE= zg30
##.SOLVENT NAME= DMSO
##.SHIFT REFERENCE= (INTERNAL, DMSO, 0, 15.7039)
##AUDIT TRAIL= $$ (NUMBER, WHEN, WHO, WHERE, WHAT)
$$ ##TITLE= Audit trail, XWIN-NMR		Version 3.5
$$ ##JCAMPDX= 5.01
$$ ##ORIGIN= Bruker BioSpin GmbH
$$ ##OWNER= she
$$ F:/spectra/data/she/nmr/H-F/1/audita.txt
$$ ##AUDIT TRAIL=  $$ (NUMBER, WHEN, WHO, WHERE, WHAT)
(   1,<2019-10-24 14:25:35.67 +0400>,<she>,<DPX200>,
      <created by zg, POWCHK disabled, PULCHK disabled
       configuration hash MD5:
       00 E9 B6 7A A2 85 ED C7 34 08 36 98 17 FE 4E 26
       data hash MD5: 16K
       CD 9D C3 86 13 25 42 45 B7 2A 29 59 CA 78 52 5A>)
$$ ##END=
$$ 
$$ hash MD5
$$ 8B 38 0B 31 16 10 D4 87 A4 7D B3 E2 5A 38 28 12
##$RELAX= 
##$RELAX= 
##$RELAX= 
##$RELAX= 
##$RELAX= 
##$RELAX= 
$$ Bruker specific parameters
$$ --------------------------
##$DU= <F:/spectra>
##$EXPNO= 1
##$NAME= <H-F>
##$PROCNO= 1
##$TYPE= <nmr>
##$USER= <she>
##$AMP= (0..31)
100 100 100 100 100 100 100 100 100 100 100 100 100 100 100 100 100 100 
100 100 100 100 100 100 100 100 100 100 100 100 100 100 
##$AQSEQ= 0
##$AQ_mod= 1
##$AUNM= <au_zg>
##$AUTOPOS= <>
##$BF1= 200.13
##$BF2= 200.13
##$BF3= 200.13
##$BF4= 200.13
##$BF5= 200.13
##$BF6= 200.13
##$BF7= 200.13
##$BF8= 200.13
##$BYTORDA= 1
##$CFDGTYP= 0
##$CFRGTYP= 5
##$CHEMSTR= <none>
##$CNST= (0..31)
1 1 145 1 1 1 1 1 1 1 1 1 1 1 1 1 1 1 1 1 1 1 1 1 1 1 1 1 1 1 1 1 
##$CPDPRG= <>
##$CPDPRG1= <>
##$CPDPRG2= <>
##$CPDPRG3= <>
##$CPDPRG4= <mlev>
##$CPDPRG5= <mlev>
##$CPDPRG6= <mlev>
##$CPDPRG7= <mlev>
##$CPDPRG8= <mlev>
##$CPDPRGB= <>
##$CPDPRGT= <>
##$D= (0..31)
0 1.2 0 0 0 0 0 0 0 0.06 0 0.03 0 0 0 0 0.0002 0 0 0 0 0 0 0 0 0 0 0 0 
0 0 0 
##$DATE= 1571912735
##$DBL= (0..7)
120 120 120 120 120 120 120 120 
##$DBP= (0..7)
150 150 150 150 150 150 150 150 
##$DBP07= 0
##$DBPNAM0= <>
##$DBPNAM1= <>
##$DBPNAM2= <>
##$DBPNAM3= <>
##$DBPNAM4= <>
##$DBPNAM5= <>
##$DBPNAM6= <>
##$DBPNAM7= <>
##$DBPOAL= (0..7)
0.5 0.5 0.5 0.5 0.5 0.5 0.5 0.5 
##$DBPOFFS= (0..7)
0 0 0 0 0 0 0 0 
##$DE= 6
##$DECBNUC= <off>
##$DECIM= 24
##$DECNUC= <off>
##$DECSTAT= 4
##$DIGMOD= 1
##$DIGTYP= 9
##$DL= (0..7)
0 120 120 120 120 120 120 120 
##$DP= (0..7)
150 150 150 150 150 150 150 150 
##$DP07= 0
##$DPNAME0= <>
##$DPNAME1= <>
##$DPNAME2= <>
##$DPNAME3= <>
##$DPNAME4= <>
##$DPNAME5= <>
##$DPNAME6= <>
##$DPNAME7= <>
##$DPOAL= (0..7)
0.5 0.5 0.5 0.5 0.5 0.5 0.5 0.5 
##$DPOFFS= (0..7)
0 0 0 0 0 0 0 0 
##$DQDMODE= 0
##$DR= 18
##$DS= 0
##$DSLIST= <SSSSSSSSSSSSSSS>
$$ [...]
##$SUBNAM2= <"">
##$SUBNAM3= <"">
##$SUBNAM4= <"">
##$SUBNAM5= <"">
##$SUBNAM6= <"">
##$SUBNAM7= <"">
##$SUBNAM8= <"">
##$SUBNAM9= <"">
##$SW= 24.0689530833862
##$SWIBOX= (0..15)
0 0 2 0 0 0 0 0 0 0 0 0 0 0 0 0 
##$SW_h= 4816.95568400771
##$TD= 16384
##$TD0= 1
##$TE= 0
##$TE2= 300
##$TE3= 300
##$TEG= 300
##$TL= (0..7)
0 120 120 120 120 120 120 120 
##$TP= (0..7)
150 150 150 150 150 150 150 150 
##$TP07= 0
##$TPNAME0= <>
##$TPNAME1= <>
##$TPNAME2= <>
##$TPNAME3= <>
##$TPNAME4= <>
##$TPNAME5= <>
##$TPNAME6= <>
##$TPNAME7= <>
##$TPOAL= (0..7)
0.5 0.5 0.5 0.5 0.5 0.5 0.5 0.5 
##$TPOFFS= (0..7)
0 0 0 0 0 0 0 0 
##$TUNHIN= 0
##$TUNHOUT= 0
##$TUNXOUT= 0
##$USERA1= <user>
##$USERA2= <user>
##$USERA3= <user>
##$USERA4= <user>
##$USERA5= <user>
##$V9= 5
##$VALIST= <valist>
##$VCLIST= <CCCCCCCCCCCCCCC>
##$VD= 0
##$VDLIST= <DDDDDDDDDDDDDDD>
##$VPLIST= <PPPPPPPPPPPPPPP>
##$VTLIST= <TTTTTTTTTTTTTTT>
##$WBST= 1024
##$WBSW= 4
##$XGAIN= (0..3)
0 0 0 0 
##$XL= 0
##$YL= 0
##$YMAX_a= 66595
##$YMIN_a= -120149
##$ZGOPTNS= <>
##$ZL1= 120
##$ZL2= 120
##$ZL3= 120
##$ZL4= 120
##$ABSF1= 10
##$ABSF2= 0
##$ABSG= 5
##$ABSL= 3
##$ALPHA= 0
##$AQORDER= 0
##$ASSFAC= 0
##$ASSFACI= 0
##$ASSFACX= 0
##$ASSWID= 0
##$AUNMP= <proc_1d>
##$AZFE= 0.1
##$AZFW= 0.1
##$BCFW= 1
##$BC_mod= 2
##$BYTORDP= 1
##$COROFFS= 0
##$CY= 11.3945322036743
##$DATMOD= 1
##$DC= 2
##$DFILT= <>
##$DTYPP= 0
##$F1P= 20.1720416913024
##$F2P= 0.152960286110954
##$FCOR= 0.5
##$FTSIZE= 0
##$FT_mod= 4
##$GAMMA= 1
##$GB= 0.15
##$INTBC= 1
##$INTSCL= 1
##$ISEN= 128
##$LB= 0.24
##$LEV0= 0
##$LPBIN= 0
##$MAXI= 10000
##$MC2= 0
##$MEAN= 0
##$ME_mod= 0
##$MI= 1.114404
##$NCOEF= 0
##$NC_proc= 0
##$NLEV= 6
##$NOISF1= 3.799351
##$NOISF2= 2.8
##$NSP= 1
##$NTH_PI= 0
##$NZP= 0
##$OFFSET= 15.70392
##$PC= 1
##$PHC0= -9587.797
##$PHC1= 36.20082
##$PH_mod= 1
##$PKNL= yes
##$PPARMOD= 0
##$PSCAL= 0
##$PSIGN= 0
##$REVERSE= no
##$SF= 200.130013532006
##$SI= 16384
##$SIGF1= 3
##$SIGF2= 2
##$SINO= 400
##$SIOLD= 16384
##$SREGLST= <1H.CDCl3>
##$SSB= 0
##$STSI= 0
##$STSR= 0
##$SW_p= 3612.71676300578
##$SYMM= 0
##$S_DEV= 0
##$TDeff= 0
##$TDoff= 0
##$TI= <>
##$TILT= no
##$TM1= 0
##$TM2= 0
##$TOPLEV= 0
##$USERP1= <user>
##$USERP2= <user>
##$USERP3= <user>
##$USERP4= <user>
##$USERP5= <user>
##$WDW= 1
##$XDIM= 8192
##$YMAX_p= 0
##$YMIN_p= 0
$$ End of Bruker specific parameters
$$ ---------------------------------
##NTUPLES= NMR FID
##VAR_NAME=  TIME,          FID/REAL,        FID/IMAG
##SYMBOL=    X,             R,               I
##VAR_TYPE=  INDEPENDENT,   DEPENDENT,       DEPENDENT
##VAR_FORM=  AFFN,          ASDF,            ASDF
##VAR_DIM=   8192,          8192,            8192
##UNITS=     SECONDS,       ARBITRARY UNITS, ARBITRARY UNITS
##FACTOR=    0.0002076,     1,               1
##FIRST=     0,             0,               0
##LAST=      1.7004516,     0,               0
##MIN=       0,             -120149,         0
##MAX=       1.7004516,     66595,           0
$$ Real data points
##PAGE= N=1
##DATA TABLE= (X++(R..R)), XYDATA
0 0 0 0 0 0 0 0 0 0 8 -8 8 -8 9 -16 16 -23 24 -32 33 -40 48 -56 65 -73 87 -97 113 -128 145 -166 184 -207
32 -207 233 -262 292 -327 362 -402 448 -494 548 -607 671 -744 825 -914 1016 -1130 1264 -1416
50 -1416 1599 -1814 2081 -2413 2846 -3439 4296 -5664 8184 -14435 66595 46704 -74138 -19288
64 -19288 47661 51500 -10043 -14075 20970 39397 4674 -8531 13423 33774 16911 2164 -5048
77 -5048 -12676 -14488 8489 20793 1311 -25676 -14592 17649 21129 -15580 -30087 2587 22630
90 22630 -12145 -43439 -20096 21548 22395 -10513 -28411 -9156 15137 11851 -6670 -12860 -6314
103 -6314 1866 5998 -1085 -11695 -1752 23691 22091 -9424 -24693 228 31345 22003 -16457
116 -16457 -26476 7736 29088 6506 -16862 -3845 20052 16672 -9031 -21932 -4348 19090
128 19090 14273 -11639 -21864 -7019 11606 13074 -4065 -16950 -6857 7948 1430 -14615 -13436
141 -13436 2172 9782 641 -14925 -15950 2222 15097 6570 -11013 -16573 -5173 11393 10980
154 10980 -9319 -15581 5298 19959 1816 -19818 -9658 19332 23764 -8073 -28840 -5110
166 -5110 24900 14392 -14579 -15414 6379 12970 -1618 -13594 -5892 7470 6317 -6569 -12680
179 -12680 -8704 -1056 7228 5666 -11437 -20705 -4602 12361 3493 -17099 -16490 4257 12029 -8426
193 -8426 -23575 -4461 18357 7775 -17137 -18270 1762 11992 3897 -7758 -8482 -285 4895
206 4895 3058 -972 -3885 -1520 7699 9095 -6747 -14926 3068 20963 8961 -16030 -15970 9616
220 9616 21577 1198 -18773 -5243 16909 9014 -13323 -12913 6243 14326 1833 -12324 -9766
233 -9766 3373 8657 1668 -4828 -6760 -4169 2943 5279 -3153 -9168 -222 8735 2491 -10165 -10435
248 -10435 4846 14858 2068 -15569 -9869 9282 12463 -1806 -9861 -2955 7828 7736 -4110
261 -4110 -9375 1178 11489 5707 -7117 -10381 448 12699 8783 -7561 -12145 2178 11155
274 11155 3202 -7350 -5668 5056 9132 -690 -10502 -4180 9301 9608 -2209 -9723 -5227 6243
288 6243 10141 -158 -9373 -3158 7841 5783 -3868 -7160 1522 9909 5164 -7975 -8631 4251
302 4251 10981 2855 -5697 -5850 1470 7084 3570 -4351 -4621 2891 5743 1024 -5802 -5719 4434 11088
318 11088 799 -12619 -6728 9010 10864 -3093 -11427 -2396 9563 5526 -8191 -7639 5749
331 5749 9022 -1375 -7969 -3394 4617 6476 1529 -4705 -4306 1734 5078 3426 -1778 -4862 887
346 887 7616 2196 -7342 -4024 7267 8605 -2268 -9927 -2964 9000 7962 -4953 -9095 1042
360 1042 6825 1402 -4938 -3785 1648 4389 500 -5704 -4533 1944 5089 1748 -4509 -6996 -67
375 -67 7405 2841 -6939 -5586 3834 6247 -1285 -7112 -1959 7401 6196 -5122 -7743 1467 8021
390 8021 3455 -2833 -4169 445 5255 3009 -2618 -2287 2639 4560 1102 -3199 -3315 2505 6621 1905
406 1905 -6104 -4423 2933 5656 1051 -5012 -4161 2969 4950 -1774 -5944 -865 4538 2898 -3552
421 -3552 -6082 -1344 5594 3766 -4248 -5704 545 4423 1875 -3126 -3681 1849 4997 -49 -4951
436 -4951 -1515 4149 4204 -76 -3631 -2395 2896 5137 908 -3081 -1072 2638 3715 232 -3228 -1031
452 -1031 4995 3900 -3034 -5069 1478 5448 2485 -3510 -4704 880 4362 652 -4058 -1847 1753
467 1753 1625 -771 -2757 -2307 1590 3133 -671 -4249 -2445 1615 3429 986 -4018 -2968 3087 4182
483 4182 -1927 -4027 657 4500 2046 -3269 -3694 2030 5781 1143 -3171 -1752 2344 2891 787 -809
499 -809 -1183 1096 2484 186 -1810 -921 1577 2730 517 -3446 -3124 2319 3587 -1162 -4129 -1518
515 -1518 2274 1618 -1969 -3340 -367 2815 194 -3748 -2335 1119 1842 -86 -2398 -2892 496 2710
531 2710 111 -1919 -1170 411 1523 695 -2082 -1485 2211 2971 -1026 -2633 -366 2672 2417 -447
547 -447 -2689 -704 2799 1740 -1713 -1151 584 1790 713 -1656 -2167 1193 2590 -81 -2444 -1542
563 -1542 302 1369 421 -1824 -1888 601 1352 -1251 -1718 -835 529 1207 -1144 -2504 -851 1940 1340
580 1340 -1647 -2235 -872 1227 1615 -996 -1709 86 2336 154 -1771 -813 1211 1900 57 -1914
596 -1914 -1166 1513 1624 -259 -900 -511 168 1105 510 -1048 -563 1464 786 -1115 -1366 -711 981 1316
614 1316 -896 -2565 -388 1877 450 -1402 -1180 209 716 237 -1849 -994 1010 1345 -1103 -1331 -167
631 -167 339 1183 689 -977 -859 1018 937 -114 -467 162 658 1371 -460 -1406 308 2100 1104 -1049
649 -1049 -704 502 954 1190 -713 -861 943 946 -353 -423 122 460 842 188 -727 -653 919 771 -399
668 -399 -507 -723 163 676 89 -1176 -181 1147 395 -694 -561 -149 733 979 -1016 -1022 818 1043 38
687 38 -313 -251 -355 424 125 -478 -25 763 508 -178 -289 157 626 795 159 -772 -17 533 131 -9 -99
708 -99 -276 363 533 -369 -761 894 972 -246 -556 -455 1 684 585 -798 -259 441 295 -453 -187 -96 -11
729 -11 341 29 -908 -183 713 371 -99 -340 -208 250 480 -17 -616 307 430 34 -246 -209 15 564 444
750 444 -970 -321 816 298 -46 -299 -347 -67 210 286 -520 229 231 -250 -54 -13 -236 -47 645 -74 -929
771 -929 38 401 -33 -151 -214 -349 431 369 -278 -73 494 120 -338 -68 -352 73 453 242 -627 -130 140
792 140 -102 31 337 -226 -149 289 -471 -328 168 242 3 -308 -228 -213 576 260 -158 -62 17 70 -216 232 -82
815 -82 -150 -39 76 -746 85 580 -447 103 -201 -201 -169 334 -115 -255 381 185 -107 -69 32 -46 101 161 -350
838 -350 -428 -133 27 -162 93 -296 -437 -43 -80 -560 -98 297 -17 -140 258 154 -70 449 -112 -258 242
859 242 -175 -276 297 -21 -136 191 162 -250 -107 518 94 -218 -81 -68 -57 206 192 -163 21 -13 -520 31
881 31 211 -238 10 222 -104 -385 489 169 -197 162 -5 -91 247 386 -62 -60 202 54 -137 103 -101 -184
903 -184 602 -19 -87 55 62 122 -147 135 -213 11 104 261 -246 294 -50 -189 -47 241 -65 -16 47 -43 -118
926 -118 108 -180 28 115 -212 -180 145 223 72 -2 212 83 40 44 -51 109 273 142 -437 -10 99 -365 129
949 129 0 -233 50 215 -255 -18 101 -241 -220 64 84 -135 138 237 -281 153 32 -363 24 212 -22
970 -22 127 229 -269 -58 260 48 -320 499 136 -324 272 -84 -344 40 -8 -10 46 303 170 -209 268 -43
992 -43 21 -155 259 162 234 7 -429 -231 57 -32 -261 184 8 0 -181 -51 -250 79 48 -30 -244 146 -219
1015 -219 -76 -57 -230 -238 -125 9 3 434 62 -32 -51 208 -167 -84 -97 -111 -255 -131 -162 -464 -41 243 -120 28
1039 28 91 13 66 -142 80 -52 -200 -279 133 304 -45 -240 333 132 -191 -83 -11 -137 -50 -58 -454 -154 265
1062 265 -26 -106 245 3 -87 81 117 -215 91 -33 -171 -125 -44 -162 -62 306 -204 -210 70 189 96 193 180
1085 180 -85 126 224 -210 -83 -89 -71 -202 -182 -294 24 -43 255 -173 68 3 -139 81 -145 -100 -26 70 -73
1108 -73 -108 105 196 -17 235 148 -78 -42 167 -29 -138 185 -83 -60 256 -81 80 176 -41 -297 -273 255 -92
1131 -92 69 204 24 -32 210 151 200 -144 147 -179 56 222 -168 -102 26 71 128 159 -173 52 -54 -307 -174
1154 -174 369 10 45 -92 1 -255 409 -325 -114 -213 99 253 71 133 85 -342 -104 175 -183 37 118 -307
1176 -307 -203 120 196 -73 422 -160 -314 -72 252 92 -258 31 -71 -114 -105 -81 -109 -105 -186 131 31 348 -195
1199 -195 111 -33 -112 -117 297 -126 -7 208 -32 -120 90 -143 -528 -122 246 -329 34 54 -127 -185 -167 66
1221 66 -26 177 66 -6 131 -141 -59 -15 70 -358 21 222 -184 167 -64 43 -169 95 278 -123 28 200
1243 200 -66 -72 -204 -159 -47 17 -297 -201 236 56 -74 72 26 31 140 136 -25 -178 -13 -347 20 -78 -67 -148
1267 -148 -38 -2 -305 30 -146 -136 -10 -139 -313 -17 55 -83 -308 468 -191 53 73 -187 -26 164 -40
1288 -40 11 -136 -8 -75 65 344 -241 31 -42 -35 -78 13 102 -147 43 -163 -66 -44 127 77 24 191 -2 -9 -94
1313 -94 32 -70 99 248 -98 117 -65 -14 204 138 214 118 -73 256 283 14 43 -193 -153 -15 215 -201 -56
1336 -56 -124 87 203 180 -111 -294 266 245 301 -114 -440 194 129 -59 -55 -105 -11 -82 254 13 -136 -71 67 -218
1360 -218 218 -84 -125 -37 253 -113 -231 -112 49 155 112 244 44 -45 18 -56 -31 -61 -254 304 141 -177 192
1383 192 55 32 16 -186 -140 176 215 123 17 -63 167 141 176 -79 10 38 244 -264 -395 146 -35 426 218
1406 218 89 -12 -61 241 -300 -49 -307 48 -103 72 54 -66 108 151 -203 116 -43 -36 -29 182 150 -121 102
1429 102 190 -237 -3 -171 40 -41 -221 -77 267 -6 -132 -11 50 285 -24 81 -190 32 257 78 -152
1450 -152 123 99 -17 68 101 75 -103 -63 159 11 -104 -339 -62 -73 -27 -124 -180 367 -12 -182 140 -7 -265
1473 -265 -80 -107 -133 314 -111 -387 169 -37 -171 -168 -53 -288 -280 191 -233 117 9 92 -142 -17 41 199 -137
1496 -137 12 -210 -198 -30 118 42 4 -241 -185 -63 21 -105 -100 300 125 -24 -177 -144 14 245 -50 -39 -21
1519 -21 -75 -50 64 -125 44 -42 61 -259 -87 -98 91 258 -23 -120 203 -131 -84 0 -157 69 -125 6 332
1542 332 239 -122 339 -73 -122 4 -48 115 94 -74 140 119 -109 -406 163 202 136 52 155 -61 -287 87 -29
1565 -29 37 -13 48 82 157 85 -42 4 133 -117 113 -186 -13 48 -94 148 -42 -248 155 87 -167 194 -14
1588 -14 138 64 -59 -46 -9 26 6 -176 84 303 72 63 -276 -24 77 28 -217 134 312 54 -104 191 -13
1611 -13 23 -264 -251 -125 115 81 -79 203 63 -9 489 -149 22 -322 -87 34 -141 219 -210 -16 211 203
1633 203 46 -82 -127 43 96 29 -88 11 -66 212 -101 -109 -59 86 92 -168 -324 26 146 -32 -143 341 -185
1656 -185 206 -138 126 298 48 -330 17 -152 84 45 -127 -154 164 89 126 286 -209 -107 -29 129 -51 185
1678 185 16 -62 -10 -329 -78 -163 -172 339 81 -222 6 255 54 59 48 213 -145 14 -69 -67 59 -158 -70 -219
1702 -219 227 -95 -24 103 29 28 -222 -7 -2 156 -241 -267 172 192 -239 -155 233 65 -49 133 166 -112 -149 72
1726 72 -95 127 93 -3 -435 -35 69 86 301 86 105 385 137 -162 19 1 47 -229 250 -127 65 -145
1748 -145 -206 100 76 -155 -45 97 -272 -241 -78 298 -126 -28 -74 -22 75 -199 186 4 -11 -140 -314 -49 216
1771 216 43 -3 -73 -205 -83 -229 -61 333 -186 -132 -354 47 349 -115 -39 -151 55 161 259 -318 -83 366
1793 366 148 -44 209 -154 108 120 86 -101 65 -22 -5 330 99 -64 229 313 70 -37 284 -8 48 -172
1815 -172 113 -208 -97 161 -83 6 -41 134 3 -140 119 -182 49 -95 204 52 82 159 -110 -130 15 60
1837 60 -137 185 62 -77 137 46 153 127 -17 45 -199 88 -21 64 126 -322 85 -76 84 -32 -14 -59 226
1860 226 103 90 -115 273 -81 89 -95 362 152 -278 -5 17 -154 -21 27 -299 187 -351 -32 41 -33 88
1882 88 6 28 -150 178 6 125 42 142 -94 120 3 -2 32 13 -207 -8 15 192 -215 31 -102 128 60
1905 60 -3 111 -108 -224 144 -98 91 45 -214 -18 124 -13 -128 -104 90 213 98 189 29 65 -134 -29
1927 -29 -370 -99 -235 54 18 6 18 -125 56 -105 59 -348 -161 40 49 -60 111 -213 184 -14 -64 54
1949 54 -315 223 -208 -323 -130 -205 59 17 -9 -67 107 -133 -232 -143 -232 -161 12 112 -97 70 -45 105 26
1972 26 -40 -72 -57 -205 97 -187 -158 108 442 -202 231 -29 73 288 125 -157 96 -60 174 96 118 -76
1994 -76 -12 51 -129 98 43 12 -31 -166 79 249 -183 -163 -95 -53 59 -93 -270 315 -171 148 39 -238 -198
2017 -198 92 141 118 10 190 -130 -154 47 -151 160 51 -2 80 64 49 32 103 -208 30 -31 142 53 61 -112
2041 -112 -96 -48 -83 -258 -178 -329 23 -168 -44 23 -225 1 -100 115 -136 -240 -60 -111 -109 -176 -83 139 178 -145
2065 -145 -357 114 508 -166 -140 251 -37 -156 97 285 -112 40 50 88 296 149 231 145 143 -179 0 40 127
2088 127 11 98 5 127 6 -1 -15 -55 -30 -95 -251 283 77 -23 -31 301 102 102 1 -48 -111 199 220 -25 -11
2113 -11 -4 -97 55 12 80 116 -48 90 -170 191 -24 246 -248 106 149 -82 15 11 164 125 157 -124 -13 -117
2137 -117 130 -27 -19 226 -195 143 -137 440 26 92 -36 -261 -279 31 -155 82 46 37 -45 58 -240 130 -26
2160 -26 -87 172 32 -164 -66 -6 63 15 -226 67 -79 47 3 153 -38 -154 -51 -13 -242 146 182 -237 -142
2183 -142 -134 -37 51 -61 38 -14 -83 -57 12 277 -255 6 131 -115 -156 70 399 122 127 46 -94 -162 -13 -56 100
2208 100 120 -305 86 -68 28 -133 -47 144 -297 -271 153 61 -58 -82 -34 -216 -189 -20 85 166 25 -291 -4
2231 -4 44 -128 -71 -95 58 -278 281 118 133 -53 53 -1 157 141 100 82 76 176 131 -84 -82 -40 95 -157 309
2256 309 327 -222 -183 -243 174 -220 152 -220 -305 -5 137 172 -43 77 420 113 158 -117 70 67 256 96 86
2279 86 -26 -74 3 140 28 -123 -41 -75 -180 -21 -44 -63 32 -53 -42 -186 -16 -23 242 -16 -185 129 146 -42
2303 -42 -387 -163 -24 170 -107 -389 -244 22 -86 -63 84 144 135 -316 -199 -220 -98 78 -29 -87 -106 247 24
2326 24 241 162 61 -2 -192 -153 56 -154 -56 164 19 -168 -72 -19 93 63 -200 -72 420 -35 -8 -155 9
2349 9 69 142 -113 40 239 -92 1 -192 -27 259 329 -131 -341 64 -5 171 -162 236 -28 69 192 72 -141
2372 -141 60 418 246 -28 -29 255 -174 86 -120 275 -1 66 -3 -322 -56 179 149 86 -159 179 134 166 -237
2395 -237 -7 -14 -104 261 102 82 179 20 167 -64 -218 161 540 134 -189 158 -177 -58 38 -44 -20 39 -255
2418 -255 93 -36 -144 -159 169 284 -116 135 27 139 213 -71 116 105 -21 375 -213 -74 130 -32 -167
2439 -167 -24 28 112 308 -116 7 -117 99 -3 -223 20 176 -281 -166 10 -19 -33 -50 -9 -106 -63 16 90
2462 90 -162 -111 -20 222 -18 -135 54 106 -183 -52 -214 -27 36 78 123 -144 97 -248 197 77 7 -153 53
2485 53 -63 73 -2 67 261 -89 228 -51 -256 -260 145 28 -379 133 227 89 -198 -22 7 -28 -150 -351 -83
2508 -83 -152 210 -102 -83 -124 21 82 -6 -3 -36 -43 245 17 -64 -180 -86 204 74 -55 -53 3 166 -126 98 -216
2533 -216 290 13 -253 -13 -368 145 174 -140 -111 -55 98 14 -72 -62 189 277 -167 -214 -189 213 285 10 117
2556 117 -29 260 -11 -144 -104 -43 482 231 158 33 311 -60 -268 16 -167 63 188 71 -185 32 -67
2577 -67 2 318 61 33 -52 23 -56 -21 -123 -82 -35 -32 -163 150 446 205 128 100 -38 64 -69 -132 84 -338 312
2602 312 161 30 -119 -55 143 224 54 -138 346 76 -72 146 -130 98 -90 67 -61 -203 196 292 17
2623 17 -123 -87 125 -84 106 152 -147 260 183 -114 344 -82 13 -450 -99 19 29 170 -217 -135 165 271
2645 271 404 -82 -246 -149 67 112 46 -23 -113 -195 199 173 -154 -74 7 -98 91 276 21 -125 39 287 -76
2668 -76 95 11 11 -123 -91 -13 8 116 -89 -3 -184 220 -280 245 -157 -178 251 72 33 54 -168 205 -130 -258
2692 -258 -26 8 -151 -28 123 130 47 -78 -45 -65 320 31 -27 -155 13 41 18 -80 -146 -55 40 -169 60 -197
2716 -197 -158 2 -128 -120 133 -141 -168 52 78 -271 -88 -58 35 119 -257 -119 333 -86 -112 -119 -95 -76 -344 -239
2740 -239 310 3 -39 -107 -200 -144 147 37 8 -8 141 111 83 124 14 32 90 144 -26 63 -166 303 -62 -283
2764 -283 -32 -75 50 -143 249 266 -435 246 180 -116 121 322 -42 -112 89 89 93 366 265 63 -128 -211 -96
2787 -96 -115 111 200 -55 -87 94 -86 2 103 -49 153 2 248 46 -247 274 -96 -23 89 -146 171 -33
2809 -33 -117 67 325 67 -4 88 20 -14 -215 -174 315 215 -53 -91 -52 -19 34 -172 -160 -2 34 -98 25 200
2833 200 274 89 74 -21 -227 -172 -8 86 -207 333 89 120 -130 24 -255 -296 360 -167 91 240 49 -106
2855 -106 11 165 -173 313 152 -214 -133 207 98 -229 92 -357 92 88 93 53 255 -131 -93 56 -154 216
2877 216 52 -74 14 -179 65 -263 -456 -112 217 182 -121 -164 -197 -64 20 -138 -196 106 -271 77 -52 -112
2899 -112 79 -5 -97 362 -126 -77 138 -8 -23 95 293 129 70 5 48 85 -2 113 128 201 29 -74 -126 312
2923 312 -77 -82 -330 134 -247 -140 -36 198 278 -27 -2 -55 30 114 -5 132 -83 -246 -41 -267 202 -110
2945 -110 244 75 74 -173 44 -31 -67 70 -235 167 202 8 41 217 -41 -98 89 -73 128 250 206 -164 -394
2968 -394 -310 -111 37 159 -19 -154 130 43 -18 169 14 237 106 33 -179 -60 47 -102 -50 -215 -76 10
2990 10 -235 -566 -45 179 85 -24 -126 -158 35 -160 -168 -52 -15 -32 158 -226 1 126 303 96 -229 63
3012 63 -301 127 -93 -118 -293 -105 134 144 -452 48 198 120 -30 -47 320 303 -352 -9 -199 -48 189 -86
3034 -86 -68 -44 -240 -30 209 -55 -12 250 260 -92 -357 -127 331 135 50 -175 -17 -118 154 -112 134 -177
3056 -177 193 49 129 -119 42 154 -90 -98 244 -82 -105 -226 16 76 -110 35 114 -288 104 -39 151 -159
3078 -159 234 36 97 -17 111 7 -447 68 117 153 92 -105 51 12 8 33 -37 195 16 -184 -119 -67 119 -86
3102 -86 -203 -53 13 52 -94 -99 165 -40 -254 305 48 -203 63 -267 -354 67 -89 -211 -74 63 -183 134
3124 134 -67 241 -134 -77 85 107 200 158 195 -142 32 -190 -150 -27 -26 -143 -89 22 -40 -9 151 -89 5 -77
3148 -77 -87 -8 -37 26 124 -37 94 94 -92 73 135 -110 -40 -260 25 265 -72 -41 37 -19 -109 189 135 -102 -162
3173 -162 -19 138 126 -4 329 -131 -190 -17 196 164 -122 33 336 -60 140 -23 256 191 29 -38 140 135
3195 135 -137 396 -196 187 -198 364 99 -146 -171 -103 -280 277 -55 -127 83 16 208 -57 69 139 272 388
3217 388 -158 80 -71 102 -107 62 -20 -265 336 -290 42 -32 174 -154 69 -119 -31 -420 -175 -99 -4 115
3239 115 30 138 -39 -47 138 63 -86 267 -107 55 11 -217 -143 69 79 39 12 38 -115 137 -91 -292 162
3262 162 -66 61 140 22 170 -210 -120 135 173 -64 -187 -36 -256 137 100 -74 64 -27 27 109 -52 -76 -127
3285 -127 -42 -14 131 131 -247 -33 83 272 99 -32 13 -151 -86 -172 107 -128 250 -251 -193 75 -351 -232 -51
3308 -51 175 11 -109 96 -17 88 -7 -33 -46 34 -146 -6 86 -8 19 -14 117 -46 -63 -97 -3 90 -208 214
3332 214 -263 -70 87 -186 -90 117 251 108 61 -7 -95 226 116 -234 109 -14 228 -149 -387 122 127 132 -307
3355 -307 34 -47 -87 -96 -41 16 -7 146 96 -54 -269 -15 148 279 -81 -54 63 -177 -35 88 -229 -340 105
3378 105 15 -334 -290 -356 -163 79 14 82 118 -208 -277 -142 248 -174 -111 -135 -119 -24 -96 20 -203 -156 97 -41
3402 -41 -140 -115 85 -238 -21 -89 -17 -8 150 -86 69 -39 153 -175 -127 364 -122 -408 20 27 -66 60 186 90
3426 90 -203 157 292 158 -325 -18 -130 -3 154 -52 47 -276 -337 32 -212 79 -282 268 17 -251 -390
3447 -390 -197 -177 -268 -72 -262 125 118 -268 63 -170 -268 53 -39 -40 -407 -238 70 85 -200 -242 22 -84 -175 183
3471 183 -123 -248 -231 -95 -72 -154 159 168 -215 -174 -66 -4 76 144 156 -259 81 -16 -203 -79 202 113 320 29
3495 29 -2 -25 -77 155 348 -203 -141 -82 -102 -64 10 216 215 -187 -175 26 52 -102 -97 -22 15 -78 22 245 -234 -143
3521 -143 -138 -6 -124 -123 90 202 185 -225 -60 -43 -11 -132 -79 -93 183 61 -367 126 -44 -104 -78 -160 88 405
3545 405 -132 216 -99 280 39 -48 -35 169 -94 112 86 9 164 -266 216 -284 152 -179 97 -84 175
3566 175 -270 190 -91 -202 -209 72 79 -176 79 -220 -53 -105 94 -101 185 -46 25 114 -91 9 114 54 281
3589 281 38 -231 -85 -68 -268 -153 -27 90 -231 285 13 -215 -208 -64 -155 107 182 52 219 -4 201 297
3611 297 84 82 -43 -25 39 -37 237 163 -74 -256 -64 -9 -85 -228 -86 -90 -98 -47 192 237 139 -292 200 40 -174
3636 -174 -21 136 -34 -77 196 90 -61 10 -111 -35 164 109 -26 137 138 -75 -190 87 -331 234 139 -111
3658 -111 -183 174 299 78 191 35 -138 -13 45 -169 -79 15 -63 154 33 -34 15 -172 83 -128 -58 -83 114
3681 114 -156 26 83 -10 63 -148 166 -185 -23 -49 -140 -91 -34 154 -279 -160 34 70 108 168 63 -100 173
3704 173 -122 37 37 212 25 219 151 -84 -79 12 -200 -154 315 -53 69 95 163 -64 -34 26 -159 75 9 191
3728 191 114 35 121 260 -152 -271 83 -107 85 -73 -361 85 -124 -133 -87 137 151 -129 155 47 182 206 -61
3751 -61 53 140 350 -121 199 -38 176 64 -230 -258 110 357 148 41 251 -84 -164 -258 -39 120 -533 -95
3773 -95 -130 291 -20 106 73 -181 -47 -490 -283 208 -13 -23 135 153 -175 -76 96 -93 -213 -169 -76 -131 -26
3796 -26 -68 -36 200 -51 -276 138 67 -181 -5 -62 -20 137 159 166 33 120 255 -200 -87 68 -4 -121 180 -72
3820 -72 61 129 195 -43 -32 -3 -145 151 207 -128 184 231 136 259 -61 -115 157 110 -47 109 212 -111 -1
3843 -1 12 82 -7 -139 109 152 -174 91 -30 -242 -118 -276 -67 15 -139 120 36 191 -33 65 -99 -267 -39
3866 -39 50 -155 -98 -61 -186 -97 114 26 486 84 -140 -97 146 -71 237 159 46 400 64 54 -130 89 -255
3889 -255 -216 104 -54 113 64 -81 -347 -231 -39 -30 34 52 -140 109 2 -205 159 -113 -50 -79 -279 104 48
3912 48 7 52 1 -371 18 99 158 -83 -129 -63 -177 138 -70 133 211 -46 116 246 155 -3 203 -42 366
3935 366 -219 -456 13 -164 -74 151 77 17 142 -231 69 32 128 -243 -242 -33 135 195 -218 45 -105 117 47
3958 47 239 -158 -70 -26 -129 76 -172 -17 60 436 -12 -155 83 37 10 68 134 53 27 94 250 85 -203 94
3982 94 157 -136 145 33 154 -129 194 136 114 -78 224 167 -129 329 -163 135 -32 108 -149 -399 13 94
4004 94 227 -249 -195 -157 -105 168 -206 -98 133 -154 -42 -151 -28 6 19 107 34 -197 -34 217 53 132 -254
4027 -254 34 78 0 99 41 -170 102 125 309 -276 133 -271 -80 60 174 -87 161 -71 -96 329 134 -83
4049 -83 14 -210 -42 223 -105 -11 31 -103 124 119 102 -27 -284 -88 -418 -283 14 0 11 124 232 -7 -267
4072 -267 121 -98 -92 -40 -64 -60 36 -26 -367 -53 2 43 24 21 154 -137 -80 44 40 -224 125 -15 67 317 2 -216
4098 -216 202 -46 199 219 -83 202 331 52 -47 57 -59 -193 70 -43 181 192 -138 39 321 -113 -287
4119 -287 188 -296 376 -190 -426 41 153 332 -348 314 65 -61 129 -38 112 68 67 474 284 177 86
4140 86 -26 -52 -103 189 131 -67 -202 173 148 -67 -67 -124 26 79 30 -31 139 91 36 -61 -6 45 -227 -135 -126 110
4166 110 -250 -19 -15 -148 216 27 -425 69 13 -86 -105 192 -341 31 -115 -106 30 -65 5 357 179 183 -78 -160
4190 -160 -59 -164 -85 -178 -67 -11 -165 8 -78 -386 43 307 -75 -202 149 -115 228 -77 -282 46 -16 129
4212 129 53 22 -3 -96 -103 -13 -125 53 54 -40 -83 -96 -64 184 -94 -122 -61 188 17 46 138 37 184 -171 -53 151
4238 151 93 -194 -30 -54 -96 -202 -225 -69 -46 93 185 42 -208 -135 33 31 -18 -78 -106 -281 300 -106 -167 71
4262 71 220 -285 -184 38 -73 -43 34 96 -209 1 27 95 15 87 68 -34 -261 -36 221 198 -362 -212 -43
4285 -43 62 256 5 259 123 -147 98 250 -20 -165 -77 121 32 -97 -48 86 4 -37 -30 -45 -47 -109 -13 17 -156
4310 -156 -124 -202 -87 -33 231 224 226 -187 -272 -282 95 167 16 -305 147 58 -228 78 -8 -155 22 -7 -7 70 115 78
4336 78 -368 99 -82 -229 78 97 225 -66 -242 -179 -179 113 -49 122 39 -101 57 2 156 150 74 230 -310
4359 -310 -158 348 -43 2 -106 -307 -200 -7 188 52 48 -136 223 66 -85 13 -171 -41 240 -174 25
4380 25 84 -285 -142 -66 321 -50 65 96 134 -133 -72 -141 -209 126 -295 285 71 186 -31 78 -61 -502 104
4403 104 52 84 240 30 53 82 -257 -14 261 -227 107 18 -187 32 107 287 117 -117 182 72 74 -28 -65
4426 -65 -46 101 4 -43 179 -128 -88 -149 93 -42 -166 24 -79 85 25 208 -57 178 -81 -10 -170 38 -71
4449 -71 135 224 31 114 154 -222 37 -95 138 -190 192 173 -334 331 104 -13 -144 142 -121 -8 -77 -66
4471 -66 -357 23 148 50 116 -160 -19 -127 -100 -144 217 -7 -153 38 257 307 91 115 10 -146 -189 114 -276
4494 -276 -103 34 133 -244 -13 232 62 -35 63 -107 -273 41 15 -160 -221 81 -164 -17 218 112 113 -22
4516 -22 -131 148 -18 -172 90 -255 -6 -11 30 226 147 -72 131 119 -63 172 -85 70 -57 -263 -12 97
4538 97 83 54 -150 92 91 -104 -90 -59 319 -186 238 -216 77 203 75 -167 -25 34 -134 -39 44 162 392
4561 392 -76 17 29 -114 -129 221 75 -133 -26 74 -158 -3 73 52 -210 -51 310 -135 -216 -31 -74 159
4583 159 129 15 19 254 2 4 5 2 38 -160 158 -358 -159 207 -15 56 -105 -196 -28 -58 -54 -330 -305 23 -193
4608 -193 170 164 -186 68 -157 -167 130 50 294 -53 136 60 -45 -2 32 -124 -233 7 126 -10 207 133 -70
4631 -70 30 242 -149 -61 -63 -57 39 -206 65 -29 -115 -76 173 -30 219 42 6 -56 259 12 -215 393 250 -78
4655 -78 208 229 -101 -311 -50 -96 -197 -232 -123 40 -173 -3 122 -63 35 -62 -173 77 -23 26 -46 -234 174
4678 174 46 80 -171 7 143 -69 190 153 -86 -19 -182 -50 -159 217 -180 -61 -113 -130 26 -53 -86 -138 54
4701 54 198 -31 75 -149 -5 -166 -95 -75 316 224 -32 162 -356 112 -271 -64 107 75 169 -9 -61 -6 -142
4724 -142 54 -48 72 -104 -40 -153 -15 215 -193 -77 -284 129 102 158 46 -38 -203 -142 -22 -147 117 90
4746 90 107 142 50 -104 39 -122 -95 -16 107 -64 -50 -140 -20 -7 77 -186 18 -68 -177 -371 -47 24 266 24
4770 24 -193 77 -103 -176 178 -68 23 105 -105 -77 148 -121 -446 27 58 204 -204 -215 191 145 -118 -125 -350
4793 -350 75 -11 -78 56 152 -352 -79 -131 156 112 13 43 -154 157 186 261 -32 83 82 -42 76 -180 -32 15
4817 15 -66 -257 35 -10 -144 21 19 -201 58 45 26 -159 -85 82 298 126 -112 76 101 -20 -201 64 45
4840 45 -204 37 21 200 456 233 -154 -188 -52 -47 275 -132 -31 -3 205 51 13 -14 -60 -15 -104 63 -171 -36
4864 -36 -39 103 70 -188 76 -112 190 171 78 -121 304 171 227 172 -169 144 288 118 -132 187 -72 12 -84
4887 -84 149 311 44 74 61 37 107 -384 -49 85 78 -141 -17 -166 230 17 -3 37 169 459 -105 -64 -30 81
4911 81 -77 -290 -245 -347 26 33 132 -64 200 187 -219 116 -244 -108 -128 103 3 -213 -70 262 -294 59
4933 59 77 82 -133 -214 -161 123 172 265 74 -239 40 80 -216 -39 -9 209 -39 97 209 -164 -292 -130 -7
4956 -7 -110 -262 -274 107 -154 219 -18 -139 -54 -62 217 426 9 81 185 -248 -28 15 -106 105 -156 318 -67
4979 -67 -191 -251 229 74 -45 393 13 -121 219 132 50 55 58 -156 -199 43 296 338 6 -106 270 203 -43 95
5003 95 -95 -10 7 -462 160 -115 -8 -104 8 190 242 89 -4 -233 35 86 -15 -31 -68 35 -173 68 -91
5026 -91 -63 198 -138 -38 158 -136 64 -107 11 8 -273 43 50 324 100 -64 37 112 238 -33 -187 -331
5048 -331 202 -74 -151 -335 251 -86 72 40 -76 -151 -11 124 -25 -195 126 229 63 36 95 -254 13 148
5070 148 151 -98 13 161 -146 152 28 135 -134 151 149 110 -136 60 -174 77 -14 -46 -63 -140 247 -64 75
5093 75 273 -26 -170 27 157 18 38 -90 278 334 86 9 50 -140 249 -132 212 199 23 -27 -224 205
5115 205 51 -192 67 0 107 -134 15 -106 -172 -62 -221 15 -130 -87 -109 -104 57 11 99 25 50 445 98
5138 98 136 -105 87 17 -119 -150 489 -87 29 -26 -179 -90 -102 171 94 47 -193 -9 -174 97 -55 -175 -60
5161 -60 274 190 5 -81 -143 -2 -198 -142 -50 -99 -200 -55 277 -80 147 60 138 -399 67 85 -7 164 -60 -65
5185 -65 122 209 99 -11 -100 54 -195 -19 -182 165 -174 78 -202 176 319 184 -181 160 -154 91 222
5206 222 -69 -31 -164 144 119 255 -35 82 -120 39 -143 -222 -34 115 6 -210 192 -170 286 -105 -354
5227 -354 -165 382 157 110 -85 -98 -70 -147 12 -227 193 36 83 -121 160 -47 59 -257 59 -88 21 236
5249 236 204 -184 -77 115 -64 -232 -58 101 -129 256 243 54 107 66 210 221 -152 2 -139 -38 -162 128
5271 128 -46 -23 130 139 107 165 281 -120 -251 214 -191 64 2 -174 -120 171 95 155 -10 66 35 -155 -88 -246
5295 -246 -67 -249 41 -80 -67 -15 136 -178 -6 -18 -9 -141 150 183 -192 45 -181 66 149 109 84 183 55
5318 55 -110 -120 -14 -351 103 -5 -276 124 -52 -47 319 -392 -8 -24 20 -229 -186 -104 -71 141 22 -59 -25 -14
5342 -14 231 -39 -484 85 -134 -180 137 49 135 -25 86 301 253 82 -185 16 -105 -326 185 -99 108 -67
5364 -67 -6 -134 0 35 -151 -153 -51 67 -96 60 -404 274 187 -75 55 -47 108 -117 -75 137 23 -25 -82
5387 -82 -11 -136 -21 -27 -2 67 225 62 162 97 63 5 -53 183 -195 38 49 -44 -97 91 125 -97 143 488 214
5412 214 47 -269 39 62 -393 -22 47 242 -98 6 65 -118 -114 13 -150 -194 -60 22 48 323 306 -88 -85 -23
5436 -23 -149 57 -79 70 162 -79 -113 164 -51 -218 91 28 -217 167 267 -11 -283 -382 -254 -145 50 -119
5458 -119 19 236 -72 236 299 -92 -24 -131 79 131 -99 -169 -4 -137 91 101 -225 27 -21 32 -16 111 149
5481 149 -116 73 -34 -40 -62 76 14 232 -95 19 102 -198 42 189 93 191 -286 -26 -227 -145 271 -148 154
5504 154 -147 -187 -129 190 -92 248 207 63 32 148 92 -198 219 -79 -33 -76 274 -202 -75 -161 -116 32 -21
5527 -21 306 -13 -220 -151 207 12 72 168 16 148 61 56 -45 20 151 -377 96 30 48 119 133 -203 -114 33
5551 33 -112 -184 221 93 98 -123 -305 83 107 278 -81 139 -24 13 51 -65 -1 9 131 -85 -104 -175 25 -100
5575 -100 -209 -143 72 -26 -142 203 285 214 73 -49 -94 88 -101 76 221 150 67 -80 191 -207 -29 -244
5597 -244 71 -30 80 -28 -214 -53 342 -147 -109 215 -135 -37 130 -103 139 136 133 -173 171 -27 -58 50
5619 50 288 252 -32 104 -46 150 -8 -206 -142 12 -142 8 -141 32 82 18 21 56 -50 -91 -192 63 -98
5642 -98 -116 -175 217 165 30 42 150 95 -41 216 68 207 -165 -79 -105 -131 124 -127 -44 -213 -70 208 227 -162
5666 -162 43 28 259 -70 21 -73 314 229 -326 -38 194 -58 -71 76 -48 73 15 134 -63 -101 99 -39
5688 -39 -203 -29 247 -267 -132 -262 -153 -106 57 124 -153 -267 127 -90 -147 110 149 11 -40 102 -220 -102
5710 -102 -202 -140 -26 -32 170 -26 7 -119 -86 -22 14 555 -51 -45 27 161 -71 -52 83 -195 109 60 -78 -161
5734 -161 41 81 268 -145 220 59 -136 28 121 -61 10 136 -11 2 -142 -95 342 -176 171 -35 5 -60
5756 -60 -80 177 -158 -53 -64 -210 -69 -3 -172 -159 180 115 -16 67 -35 -479 68 35 -138 -28 121 -121 97
5779 97 89 -210 13 75 118 -96 71 -119 -119 -136 103 -2 34 -185 -102 2 20 21 36 -196 81 115 -202 371 -140
5804 -140 233 -146 -32 30 186 -63 36 -94 242 86 25 213 -133 -62 -78 -69 -84 -76 156 6 83 152 -278 -125
5828 -125 -24 -141 -28 -194 96 -66 -302 170 -203 -206 -36 307 132 -34 19 -85 -9 193 67 -146 -198 30
5850 30 40 -81 -131 61 280 -157 214 76 -54 157 -133 -19 -83 81 34 -17 114 67 95 160 128 -236 -212 -246
5874 -246 -49 277 -121 -23 196 211 -180 -12 141 -193 -186 394 11 -149 196 196 -88 129 -310 183 106 272
5896 272 138 37 -89 -4 184 197 -352 -236 32 56 216 76 -69 -234 262 -38 -57 -67 144 -316 -317 -77
5918 -77 185 15 -158 -173 -261 -273 -139 40 -179 240 -198 98 -137 -9 -240 1 6 35 -311 -7 66 -162 -143
5941 -143 -11 -154 -18 102 -129 -86 115 -9 227 241 -149 -79 -373 53 -63 84 -9 -64 135 3 -5 86 239
5964 239 189 -152 -138 -133 249 225 -228 235 122 50 28 -42 29 55 74 211 -16 144 123 -48 -92 -101 193 -235 -195
5989 -195 -2 233 -164 -25 -224 138 51 35 104 248 187 274 232 -88 459 -86 58 -154 -88 197 -49 17 -88
6012 -88 43 -91 178 -90 -302 -133 -203 -42 147 -211 -144 -98 -13 207 -69 -187 129 -91 47 136 -40 33
6034 33 181 170 330 -1 116 -296 2 110 54 230 187 0 -181 -302 159 -202 -115 -304 -34 -14 -2 -87 168
6057 168 -295 57 -104 71 -152 -97 156 -175 87 -1 -175 -156 93 -57 242 -338 -250 105 -155 -198 209 -148
6079 -148 -152 -127 -187 -172 352 44 -78 52 286 -199 -133 244 102 -226 -66 44 17 -70 94 -278 128 49 -7
6102 -7 -123 74 147 -7 -161 125 117 300 -3 139 208 -191 109 -77 -386 -11 153 152 -83 44 -122 -168 92
6125 92 -218 49 -311 192 -32 260 -6 -405 220 145 -226 91 -185 -147 -50 -160 -185 -147 160 56 253 106
6147 106 11 -145 -175 -114 74 -35 62 -26 36 -7 8 85 -102 -317 -100 -116 94 90 60 -310 -33 -84 133 -120 3
6172 3 61 -241 -124 92 -170 59 129 -127 213 -83 -14 -41 22 5 70 -37 -419 10 -110 79 123 161 -224 -156
6196 -156 216 260 -68 6 313 113 -114 -82 194 -57 33 327 252 99 -321 16 -105 -144 121 283 -175 182
6218 182 146 -196 188 -129 -93 -136 71 40 104 325 132 128 -44 -195 -50 241 -99 230 141 -106 -57 -114 -183 79
6242 79 -145 -39 -48 11 181 -129 -151 2 -124 -50 -85 -158 -63 -79 -145 22 246 -39 -207 -333 232 51 -104 123
6266 123 59 18 -45 -150 45 58 3 29 150 11 -170 -221 -23 -118 -201 -132 -148 224 -159 -2 162 103 -232 200
6290 200 296 426 158 173 96 -33 164 287 94 163 25 -28 93 22 -95 172 255 63 -1 223 -169 118 -53
6313 -53 -129 -5 -74 -75 -151 -32 104 12 -101 -37 -37 133 96 54 -26 -67 -184 -10 -6 73 21 -173 -7 -8 -226 63 -28
6340 -28 141 -138 -37 -92 -50 86 -13 -226 -194 301 -237 54 56 100 -151 171 -196 55 432 37 -195 -43 23
6363 23 107 37 231 -50 -59 -64 -145 -110 58 161 -79 -103 140 -16 -314 -49 122 -3 -121 -29 -198 -74 -121 -174
6387 -174 94 69 162 -265 -99 23 -89 -138 -375 -112 -200 -121 -311 -65 -34 117 29 -94 -13 134 199 102 -117
6410 -117 215 191 -429 -66 -171 55 -111 31 -166 43 -190 30 20 233 60 0 -102 117 -198 179 59
6431 59 -318 292 -122 -111 212 -10 -167 -112 -135 41 -245 -93 -105 -82 37 68 -60 134 135 -108 -171 288 288 -228
6455 -228 -120 201 -13 -131 -354 -169 117 71 144 72 -2 -319 71 -147 37 -70 166 72 -90 113 -63 -70
6477 -70 74 118 183 -211 -133 -252 67 -81 -57 -57 -43 35 158 161 144 62 6 172 61 -28 -242 -83 -30 97 193 30
6503 30 -67 253 219 185 89 -10 171 -144 171 -40 -138 91 23 90 -289 -113 177 -82 -39 141 -212 209 139 44
6527 44 -51 -148 305 -270 -13 -30 108 -106 253 56 279 90 -143 129 4 -44 86 162 131 54 -99 70 124
6550 124 90 -2 19 -114 83 90 192 -124 -54 -18 -152 86 -98 -37 -6 91 21 -98 -214 63 29 26 243 -49 187
6575 187 154 117 114 148 -27 -364 38 17 155 33 73 122 -244 58 -294 205 258 -47 -253 30 251 14 90
6598 90 21 383 195 74 211 -68 119 332 -41 -261 -10 -170 271 213 118 235 142 60 -312 -152 -187 -3
6620 -3 242 7 -99 -25 23 8 27 -130 -20 73 -104 25 267 95 -81 -314 317 -247 -2 -76 -82 39 -64
6643 -64 -41 -10 251 51 -177 177 -86 -11 -21 -42 -200 -219 -96 157 -169 -46 -95 202 -12 170 162 -136 449
6666 449 101 60 -107 -100 -272 325 104 -276 64 169 10 -28 -128 186 84 -158 -278 23 264 128 29 -198
6688 -198 32 66 -20 -184 -192 -47 -167 -165 -64 -99 150 -80 29 103 -65 -44 -73 43 -181 103 116 135 79 4 -38
6713 -38 -93 21 192 -138 -253 243 179 2 -204 -254 -107 -240 90 187 178 -114 -22 207 -98 -17 -155 -65 40
6736 40 183 9 35 198 -12 40 68 -130 -57 -10 -203 -234 107 -187 -145 102 213 -29 89 5 -9 -224 -236 295
6760 295 -123 81 4 7 63 10 89 -159 -123 -181 -294 126 -4 -154 -104 -115 141 11 96 75 -291 -319 -173 -20
6784 -20 -137 -44 -21 41 3 -12 -254 -19 175 157 170 -100 40 249 -10 164 -43 44 -242 -34 238 -108 58
6807 58 -194 140 -441 -133 -169 -153 -40 -119 -61 178 78 185 169 -53 -41 -18 -126 -252 122 91 44 107 35 -74
6831 -74 160 -170 -201 7 -203 -299 -59 52 200 -362 121 -57 -154 240 -3 42 169 63 33 -146 164 210
6853 210 117 163 61 273 -217 16 94 -235 -23 8 -213 169 -234 -109 -82 -93 -59 184 -52 -134 102 176 262
6876 262 -58 20 167 192 102 -16 70 -289 12 289 -136 302 -97 -4 -48 42 -209 23 114 -171 152 -56 226
6899 226 -192 341 -94 -202 -27 69 77 -179 185 -114 -203 28 -6 -54 -56 264 -2 -248 171 -124 104 130 257
6922 257 -316 -182 71 135 -59 19 141 -226 226 -84 111 -75 -250 -126 67 70 -87 58 81 7 49 -242
6944 -242 -29 -92 347 183 -10 -178 144 -13 129 49 -191 72 -313 69 -238 -47 76 298 -235 36 124
6965 124 276 106 -199 57 -154 178 107 52 276 -160 -137 81 -267 -88 56 105 198 271 31 92 139 -52 -52
6988 -52 -52 78 133 153 -15 -148 -65 -90 361 -176 154 -126 53 95 306 240 277 -219 -42 34 -4 -157 -267 -84
7012 -84 88 -15 2 172 17 187 318 -56 158 -17 90 237 -61 -122 -70 -78 38 90 49 53 58 178 189 110 -36
7037 -36 -78 -86 -125 16 -65 117 -127 -7 -169 -261 302 -201 23 -268 52 -163 -65 90 6 83 46 -33 -193 25
7061 25 -167 266 22 160 -184 -197 168 60 341 101 -44 -81 -126 169 140 -116 152 -18 80 225 -92 -284
7083 -284 27 163 -185 59 270 167 -146 51 212 -107 -274 -132 -298 138 180 109 68 -52 311 -80 -43
7104 -43 5 -47 159 55 145 70 142 51 -157 6 101 -16 35 -73 -90 146 164 -27 -26 -244 -33 54 28 -138 145
7129 145 193 108 55 149 -92 166 -222 -9 -2 93 -79 56 117 -161 82 170 -165 48 105 32 139 -329 -93 13
7153 13 -224 -77 186 -82 -46 60 63 236 -413 87 -239 -191 -248 246 -121 -43 19 -31 222 22 145 -23 -18 -371
7177 -371 424 125 121 -27 38 6 -39 149 59 -242 -210 61 -84 178 211 347 -238 -99 -4 -67 150 -41 202
7200 202 180 -110 88 -327 -76 -104 18 66 59 -199 282 88 -245 -435 62 -349 -344 108 67 76 144 227 45 -166
7224 -166 131 45 78 -71 -180 151 -333 69 -137 -139 -114 105 -184 -359 -138 45 6 31 -151 69 -156 -132 297
7247 297 152 20 -23 89 -314 -37 67 -100 46 -236 -357 -76 51 -291 60 -379 -149 -103 176 428 -134
7268 -134 -104 268 -33 -52 -7 132 190 -24 -56 28 -96 122 68 260 21 82 331 18 -62 -272 -48 -104 -166 -38
7292 -38 88 -153 -58 79 -1 162 153 125 133 36 59 -25 -139 -92 -89 66 -53 -20 -56 163 270 -18 102 44 -64 -100
7318 -100 -112 -232 -87 -1 111 234 -89 38 -128 -196 110 -202 159 289 191 -135 84 87 -148 89 140 242
7340 242 141 -259 -172 88 -76 164 148 339 -132 -38 -185 -169 -186 -191 416 68 314 -132 -105 -60 -6 -109 -31 33
7364 33 -26 107 -18 -263 244 125 -260 -124 315 93 86 -79 -186 68 223 9 -2 -52 -112 -209 -162 111 -1
7387 -1 -97 95 -132 -161 15 -206 -37 -200 -11 -102 185 403 128 -55 127 59 -288 -90 -125 212 -159 -18
7409 -18 -30 -182 19 92 -5 158 -141 8 -148 -385 254 285 -381 -31 53 -69 -15 -43 -208 -194 -86 -74 -77 122
7433 122 -51 -93 207 -163 226 -49 57 -123 -11 94 9 -37 -187 -87 -94 -298 -127 -68 68 -144 -220 -144 159
7456 159 -39 84 240 78 119 291 103 257 -68 50 76 -56 -128 -241 38 -300 100 -228 -125 -26 22 69
7478 69 187 -253 -81 247 -39 -99 19 -24 -198 314 -23 -65 157 -8 159 -188 -167 140 -16 201 179 28
7500 28 224 80 -176 234 -16 53 31 87 108 59 343 -165 75 233 140 28 87 -47 -60 163 -8 -63 -80 296
7524 296 -22 65 -164 -129 171 3 336 -51 151 -22 52 187 -118 -42 -48 117 -181 -174 -36 189 273 130 99
7547 99 139 115 17 72 9 -238 23 175 -137 166 -41 144 69 73 -24 -82 -96 -473 177 391 -187 -214 -21 -109 182
7572 182 3 -93 -159 -56 -237 113 -52 93 -124 -212 232 86 -67 12 205 -162 60 -163 79 182 120 5
7594 5 72 181 39 -103 84 471 168 176 -83 -159 -144 40 -67 -62 442 105 -174 -377 -235 -174 34 8 16 -40 58
7619 58 334 -206 159 56 -290 -75 78 -398 -142 -200 1 228 298 -73 130 128 192 182 49 270 -106 -37 -300
7642 -300 -131 -242 160 11 -47 -201 102 210 1 53 -131 61 -201 66 140 -62 -126 -332 -2 204 -105
7663 -105 -255 26 70 -39 -75 -47 -62 -34 -269 -115 -9 4 -88 125 -17 47 -58 -89 -79 -7 135 -88 -36 203
7687 203 97 -21 -170 22 42 -64 150 75 -104 36 171 -171 -32 -54 -60 -143 -277 -131 12 -20 -68 121 25
7710 25 90 -159 -1 381 221 125 94 -3 59 391 135 142 -287 -362 -73 -49 -111 59 6 123 45 56 95 37 -170
7735 -170 -333 -22 -142 20 107 294 -166 -91 87 -113 69 -121 -239 145 119 160 19 164 19 -33 25 21 233
7758 233 149 162 -49 259 147 40 -110 251 88 115 -252 128 -111 -166 43 120 204 -109 44 -76 -19 319
7780 319 106 -51 -193 -67 -38 1 -77 273 87 150 152 -191 -269 36 143 94 -76 -297 7 -10 -97 -100 165 -156
7804 -156 112 132 -118 22 -128 13 65 52 35 171 318 3 61 -1 -26 84 37 13 -27 70 63 -11 -202 146 -108
7829 -108 -124 266 110 -101 -91 -136 -85 -68 18 135 66 -19 0 -66 -64 106 -7 -112 90 -25 135 120 49 -223 -75
7854 -75 262 -73 -254 -191 -13 76 -16 -164 68 76 146 123 13 -29 112 -38 -3 -177 -5 246 -96 96 117 -109
7878 -109 13 -45 201 53 61 141 110 -105 6 136 -54 148 -194 -142 -122 -5 -35 218 -17 -221 -227 -154 10 134
7902 134 -153 -73 141 -143 185 -27 -95 -132 -135 -216 -196 171 13 -142 23 -95 33 -19 126 218 -279 184 149
7925 149 -74 -49 288 -27 6 1 -213 -269 -127 93 202 63 -37 71 51 173 -8 -154 -19 -30 -9 84 -139
7948 -139 -150 -128 281 -80 92 -6 -36 -171 69 -94 -76 43 113 -100 -59 325 137 16 9 -138 9 -198 155
7971 155 -107 29 -71 -231 202 57 92 -206 -108 -134 156 -27 -63 -135 111 -127 181 331 -72 8 308 285
7993 285 -71 -112 15 -214 11 187 73 -150 93 -18 -103 -142 157 270 15 -288 -60 -81 7 252 5 -47
8015 -47 -89 7 -80 122 71 153 -38 -135 68 -10 -78 97 -191 333 52 -66 270 57 83 -201 66 103 -84 225
8039 225 167 -51 -128 -38 -78 -157 -180 -247 -17 186 321 -67 -85 3 -154 6 151 233 117 -201 -159 -58 98 -215
8063 -215 254 35 -223 27 15 50 42 105 25 -144 -105 -302 263 -30 -280 138 19 76 -46 73 -87 -109 -294
8086 -294 -191 -113 158 -246 -98 -158 161 265 221 128 -28 -91 58 -79 -106 72 94 113 62 -243 -130 -62 -35 4
8110 4 -20 -226 -17 66 -111 -38 152 -35 -41 -121 -80 -25 -247 112 457 64 137 209 -145 -58 89 -21 254 115
8134 115 -84 295 -87 202 109 375 63 13 -56 166 1 20 86 -40 64 40 243 -5 -107 -117 534 -16
8156 -16 197 -128 49 -102 70 110 132 -4 -53 84 94 16 -23 -19 -96 75 -86 276 -238 -37 -182 358 75
8179 75 -18 -120 2 320 -347 90 -143 -40 11 77 -3 43
8191D3
$$ Imaginary data points
##PAGE= N=2
##DATA TABLE= (X++(I..I)), XYDATA
0 0 0 0 0 0 0 0 0 0 0 0 0 0 -8 8 -8 8 -8 10 -16 16 -17 24 -24 32 -32 40 -44 49 -56 64 -72 81 -90 101 -112
35 -112 127 -137 154 -170 190 -210 231 -256 287 -315 350 -391 434 -487 548 -619 707 -817 954
54 954 -1137 1396 -1782 2427 -3706 7188 -34896 -120149 -36355 49968 37116 -28277 -27494 18844
68 18844 34012 -822 -14447 12927 30719 8661 -10083 -7619 -2014 3115 21255 27397 4692
81 4692 -16154 -972 27867 22861 -14369 -25259 8095 24375 -10813 -36218 -5890 31768 18958
94 18958 -20606 -32574 -7345 14850 3261 -20174 -22647 -10224 -2287 -2763 -9450 -15807 -6293 11297
108 11297 4143 -25418 -31236 -1213 23079 5817 -29502 -29569 9387 26927 -978 -23793 -5827
121 -5827 17793 9035 -16096 -20308 2606 21812 10599 -15614 -18476 2704 18509 11568 -7727
134 -7727 -16156 -3460 10545 2142 -13107 -9127 6987 9729 -3748 -16509 -11921 5925 12874
147 12874 -1738 -18734 -16897 -1025 10799 4942 -13670 -16780 4591 14967 -4808 -22074 -7251
160 -7251 18959 15299 -15483 -27387 1442 28908 11856 -18468 -13796 11933 16193 -1282 -10638
173 -10638 337 13525 9051 -5066 -7438 1679 9294 11448 5668 -8541 -12535 4874 18330
186 18330 4872 -14846 -9903 10427 13746 -6985 -18677 1081 20237 4919 -20646 -15909 7275
199 7275 14311 -161 -12260 -9074 1634 5278 329 -4036 -4200 -1539 5118 4573 -8391 -12243 6001
214 6001 19694 3445 -18398 -11900 14772 21312 -1897 -18355 -1546 20503 9581 -12696 -8620
227 -8620 12636 16786 182 -11293 -4455 10484 12420 1704 -5461 -3293 1648 6151 6372 -1823
241 -1823 -6427 2375 9812 1499 -9805 -6027 8707 13424 -1715 -16105 -6012 13046 12088 -5155
255 -5155 -11341 -986 9088 5625 -6196 -8099 3234 11246 2611 -9560 -7643 4990 12983 5230
269 5230 -10119 -10555 5625 12204 1336 -8580 -3839 6644 7902 -2389 -9488 -1070 10744 7345
283 7345 -6002 -9987 -1742 8672 8337 -3057 -10385 -2037 9073 4710 -5952 -6797 2926 8522
297 8522 1753 -9511 -7276 6756 10617 -672 -8524 -5012 4071 6940 1628 -5296 -4009 3792
311 3792 5580 -533 -5744 -2863 5845 8955 -1865 -12125 -3516 11418 9139 -5942 -11446 -154
325 -154 10421 4253 -8949 -7398 6721 8299 -4355 -9445 -1673 6512 4841 -1749 -6812 -3569
339 -3569 3102 4807 720 -3909 -4489 1159 6311 857 -7484 -2683 7932 6384 -4928 -9077 113
354 113 10859 6337 -6702 -8293 3393 8553 995 -5322 -2091 3904 4601 -822 -5166 -2371 4438
369 4438 5160 -243 -5351 -5106 2047 7348 1367 -8040 -4604 5079 5267 -3351 -7269 -571 7062 3264
385 3264 -7311 -7801 2660 7628 903 -5988 -4364 1174 4591 1334 -4029 -2692 2903 3793 -442
400 -442 -3446 -1555 3501 6097 241 -6034 -2579 5452 6103 55 -4640 -2011 4623 5306 -1764 -5118
416 -5118 1181 6094 1908 -4278 -4524 1054 6149 2415 -5368 -5843 2110 5040 400 -4587 -3571 1762
432 1762 3543 -1577 -5997 -1395 4109 2351 -3002 -4728 -1892 3078 4136 -1451 -4495 -1247 3051
447 3051 2509 -1162 -3059 -464 4256 2868 -4024 -4369 2671 6092 1371 -3807 -3034 2280 5309 494
463 494 -3829 -1186 2927 1943 -1167 -2126 -857 2034 2683 -1589 -4388 -1613 2809 2545 -1461 -4832
479 -4832 -2887 2810 2654 -3554 -5146 543 3609 -81 -4392 -3428 1910 4213 -855 -5132 -1926 2544
495 2544 2157 -751 -2025 -1420 932 2247 -161 -1772 -109 2133 2099 -154 -2684 -1141 3587 3859
511 3859 -1658 -3919 -131 3290 2012 -1951 -2808 439 3130 -164 -4053 -1150 2371 2169 -1204 -3091
527 -3091 -2063 648 2313 -752 -3069 -1535 610 789 -1018 -2428 -1807 1750 1533 -2264 -3451 88
543 88 2707 1392 -1699 -2901 -186 2810 1324 -2195 -1382 1407 1941 380 -1181 -957 2237 2873 -139
560 -139 -2219 -468 2177 1743 407 -1441 -1216 1591 1676 -678 -1741 435 1690 920 -722 -1698 -255
577 -255 2408 1340 -2038 -2211 222 1486 791 -1416 -2140 105 1813 -154 -2024 -530 1597 1236
593 1236 -783 -1672 -788 1921 1742 -601 -1614 525 949 932 152 -473 -56 1694 909 -974 -839 762
611 762 1525 1140 -601 -1970 643 2486 648 -1386 -586 1034 1044 43 -1122 -371 1584 1386 -834
628 -834 -1216 362 743 483 -262 -1058 -735 933 798 -430 -979 109 487 652 -629 -1508 253 2207
646 2207 703 -1401 -411 670 1401 534 -936 -645 1051 1197 -215 -388 622 646 595 -177 -616 19
664 19 1269 1140 -225 -730 -189 461 1066 377 -785 -53 1054 167 -790 -332 467 812 373 -978 -1087
683 -1087 782 1315 -464 -807 -235 131 426 -14 -578 -216 607 31 -714 -600 344 269 754 -73 -1020 -21
703 -21 1269 340 -598 -423 -122 190 540 -715 -969 553 736 -306 -782 74 333 725 208 -551 -556 658
723 658 244 -388 121 -110 -181 189 -148 -692 72 621 -20 -431 -299 -224 49 539 -84 -1009 46 437 181
744 181 -613 -6 129 361 394 -501 -457 679 517 -327 -553 -48 -12 -51 283 -451 -414 489 -52 -416 -121 278
766 278 92 360 -229 -651 72 173 23 -106 -2 -120 -103 172 -317 -275 248 357 -301 -404 31 10 263
787 263 281 -133 -340 692 -158 18 88 -69 -178 283 -52 -533 315 709 -303 -163 -28 -35 383 377 -153 -521
809 -521 17 364 -294 -161 -88 -60 82 -92 -310 -134 554 82 -136 68 -7 -152 237 94 -386 326 469
830 469 -354 -149 -23 -215 189 22 -124 -126 423 353 194 166 -87 52 126 14 -318 83 208 -146 -96 210
852 210 -242 273 294 147 -254 116 158 -74 66 349 -302 -36 311 -213 -46 216 -83 -265 -168 13 47 205
874 205 189 -101 5 129 78 -84 290 9 -199 171 156 -211 88 -14 -388 10 -44 -361 198 429 -469 36
896 36 -112 -181 -402 -29 204 30 246 -121 -240 -10 167 43 22 113 -88 -112 239 54 -122 90 255 -342
918 -342 -17 36 38 238 106 -238 -151 31 83 -143 142 -61 -32 120 58 -287 9 124 -242 166 265 -279 -200
941 -200 197 -235 -383 167 -60 -451 246 137 131 -181 227 91 -120 419 -59 -270 102 -403 -15 115 70
962 70 48 -35 232 -202 66 5 149 -151 186 11 -106 204 -122 -279 87 243 -58 -141 -10 -72 186 109 -230
985 -230 -56 277 40 -43 93 147 -20 321 -239 99 38 239 -84 -264 301 -18 -241 80 114 -77 133 -84
1007 -84 -82 391 213 -60 -161 129 -80 -106 249 5 -269 -108 244 -377 -32 166 -108 273 270 -75 20 167
1029 167 168 160 370 -3 -304 131 217 -125 81 -45 -163 105 413 -177 12 161 -41 -351 157 281 -202 98
1051 98 163 -207 68 -141 -84 267 -15 -113 68 156 -80 -319 116 -30 -229 -454 217 64 125 10 -217 -84
1073 -84 128 33 -310 165 -166 -376 56 -74 -116 -72 326 -200 59 7 119 -189 127 26 -64 -176 183 1
1095 1 -132 302 -52 181 -285 -181 -86 100 241 -383 217 139 -372 149 137 -32 -241 198 -60 43 -167 -49
1117 -49 -129 149 -196 -258 -27 118 75 253 -94 -170 -249 -2 -142 114 187 13 -13 57 -129 -184 -122 279 78 -11
1141 -11 135 106 -134 65 -69 -176 181 -36 -58 218 44 -158 149 272 -107 120 -143 44 40 -220 35 -80
1163 -80 192 -65 -1 81 -65 -255 53 87 -8 17 356 -46 -296 -56 -104 199 102 -248 82 227 -95 -148 -222
1186 -222 136 83 90 -40 -95 -30 -59 145 -13 -157 89 -241 114 7 -320 5 291 112 -120 174 118 0
1208 0 143 87 -316 180 204 -24 -29 34 25 145 110 -143 -138 158 -55 -169 -159 39 105 0 -55 -229 57 387 170
1233 170 -99 281 113 -143 187 -135 -46 -133 42 2 -73 -80 -424 90 108 -149 -51 128 16 246 -279 252 -34
1256 -34 3 -2 -208 -125 352 -88 60 8 -294 -277 62 -234 -263 246 83 -33 95 48 -300 -56 -184 -88 12
1279 12 -100 215 -457 -119 -176 315 82 -159 -304 -189 528 -45 -129 25 -163 29 331 -331 179 247 2
1300 2 -72 125 -81 76 -51 198 -3 -96 174 140 -272 -159 -165 -167 31 89 -187 -170 208 53 120 -55 -49 -348 40
1325 40 9 168 46 236 -106 -162 57 -242 5 80 -300 -202 132 100 -15 109 24 85 -14 93 -51 11 -166
1348 -166 -86 -192 338 -156 -265 -62 240 7 104 312 -85 -66 65 -73 -67 -18 -174 -149 -229 90 -213 207 -164
1371 -164 -78 131 65 65 105 -105 67 81 -25 -130 135 400 -214 -127 12 41 21 -145 26 -202 206 -49 -63
1394 -63 -34 98 -131 38 85 -261 -339 -58 236 156 119 221 -186 40 83 236 400 87 27 -169 54 229 45
1417 45 281 -80 -131 -72 220 -112 -283 -122 121 -252 -85 12 -179 140 198 15 -179 -72 -252 -119 49 -262
1439 -262 -199 -60 -133 174 -285 -108 -29 198 9 -89 292 136 -220 -251 -64 164 -137 67 346 -225 28 163
1461 163 -93 72 193 200 75 26 -193 35 360 209 36 91 25 -97 92 128 -103 49 157 48 -190 -38
1483 -38 74 -206 57 -288 -195 -101 130 -29 176 43 116 -122 86 -66 -256 -38 -175 1 -208 -24 156
1504 156 -18 -61 -31 -413 215 -143 -120 344 -56 -23 33 -215 -238 186 78 209 -9 -153 22 92 -124 0
1526 0 -378 -131 197 21 34 -129 205 -27 21 131 -279 233 -88 -196 220 -219 -69 -335 35 -376 -157
1547 -157 -235 98 -405 119 33 4 244 -306 136 57 -205 228 62 98 241 145 176 -59 62 -35 48 189 297
1570 297 336 -113 -21 48 -18 312 -66 -4 -197 186 117 -184 311 -83 -72 -122 -87 -356 66 -58 -154 -150 220 -263
1594 -263 -245 -110 -21 -57 207 173 -138 -77 66 189 -19 -34 -274 6 173 -188 76 -58 -135 102 36 91 -27
1617 -27 1 47 -137 38 349 78 78 -249 -42 -79 -259 -37 19 105 -195 144 -11 28 -40 -405 -54 -240 12
1640 12 79 151 -140 247 44 11 -104 -59 -191 -303 -160 -126 54 200 341 -151 145 160 55 100 239 90 288
1663 288 418 28 -337 107 3 -46 -91 72 249 103 -142 -124 -30 133 -32 19 -135 -84 20 -203 -228 -91
1685 -91 104 -32 81 36 142 -334 6 -11 192 -174 8 3 -12 58 -113 24 162 -133 -39 233 261 67 58 214
1709 214 -143 143 -15 56 -382 -47 -143 -112 -145 -141 66 -220 141 22 38 -10 -14 -83 -99 -13 24 -10 -365 -220 92
1734 92 -67 -116 -45 93 95 -91 211 -29 25 194 109 87 -88 17 -249 118 240 -231 -283 190 131 95 -23 -1
1758 -1 22 -52 209 1 162 -52 -25 132 194 -133 152 -144 -59 513 -251 186 -172 -173 -67 -63 101 -80 -154 117
1782 117 -64 -74 -204 152 222 -99 5 -72 84 18 161 -93 420 48 269 94 76 25 -303 10 -303 392
1804 392 162 28 -118 -192 -43 27 116 -263 -79 26 75 67 -302 126 44 43 35 37 141 46 31 166 124 235 -26
1829 -26 -190 35 31 -200 248 323 -100 21 -168 -318 260 -156 -5 -24 239 57 -165 -3 -166 33 315 184
1851 184 55 -26 -119 -21 -133 39 30 136 75 -13 315 125 -156 53 192 -134 46 84 -215 11 -17 315 9
1874 9 48 -216 -110 108 145 -8 117 150 -2 -4 -27 -126 -151 -239 184 -59 -23 55 -115 0 -64 -142 -143 109 32 -2
1900 -2 206 -81 222 63 236 -22 81 -48 -46 5 40 46 -23 99 -86 -52 -371 167 -175 223 66 231 -383
1923 -383 -101 -101 -171 31 -79 -119 126 -77 -87 146 -146 4 -64 276 -32 -2 0 -84 -71 -241 15 119 -102 -83
1947 -83 113 -167 -190 134 -171 41 133 262 314 42 52 -109 -12 105 191 156 43 121 176 -237 303 -107 -99 -30
1971 -30 -113 -67 -43 -149 -2 -14 -235 210 -134 120 -298 24 23 -85 242 -86 2 58 -24 -13 94 -108 35 -173
1995 -173 172 -153 -237 -131 8 -21 19 43 62 -151 -256 -225 124 28 -184 -187 209 -33 -16 4 -96 252 158 -166
2019 -166 70 -103 -49 105 -351 144 222 74 -33 -7 88 -171 -6 -168 -28 -158 -207 13 228 321 -436 -4
2041 -4 -93 184 -148 68 -139 -49 8 175 -65 -101 -131 239 39 -188 159 39 56 -123 175 -63 28 286 197
2064 197 -147 235 3 -46 -302 -51 -200 14 84 -66 -98 177 49 -129 -42 -163 -76 -227 149 6 -134 5
2086 5 10 247 106 -177 -76 -178 30 210 -326 56 -347 -211 -23 -92 130 -26 205 -267 -21 214 81 -55
2108 -55 -151 -317 -121 92 -231 -170 17 -113 -70 -210 -119 -274 105 205 -12 -155 136 47 -270 147 180 -65
2130 -65 303 -1 93 201 207 97 -140 -265 -80 75 253 -176 93 22 -34 -408 -76 -101 429 132 278 -4
2152 -4 -343 79 -18 21 -166 -182 -86 -54 -160 25 252 110 -62 -26 30 -210 -171 147 -127 191 12 321 -100
2175 -100 25 29 4 94 212 -227 103 -10 -204 173 -86 -122 -157 286 -118 72 -68 -159 -51 -205 4 -131
2197 -131 96 296 155 -123 -97 186 24 129 59 49 252 281 -108 204 -154 -295 61 -118 -230 36 -39 -165
2219 -165 -181 -108 -173 -34 -268 142 -136 28 41 -353 -212 -70 45 243 98 -128 181 139 -189 148 -265 -304
2241 -304 231 -149 -93 -152 -107 0 51 -39 103 140 226 204 298 178 -16 -218 -68 -58 35 -100 -12 -61 -111 199 141
2266 141 -196 116 40 210 -41 50 231 -299 177 -110 9 -236 -32 248 24 13 -198 -153 -287 -53 -239
2287 -239 -60 -108 149 58 -112 -159 -14 -292 -6 -158 93 139 -250 38 -131 23 60 168 290 1 -78 59
2309 59 271 -70 -77 106 40 -388 -293 31 -153 -180 -65 18 93 -139 225 -11 -166 30 -41 227 -61 -182 -48
2332 -48 -126 39 158 -36 -22 220 -65 341 149 171 27 31 -104 46 102 -70 42 -37 -114 -122 196 25 33 -127
2356 -127 60 -63 23 -51 23 -123 176 -71 -111 -38 25 61 -25 -13 -153 138 -84 -92 -90 -120 -270 -186 -140 -323 -103
2381 -103 -8 -6 -63 15 -28 280 -14 2 99 -160 -42 109 185 128 -228 -137 37 5 74 84 162 114 -16 169 -88
2406 -88 6 -11 -87 82 260 248 78 -28 200 -237 266 114 -190 -181 129 201 -65 -43 -120 141 168 -155 -340 -24
2430 -24 -172 -240 -35 32 -102 231 -363 -183 -11 -248 -97 166 -34 -203 230 143 101 175 -261 -6 5 -116
2452 -116 -357 101 -92 298 112 -53 64 -102 143 -246 -109 -110 131 62 -155 -138 152 341 4 -25 -257 89
2474 89 -104 -49 147 -168 -39 -53 37 51 -292 -46 230 397 -293 3 88 -103 -189 -3 -74 154 -30 -24 180
2497 180 106 -55 -113 -165 -261 83 339 231 -140 -142 108 -280 -11 -60 -48 210 256 -82 -261 -43 56 76 -85 46
2521 46 177 148 136 339 18 -60 -37 113 -39 60 -49 423 52 17 -97 211 -207 -232 57 31 191 32 -249
2544 -249 -68 304 173 112 20 -345 -105 -127 -17 -39 -231 -187 253 213 184 -189 184 323 -11 9 -173 12 -90
2567 -90 43 214 -101 -247 -192 11 16 17 18 -20 -48 -115 14 -121 104 -220 109 293 227 -221 69 43 58 -112 33
2592 33 -506 82 -58 48 469 -173 55 -3 201 263 -140 -251 198 -153 -120 151 -120 288 86 -137 48
2613 48 -193 98 151 -111 -59 -273 145 -24 -61 -305 -10 -63 10 49 50 67 142 -227 -91 -96 -104 182 -127 112 -122
2638 -122 -243 114 -329 -632 45 30 194 -67 -225 -306 146 -27 -256 -96 159 121 -35 -101 -31 27 3 363
2660 363 -418 69 13 368 117 -27 244 -57 52 315 -186 -36 252 163 -236 89 183 114 40 -81 209 233
2682 233 130 -159 194 -85 44 33 131 166 -28 -12 159 174 152 -211 67 151 -178 22 -130 173 85 -133 94
2705 94 -175 290 374 -175 -109 69 120 272 -295 -141 180 87 -110 136 -178 -164 61 30 -156 -7 296 461
2727 461 -169 -41 27 316 397 -131 -10 13 -90 -46 243 -92 12 71 99 186 -183 -46 -208 21 212 18
2749 18 -115 -5 0 -54 -287 -74 6 -97 0 -48 140 -35 152 130 7 64 -266 92 -77 73 4 -145 142
2772 142 70 -136 -60 -19 -26 467 -34 180 84 106 -72 71 346 -113 -40 116 82 18 -26 -200 -467 -227 -133 -185
2796 -185 -132 -346 121 -147 -137 85 95 107 -156 -181 132 107 -80 26 -237 -239 -90 99 -34 69 -25 93 155
2819 155 63 118 -21 75 259 -203 -220 102 150 -165 -187 78 34 -60 106 254 90 36 110 -289 -122 -20 157
2842 157 -138 61 -365 107 186 -6 250 -380 56 107 -221 -85 160 25 6 164 -40 -157 470 -86 208
2863 208 -322 98 -109 -123 220 75 -101 -323 67 19 213 -114 128 -145 159 -12 -177 -76 -59 121 -61
2884 -61 104 -64 12 -86 -12 26 166 310 54 189 -159 -79 14 -1 -79 -28 24 82 162 215 -142 30 23 185 -332
2909 -332 -207 -45 -20 -134 -7 158 109 -30 36 33 23 -36 62 -46 -153 -56 -183 -182 -362 116 174 -230 283 -56
2933 -56 -146 357 27 466 109 -84 -223 -141 -43 -152 86 -63 119 79 -138 43 -248 51 -139 -207 -39 193
2955 193 154 -109 -167 -119 84 -368 -120 -114 -193 -24 18 405 -60 -10 -66 -200 -9 -80 -35 -288 -100 60 -11 -141
2979 -141 116 -7 -75 86 39 -10 -78 -311 -150 73 158 271 137 41 51 -144 -165 223 22 -53 206 -102 123
3002 123 -132 -156 -42 47 -185 48 -15 175 122 153 0 -25 -154 -289 -28 73 105 -304 53 396 7 144
3024 144 260 104 1 148 60 -101 -1 428 408 -39 -341 118 -229 -23 -66 -209 -93 28 63 291 -53
3045 -53 25 -62 169 -164 -132 -248 -146 -1 -78 -239 -146 139 18 19 -52 45 133 -133 -44 95 -167 -395 -67 97
3069 97 -225 47 -102 -68 105 -92 106 -51 37 282 -83 142 281 -99 88 -66 38 216 -4 137 9
3090 9 -148 -77 31 18 84 326 -273 -79 -137 -217 -237 242 -52 -124 157 83 -53 53 -101 -164 96 21 101 65 -156
3115 -156 187 142 149 181 71 65 100 -97 234 126 114 214 -21 -92 61 55 58 -269 -64 200 -12 101 -340 -94
3139 -94 -343 -76 109 83 -327 -65 8 -49 319 303 -83 -60 -32 37 -256 -81 -191 -63 -24 206 58 78 -26
3162 -26 140 139 -349 35 38 -96 -111 65 66 78 -168 94 -228 93 25 5 43 71 197 216 72 19 140 -90 -51
3187 -51 -54 -18 95 -24 136 95 -16 188 23 -21 120 -3 84 121 -59 -262 -77 -116 74 -173 37 111 112 -75
3211 -75 -138 68 17 -131 321 59 19 -91 -86 -41 -63 -152 42 -133 69 5 -18 -35 10 -205 65 -18 133 -110 -47
3236 -47 82 -32 19 -56 -64 -87 -219 41 103 5 220 31 24 17 -95 -119 -191 320 -218 24 26 89 88 93 -212 107 79
3263 79 -81 -277 -43 1 -21 -29 -208 -34 -102 59 -19 -177 -19 208 53 -22 79 204 1 17 190 -33 -94
3286 -94 -3 -103 -190 87 -59 -18 122 -166 -63 2 -109 -161 -97 -141 204 -245 -87 122 -120 35 117 24 190
3309 190 -163 -73 -79 7 30 126 233 -59 161 7 -41 -145 199 103 -78 -68 156 138 -162 50 156 -117 2
3332 2 -55 -1 212 226 160 -1 -16 -139 157 -92 -21 -357 -132 -253 70 82 -147 -147 -21 137 -167 -28 167 261
3356 261 -102 -96 -27 51 174 -73 -9 -274 308 -13 -82 22 -270 -63 61 26 21 -88 -48 -64 -32 -66 -179 -26
3380 -26 -253 9 -201 -13 67 -17 118 -11 -59 -2 -163 -255 -57 -210 -360 57 71 167 54 -233 -141 -208 91
3403 91 -44 -28 20 -41 234 -62 181 178 48 168 -157 29 54 -217 77 -110 -10 184 -232 72 -132 -126 266
3426 266 92 181 91 -194 -128 -275 119 16 56 -151 -38 1 -206 170 113 -54 53 -4 125 182 182 -12 95
3449 95 112 263 23 89 80 261 45 -30 -132 239 26 115 225 -467 -10 -43 131 424 -42 21 18 215 -153 -139
3473 -139 -128 -32 -45 -241 -17 -283 -96 134 -101 -110 -286 -19 50 170 215 -148 67 -92 -28 174 184 56 -161
3496 -161 40 -263 187 44 36 65 185 -330 -339 160 -57 81 98 -91 -146 246 88 -125 173 109 109 -254 122
3519 122 239 56 -132 108 18 -131 -167 302 -24 -13 -86 -104 -211 308 111 3 -286 63 60 99 -87 2 -37
3542 -37 142 33 -212 174 94 70 -125 180 54 182 -35 109 -110 70 54 -152 -163 -51 -63 99 -126 57
3564 57 -134 -88 273 272 -103 -155 -218 -66 126 -162 -52 -79 46 89 -220 17 -55 -124 -164 -312 -10 -7 120 290
3588 290 -20 -48 47 6 21 -216 125 -121 -80 -293 8 -7 -321 69 -42 157 -240 -3 81 212 0 83 59
3611 59 -250 88 -49 64 30 -265 -231 3 -140 -98 1 -52 -281 -267 122 38 256 344 -106 13 -14 -247 -257 297
3635 297 -124 9 61 181 -163 -50 -66 -56 40 -201 38 16 42 -272 34 -443 104 117 -274 -71 54 -30 -108
3658 -108 -232 -88 -265 95 32 -78 -107 -148 -69 61 72 -125 -143 -197 143 -230 101 -24 33 -72 62 65 -8 10
3682 10 -131 -251 83 -41 -46 86 -145 -254 92 172 54 -128 -160 -51 -21 -34 -101 241 -69 -399 -105 325 72
3705 72 0 41 46 116 153 -6 -164 96 -128 73 -43 42 107 72 41 66 33 -153 81 -194 68 -40 -46 -211 -8
3730 -8 -178 216 217 50 99 -294 193 -47 215 46 -168 -81 -104 -50 -78 -250 -118 -112 -157 -123 164 25 -7 -17 33
3755 33 106 -225 -124 182 -125 21 -164 -204 -148 46 -279 212 80 -101 -57 -78 290 -59 153 -203 155 -228
3777 -228 110 59 57 -282 -236 -182 114 -268 -41 -11 -66 -86 81 100 -32 -99 106 180 21 -194 -123 -213 153 -54
3801 -54 88 -85 -258 318 -8 -95 244 22 114 95 114 -317 250 -262 142 87 23 43 -43 241 41 -121 -133
3824 -133 160 -105 238 -110 -40 -71 -87 131 -86 -50 12 -32 99 -39 -54 -222 -37 -307 -1 -146 -122 33 -30
3847 -30 32 -208 230 40 -55 -90 7 281 -66 223 -309 -8 284 45 16 297 -73 -112 201 -104 335 -316
3869 -316 64 -34 36 216 -2 -98 -25 70 67 -236 -260 -50 96 -335 -76 112 52 150 41 -156 -9 141 19
3892 19 87 -319 -54 34 56 -49 -9 -88 -61 92 -259 211 -11 180 -120 -2 -148 -133 94 65 -54 21 -61 292
3916 292 275 -140 -31 109 123 17 65 -3 -60 87 -25 18 -345 153 -220 42 -361 28 38 179 113 -237 132
3939 132 -233 73 1 99 -82 -143 25 -55 -271 -87 173 48 -36 126 -80 118 71 -14 40 314 -82 56 -235
3962 -235 -112 106 -29 181 -117 6 -103 267 61 3 3 73 87 -199 -49 -205 -257 -198 147 38 -248 -97
3984 -97 -163 155 273 -74 -150 -398 56 80 76 96 55 -279 27 57 177 -383 -204 2 45 -35 285 -132 -48 -154
4008 -154 15 -65 -149 114 -26 -128 46 -145 225 50 7 207 -212 284 -126 50 256 40 -20 -69 -23 72
4030 72 -141 136 -198 -93 -45 134 39 -67 10 -65 368 198 -107 95 5 -196 163 -12 -131 192 49 -107
4052 -107 -110 -193 -73 50 -69 -317 48 -8 191 -85 -15 -12 -89 73 -202 47 56 28 -119 -153 -210 -220 -141 133 -155
4077 -155 -14 -53 -419 -385 180 -151 -198 -134 53 -241 -271 59 -36 248 -201 92 -30 -341 -140 145 -67 50
4099 50 -183 -36 118 57 -119 59 44 -216 154 -2 493 26 223 -89 -43 -52 156 132 -133 -213 -70 74 -138
4122 -138 325 -67 -71 244 -163 62 -92 -72 -58 -237 310 -100 385 119 -77 -2 -157 -194 -173 -21 -13 141 -207
4145 -207 224 -75 118 -206 276 -44 -42 -189 86 -23 -129 -122 232 -218 107 47 154 63 312 -56 -132 -27
4167 -27 -185 -148 -165 186 -422 -310 27 205 -185 -33 -100 114 -89 121 -213 -7 -347 -246 -39 -116 -92 -53
4189 -53 89 22 243 138 -3 87 76 23 -84 89 -168 163 10 -105 -172 282 -152 -14 234 27 -117 -107
4211 -107 -213 105 -15 101 -108 -4 134 -244 108 84 -45 -107 47 -11 -185 -5 -224 143 -63 93 34
4232 34 4 143 62 58 197 -87 -7 289 12 131 -49 41 -21 -60 112 153 37 28 239 -200 -226 -71 184 -90
4256 -90 -18 -417 156 -136 70 1 11 -31 -38 167 48 -34 -479 85 89 27 -49 56 -94 -64 -91 37 -340 75 -146
4281 -146 199 4 282 84 -53 -10 43 -61 11 -116 99 -108 -212 -148 -25 -93 49 93 33 -51 34 204 -46
4304 -46 -88 -54 -62 44 162 21 421 196 -169 85 114 101 -1 -185 -128 -17 20 -1 37 -174 194 -66 90 42
4328 42 209 -37 170 193 23 114 97 -178 68 141 -112 109 -78 -132 19 -99 158 -85 68 -4 -49 -39 -77
4351 -77 25 115 -23 -67 -109 188 160 206 -24 162 168 -249 -138 -103 -267 92 -13 117 -82 -82 -193 -33 -70 -82
4375 -82 -36 -196 -17 45 25 -205 -38 49 67 -9 319 65 268 -243 6 122 -6 -351 -20 -181 -102 -279 42
4398 42 -60 -135 108 10 167 107 -84 -207 4 -32 -3 -60 -209 -84 -118 16 298 5 329 37 -170 -128 -207
4421 -207 13 227 195 -86 68 39 399 -58 -115 10 -161 25 47 -264 38 123 36 177 -379 -118 -89 98
4443 98 50 179 -42 105 100 -259 13 -217 248 -55 -9 -202 -187 -265 58 292 -39 -88 -121 -70 125 -121 -105 -179
4467 -179 -198 -75 8 182 -67 -228 -261 16 181 133 -109 66 124 -146 197 191 -109 -75 5 165 66 130 78 188
4491 188 -202 -1 144 192 -230 158 -142 132 196 102 -161 67 86 57 227 33 158 -52 16 106 111 323 -161
4514 -161 -86 109 107 -181 242 97 47 166 75 126 168 12 46 123 276 125 -125 -154 -65 -313 -287 195 -260 164
4538 164 76 25 174 -31 -71 -94 -44 -200 -200 -33 -68 39 110 263 -104 -52 0 -61 -301 79 96 117 101 62 -2 -13
4564 -13 199 207 174 -74 -5 9 -11 173 268 -7 -129 -152 177 -183 172 -164 -97 -114 41 152 93 -31 -113 -180 -192
4589 -192 39 165 -158 -151 365 11 -53 77 -9 15 -40 -10 216 55 -280 -13 362 -74 -168 -103 -179 9 -186
4612 -186 189 198 -269 -109 -258 265 -1 304 23 186 -17 -79 84 -25 -18 22 -133 7 181 130 66 32 -308
4635 -308 37 141 77 -48 -168 171 -19 -69 -98 -213 -63 42 63 -267 122 -5 64 363 -365 -75 198 -2
4657 -2 50 47 -213 62 23 70 -89 -129 -106 -191 12 254 -24 23 360 -32 -128 -161 106 244 49 -120 -182 -13 -58
4682 -58 -128 -178 -103 147 -90 -16 70 11 -47 -144 106 -72 76 -191 -112 147 116 -15 -135 116 -18 217 -200 34
4706 34 204 -203 -187 -199 126 -37 -32 -185 87 -298 -155 206 55 5 -127 334 -139 156 222 -68 174 -256
4728 -256 -108 181 218 106 99 173 221 -46 -146 -155 87 -33 -219 -38 68 -85 -30 -2 -274 -65 -187 -3 -17
4751 -17 324 -23 -6 -131 275 163 -290 -280 155 -39 -58 65 113 -49 194 17 -379 -91 -114 -109 33 -158 -249
4774 -249 -52 15 -39 99 5 -144 325 155 -275 -31 181 -184 388 -343 120 -26 -141 215 191 -55 -211
4795 -211 38 204 -277 14 -220 82 212 211 -37 29 45 -97 -264 -150 -187 61 55 -57 106 -187 299 95
4817 95 -182 128 -105 163 246 -232 1 153 95 -167 279 49 -73 147 153 -181 -326 78 -114 94 43 -66
4839 -66 115 -256 -69 298 -114 154 -88 85 182 -70 -88 -97 42 172 94 200 43 -59 -32 153 58 331 -27
4862 -27 -32 145 -22 -21 -101 64 -82 -67 7 -312 -64 66 92 54 -18 -94 139 192 -41 33 73 13 149 -372 9
4887 9 -188 -121 232 239 209 -46 105 -182 50 140 36 16 171 1 0 214 -183 43 285 -46 -283 69 -121
4910 -121 -225 246 107 50 -185 130 93 -36 52 4 -327 -120 -156 163 344 -47 49 -37 -11 15 213 -125 18
4933 18 153 -3 133 -80 38 43 183 138 159 -24 193 58 -47 79 -346 -136 -83 122 184 39 57 10 73
4956 73 294 -170 30 -142 184 -168 -152 -110 19 -98 -103 -76 89 -245 205 -195 -228 278 -130 -114 141 113 167
4979 167 91 -377 77 152 106 -243 123 375 434 -110 79 -48 -97 220 -111 212 -358 36 269 77 96 232
5001 232 -4 -96 271 -334 39 -152 -115 60 -72 -8 -59 10 -66 -27 -196 41 -117 141 -142 174 70 218
5023 218 -222 26 161 251 138 -44 8 133 42 -195 136 -228 3 -313 -14 247 149 -308 106 -79 215
5044 215 101 -150 146 38 45 -54 246 111 -62 -101 -141 -115 -236 127 -368 38 7 157 -83 -104 -11 -286 -97
5067 -97 41 63 155 187 -129 274 -153 109 -27 157 7 -87 -170 234 58 42 127 -77 111 221 55 -67 220
5090 220 -2 59 -9 -46 -142 -153 40 13 124 -80 -97 41 -13 -217 -174 -116 356 -50 -86 -19 127 81 192 -44
5114 -44 270 23 78 93 128 16 141 -153 -7 4 -29 214 252 242 273 -130 -197 222 141 121 -86 -92 86 201 135
5139 135 116 -384 -178 336 -172 261 -190 -176 -73 -302 72 -76 208 -135 189 190 -43 16 -400 133 41 -55
5161 -55 -238 1 -108 92 -54 -15 223 178 -81 20 45 -302 104 135 219 -92 -5 -144 -87 -175 -5 115 75
5184 75 138 -155 258 -83 -97 -84 -199 -158 20 20 -17 6 -284 -178 -58 177 337 18 -201 -29 37 -15 254 109
5208 109 -133 -185 -25 -310 -165 26 -64 272 66 93 -143 -30 -1 -207 -46 40 -74 113 148 -90 183 -335
5230 -335 197 148 -186 183 118 -86 29 -174 -21 277 -168 107 57 -83 201 -240 173 -44 29 116 -50 -28
5252 -28 33 31 -43 109 -51 -135 6 48 -35 -215 89 169 144 -6 -114 94 264 110 -94 21 382 9 136
5275 136 -175 29 57 39 159 -84 -14 -324 136 -50 194 -161 -77 260 69 -74 20 89 -2 71 -64 -4 -284
5298 -284 -350 -33 41 32 -132 89 104 -76 241 5 93 36 -227 -134 -254 60 62 -67 -30 -7 154 217 -261 -105
5322 -105 389 -59 -34 146 143 -76 -244 -89 142 101 -182 -140 -47 68 49 -15 90 241 40 -15 175 130 -51
5345 -51 369 -54 10 122 171 79 2 -28 210 -162 101 122 83 -26 -81 -56 169 83 -41 373 102 -167 -23 121
5369 121 -10 -238 -51 -50 211 117 111 -54 141 -145 -227 34 181 280 54 -160 -124 -135 -119 -252 62 -39 -46 -69
5393 -69 -130 -20 62 -1 115 -18 -61 81 117 232 -190 87 -66 -75 -168 -93 -18 199 166 -137 -171 128 -22 -10 300
5418 300 15 272 190 104 -24 -26 -35 -144 -66 309 -173 -122 -61 188 -106 46 152 -100 110 100 12 -99 -4 144
5442 144 -87 -320 35 73 -202 36 -46 -102 72 237 24 35 -238 -128 147 159 99 -79 448 -4 39 -126
5464 -126 -70 61 120 7 -351 -96 220 163 186 69 -173 254 116 129 70 -65 -280 34 -174 94 -63 300
5486 300 90 140 -14 -28 -345 67 -60 -66 311 -304 -141 62 121 -264 -165 -228 41 -39 95 -24 -31 -50 -87 -223
5510 -223 -140 -111 60 231 138 92 -84 66 -152 -88 -50 55 -159 35 149 -141 224 181 311 36 51 -120 -186
5533 -186 -52 -55 -140 -74 -199 54 38 212 -170 -44 8 110 130 -97 26 127 -382 -138 208 512 143 120 -38
5556 -38 103 -85 29 -209 249 161 -148 157 -341 162 100 -158 -66 -29 -249 -114 -138 187 -165 86 299 -15
5578 -15 167 223 -243 30 -21 -149 -82 -188 61 44 -63 61 -102 -62 -109 -25 84 88 -133 -149 321 79 29 432
5602 432 -65 -130 -55 -83 -177 372 -49 -158 54 -7 116 81 223 -15 -216 167 -100 -98 172 182 308 -138 -27
5625 -27 398 -108 118 -25 -265 -200 -15 -351 -52 208 -68 -278 -107 -86 27 -127 1 479 150 262 -81
5646 -81 -117 -110 64 -72 -33 70 249 34 -26 18 -181 -36 -20 -115 103 -160 -236 3 476 -111 384 90 -72
5669 -72 88 138 39 -109 60 -1 -63 67 23 17 213 -78 11 142 -285 72 257 91 -190 -91 132 101 -213 112
5693 112 373 -36 -274 60 -6 -14 106 -404 -65 78 -28 35 -46 107 -135 -138 -38 69 -161 149 -81 -101 67
5716 67 -16 184 114 217 227 28 -282 -107 -158 -56 68 420 1 -186 280 -7 -206 -53 -103 223 -94 -98 120
5739 120 136 167 195 152 -127 -157 -45 -254 225 -112 131 -189 -104 46 44 -199 187 -27 -166 -152 235 -26 -169
5762 -169 6 -25 164 -403 8 167 -164 116 22 55 178 127 41 27 -14 276 229 -47 -54 124 -65 341 -38
5785 -38 35 -75 -171 -74 -107 11 26 91 -247 -51 -10 145 -6 -16 85 45 -199 229 -26 -126 15 -4 61 137
5809 137 -39 197 1 59 -334 -173 -222 227 69 -74 190 78 -99 -62 -24 -144 -53 -29 264 31 303 -123
5831 -123 -59 -298 -173 59 -56 146 49 150 154 8 259 279 -103 -32 -80 -13 366 -59 -132 -87 64 99 197 299
5855 299 63 -261 58 -323 7 -119 12 93 205 155 -154 -38 21 159 -115 -70 18 -12 70 -488 -158 133
5877 133 17 14 69 165 220 85 31 193 -145 20 5 5 125 -113 -184 33 58 -96 22 60 -116 -59 -74 4 -95
5902 -95 151 -115 112 235 -337 -131 67 198 -243 -10 227 -88 261 -62 71 119 -292 -108 56 113 -144
5923 -144 136 294 -158 91 161 -30 -102 21 -191 59 -47 -9 153 -254 258 -227 288 -22 47 66 311 72
5945 72 83 -274 -76 209 318 108 -110 18 -52 -134 -24 -151 -12 47 -32 22 -9 -306 135 -161 -172 0 12
5968 12 189 -120 -235 -41 -251 51 30 -2 409 117 319 -21 39 173 -81 164 14 275 -93 168 17
5989 17 134 178 -188 149 -80 80 -81 116 2 -331 9 142 -59 -10 -33 2 -43 151 101 -159 30 365
6011 365 456 -51 -98 -239 -20 109 -22 -29 59 -324 -99 166 116 104 -45 -94 -68 131 90 2 156 27 -50 186
6035 186 98 -115 141 -86 78 -46 33 -22 27 171 27 -46 -137 76 -5 14 -171 79 206 -152 -113 -103 -226
6058 -226 167 -23 -178 -208 -330 279 239 163 21 -61 20 -199 -67 153 -92 154 121 -136 -41 77 309 29
6080 29 114 83 110 -328 -153 29 94 -84 -75 30 216 106 113 -66 18 304 -144 143 70 147 -43 -107 113 -28
6104 -28 -86 -86 -95 -107 101 -213 75 -74 -253 72 145 56 -154 -80 84 135 -195 -137 -69 140 148 83 136 42 -98 -139
6130 -139 -160 251 -35 19 21 15 -63 113 -229 181 -50 -173 -183 -80 -1 19 15 -88 147 284 -246 133 119 -184
6154 -184 -98 -33 -106 -441 92 14 -14 -29 169 5 86 -241 21 -57 -31 2 71 -7 155 -136 89 93 58 -72 44
6179 44 98 -249 53 127 -123 128 -66 4 -177 -227 80 -64 71 136 166 286 172 -75 -203 158 203 95 -108
6202 -108 -85 -101 29 18 18 202 27 171 -134 -53 -90 140 -50 -192 147 -66 174 -27 79 225 -131 385
6224 385 29 -94 -62 112 72 -42 281 -5 48 215 -149 -183 298 -98 98 -257 183 -38 -47 -48 142 -100 97
6247 97 -61 -64 -10 22 214 98 -121 -166 14 15 252 98 81 43 -55 229 -155 -193 -45 -7 -137 -35 -103 -114 -1
6272 -1 -59 -51 -20 -129 -144 -81 240 -10 -116 -2 -44 -56 349 -176 -117 -96 32 44 -143 -84 -121 154 -95 -13 -151
6297 -151 -41 59 -276 -193 -208 -52 -171 11 186 -167 -61 303 -424 222 81 -88 -120 -105 48 21 -203 -74
6319 -74 -104 -114 94 -220 -71 82 -50 134 257 131 -71 -101 120 43 114 174 323 -14 -87 205 264 58 14
6342 14 153 -4 150 13 -250 36 160 15 97 147 51 -94 100 17 -222 -172 -166 -197 -27 -289 -50 -271 18
6365 18 -201 278 382 113 -184 -142 -141 -138 82 -95 401 181 85 339 -34 -208 81 -371 -247 62 185 202 89
6388 89 -43 167 247 148 164 42 -134 70 -99 -48 -104 291 -30 -10 -206 -275 -1 261 104 -280 -108 133 -174
6411 -174 -268 -47 -35 -154 -234 98 -73 -33 129 30 -440 -108 -91 -125 3 101 -176 150 -94 89 -6 60 76 45
6435 45 -83 -295 -132 -89 -210 199 -92 52 -18 318 3 -273 -10 -315 33 355 -179 125 -365 80 -7
6456 -7 -216 -94 83 -145 -60 3 -55 -102 -201 -1 107 177 -91 -84 234 186 -124 -87 186 68 -78 146 -174 13
6480 13 -73 -94 -67 39 301 117 -220 213 191 -149 127 57 -67 82 212 379 54 102 23 -192 156 -275 -239
6503 -239 194 -63 -91 -81 113 -151 171 129 -61 -267 217 22 29 144 303 65 93 -37 -100 -354 -62 -47 349
6526 349 -141 -140 12 -206 26 -18 57 -119 -107 15 152 36 52 153 232 -41 -68 164 146 16 -222 120 206
6549 206 -96 -153 75 168 23 266 -269 121 -222 -387 59 -64 -176 -73 148 -158 127 230 -35 339 121
6570 121 -106 13 -54 -251 66 -52 -32 -133 -134 212 190 -32 10 -213 -71 -339 -130 -94 -384 52 249 316 -146
6593 -146 127 -250 42 69 -212 157 -351 -27 -274 -129 -79 104 174 -249 -107 64 328 -160 9 57 -36 -76
6615 -76 55 -75 -115 30 353 -116 119 103 143 66 -157 -31 -46 -70 -71 5 -71 -52 78 -176 -93 82 -309 72
6639 72 21 -17 34 100 232 25 -52 -120 170 -4 192 150 -67 25 -23 -73 194 -273 -75 -95 72 -13 -194 98
6663 98 8 -2 31 -72 288 321 53 114 -75 -244 130 49 22 204 -136 -49 -208 -204 -112 53 174 -60 -148 56
6687 56 -282 140 -293 -239 44 -63 25 -70 -239 124 52 25 -22 1 57 115 85 110 -123 178 -63 -84 91 -145
6711 -145 2 -141 -76 -77 146 -13 -107 179 -31 -236 116 -158 -191 -82 -380 -82 -227 143 178 -64 -13 -10 190
6734 190 -133 -10 75 31 190 -20 -43 209 107 -1 -356 -104 -105 156 -138 281 -312 -20 166 -11 96 -75
6756 -75 -309 134 -15 -157 -70 -148 258 45 149 -114 152 -219 -102 65 3 -129 -89 229 -13 241 -114 92
6778 92 138 -15 46 -65 -87 51 283 -86 -253 79 16 -175 -344 161 -133 49 -153 17 -167 192 182 233
6800 233 158 -51 -29 180 97 -217 -84 -165 47 -237 156 -180 16 -86 -28 96 96 61 132 37 88 -308 107 7
6824 7 29 -183 120 -34 -68 400 8 -5 -165 232 169 256 -104 67 -110 -322 -46 156 -116 -27 -47 242 -255
6847 -255 -109 -3 -97 139 -282 -115 -24 84 65 -35 -192 -32 -164 -200 75 101 -296 -147 253 26 91 -315
6869 -315 183 142 -149 126 -22 198 -37 146 -77 72 55 44 123 -150 -160 68 -99 -268 -293 123 -309 -353
6891 -353 90 -72 -138 -236 209 206 -77 -110 -83 50 27 -105 -83 4 -56 -252 -31 -116 73 253 67 -377 -27 44
6915 44 -97 53 -141 -199 -187 -258 -187 91 -102 34 34 -30 -105 98 254 -97 -125 -136 101 -370 49 89 104 37 -94
6940 -94 73 -296 -77 -212 189 34 -71 -140 62 15 147 31 -228 42 32 -125 -19 257 -118 -34 -56 163
6962 163 -175 130 -143 77 -282 166 -82 142 -261 -8 -247 -175 198 -203 79 77 89 -124 -200 49 -53 207
6984 207 68 1 154 34 139 -178 119 161 -89 13 -80 135 -90 -197 150 71 29 165 218 -321 192 -231
7006 -231 -81 115 86 26 -248 74 274 72 -71 -21 -16 -55 -69 -100 -208 46 -106 -47 29 136 63 234 90 -1
7030 -1 -215 -239 21 -78 -127 51 -241 -56 2 137 255 127 79 -285 217 54 126 64 178 120 206 289 269 214 214
7055 214 245 -191 -42 56 -45 12 -96 -13 165 41 -88 15 141 293 133 47 -69 35 63 -59 44 113
7077 113 86 -180 -213 200 -266 -19 12 -135 9 -292 -19 39 52 85 -93 255 -254 -100 -112 40 94 155 97
7100 97 3 85 -62 -81 7 -274 -23 317 170 126 65 -197 -127 -261 193 66 -30 22 189 -179 -3 -183 -25
7123 -25 170 198 -4 -44 -78 137 121 -98 54 -206 169 -141 144 -124 -78 -90 -94 76 -198 -39 -25 109 -55
7146 -55 -127 -143 -140 210 -200 4 342 -49 82 -56 76 75 37 146 -180 -12 -17 116 -293 -55 69 -308 -51
7169 -51 -43 293 -212 78 45 44 -103 -57 -150 97 1 121 63 -31 -96 91 60 -105 -86 -129 -192 -40 -165 167 -61
7194 -61 38 242 117 -149 42 -21 17 150 114 -178 -198 -160 50 -109 26 -236 25 15 37 -139 32 -8 -79 -2
7218 -2 -11 60 256 -60 -192 -11 120 -53 -44 11 112 255 112 96 -6 220 -86 121 196 57 52 45 -148 -5 46
7243 46 -276 -61 -175 173 -29 -101 100 -34 255 -234 116 -329 165 235 144 -225 173 -306 89 -133 -58 -106
7265 -106 28 9 -104 64 232 -99 67 -110 86 94 3 -31 108 157 -81 11 -10 -113 3 0 70 50 168 -105
7289 -105 -232 143 -71 -163 136 -106 69 -260 105 -74 -84 84 -66 40 54 22 166 -65 200 -14 -69 -160
7311 -160 273 -354 85 160 265 -58 126 -97 133 280 -38 -35 -49 -294 -147 -77 -152 97 -13 8 -77 172 -165
7334 -165 89 -62 -80 49 -47 19 51 -81 109 -188 -58 216 92 183 67 19 -94 -8 -66 -179 -17 17 76
7357 76 -270 255 -295 -331 -12 -17 -56 166 224 44 118 -31 -87 -78 -128 -25 -13 -32 -203 151 40 -165 50 41 66
7382 66 43 -53 71 197 167 -64 166 189 -177 286 -20 -11 61 -98 16 150 77 -239 112 291 173 -103 152
7405 152 128 35 62 140 -133 200 -163 43 -52 185 87 69 -14 -247 -92 -127 -31 -42 -69 14 -218 -145 280 -242 -72
7430 -72 57 -145 -95 -77 197 -15 288 -411 -91 22 25 172 -149 32 71 100 29 145 -20 117 68 222 -45
7453 -45 -6 15 -126 -43 -14 -6 118 155 -183 11 -52 -104 234 31 54 -104 127 -8 -22 177 95 -33 -4 67 254
7478 254 20 -64 -155 107 305 -209 -190 45 -334 -168 -14 152 311 -133 -5 241 54 -260 146 26 -268
7499 -268 -262 -203 59 -94 -33 4 -26 -39 -44 -43 72 223 83 33 66 -103 -193 35 94 23 285 81 -335 212 -125
7524 -125 109 -76 -63 -195 -41 130 82 34 117 -65 40 112 270 161 69 159 -116 37 239 -242 -80 -92 85
7547 85 111 -125 -213 -85 91 87 -181 24 -71 56 -23 -73 161 182 94 -117 209 169 -187 -98 -227 66 43 183
7571 183 16 180 -65 61 67 238 -233 -11 -156 -51 -193 -41 19 205 163 3 73 46 4 -79 -8 -63 27 -200
7595 -200 -51 74 -35 263 -46 236 35 -93 68 -49 70 -258 243 18 241 -39 123 145 -103 29
7615 29 -59 -208 116 271 49 22 -28 137 132 -305 -115 -169 -81 27 -27 -134 79 -261 32 -44 42 31 -64 354
7639 354 309 -75 38 -110 79 71 -54 -52 -23 -106 -65 -446 146 -244 11 19 125 -116 108 57 -408 21 -73 -244
7663 -244 -152 -113 -177 22 -50 -118 20 -30 8 -242 1 -14 -9 -6 -85 -39 75 160 76 67 -252 -16 11 -17 -195 192 -94
7690 -94 44 -135 26 42 18 113 -4 -139 -328 -323 -16 112 -129 -138 89 247 122 -11 17 -60 -6 -191 150 159
7714 159 -76 -66 -252 -159 94 62 163 -16 -91 -96 60 150 159 57 58 -220 -9 38 90 266 41 -260 -24 51 173
7739 173 -105 218 -225 -48 -64 44 -38 -273 15 -133 47 300 13 14 -76 -194 360 -192 -73 -120 138 163
7761 163 187 -43 128 68 -124 -143 -87 -125 -177 37 263 -171 145 -2 57 -127 27 -216 19 -116 69 54 183
7784 183 271 -76 -4 -107 41 -214 2 -124 174 -41 167 118 -31 -28 -125 211 -71 -36 111 51 -51 183 -225
7807 -225 -87 7 34 -40 151 26 -49 -106 175 -55 -112 -1 -68 52 -244 -27 3 -181 -79 95 76 -160 19
7830 19 8 109 69 1 -323 -123 12 -70 -74 158 -59 -12 178 -345 -113 -73 -160 160 -230 293 -94 -59 92 127
7854 127 80 252 72 88 -86 -37 -29 174 117 182 175 54 -30 -52 -265 -48 281 -123 -87 198 17 -312 79 62
7878 62 115 42 223 13 -20 123 7 -221 -340 72 119 69 -144 -178 -13 -50 -144 58 72 -102 -90 -117 -32 -64 162
7903 162 76 20 237 129 170 1 -58 26 -128 -29 106 -194 -14 40 91 -5 -206 57 81 -99 17 -32 -111 -46
7927 -46 -83 193 -87 -125 -200 131 -108 -83 -86 -249 -42 -155 130 -130 -53 -228 -161 191 233 -104 4 -127 363
7950 363 -287 -81 154 111 -19 48 101 -82 -234 25 -304 -160 -48 44 65 -312 6 -99 121 -66 -39 318
7972 318 160 51 34 94 0 -71 -87 88 139 119 -356 -32 187 133 60 42 174 215 216 259 -19 -28 -22 -198 -231 -186 -147
7999 -147 106 -33 33 110 141 -51 77 207 -107 106 -14 -188 -110 -101 -312 -128 -114 45 263 -134 292 99
8021 99 -29 9 -71 -67 9 37 -236 103 47 101 -32 38 301 -159 78 79 194 -49 121 -32 56 -39 230 155 75
8046 75 -34 92 -39 11 127 -81 47 81 25 110 -52 17 -22 -342 98 52 71 -50 54 -206 153 -391 -118
8069 -118 127 -123 -147 202 -77 300 -179 261 -109 59 -40 -213 46 -25 -47 24 -2 -40 -222 -145 -208 -11 257
8092 257 97 -76 -244 50 -187 93 59 337 228 147 -169 248 -196 -64 85 -60 154 -24 51 12 300
8113 300 -50 173 8 -136 -62 129 -63 343 134 -2 333 185 -77 353 222 -31 15 27 1 -229 -19
8134 -19 65 -122 73 -176 30 78 -17 218 -39 13 175 -114 -173 43 163 280 -183 34 129 145 -194 -61 74
8157 74 -251 55 -8 -81 -74 58 16 248 152 -106 123 -83 166 -73 -6 281 6 106 -88 308 -208 -227 168
8180 168 123 -66 -186 81 106 -269 -134 -157 125 221 248
8191B48
##END NTUPLES=NMR FID
##END=
