##TITLE=1H_TG-2257
 CDCl3, 8 sc, 
 18.10.2019
##JCAMPDX= 6.0         $$ Bruker NMR JCAMP-DX V2.0
##DATA TYPE= NMR FID
##DATA CLASS= NTUPLES
##ORIGIN= UXNMR, Bruker Analytische Messtechnik GmbH
##OWNER= root
$$ XWIN-NMR		Version 3.5
$$ Fri Oct 18 14:03:59 2019 Russian Standard Time (UT+4h)  she@DPX200
##.OBSERVE FREQUENCY= 200.1315
##.OBSERVE NUCLEUS= ^1H
##.DELAY= (6, 6)
##.ACQUISITION MODE= SIMULTANEOUS
##.ACQUISITION SCHEME= undefined
##.AVERAGES= 8
##.DIGITISER RES= 18
##SPECTROMETER/DATA SYSTEM= spect
##.PULSE SEQUENCE= zg30
##.SOLVENT NAME= CDCl3
##.SHIFT REFERENCE= (INTERNAL, CDCl3, 0, 15.7039)
##AUDIT TRAIL= $$ (NUMBER, WHEN, WHO, WHERE, WHAT)
$$ ##TITLE= Audit trail, XWIN-NMR		Version 3.5
$$ ##JCAMPDX= 5.01
$$ ##ORIGIN= Bruker BioSpin GmbH
$$ ##OWNER= she
$$ F:/spectra/data/she/nmr/H-F/1/audita.txt
$$ ##AUDIT TRAIL=  $$ (NUMBER, WHEN, WHO, WHERE, WHAT)
(   1,<2019-10-18 14:03:01.48 +0400>,<she>,<DPX200>,
      <created by zg, POWCHK disabled, PULCHK disabled
       configuration hash MD5:
       00 E9 B6 7A A2 85 ED C7 34 08 36 98 17 FE 4E 26
       data hash MD5: 16K
       C1 06 E8 E5 47 65 1C 75 85 8B E2 F4 50 B4 BF 51>)
$$ ##END=
$$ 
$$ hash MD5
$$ 11 3D BC 1D 01 1F 8F 88 EC BD 25 98 53 A4 DE EE
##$RELAX= 
##$RELAX= 
##$RELAX= 
##$RELAX= 
##$RELAX= 
##$RELAX= 
$$ Bruker specific parameters
$$ --------------------------
##$DU= <F:/spectra>
##$EXPNO= 1
##$NAME= <H-F>
##$PROCNO= 1
##$TYPE= <nmr>
##$USER= <she>
##$AMP= (0..31)
100 100 100 100 100 100 100 100 100 100 100 100 100 100 100 100 100 100 
100 100 100 100 100 100 100 100 100 100 100 100 100 100 
##$AQSEQ= 0
##$AQ_mod= 1
##$AUNM= <au_zg>
##$AUTOPOS= <>
##$BF1= 200.13
##$BF2= 200.13
##$BF3= 200.13
##$BF4= 200.13
##$BF5= 200.13
##$BF6= 200.13
##$BF7= 200.13
##$BF8= 200.13
##$BYTORDA= 1
##$CFDGTYP= 0
##$CFRGTYP= 5
##$CHEMSTR= <none>
##$CNST= (0..31)
1 1 145 1 1 1 1 1 1 1 1 1 1 1 1 1 1 1 1 1 1 1 1 1 1 1 1 1 1 1 1 1 
##$CPDPRG= <>
##$CPDPRG1= <>
##$CPDPRG2= <>
##$CPDPRG3= <>
##$CPDPRG4= <mlev>
##$CPDPRG5= <mlev>
##$CPDPRG6= <mlev>
##$CPDPRG7= <mlev>
##$CPDPRG8= <mlev>
##$CPDPRGB= <>
##$CPDPRGT= <>
##$D= (0..31)
0 1.2 0 0 0 0 0 0 0 0.06 0 0.03 0 0 0 0 0.0002 0 0 0 0 0 0 0 0 0 0 0 0 
0 0 0 
##$DATE= 1571392980
##$DBL= (0..7)
120 120 120 120 120 120 120 120 
##$DBP= (0..7)
150 150 150 150 150 150 150 150 
##$DBP07= 0
##$DBPNAM0= <>
##$DBPNAM1= <>
##$DBPNAM2= <>
##$DBPNAM3= <>
##$DBPNAM4= <>
##$DBPNAM5= <>
##$DBPNAM6= <>
##$DBPNAM7= <>
##$DBPOAL= (0..7)
0.5 0.5 0.5 0.5 0.5 0.5 0.5 0.5 
##$DBPOFFS= (0..7)
0 0 0 0 0 0 0 0 
##$DE= 6
##$DECBNUC= <off>
##$DECIM= 24
##$DECNUC= <off>
##$DECSTAT= 4
##$DIGMOD= 1
##$DIGTYP= 9
##$DL= (0..7)
0 120 120 120 120 120 120 120 
##$DP= (0..7)
150 150 150 150 150 150 150 150 
##$DP07= 0
##$DPNAME0= <>
##$DPNAME1= <>
##$DPNAME2= <>
##$DPNAME3= <>
##$DPNAME4= <>
##$DPNAME5= <>
##$DPNAME6= <>
##$DPNAME7= <>
##$DPOAL= (0..7)
0.5 0.5 0.5 0.5 0.5 0.5 0.5 0.5 
##$DPOFFS= (0..7)
0 0 0 0 0 0 0 0 
##$DQDMODE= 0
##$DR= 18
##$DS= 0
##$DSLIST= <SSSSSSSSSSSSSSS>
$$ [...]
##$SUBNAM2= <"">
##$SUBNAM3= <"">
##$SUBNAM4= <"">
##$SUBNAM5= <"">
##$SUBNAM6= <"">
##$SUBNAM7= <"">
##$SUBNAM8= <"">
##$SUBNAM9= <"">
##$SW= 24.0689530833862
##$SWIBOX= (0..15)
0 0 2 0 0 0 0 0 0 0 0 0 0 0 0 0 
##$SW_h= 4816.95568400771
##$TD= 16384
##$TD0= 1
##$TE= 0
##$TE2= 300
##$TE3= 300
##$TEG= 300
##$TL= (0..7)
0 120 120 120 120 120 120 120 
##$TP= (0..7)
150 150 150 150 150 150 150 150 
##$TP07= 0
##$TPNAME0= <>
##$TPNAME1= <>
##$TPNAME2= <>
##$TPNAME3= <>
##$TPNAME4= <>
##$TPNAME5= <>
##$TPNAME6= <>
##$TPNAME7= <>
##$TPOAL= (0..7)
0.5 0.5 0.5 0.5 0.5 0.5 0.5 0.5 
##$TPOFFS= (0..7)
0 0 0 0 0 0 0 0 
##$TUNHIN= 0
##$TUNHOUT= 0
##$TUNXOUT= 0
##$USERA1= <user>
##$USERA2= <user>
##$USERA3= <user>
##$USERA4= <user>
##$USERA5= <user>
##$V9= 5
##$VALIST= <valist>
##$VCLIST= <CCCCCCCCCCCCCCC>
##$VD= 0
##$VDLIST= <DDDDDDDDDDDDDDD>
##$VPLIST= <PPPPPPPPPPPPPPP>
##$VTLIST= <TTTTTTTTTTTTTTT>
##$WBST= 1024
##$WBSW= 4
##$XGAIN= (0..3)
0 0 0 0 
##$XL= 0
##$YL= 0
##$YMAX_a= 71569
##$YMIN_a= -126759
##$ZGOPTNS= <>
##$ZL1= 120
##$ZL2= 120
##$ZL3= 120
##$ZL4= 120
##$ABSF1= 10
##$ABSF2= 0
##$ABSG= 5
##$ABSL= 3
##$ALPHA= 0
##$AQORDER= 0
##$ASSFAC= 0
##$ASSFACI= 0
##$ASSFACX= 0
##$ASSWID= 0
##$AUNMP= <proc_1d>
##$AZFE= 0.1
##$AZFW= 0.1
##$BCFW= 1
##$BC_mod= 2
##$BYTORDP= 1
##$COROFFS= 0
##$CY= 11.3945322036743
##$DATMOD= 1
##$DC= 2
##$DFILT= <>
##$DTYPP= 0
##$F1P= 20.1720416913024
##$F2P= 0.152960286110954
##$FCOR= 0.5
##$FTSIZE= 0
##$FT_mod= 4
##$GAMMA= 1
##$GB= 0.15
##$INTBC= 1
##$INTSCL= 1
##$ISEN= 128
##$LB= 0.24
##$LEV0= 0
##$LPBIN= 0
##$MAXI= 10000
##$MC2= 0
##$MEAN= 0
##$ME_mod= 0
##$MI= 1.114404
##$NCOEF= 0
##$NC_proc= 0
##$NLEV= 6
##$NOISF1= 3.799351
##$NOISF2= 2.8
##$NSP= 1
##$NTH_PI= 0
##$NZP= 0
##$OFFSET= 15.70392
##$PC= 1
##$PHC0= -9574.375
##$PHC1= 18.20089
##$PH_mod= 1
##$PKNL= yes
##$PPARMOD= 0
##$PSCAL= 0
##$PSIGN= 0
##$REVERSE= no
##$SF= 200.130013532006
##$SI= 16384
##$SIGF1= 3
##$SIGF2= 2
##$SINO= 400
##$SIOLD= 16384
##$SREGLST= <1H.CDCl3>
##$SSB= 0
##$STSI= 0
##$STSR= 0
##$SW_p= 3612.71676300578
##$SYMM= 0
##$S_DEV= 0
##$TDeff= 0
##$TDoff= 0
##$TI= <>
##$TILT= no
##$TM1= 0
##$TM2= 0
##$TOPLEV= 0
##$USERP1= <user>
##$USERP2= <user>
##$USERP3= <user>
##$USERP4= <user>
##$USERP5= <user>
##$WDW= 1
##$XDIM= 8192
##$YMAX_p= 0
##$YMIN_p= 0
$$ End of Bruker specific parameters
$$ ---------------------------------
##NTUPLES= NMR FID
##VAR_NAME=  TIME,          FID/REAL,        FID/IMAG
##SYMBOL=    X,             R,               I
##VAR_TYPE=  INDEPENDENT,   DEPENDENT,       DEPENDENT
##VAR_FORM=  AFFN,          ASDF,            ASDF
##VAR_DIM=   8192,          8192,            8192
##UNITS=     SECONDS,       ARBITRARY UNITS, ARBITRARY UNITS
##FACTOR=    0.0002076,     1,               1
##FIRST=     0,             0,               0
##LAST=      1.7004516,     0,               0
##MIN=       0,             -126759,         0
##MAX=       1.7004516,     71569,           0
$$ Real data points
##PAGE= N=1
##DATA TABLE= (X++(R..R)), XYDATA
$$ [...]
2401A672k125j943L456p36k585K793N97l527K141K148l666O01K950k690r39L460
2417A607j730j893L385l60l095K902N75l466J607K043k786M23K772k764r18L896
2433B198k015k240L212k94k950K771Q33l026J608K357l293J28K929k343j372L464
2449A967j269k164K921k18k839K378J178l230J579J913l137K44K968k044j239
2464i92L331j279k766L239j07l064K391J397l422J003K536k977m55L260j865j572
2480a342K924j027k345L004k4k711K042J210k964O83K545k915k46L166k050j608
2496a658L218p44k533K994Q9l257J849J488k757L77K559k660n00K885j699j240
2512a589K739p29k817K931O17l374J628K077l118N51K765k879l59K806j433j727
$$ plain form
2401 1672 -453 -2396 1060 324 -2261 532 1129 -2398 -257 1891 -1775 -1174 1776 -914 -1853 1607
2417 1607 -123 -2016 1369 1009 -2086 816 1391 -2075 -468 1575 -1211 -788 1984 -780 -1698 2198
2433 2198 183 -2057 1155 861 -2089 682 1515 -1511 97 2454 -839 -711 2218 -125 -1497 1967
2449 1967 698 -1466 1455 1237 -1602 776 1954 -1276 303 2216 -921 -677 2291 247 -992
2464 -992 2339 1060 -1706 1533 1426 -1638 753 2150 -1272 -269 2267 -710 -1165 2095 230 -1342
2480 -1342 1582 555 -1790 1214 1190 -1521 521 1731 -1233 -550 1995 -920 -1166 2000 -50 -1658
2496 -1658 1560 816 -1717 1277 1366 -1891 -42 1446 -1311 -934 1625 -1035 -1535 1350 -349 -1589
2512 -1589 1150 421 -2396 535 1152 -2222 -594 1483 -1635 -1084 1681 -1198 -1557 1249 -184 -1911
2528a911K732k75k518K006Q07k845J374K102l167Q33K369k378q73K926j370k076
2544b264L106m12k349J899J143l022J514K109k669N2K545k474q82L309j232k395
2560b022K802K53k825K312J232l052J073J891k512q7K743k096r30L124j473k362
2576a929L288J56k990J929J330l174J321J954k346m88L213k251j055K988r32k529
2592a515K680P02l288J823J454k959P36K447k887j62K946j846j499K924o51k688
2608a783L053M2k595J399J517k732M68K540k600k63K798j972j248K484o22k526
2624b040K884K93k739J652J722k920M67K416k529m78K450j472j749L053o31k349
2640a970K316R10l065J200J921l046O76K733k486p41K892j221k095K795k34k803
$$ plain form
2528 -1911 821 546 -1972 34 841 -2004 -630 1472 -1695 -862 1507 -871 -1744 1182 -188 -2264
2544 -2264 842 430 -1919 -20 1123 -1899 -385 1724 -945 -893 1652 -822 -1704 1605 373 -2022
2560 -2022 780 1033 -1792 520 1752 -1300 -227 1664 -848 -935 1808 -288 -1218 1906 433 -1929
2576 -1929 1359 1515 -1475 454 1784 -1390 -69 1885 -461 -949 2264 13 -1042 1946 1014 -1515
2592 -1515 1165 1867 -1421 402 1856 -1103 -367 2080 -807 -969 1977 131 -1368 1556 905 -1783
2608 -1783 1270 1312 -1283 116 1633 -1099 -631 1909 -691 -954 1844 -128 -1376 1108 486 -2040
2624 -2040 844 1137 -1602 50 1772 -1148 -681 1735 -794 -1272 1178 -294 -2043 1010 379 -1970
2640 -1970 346 1256 -1809 -609 1312 -1734 -1058 1675 -811 -1552 1340 119 -1976 819 585 -2218
2656b218K434P66l105J516K041k720J78K621j966j308K746j046k044K738j61k295
2672a823K058R01k946J345K123k962M08K155j745r54L007j024k125K672J39l108
2688a879K160J309l110J163J910k026k58K378j647j284L016j210k102K561J47
2703A128k257J564J724l514J262K223k452o77K899j939j199K798o51k240K437
2718A106K80k923J874J543k908L91K553k300k26K743j881j523K825o01k545K582
2734I90M4k537J850J475k690L61K820k821n30K459j294j921K878k43k779K713
2750G75Q66l322J562J658k773O38K180k006r83K810j181k073K822n25k388K056
2766A16Q60k582J145J786k813N90K236k221n66K458j266j589K308J03k559K213
$$ plain form
2656 -2218 216 982 -2123 -607 1434 -1286 -1108 1513 -453 -1761 985 -61 -2105 633 472 -1823
2672 -1823 235 1136 -1810 -465 1658 -1304 -896 1259 -486 -1440 1567 543 -1582 1090 1229 -1879
2688 -1879 281 1590 -1520 -357 1553 -473 -731 1647 0 -1284 1732 522 -1580 981 1128
2703 1128 -1129 435 2159 -1355 -93 2130 -322 -999 1900 -39 -1238 1560 909 -1331 1106
2718 1106 1386 -1537 337 1880 -1028 -637 1916 -384 -610 2133 252 -1271 1554 953 -1592 990
2734 990 1034 -1503 347 1822 -868 -507 2313 -508 -1038 1421 127 -1794 1084 841 -1938 775
2750 775 1641 -1681 -119 1539 -1234 -596 1584 -422 -1405 1405 224 -1849 973 448 -1940 116
2766 116 976 -1606 -461 1325 -1488 -898 1338 -883 -1449 1009 -257 -1846 462 565 -1994 219
2782B19R80k888J142J727k500K35K322j924r02K799j208j945K580K28k850K016
2798C1Q92k571J097J781k344j25L122k273q69K519j169j745K405J94k488J906
2814C63R94k459P60K248k924k23K909j602j369K544o25k035K585m9k445J907R92
2831A571k813Q13K343k755QK620j404j521K717o38k250K350L14k906J630J670
2847A749k611M43K320k100o89K570j398j443K402k67k115J897R13k802J565J096
2863A530k596P83J900k097m89K478j277j606K657o07k255K134N87k488J319J503
2879A476k360J19K493k251o01K479j387j846K593k5k373K040P25k489Q93K142
2895A628k888N6K453k036p41K761j052j671K152k03k228J959N45k475J300J790
$$ plain form
2782 219 1199 -1689 -547 1180 -1320 -1085 1237 -687 -1589 1210 2 -1943 637 865 -1985 31
2798 31 923 -1648 -551 1230 -1114 -1239 1883 -390 -1259 1260 91 -1654 751 945 -1543 363
2814 363 1357 -1102 -342 1906 -1018 -1241 1668 66 -1303 1241 616 -1419 1166 1117 -1328 579 1571
2831 1571 -1242 -429 1914 -841 -833 1787 383 -1138 1579 941 -1309 1041 1355 -1551 79 1749
2847 1749 -862 -419 1901 -199 -888 1682 284 -1159 1243 976 -1139 758 1671 -1131 434 1530
2863 1530 -1066 -283 1617 -480 -969 1509 232 -1374 1283 676 -1579 555 1142 -1346 -27 1476
2879 1476 -884 -765 1728 -523 -1124 1355 -32 -1878 715 690 -1683 357 1082 -1407 -514 1628
2895 1628 -1260 -1204 1249 -787 -1528 1233 181 -1490 662 459 -1769 190 735 -1740 -440 1350
2911A350k374m5K311j551j103K489q84k154K759m55k174J768J316k679Q62J826
2927A262k285K28K258j918j059K623q08j963K376K91k602J798J381k841N11K491
2943A743k384j33K240j217j471K630q39j950K054L00k365J722J389k592O87J872
2959A686j841n44K262j466j355K404j9k263K169K30k068J012J465k589J87K517
2975A787k345j02K292j309j383K534n52k246K150N61k452P50J637k242L03K220
2991A603j774p04K301j225j475K078k50j840J655Q07k365J136J608k323j21K475
3007A586k312q07K719j080j748K239L55k324J833N17k454J326J239k142N8K278
3023A283j868o10K456p76k008J890J03k161J548J083k279Q29J740j991m45K239
$$ plain form
2911 1350 -1024 -1069 1242 -309 -1412 1077 193 -1961 798 343 -1831 -63 1253 -1426 -564 1262
2927 1262 -1023 -795 1463 -455 -1514 1109 301 -1662 714 1005 -1597 201 1582 -1259 -748 1743
2943 1743 -641 -774 1466 249 -1222 1408 569 -1381 673 973 -1392 330 1719 -873 -186 1686
2959 1686 -155 -699 1563 97 -1258 1146 1127 -1136 1033 1263 -805 207 1672 -917 -730 1787
2975 1787 -558 -660 1632 323 -1060 1474 922 -1324 826 1387 -1065 -315 1322 -920 -617 1603
2991 1603 -171 -875 1426 201 -1274 804 554 -1286 369 1176 -1189 -53 1555 -768 -889 1586
3007 1586 -726 -1533 1186 106 -1642 597 952 -1372 461 978 -1476 -150 1089 -1053 -995 1283
3023 1283 -585 -1195 1261 485 -1523 367 470 -1691 -143 940 -1339 -510 1230 -761 -1206 1033
3039A033j460j090K342o17j775K276J15k215J419R17k249P73J793k376J2K421
3055A319j654q44K441j047j749K083N40k602J561J167k231O72J885j918m38K154
3071A339j279j229K424p64j906K150N14k092R48J092j899M67J681k007m06K547
3087A580j294j322K169l32j813K090K9k307J071J533j745J0J930j798p24K444
3103A521j122j446K065j17k060J719N40k169J237J322k077R1J720j285r01K063
3119A101r39j388K090j01j787J434N80k137R84J271j705M0J648j407p63K138r06
3136A53j502J942p9j889J376R16k141P44J992k336p9K038j470j074K164m76j615
3153a336J662M31k105J177J194k008M00J599j767l27K244j513p95K296q14j804
$$ plain form
3039 1033 -427 -1517 825 208 -1567 709 824 -1391 28 945 -1304 -531 1262 -1114 -1102 1319
3055 1319 -335 -1179 1262 215 -1534 549 1089 -1513 48 1215 -1016 -344 1541 -377 -815 1339
3071 1339 60 -1169 1255 491 -1415 735 1249 -843 105 1197 -702 -235 1446 -561 -967 1580
3087 1580 286 -1036 1133 801 -1012 1078 1107 -1200 -129 1404 -341 -331 1599 -199 -923 1521
3103 1521 399 -1047 1018 901 -1159 560 1100 -1069 168 1490 -587 -496 1224 -61 -962 1101
3119 1101 162 -1226 864 763 -1024 410 990 -1147 -163 1108 -597 -557 1091 -316 -1079 1059 153
3136 153 -1349 593 514 -1375 1 917 -1224 -480 1512 -824 -903 1135 -335 -1409 755 279 -1336
3153 -1336 326 757 -1348 -171 1023 -985 -585 1014 -753 -1080 1164 -349 -1144 1152 338 -1466
3169a466J742K01j775J170J146k236O59J871j793p14K117j177q02J749m29j545
3185a282J739K83j752J180Q66j780K73K033k107k78J985j170j138J952j72j777
3201a145J526J040k531J231J141k234Q89J477j818l69K146j142j239J939l67j857
3217a313J692Q69k573J205J689k026K09J699j699o40J903n14j504K035m4k571
3233a583K079N91k014J095R38j674J7J732j448m75J884p21j395J891j43k016J563
3250C21N76j607N45J478j933j63J667j235j042K454o55j427J280M55k016J148
3266a54J070k018P41J304j849q5K050j536n86J875l52j874J678L72j904J173J099
3283A004j762L52J420j361m99J794j121j152J919k18j589J468P0j740J437J088
$$ plain form
3169 -1466 276 477 -1298 -128 1018 -1218 -559 1312 -481 -1195 922 -255 -1057 692 263 -1282
3185 -1282 457 740 -1012 168 1034 -746 -473 1560 -547 -825 1160 -10 -1148 804 632 -1145
3201 -1145 381 1421 -1110 121 1262 -972 -83 1394 -424 -793 1353 211 -1028 911 544 -1313
3217 -1313 379 1248 -1325 -120 1569 -457 -248 1451 -248 -888 1015 501 -1003 1032 988 -1583
3233 -1583 496 1087 -927 168 1106 -568 -551 1181 -267 -742 1142 421 -974 917 774 -1242 321
3250 321 897 -710 -165 1313 -620 -783 884 -351 -1393 1061 406 -1021 259 714 -1302 -154
3266 -154 916 -1102 -361 943 -906 -991 1059 -477 -1063 812 460 -1414 264 636 -1268 -95 1004
3283 1004 -758 -406 1014 -347 -846 948 -173 -1325 594 376 -1213 255 325 -1415 22 1110
3299A110k293O08J426j497l64J676n33j164J565j18j607J382P59k499J405J312
3315A168k212N18J685j281o61J714r63r58J729j81j594J538K60j309N82J242k073
3332g96K65K002j531r04J959p67j219J968l58j439J032P35j547Q40P59j537K6
3349e12J479q64n24J640r16j200J868k57j714J433R32j944N17J356j657k09K008
3366A436j346r93K147j085j232J759J40j774R84J168j932N98J295j607p4J581
3382A065j070r09J590m73j085J348J71j615J060J104k145L21J412j468j85J865
3398I86j274r02K084o29j855J790J26j572J334J069j988K63J493j511j26J709
3414I97j317r12J699l38j301J343L19j535J028P34j758K65J562j149l30J388j023
$$ plain form
3299 1110 -1183 -575 851 -646 -1010 666 133 -1031 534 416 -1191 191 950 -1549 -144 1168
3315 1168 -1044 -526 1159 -122 -783 931 -32 -990 739 558 -1036 502 762 -547 35 1277 -796
3332 -796 -531 1471 -60 -964 995 228 -991 977 619 -820 212 947 -600 240 999 -538 -512
3349 -512 967 103 -421 1219 303 -897 971 714 -1000 433 1365 -579 -62 1294 -363 -572 1436
3366 1436 90 -903 1244 159 -1073 686 826 -948 36 1204 -728 -130 1165 -442 -516 1065
3382 1065 -5 -914 676 203 -882 466 637 -978 82 1186 -959 -638 774 -694 -879 986
3398 986 -288 -1190 894 265 -1590 200 326 -1246 88 1157 -831 -568 925 -586 -712 997
3414 997 -320 -1232 467 129 -1172 171 490 -1045 -17 717 -1041 -776 786 -363 -693 695 -328
3431c28p66J711m85j408J561L49j803R11R02j354N7J586r89p34J461m50j366J795
3449F50m89j118R67P39j415Q03P92j598J27J657j408o92J871l85q34J095J30j919
3467a027J212Q70j620M23J069j135l34J588q74r91J667o84q47J225K25j536J045
3484B76N42j500L62J217j251j19J628r15r69J437l0j647J424L75j709P03J162
3501I86j879N79J060j252l5J496p79j073J600m29j532J702K35j613J107M24j130
3518e33J95J390j473l85J648p69j007J646k04j467J061O38j464M31J261j948M31
3535e49J099j258j31J293m72r89J377O7j512J176N11j558O51R55j360J82J384
3552H66j100o70J523p14j036J712j61j524J193J88j329J224N33j402j49J749j206
$$ plain form
3431 -328 -1094 617 132 -1276 285 634 -1169 -258 644 -710 -653 933 -56 -790 671 221 -1145 650
3449 650 161 -957 10 749 -666 137 929 -669 -542 1115 -293 -985 886 501 -333 762 892 -1027
3467 -1027 185 1055 -565 -142 927 -208 -542 1046 172 -819 848 164 -683 542 767 -769 276
3484 276 818 -682 -320 897 -354 -473 1155 240 -729 708 678 -969 455 830 -879 -176 986
3501 986 -893 -314 746 -506 -541 955 176 -897 703 274 -1258 444 679 -934 173 597 -533
3518 -533 -338 1052 -421 -806 842 73 -934 712 508 -959 102 740 -724 -293 968 -980 -549
3535 -549 550 -708 -839 454 -18 -1007 370 437 -1075 101 612 -946 -295 660 -700 -518 866
3552 866 -234 -904 619 -95 -1131 581 420 -1104 89 277 -1052 172 705 -697 -846 903 -303
3569c03p12J984q19r27J176J5j429J418K19j155N26Q75j389K20J186q41p14J449
3587G79l07j069J130J51j476R28R78j540M64J056j143l88J448r26q71J465l06
3604C73j224J443J59j548J218O30j630M44J163j170o48J938r56q57J567k11j340
3621f49J052J43j258P26R95j553J52J402j280j43J097n78r20J378m07j185J350
3638C22J92j540Q16J128j629N82P98q57o64J425p35p25J578m18j079R87M55j564
3656i28Q78Q18j233r3J378j234j14J228p95j005J548k59j043Q82N03j193M23Q44
3674F05j044R1Q79r96k56J230m20q74J303k02j181R50N32j376N47J070j497j17
3692g56J573r18p60J693l24j129J144k29r27Q23O87j396K53J186j297L93Q20j119
$$ plain form
3569 -303 -1015 969 150 -777 399 414 -1015 403 622 -533 -7 868 -521 -301 885 44 -670 779
3587 779 472 -597 533 684 -792 136 1114 -426 38 1094 -49 -437 1011 85 -786 679 373
3604 373 -851 592 751 -797 421 1051 -579 -135 1028 -142 -790 1148 192 -665 902 691 -649
3621 -649 403 546 -712 14 1009 -544 -392 1010 -270 -413 684 106 -814 564 157 -1028 322
3638 322 514 -1026 -210 918 -711 -129 669 -188 -852 573 -162 -887 691 273 -806 181 636 -928
3656 -928 -50 768 -465 -558 820 -414 -528 700 -95 -1100 448 189 -854 28 531 -662 -239 605
3674 605 -439 -348 531 -465 -721 509 89 -785 518 316 -865 85 617 -759 -212 858 -639 -756
3692 -756 817 -101 -861 832 508 -621 523 294 -633 190 877 -519 -266 920 -377 16 836 -283
3710b83k26J241n47q20J310j08j238P38P67j323M81Q45r18j81R42n63n46J254
3728H25l59j084R12N72j685J085Q95j738N44J110j531J83R27m87q64J289k67r62
3746f35J026L78j683Q27R16j478J41J698j417l50J344m91q03R96k80r82J305q4
3764D28r51N79Q08j488L46J128j006k73J238r28r67J661l52j214J234L08j313
3781g62P37Q88j489K54P88p05j22R32m08q74Q83L74j251J009J96j047K29J327
3799I59j259m32J569j291k41R91n03n91J149Q6j386R44O65j485M82R01p38j52
3817c32J089r39n44J593o65j108J135K20j362P64P46j122N42R59j342l53J509
3834G90q18n11J303k44j033N30O56j550J149P91j248k53J342j169j49J199o82
$$ plain form
3710 -283 -509 732 185 -635 675 567 -671 67 834 -489 -8 837 -81 -262 680 117 -429 825
3728 825 466 -618 294 866 -819 266 1161 -577 -33 1077 -454 -271 656 169 -695 594 327 -635
3746 -635 391 769 -914 -87 829 -649 -508 1190 -227 -577 767 276 -527 469 189 -793 512 428
3764 428 -523 56 864 -624 -278 850 -156 -429 809 -119 -1086 575 223 -991 243 551 -762
3781 -762 -25 863 -626 -372 416 -289 -411 521 113 -761 122 496 -755 254 450 -597 -368 959
3799 959 -300 -732 837 -454 -695 296 -207 -798 351 437 -949 -5 660 -825 -343 558 -180 -332
3817 -332 757 -182 -726 867 202 -906 229 449 -913 -149 597 -525 17 976 -366 -719 790
3834 790 -28 -539 764 520 -513 17 673 -877 272 1063 -185 -438 904 -265 -414 785 103
3851A03p54J369l66j019J202L58j422O19Q40j246J34R51q48n05J647j142o09J344
3869F56j60j125J046M90j628P28L58q52N53Q07j134k92J241o90o99J052m10p17
3887g76P58P26j205K95Q86q81j0Q89p40n91Q64j10r40J271j01j281R82Q05j443
3906f02M24Q60j395L19R96p12n45J252m25r14J093o4j075Q56L14j123P63P44j146
3925c80R5R76r57o74J320o77n61J382r9j125Q10L06q94K37Q22r30k65J465j075
3944b24o30J267j65q52R18J06r92Q72J80r47M31L79n64k87R92o23l63J374q61
3963A1o47P87L48j007O43N97j078l01J581r16n80J187o03m99J180l52r28J014
3981D37P6j093L62R87j095mJ120p50m98J305o62o41Q14j02r14Q75L44j048M74
$$ plain form
3851 103 -651 718 352 -667 535 893 -529 90 930 -316 -182 769 -79 -584 1063 -79 -688 656
3869 656 496 -629 417 907 -721 7 365 -487 66 873 -261 -553 688 -2 -701 351 -59 -776
3887 -776 -18 708 -497 -202 684 -197 -207 682 -58 -649 215 105 -835 436 335 -946 36 841 -602
3906 -602 -178 682 -713 -394 602 -110 -655 597 172 -742 351 287 -788 68 382 -741 22 766 -380
3925 -380 -285 691 -266 -940 380 -297 -858 524 425 -700 110 416 -478 -241 581 -349 -614 851 -224
3944 -224 -854 413 248 -604 314 420 -572 300 480 -467 -36 343 -221 -508 484 -139 -502 872 11
3963 11 -636 151 499 -508 135 732 -346 -647 934 18 -562 625 22 -477 703 351 -577 437
3981 437 513 -580 -218 769 -326 -330 790 40 -458 847 185 -456 358 256 -658 217 561 -487 -13
4000a3P78j009k24R97o55k42R58j34j231J085M1q60P51K26p57J26Q10j275k61
4019h89J554q34m70J266n98m74P58J74j150P53N13j427P68P64j074oJ081r23k01
4038d15Q59m45o25R50J01j397J043L34r22N48O95j282k8R33m82n37J195l35p33
4057e43R24l5r49O80M94q96j96J136j000mP75n63l53J287n63p15P19N6p63O20
4077A11L53j073L98R55q89m29J287m75q59J347n80r88J132L35j001L48Q15j157
4095c70J20J026p97k74J065n55q48J032L7q93L55Q06q81M56L27p84J12Q43m77
4114C00p58J232p33n55R02J89j357J013M66j169K82Q36q42m6J094j028o85J350
4132D91m23r10J279N9j025O20K15j113M69R19j139L34J045q55o07J078k73q21
$$ plain form
4000 -13 765 -244 -468 529 -126 -368 590 456 -775 310 351 -509 242 468 -289 -163 647 -628 -889
4019 -889 665 -169 -639 627 29 -445 313 487 -663 90 603 -824 -56 708 -366 -372 709 -214 -415
4038 -415 444 -1 -626 324 425 -972 71 405 -517 31 726 -556 -584 349 -133 -670 525 190 -543
4057 -543 381 346 -603 77 571 -325 -521 615 -385 -389 386 -177 -530 757 194 -521 198 254 -509 111
4077 111 464 -609 -211 744 -145 -574 713 238 -621 726 146 -842 290 625 -376 -28 787 -370
4095 -370 -250 776 -21 -295 770 215 -633 399 436 -457 -102 704 -177 279 606 -178 -66 777 300
4114 300 -458 774 41 -514 388 577 -780 233 699 -470 -188 648 -194 -240 854 -174 -859 491
4132 491 68 -842 437 496 -529 91 306 -807 -338 581 -558 -224 821 -34 -641 437 164 -657
4150f57R44r9r47O78N66j282P02Q24j047j09R68p53l75J074m83o64R60rj099Q77
4170F9M62r91J62P31r58M6J044o03p68J181k16r32R96J01r86O84O68j122k54R99
4190C13m85m03J064n68n60J073l36p69R08L84r38K85M46r37K79R30p66l03J073
4209F90n56q87J321j36j204J145Qj072O20L94q69M67P09o77m51J074l94n50P56
4228C88J10j067P95L60j004P03K12n24l84P76m79o5J147r56l80Q92P7p74M92L14
4248F33j202R06K38r77P3Q87k25p13J007l49o67N64K02r45N62K67n22J13O83p86
4268b51p8Q96p44l59J013j05r77J034O8j041O22L84q37K33M60o01l00Q17j27p15
4288f08R96k66n78O59J77r59M97O74j015J89Q31q73k88J214p02l43O14J59j148
$$ plain form
4150 -657 287 188 -759 -81 485 -797 -95 729 -318 -427 541 -212 -587 487 4 -660 300 291 -808 69
4170 69 531 -460 -298 433 -525 -479 565 -38 -806 375 159 -773 223 324 -662 22 690 -432 -686 313
4190 313 -172 -575 489 -79 -639 434 98 -671 237 621 -317 -32 414 -523 -244 686 -80 -383 690
4209 690 134 -753 568 432 -772 373 381 -691 -71 323 -546 -79 630 -47 -498 576 182 -368 388
4228 388 498 -569 226 586 -418 285 497 -27 -411 365 -114 -179 968 12 -368 524 601 -173 319 633
4248 633 -569 337 575 -402 -329 558 333 -380 627 278 -389 175 377 -568 -6 261 -261 -148 535 -251
4268 -251 -329 567 -177 -536 477 372 -605 429 497 -544 78 462 -375 -142 318 -283 -583 234 107 -608
4288 -608 388 122 -456 203 380 -579 -82 592 -423 -234 597 -276 -564 650 -52 -395 219 378 -770
4307g70J034J88j200P82L35o54j90J116p52l89P15k98k76O54j37p53O33L97j184
4326g49R52K45o54j0Q63o41n74R31k64p69R49j34n22P92K10j065L26P11j004J37
4346b70Q90o96n74J015m6r91J127k97n85N56L4n20K51L74p45K08J089p23p56J189
4366E30m51o93P00K70o44L32N18r00L71N32p87mJ088p85q01J309n03q60J067R3
4386C82q42N57K34q72M94O66p98l05P12m11m03N72K5n55O08L02q24M02O37r40
4406c59L24K47k91k50Q79o36m44P00k25o82P48Q44j360P46K86j145N60N79r47
4425d26J5Q53l68p13R37O1q54N87L50q06O0Q38p97L09L78n14m56R49l18n14P68
4446C39j07q07Q20R3q79L14O30p05m5R12p59n3M84j96n50Q55k3r82P01M00j061
$$ plain form
4307 -770 264 452 -748 34 369 -285 -475 641 -111 -500 215 -83 -359 295 158 -595 38 435 -749
4326 -749 203 448 -206 -216 647 6 -568 363 99 -670 279 145 -377 415 625 -440 -114 597 -407 -270
4346 -270 620 -76 -650 365 319 -672 455 158 -427 129 163 -357 -106 268 -477 -269 820 97 -659 530
4366 530 79 -614 86 356 -288 44 562 -338 33 565 -222 -226 862 77 -724 585 82 -778 289 382
4386 382 -460 97 331 -541 -47 619 -179 -484 228 -183 -586 -14 11 -544 64 366 -458 -56 581 -359
4406 -359 -35 212 -79 -329 550 -86 -530 170 -55 -737 11 855 -505 241 527 -618 -58 521 -426
4425 -426 -411 442 74 -639 298 359 -495 92 442 -364 -304 534 -263 46 424 -90 -546 403 85 -429 339
4446 339 232 -575 245 338 -541 -227 403 -302 -347 565 -194 -247 237 41 -509 346 323 -659 42 442 -619
4467f19M22N15n36m3P10k81n04P01k77n13Q83J54j020L83N99q94M35L67m64l67
4487c49Q66o80n90J337j65q71P11kp31P13K37q38N3Q91n90j72N25R3o61P22J4
4508E13j042Q33k23q04P74O23j088L26N17o60j80R08m16n81J131p29n58P55K56
4527C55n99J23N41p49J36L70l64l96J083l87o50P97j55q15Q47K27o90M27M96j076
4547d79L08O03o30l56Q09k88n18J049n49n29M37N27q52L58M22o05n7R42r21o0
4567c89N73j42p27R56J30q68P51N4o42J31O05q82J97P26p35Q6M35k61l96O62k46
4588A8m99O90J16n96R5Q35q72k17J062o21l68O72j08o17M52J59l19L9L27n83L50
4609A5L91n41q3R55r06k50Q17M6q76O33j16n87M97M35q23K62N79m10n33R71n39
$$ plain form
4467 -619 -197 318 -218 -261 449 168 -336 365 88 -425 458 612 -408 -25 574 -320 115 482 18 -349
4487 -349 517 -163 -753 584 419 -452 259 257 -474 239 476 -362 -309 582 -8 -180 345 438 -223 499 513
4508 513 -529 304 81 -723 51 674 -414 -88 429 -231 -411 497 81 -500 631 -98 -656 99 355
4527 355 -244 -121 420 -329 -193 177 -187 -583 500 113 -537 260 105 -710 137 364 -326 101 597 -479
4547 -479 -171 432 -198 -554 255 -33 -551 498 -51 -580 -143 384 -468 -110 312 -293 -350 592 -329 -389
4567 -389 184 42 -685 271 401 -467 284 338 -304 -173 432 -450 -253 473 -262 -176 259 -2 -398 264 18
4588 18 -481 209 325 -271 -176 659 -213 -430 632 11 -357 315 207 -410 42 201 -118 -79 248 -335 15
4609 15 406 -135 -218 737 -169 -419 398 444 -432 201 85 -502 -5 430 -393 -131 448 38 -495 476 -63
4630f3l97J011m60l20N35n0n81R3P22o80J5O99p39m2N25l18k18M08N7n25O11m8
4652B35p15N61K83o78J38O33m62q7M15k57k12M16j27n55M12K90r10K97J005q93
4672b11j64J041p92l36N68q8l17M67l12j73K78M00r80P13J12m01j77M74k07j95
4692c00N08l46k4M74j66n44L44M00o38J54O55q68Q1N32l93j61O06j90o10M26L07
4713B47o81O25J09o75J53O46o79m6P24m68l29R14l80l17K96K58q85M87L2m10K4
4734c55N35k62k75R85o18k77P56j49p60R75n08m68M11M55n26j76P79m78k29K52
4754F7M9l75K94K96n30L74J58n78K24N21o49K0M91l96l12P05l16o1L43k28m70
4775c73O09J17p32K61M23l35j34N77m76l81Q58m96l39P40l07l08M63J16o95M00
$$ plain form
4630 -63 -460 551 91 -229 306 256 -325 -232 490 -190 -175 524 -215 -257 268 -50 -268 140 197 -328 283 235
4652 235 -480 81 364 -314 -176 457 -5 -92 323 66 -146 270 143 -412 0 290 -620 -323 682 -211
4672 -211 -375 666 -126 -462 106 18 -299 168 -144 -317 -39 361 -619 94 206 -195 -372 102 -105 -300
4692 -300 208 -138 -162 312 146 -398 -54 346 -292 -138 517 -351 -270 262 -131 -292 314 124 -486 -60 247
4713 247 -434 191 300 -375 -222 424 -255 -301 423 -45 -374 540 160 -157 139 397 -488 -1 31 -379 -355
4734 -355 180 -82 -357 628 10 -267 489 340 -420 555 47 -421 -10 445 -81 -257 522 44 -185 67
4754 67 116 -259 35 331 -199 175 333 -245 -21 500 -149 -129 362 -34 -346 359 43 -18 325 97 -373
4775 -373 236 353 -379 -118 305 -30 -164 413 -63 -444 414 -82 -421 319 12 -296 167 283 -412 -12
4795a2L90o58K6N18l84l4K69Pm37O61l56l19L71P1n95L73M94n65n8N92l52n40
4817e38Q07R5q38K30L17m93N46N9m27J72M76o93P8L39j36l84M52P0m76M92o6n39
4839d57N15J93m38J74L52m31J26P62q20j96L68J86n79M35k69j40N37N0m23n4N46
4860D37p04j54Q40k26m63O76o24Q9L06j96k45M3O14n12j2N21l25k65N77m55k65
4881c43P76k91k57K72r5j26j74O30p21L80J07o6l90P77m42l29L42N1n86M99M3
4902E7j28j65N78p44J90N78k21m9M2k01n13J018l22k78K17Lk11q5K55J14m12N29
4924B52k74J1j95L18m30J67L85o23O54j54k77k5L68l73L9K61m56q6M90L9m55K17
4946a47L96l70j73L79m42J99L69l83kM38j35j36K41j47l45Q14k89o39K15L15l84
$$ plain form
4795 -12 378 -280 -254 264 -120 -154 115 122 -315 346 -10 -329 42 113 -482 -109 385 -180 -238 354 2 -538
4817 -538 269 364 -474 -244 73 -420 126 185 -242 -70 406 -287 -209 130 -6 -390 62 132 -344 148 82 -457
4839 -457 58 251 -187 -13 339 -92 34 796 -24 -220 148 334 -245 190 -79 -219 318 368 -55 -109 437
4860 437 -267 -421 419 193 -270 406 -218 -129 177 -19 -264 -221 393 -119 -131 390 65 -200 377 -78 -343
4881 -343 433 142 -115 157 62 -64 -238 392 -329 51 158 92 -298 479 37 -292 50 101 -485 14 57
4902 57 -71 -236 342 -402 -212 366 145 96 138 -63 -576 442 120 -158 59 62 -149 -234 21 135 -277 252
4924 252 -22 -11 -206 112 -318 -151 234 -389 265 111 -166 -191 177 -196 -157 104 -352 -438 52 91 -364 -147
4946 -147 249 -121 -294 85 -357 -158 211 -172 -174 264 129 -7 234 87 -258 556 267 -372 -157 158 -226
4967b26L02J26l61j23Q27k84k72L61q6o24O09n9m62L67J40n15J33N92p19j47M38
4988A7J59l62N43k25n22M26N35r30K95M01r32O47L46m90j36L92j21m10O37Pn77
5009c00J78L63o82M60L75n17N7N49m86j49N09m60k92N24k04k11Q4K69k09p4O77
5030D61q24P4P72m68l74O98k66n64N19J11n18O41j21m98K98K93n3l60K91l8r7
5051b3R7j82l17M52j99J02L47N6l93l68L72l1k90O49k99j72M01l18k91M86j04
5072b5l17N17R0m29q5N57k38j73O42p22p9L64l12J7M73l3p51O27K92n51p2M45
5094B37l59%K39Q3l52M36Kl87J45J62l96J27K77j58k49M65n3l04K75k36j15M61
5116C00k12k19L00L46o52J77M50o38J3L10j10l20L04Ok50M63k01l31L04J42l40
$$ plain form
4967 -226 76 202 -159 -282 545 261 -11 350 264 -360 249 190 -272 95 235 -280 -147 445 -274 -421 17
4988 17 176 -186 357 132 -390 36 571 -359 -64 337 -595 52 398 -92 -228 164 43 -367 270 277 -300
5009 -300 -122 241 -441 19 394 -123 -66 483 -3 -152 357 -103 -395 129 -75 -286 -202 67 -142 -216 461
5030 461 -363 -289 483 15 -359 339 73 -491 28 139 -379 262 141 -357 -59 234 181 -179 112 74 -23
5051 -23 74 -108 -425 27 -172 -70 277 333 -60 -428 -56 -87 -377 272 -27 -199 202 -116 -407 79 -25
5072 -25 -342 175 265 -164 -249 308 70 -103 539 -183 -262 102 -210 -193 280 247 -504 123 415 -136 -208 237
5094 237 -122 -122 117 200 -152 284 286 -101 44 206 -190 -63 214 56 -193 272 219 -85 190 -46 -161 300
5116 300 88 -131 169 515 -137 40 490 -148 -135 175 65 -255 49 55 -195 268 67 -264 40 182 -158
5137a58J10k9k35K24J62j66M9k0K26l35J49J52n20M32K66n79L56K50n93K54M47
5158D42m40p1K14j52j45J07J58R3N3J02o96rN64m80K31L74k91k10K62Q7l69L70
5180A94j18j34O0K00J07l50J16N5k90L52k29n93Q71k96l24L38Rk72L11L40r49
5201f02L84L40k02j92R04m13n23M42j64r9N8L91m68p2M85m62K31K52j09m57M30
5222A54n1m07M14P7n52L15K9l58J95N16m75k4M49l51k07N16l18j2M57l21k48L19
5244A17m19L0L19L8k25N9L62k01j12L69J70q20M77K05l92l9J90j60J73k38O8j63
5266a92Q72p52m96O48j77r8L42j05m35M55O1j45j27K73k53K66r6O1m42M68j33
5287el05M21L48q71J96L11l39K29J93n14K20N02m20l48O58m22j61M50L5k02L3
$$ plain form
5137 -158 -48 -77 -312 -88 74 -92 -43 -63 163 -172 -23 129 -391 41 307 -272 84 334 -259 -5 442
5158 442 2 -69 145 -7 -152 -45 113 206 259 361 -335 -344 220 -260 -29 345 54 -156 106 193 -176 194
5180 194 76 -58 2 202 309 -41 75 130 -160 192 -37 -630 241 -55 -379 -41 -32 -304 7 347 -602
5201 -602 -218 122 -80 -272 632 219 -304 138 -26 -125 -67 324 -144 -216 269 -193 38 290 181 -276 154
5222 154 103 -304 110 187 -365 -50 -21 -379 -184 332 -143 -167 282 -69 -276 240 -78 -90 367 46 -202 117
5244 117 -302 -272 47 85 -140 -81 281 80 -32 337 507 -313 164 369 -23 -62 128 -32 141 -97 -29 -192
5266 -192 680 -72 -568 80 -97 -195 147 42 -393 62 123 -22 -149 124 -129 137 41 102 -340 128 -5
5287 -5 -310 111 459 -412 -216 95 -244 -15 178 -336 -116 386 -34 -382 276 -146 -307 143 178 -24 9
5308IQ4j23j79K57k54m9M33j56j65L45K6q9P8j73k69L0K10J26k29K67j85j31J97
5331F0p2k65J46j8k44J36K88j82M0M59j47k57M30o89M62m6j29L5lL94k86L29k37
5354B04p0q0n8j30M5L60j66l32L18n8j79K03J07j91J04J31m62K25R9M5j63J93
5376A45j65J37K7j17J30J01j36m85qL64j74r6L96l8k69K78j2m22N94l18j53N70
5398C49n05n1L21J28n43M69l8o9m59M32J86m57K09N6j79J19L97n75J69J9P8N0
5420A06J77o08J75L96k98J13%r7k52M83l33j76K91L51m36P9K38j18k83M18O7k02
5442I1R9k60k00L50J9j05m7M07k99k81L23l09R2J58k14kO23l40k89J20L5j43N8
5465a14L72m28Q6M31j61k99M44k15j33J2K73l74K21j00l54N1O18n58L00K44m16
$$ plain form
5308 9 93 -30 -209 48 -206 -255 178 22 -143 202 228 139 217 44 -225 -195 15 141 -88 179 -6 -137 60
5331 60 -12 -277 -131 -149 -393 -257 31 -151 -111 348 201 -56 374 -315 147 101 -28 7 4 398 112 441 204
5354 204 134 54 -4 -134 -89 271 105 -227 91 33 -146 57 164 -27 77 208 -254 -29 70 115 -48 145
5376 145 -20 117 144 27 157 258 122 -363 -371 -7 -181 -277 119 81 -188 90 78 -344 250 -68 -221 349
5398 349 -156 -207 114 242 -301 168 130 61 -398 34 220 -237 -28 28 -151 -32 365 -210 -41 -22 56 106
5420 106 283 -325 -150 246 -52 61 61 -36 -288 195 -138 -314 -23 328 -108 -29 209 91 -192 226 293 91
5442 91 190 -70 -270 80 99 -6 -53 354 55 -226 97 -212 -120 38 -176 -178 445 105 -184 -64 -29 -172 -114
5465 -114 258 -170 -84 347 186 -113 331 116 -17 -5 268 -106 115 15 -339 -288 330 -228 72 316 -100
5486a00N1J72j47q8L91q2l46n4K98k30J94J0J25j0L8k06m2K08j90O7L16n82K22
5509A5K41n3k30K9P9j25O4M87n52l63N16m21Q7K16J37k31K45J40m81j18N44k88
5531f2l0M60m67k05R4L20l36M55l05m7L26l60K05k69k43K83K05J52l77J24O7j5
5553b5l92P52k62%M3N4k08n1L44m63J49K82n99Q3N01k64p9L65j12k70R5K09j52
5576@j51L10m10J43J2K47k47K84l28o1M35k7k35K1J41k35m9M04o3m65K93r2j20
5599a93Q2L01m92J96n4k68N01J29l59L45Rj84k70J86L91o24M08R4k80l7L80o95
5621d34M95J28k50l2K61L2l91N78l54j63K37p8l15K96O5k88kL70n34K98O5K7L1
5644D2J38j20j84J43J64p94P55k60J73MK5l42J05o8L16l58L11N7j70K53J10o04
$$ plain form
5486 -100 -49 123 -24 -112 279 197 -149 -203 95 -135 59 69 194 184 222 16 -26 182 -8 59 375 -207 15
5509 15 256 203 -27 2 81 -44 20 507 -45 -408 108 -313 -226 -10 127 -104 141 281 -200 -318 226 -62
5531 -62 -92 368 -99 -304 -210 110 -226 229 -76 -123 203 -157 48 -221 -464 -181 24 176 -201 -77 -10 -25
5553 -25 -417 335 73 73 116 170 -38 -89 255 -208 -59 223 -376 -293 208 -56 -135 230 118 -152 -57 152 0
5576 0 -151 159 -251 -108 -96 151 -96 188 -140 -201 234 207 -28 -7 134 -101 -150 254 191 -274 19 -73 -193
5599 -193 -111 190 -302 -106 -160 -428 73 202 -157 188 197 13 -257 -71 320 -304 104 198 -82 -119 261 -434
5621 -434 61 189 -61 -93 168 200 -191 387 33 -130 107 29 -286 10 75 -213 -215 155 -379 -81 -16 11 42
5644 42 180 60 -124 19 183 -611 144 -116 57 61 86 -256 -151 -219 97 -261 50 107 -63 190 300 -304
5666c04rQ42p51R6K56J34l92K95k75j29L94j38J74j90J68j86K18L91o48k19M01
5687A28O3m36K90l8O9k6K9N1k66L73n02L60k20O2J54j39j33j65P21n5k56Q4j08
5710D0l18J81J40j75J48J18n3k10L60l11p2r7K29N7P4j19jP3J73k73J86j34m57
5733d41N53m0P0j44L44k10j28qK91l65j28L42m81M55J57l32L02M5l67p3K41j66
5755h3P8J64l09q2J25K20l09L56J99l19k42K35k86L92k9J95l75J59k62LK19K95
5777C44m83k03K87P7k74M92k64j60K3K79k05J47j14J02J94q8l03R1j87L20p4o1
5799f0l3J27J03j94J3j06L82l75p5K13j59o3J53K18k96K76J4r2k8k57m2M41j72
5822a2p4j64K39K53o66K94j45K60P0j44l6L14j86P9o7J27j85J26K37k70k76J60
$$ plain form
5666 -304 -313 529 -222 -126 130 264 -128 167 -108 -237 157 19 193 3 171 -15 203 594 -54 -273 128
5687 128 191 -245 45 7 76 50 79 130 -136 237 -265 95 -125 -63 91 -48 -181 -346 375 320 64 148 40
5710 40 -278 -97 43 -132 16 134 81 -129 231 -80 -152 -249 -20 37 111 -8 -9 64 237 -36 150 16 -441
5733 -441 112 72 142 -2 342 132 4 -4 287 -78 -206 136 -345 110 267 -65 237 282 -85 -158 83 -83
5755 -83 -5 159 -150 -232 -107 113 -196 160 359 40 -202 33 -253 139 110 305 -70 89 -173 -170 49 344
5777 344 -139 -342 -55 22 -252 240 -24 -184 -161 118 -87 60 -54 48 242 154 -149 -58 -245 75 1 -60
5799 -60 -93 34 137 -57 -44 -150 232 -143 -218 -5 -164 -227 -74 144 -152 124 138 46 18 -239 -281 160 -12
5822 -12 -86 -250 -11 242 -424 -130 -275 -15 55 -89 -125 189 3 82 15 142 -43 83 320 50 -226 -66
5844f6J89l34L83j06k91K84jj13J10J98o14L61J46l52J07K54l38J52l1Q3L8O7
5866A26j19l75K14j1N6J88J67n9r7M01m00k29M72l98oJ88k85P2J34n6N5J09oj37
5890DkJ80K3j71J47k85O6J21J39l34J13K25l85J36J20q5K7R5k73o9N00k22o6J95
5914A99j31L7k6j23j31N5K08j7j74N7J76l26K40L0j49J13k32K54k00Q5j5M0J55
5937A25r3k42L40j21l42J92L56j71J15O2m27J12J58j90k23M16l71J77L44m9j87
5958a9k6K85l20J93l19L56l03O44m72J82l05Q5j99L37k3n42O67l16J09Pj91J12
5980e8M8RN5Q6L6p5R5q9m2j76J65q4kJ22k5k58n9J82J21l45P39n10m4J79j36K18
6006A52l90K65L22m56M2%K54K52o15L30k54k06J69J60M09l93j52j51K73j6l7r4
$$ plain form
5844 -66 123 -211 172 66 -225 59 58 -55 55 253 -361 0 146 -206 -99 155 -183 -31 -62 21 59 126
5866 126 7 -368 -154 -165 -109 79 246 187 90 491 91 -138 334 -64 -70 118 -167 -95 39 -17 38 147 141 4
5890 4 2 182 205 34 181 -104 -38 83 222 -112 1 226 -159 -23 97 12 39 134 -139 -208 292 70 4 199
5914 199 68 105 79 -44 -175 -120 88 71 -103 -46 130 -196 44 74 -75 38 -194 60 -140 -55 -70 -30 125
5937 125 32 -210 130 9 -333 -141 215 44 159 221 -206 -94 64 -126 -349 67 -304 -127 217 168 -19
5958 -19 -45 240 -80 113 -206 150 -153 491 19 201 -104 -19 -218 119 96 -446 221 -95 14 21 -170 -58
5980 -58 -10 -1 54 140 176 101 196 107 65 -111 54 -30 -32 90 65 -193 -252 -70 51 -294 445 -65 -109 70 -66 152
6006 152 -238 27 349 -107 -65 -65 189 441 -174 156 -98 -304 -135 25 434 41 -111 -262 11 -5 -42 -136
6028a36o5J82J91L4l22J06l2J70mp9j69K83j49k73j17L97K33n6m52J02J99qn7
6051b2l9nP2j12n9m4J30l58N81P9l16L62m14K07r1M6L5j71R6q3N03k51j72l8J47
6076H3n1K2N0k04K04P2l53J96N1k80K32R1j2O2l1n2j70J9J48j5j2j5Oo8lJM74
6103D45m31L96k59j42k40M51j04j75k20N10k15j78M05j34l76L23l8l1q6L76l54
6124g7Q2j39M5K09j38L33k11M9R9l14q1J45n1q7O00n01O8l11N09l7k79R8j76O0
6148a05K56p1k52L06J15j19j10N6j75j74K51k38K15j66J01J58J24j7j66j02p4
6169a87K24M0n9K48m28j2k07O49J11o49M46j80K9j16J20j05O7k3J30j18J71l2
6191A19k89J70K6l7J40j1k55j97K71J82r1J88j45j62M7K76k56R5o0j25L72m12
$$ plain form
6028 -136 -201 -19 172 206 -116 -10 -42 128 124 45 -124 159 10 -263 -380 17 250 194 -258 -156 43 35 -22
6051 -22 -61 -66 6 -106 -165 -209 -79 -437 144 223 -93 269 -145 62 -29 17 52 -119 -23 -106 397 146 -26 -64 83
6076 83 32 54 104 -100 104 176 -177 19 70 -210 22 113 101 163 132 80 -90 -71 77 62 50 35 41 -27 -30 -29 445
6103 445 14 410 151 9 -231 220 116 -59 -279 231 16 -162 243 109 -267 56 18 -13 -99 277 -77
6124 -77 5 -134 -89 120 -18 315 104 153 252 -62 -143 2 -49 -136 464 -37 31 -280 229 192 -87 11 -165 -105
6148 -105 151 80 -172 134 249 130 20 76 -99 -273 -22 -260 -45 -211 -110 48 172 155 -11 -113 -187
6169 -187 37 77 18 266 -162 -174 -381 268 379 -270 176 -4 25 -91 29 -76 -9 -32 98 -20 151 119
6191 119 -170 0 26 -11 129 118 -137 -334 -63 119 28 216 71 -91 -44 232 -24 71 11 -114 258 -154
6213a54K3K28j63J24l42K47k13J52N2K52m03J37Q1k63M49n3k24N4J89k55O9K74
6235B61j11j12K34k10M3n9j1K2m0J30k92J37J66L4j1j32o6Q7r7J53k32J79J3j57
6259g1J06J8j18M38l63J65l55K84q7k19L57M1k71M2r0K36K8k07l03L65R8j89j31
6282b26M34k34J61j25L7K9j32j31lL34k84K82j81l2j62K3Q5J99j79J77j57M81
6304C96k87l34K33j38J74J56k75K42k90Po9K64JNl23l4M32j30K56l8n65K33k18
6327c02O05N8n26J79O4k08n5L67k88K49j36n6j43N83l86j67J37r2j19O78o09O5
6349a02J25j00j12J18R6j6pJ88J05l88J94k11K84j03J72k84J17l36K91j15j10
6370a94J11kJ82j0o4J32R4l77K63l45Q3q9N49k97m3J43j85K22M4l8m32J73K40
$$ plain form
6213 -154 -131 97 -66 58 -284 -37 -250 -98 -46 206 -197 -60 21 -242 207 154 -70 -16 173 -82 -13 261
6235 261 150 38 272 62 105 46 35 57 17 147 -145 -8 158 192 181 49 -17 70 -27 126 -106 73 86 -71
6259 -71 35 53 -65 373 10 175 -180 104 17 -202 155 196 -75 -33 -123 113 141 -66 -369 -4 94 -95 -226
6282 -226 208 -26 135 10 47 76 -56 -187 -190 144 -140 142 -39 -71 -233 -210 -125 74 -105 72 -85 396
6304 396 109 -225 8 -130 44 200 -75 167 -123 -116 -185 79 80 85 -238 -272 160 30 286 248 -317 -84 -302
6327 -302 303 361 -165 14 78 -130 -185 182 -106 143 7 -49 -192 391 5 -162 -25 -117 -236 442 -167 -102
6349 -102 23 -77 -189 -71 25 9 2 190 295 -93 101 -110 174 71 243 -41 76 -260 31 -84 -194
6370 -194 -83 -85 97 87 23 155 249 -128 135 -210 -127 -216 333 36 -7 136 -49 173 217 179 -253 -80 160
6393A60j83l6J16k83K11K08k55j08J03j69n7M40j6j40J34k95J66L9J5l47M91K2
6415B16l21L80m19l66N77k95J20J89l94M31k17K77j50j32K92r1j90n4K41l50K10
6436d6J51k20r4J18K07k03o9q0K65jn3Pk71M44J3j74k49K33mL3J50k13J3K86k13
6461C0R3q7k7j16j42K77J63k69k41K01Oj70K80L69p2k01j92J46k74J18l9J26R0
6484F9J69j70k33M34P5k24J35m1j47N0J00K4k02J43j38j08j50J74J00L73k96k89
6506a52L34k71O3L4J48n8j81J44q0J34j77p3J26j19K12j11J43j6n0K11l49L45
6528B57l45J99j72l76N41q6r5J65k69mJ17k02N05k36j89j60J5O25l36k92M14R5
6550A71m50J41N6R0k83J36L34k92P9Q5J53l44J19j02N85j82m90j33K05P2k34J70
$$ plain form
6393 160 -23 -59 57 -226 -15 193 -62 -170 -67 -236 -293 147 131 -9 125 -170 -4 35 50 -297 194 216
6415 216 -105 275 -144 -510 67 -228 -108 81 -313 118 -99 178 28 -104 188 97 -93 -147 94 -256 -46
6436 -46 105 -115 -209 -91 116 -87 -156 -236 29 28 -25 -18 -289 155 168 -6 -255 -22 -26 7 157 -56 -43 243 30
6461 30 123 36 9 -107 -249 28 191 -78 -319 -118 -112 -282 -2 367 295 94 -98 48 -226 -108 -147 -21 69
6484 69 238 68 -165 269 344 120 255 214 67 117 217 241 39 182 44 -64 -214 -40 60 433 137 -152
6506 -152 182 -89 -26 8 156 98 -83 61 -19 115 -62 -135 -9 -128 84 -27 116 100 50 261 -88 257
6528 257 -88 111 -61 -437 104 18 -77 88 -181 -185 -68 -270 235 -1 -190 -350 -335 290 -46 -338 76 171
6550 171 -279 -138 -82 8 -275 -139 195 -97 -18 67 220 -124 -5 -107 478 296 -194 -327 -122 -50 -284 -114
6572a14N9J36j40L9N17m83L98k76j05J29l88L6J93l18M16J65j32j48j55J92k3
6593bj40LK06J8l08N9P78p02OJ98k9j27L7K05m5q8J8p8K2q0N8n0J44l35k3J03
6619a52J48k61L42j38j30L15j49N7j98M39l30k8j6K63l4k72K00O0j41j75m5L86
6641A41p2j06K89j62N4K12m28J5L05l01k9J28o7J19j57K46j26L01m43J66k4k78
6663b17p7K38L4r7J81l02R0L2Q5O3J8NJ82l80K57j91l7L27k07l7j05J65k60K12
6687b1r0J2p2mK80j11Mk02J40J29m1r2R1j7J58k77j15P6K0j01L97l45j35M18l46
6712b44P0L32k39K3J40o2m6j33J38q9K69m07L86j12n1Ok81L54l75J51K20j95K37
6735I2J56k61J1r2n2K38O6j13P7j26R2j19O4K38k40K83j56m0l22K79j32J01k96
$$ plain form
6572 -114 -55 81 -59 -20 497 14 412 136 31 160 -228 -192 1 -317 99 264 132 -16 -171 21 -2
6593 -2 -142 -139 67 85 -223 -164 614 -88 -82 116 87 -40 -3 202 157 69 87 9 31 -49 9 -41 103 -232 -255 -152
6619 -152 -4 -265 77 -61 -191 124 -25 32 -166 273 -57 -85 -101 162 128 -144 56 116 -25 -200 -245 141
6641 141 69 -37 252 90 144 356 -72 -57 248 -53 -82 46 -21 98 -59 187 61 362 -81 85 61 -217
6663 -217 -294 -56 -22 -119 62 -240 -150 -118 -33 30 48 53 235 -145 112 -79 -116 211 4 -33 -138 27 -233 -21
6687 -21 -111 -99 -171 -175 105 -6 -2 -204 -64 65 24 -68 23 6 164 -113 -228 -152 -132 -233 164 -181 -316 102 -244
6712 -244 -174 158 -81 -58 82 20 -26 -159 -21 -110 159 -248 138 26 -25 -19 -300 54 -321 -170 50 -145 92
6735 92 248 -13 -2 -94 -146 92 158 45 122 -4 88 -31 33 271 31 314 158 118 -204 75 -57 44 -252
6758b52L46K6n9K7J73l71J21o6k13J43K35l44L77j45j8mQ3j33M0nK32k46P6J58
6782A81l5p8j24J24k6J86k76J47K56n58m3P3K18PN8j92J26J9K4j11j97L24K10
6805C13l71n6L46m04J36J14o2Pj04mL4p4k9k98L50j23K06J79l17K96l73K79K02
6828B47l10K3M9PQ4J01k65R7j1J3J23l19J09L1q9L12O4m95L08j46O20n76k81N90
6852B86k44Oj91K42p4K12l82K55k83j99N20l00P6O4j28K27j48l76O46m51L46k38
6874a34J33r1k2N0k73K83N1j71qJ44m0J84J1J77l13n8O9j10J49j0j79n7L66k20
6898f9J06j01J39j62M5j5j74J54M37n30K41oj82J71M19k53j72L13l38J00j5J35
6920B43Q5l78J1M5R8n0j49n3J04k49L58N6j17j19J41NR4j83pP4K6J53n4j03p5
$$ plain form
6758 -252 94 120 61 88 261 -110 11 -55 -268 -125 110 -234 143 -2 -20 -24 59 -74 -34 -39 193 -53 23 181
6782 181 146 68 -56 68 42 228 -48 99 355 -203 -246 -173 45 52 110 -82 44 63 87 -24 -221 103 313
6805 313 -58 -114 232 -172 -36 78 16 23 -81 -85 -51 -125 -154 -452 -102 -225 -19 160 -157 139 -234 45 247
6828 247 -63 -40 9 16 100 201 -64 33 22 35 158 -161 -52 -21 -110 202 266 -229 79 -67 553 -23 -304 286
6852 286 42 48 -143 99 25 237 -145 110 -173 -372 148 -152 -76 -12 -140 87 -61 -437 209 -242 104 -134
6874 -134 -1 -92 -114 -64 -337 -54 -3 -174 -182 -38 -78 106 117 294 -19 -77 -8 -118 31 21 -158 -215 151 -69
6898 -69 37 -64 75 -87 -42 -57 -231 -77 360 -170 71 65 -117 54 473 220 48 361 23 123 108 243
6920 243 328 -50 -39 6 104 54 -95 -148 -44 -293 65 121 4 -115 26 31 125 -58 -65 9 35 188 134 31 -44
6945d4J5O5J4k33K50P3l22O7J59k08J36M0J1K9l6J86p9l11J58J67J6k52Q4K1j18
6970a12K79j8k66Q6K31k97K72k30K4J4j34q0L43r0J01j46K15k76J92R2l46L59
6992B13J03k42j22Jj00j33L82M8j72Pk63L59l10N8J01pJ45J9j67J08L4J56o5k23
7016g0l5j08L9J9l8K33m5q2J8K00j25j07O4j02J08j86M85m00M10j39j83m9M22
7039C29l61k13j5M57m0k16lj72K36O9p2K97m84j73N51lj33M1O1k09K55j63j97
7062a58L12k27OP8k6J31k48J61k42L37J4j10K23p7k01K12k25J40l02N1K23l0l7
7085Ej79K4%K21P0K0k67Q9n2K87k15j59K35k8j65Q1j50J62m38M70L4m9J10j1K8
7110A23J4k60J54l34M37k56L02o9j04l3%k10K39p2L92l6j11j04j92p1J42K80k38
$$ plain form
6945 -44 -29 36 50 -183 67 140 -182 -115 44 -164 -28 12 23 52 16 202 123 -188 -30 137 153 -99 -15 6 -112
6970 -112 167 149 -117 -31 200 -97 175 -55 -31 -17 -151 -231 112 22 123 -23 192 -84 108 200 -146 213
6992 213 316 74 -48 -47 -147 -280 102 150 -22 -15 -278 81 -229 -171 -70 -77 68 87 -80 28 62 218 153 -70
7016 -70 -105 -213 -174 -155 -193 40 -5 -87 -69 131 6 -101 -37 -139 -31 -217 268 -132 278 139 -44 -93 329
7039 329 -32 -245 -260 197 157 -59 -62 -234 2 71 -1 296 -188 -361 190 187 54 95 156 -53 202 39 -158
7062 -158 154 -73 -67 11 -15 116 -132 29 -213 124 138 28 251 174 -27 185 -40 100 -202 -151 72 42 5
7085 5 -174 -150 -150 71 141 161 -106 -17 -69 218 3 -156 79 51 -114 -33 -183 -21 -459 11 45 -4 106 95 123
7110 123 137 -123 31 -303 134 -122 180 111 7 -26 -26 -236 3 -69 323 287 176 72 -120 -191 -49 231 -7
7133gl56M15k2r7j28K38j28J27j4J83m70N48o80M73J01k41j96K13R8k08O2J68
7155G9k09J66r9j44K79k27K81k49l1J13O4j89q2N08j89l7j91R6N2r9J25J70l75
7178a88K90k94R4P6m4J78l06M6J48j7P2j69Q0l3J8N3J55j21j43R3J64k86L12K94
7202D72l34m7j37j7r5P3J17Jk5j43K99j62N3q1J52q4k75K96j32j4n8J80k03L15
7226A51j23K39k23R6l0j75K2r1K57m6J40j49k55M5L62l23O3K34k41rJ11l01J33
7249a13L73r2l21J84r7K44k41k6k42K42J31Kl00L86k03K6m4J04O2l3l3K7j08J70
7273I8K50l08J7o5J15j14J29r0P2o5j02L1J32l1j77L22m44J82K02k33N9p8j1K22
7297A13m4j54J74l0k72O0j75J93n3R4L06j90K9J68l39L33l74L36k09j52K32k49
$$ plain form
7133 -7 -363 52 30 -67 -195 43 -85 42 28 211 -259 289 -391 82 183 -58 -254 -41 57 -151 -89 79
7155 79 -130 36 -63 -207 72 -155 126 -123 -154 -41 23 -166 -248 260 71 34 -157 -61 -9 -108 17 187 -188
7178 -188 102 -192 -98 -22 -66 112 -194 -148 0 -17 55 -114 -34 -67 -49 4 159 38 -105 -12 152 -134 178 472
7202 472 138 91 -46 -63 -158 -85 32 33 8 -135 164 2 55 -26 126 42 -233 63 -69 -83 -141 39 -164 151
7226 151 28 267 44 140 110 -65 -43 -134 123 77 217 68 -187 -142 220 -103 -40 194 -47 -56 55 -246 -113
7249 -113 260 168 -153 31 -66 178 -63 -89 -331 -89 42 44 -256 130 -73 -47 -91 13 75 42 9 36 -72 98
7273 98 348 40 57 -8 107 -7 122 32 104 39 -63 -32 100 69 -108 214 -230 -48 154 -79 -20 -98 -109 113
7297 113 69 -85 89 59 -213 -153 -328 -135 -188 -94 212 22 51 219 -120 213 -161 175 -34 -186 46 -203
7319b03J91j21K35k45M05k81l7K14l08J02j3K7M7KJ20j23Q5J99l02K8j32l22K34
7342a98K27K2j5j58K92l26K07k10l6K17N1j94rK40j75K9Nr2N0L6Q7J47j94J02
7366A05n3N2k53N6j78K45J53m3j27K80n24N67k26j51K36k81J07j89K59P6Pp1p2
7389b5J37q8j04J41M2l1j31l17L96j00J01L9N2J73j05J17j24l38J76J8j48K20
7411A01k29K26j03l21L54J56k20K99j91M2k63J19Q5j55J06L3j6O9k62L84N0k31
7433C3J18l12K03j25J22m1N3k76m6L16j04p3NP6N6R4J39j32l02PJ68J54o1J42
7457B14l15J03K34l24P1j41J60l2J59n1J85k7l56K25j50j3J11j70q6N39m28r6
7479a88K53L2k41J26J73l53rK1J11K09lM9j40k24k8M03j82P3j31L09k16J63j58
$$ plain form
7319 -203 -12 -133 102 -143 262 -19 -56 158 -150 -48 -61 -34 13 15 135 12 97 296 -6 22 -110 -432 -198
7342 -198 29 51 36 -122 170 -156 51 -159 -195 22 73 -121 -130 110 -65 -36 -31 -123 -73 -37 50 197 3 105
7366 105 52 104 -149 -93 -271 -26 127 84 -43 237 -287 280 54 -97 139 -142 -35 -224 35 111 118 47 -25
7389 -25 112 24 -80 61 103 72 -59 -376 20 -80 21 60 112 285 180 297 173 -165 11 29 -119 101
7411 101 -128 98 -5 -326 28 184 -36 263 72 114 -149 -30 55 -100 6 39 23 92 -170 214 264 33
7433 33 151 -161 42 -83 39 -2 51 -225 -271 45 -59 -132 -127 -51 5 99 238 106 -196 -189 -21 133 72 214
7457 214 -101 2 236 -88 -17 -158 2 -30 129 78 263 236 -120 105 -45 -58 53 -117 -203 336 -92 -188
7479 -188 65 97 -144 -18 155 -198 -207 -186 -75 134 131 180 40 -184 -212 191 9 82 -49 260 44 207 49
7502D9r3j93J91p9o5j59M12m9P2N3n3l53K96J70k77K26j50pJ84j11Ro9n6N1M9
7527D8K44k25j36J67q4j88J91R6m8k11K45n0R3k2Q9j05N0j69p6J32J84p9m47N82
7551B81l38J39O0K6K1J14l61L1j00K32l01L67k94q7N23l76K22l83Q8j96R5K53
7573A6L2j25J53l2l4L12q3k70r0J95K99n59J27j01O6L78M8k79j83K90J26l60j1
7596h5p9K69r5qn8J22Q6J4l00L04j42m4O0m07N08j81j37J18K15k61J10l48K50
7619h9L80j68p2j3LM9l7j1%l3m9M0J44j89m2m37M70O5o0O0J02m35J98J52L6l4
7645C0J71j12o4K23l70K17Kl30O0Q4J82k09j12J89P5m4j01L23o32J24K06J27n
7668C4l97K14l4J82n3L2L79k14j63j23K67k44m7L53m49J82M1L10k66R5k48j09
$$ plain form
7502 49 -44 -237 -46 -125 -190 -349 63 14 86 139 86 -267 29 199 -78 148 -2 -9 175 64 73 4 -52 -1 48
7527 48 292 67 -69 98 14 -174 17 113 65 -146 99 49 142 120 209 104 154 -15 -91 41 225 146 -301 281
7551 281 -57 82 142 168 189 303 -58 -27 -127 105 -196 171 -123 -210 313 -63 159 -224 -136 -332 -237 16
7573 16 48 -77 76 44 10 322 239 -31 -121 74 373 -186 -59 -160 -94 284 332 53 -130 160 286 -74 -85
7596 -85 -164 105 10 2 -56 66 152 166 -134 170 28 -16 44 -363 145 -36 -173 -55 160 -101 9 -339 -89
7619 -89 291 123 51 38 41 90 53 42 42 9 -40 0 144 -45 -87 -524 -54 11 -49 11 113 -322 -124 28 64 30
7645 30 201 89 25 248 -122 95 97 -233 -173 -89 93 -116 -228 -39 36 -8 -109 214 -418 -294 -88 39 34
7668 34 -363 -149 -183 -1 -54 -22 357 143 -20 -143 124 -120 -167 186 -263 -81 -40 270 4 99 -149 -258
7690b58K80J02k10q2K77RJ10p7k03l2L51k78j25M41j88J32l93J9L69k97J26K38
7712C11l12j94R6J72l18K21J06P1l4m58N05j0r3K04k47j85P0J3K35j51m9K51k61
7735e7J97j56J81k22L6L54k73J00m2O3k26J9J60j10M03l98j83k1Q6K71l3j74k05
7758b30J42L85k48m34Q32l25j23j27j21K26j3M4o8J97J7j29j2J65k60J45n6j22
7780a15K03j41n2O0K02m2j10O6Pl25L94R3k19l27J97j24M68n0j20M7l07K18p0
7803d7l1L49m89J82r0L42o2q0l4J59j46K2k29K24m59K19K83j39J52j06M2k6j7
7826A9j29l1r2N02m77L61j2k95n2J33K60j55J47l15J16J57k27P8Lq0K0L07l50
7849a12K63k63K42K27l79RK26k04N7k2k58J71K24j11k65J40K46k73j76J37o0M43
$$ plain form
7690 -258 22 124 -86 -168 109 118 228 151 -52 -84 267 -11 -136 305 117 249 -144 -125 244 -53 73 311
7712 311 -1 -195 -99 73 -245 -24 82 153 119 -339 166 156 63 267 20 -165 -95 -82 153 2 -47 204 -57
7735 -57 140 -16 165 -57 -21 333 60 160 118 181 -45 -26 134 24 427 29 -154 -175 -89 182 149 -25 -230
7758 -230 -88 297 49 -385 447 122 -1 -128 -249 -23 -36 8 -60 137 154 25 13 178 -82 63 7 -115
7780 -115 88 -53 -105 -45 157 115 5 71 78 -247 147 240 21 -306 -109 -233 235 185 65 112 -195 23 -47
7803 -47 -78 271 -218 -36 -126 216 154 74 40 199 53 75 -154 70 -389 -170 113 -26 126 20 62 36 19
7826 19 -110 -141 -233 269 -208 153 141 -154 -206 -73 187 32 179 -136 -20 137 -90 -12 -9 -89 -69 238 -112
7849 -112 151 -112 130 357 -22 -13 213 9 66 44 -214 -43 181 70 -195 -55 191 -82 -258 -121 -181 262
7871B62k94J91j99L14m70Q1R5K70j24n9M0l42L85n6j98J33Q4J51q0p5K9j16k67
7894b45J98O8L0J80j89j98M33l76NRR9r1M11m53j6L10l38K85Jj8n2K02k54k5p
7919c1m7l9J6K68k64J64o4j40O8K8J78k14M1o4J16J21j37j76K34J00o6k16Q2K14
7943A72j51J09l14J2Q2P7RL64o00K27J8J97j94Q5K45n24M02l63K35M6K04n02J39
7966b5J68k72J29M71m83J19m10L96J90j94J6o9q7j61L74l11L64n27J06K59L6k36
7988a47rK71%m2J16j92j44J78J21j80p3J19J3p0j29k9K94K33k05j83N8n5n0j80
8012b85K41j07j19L26n9j69r2J54J29J86j22J63m37mO9Kj17K12j73K94m22N3L32
8035E5p5J87j47Q2l34K63L4L4O8l2n9r5M2j69J68K7k87N22l29K03o0m08L89o8
$$ plain form
7871 262 -32 159 -40 274 -196 -115 -20 250 126 67 107 -235 150 94 -104 29 113 264 184 109 138 22 -245
7894 -245 -47 21 51 231 42 -156 277 -99 -94 -85 14 -77 334 -119 -135 175 -163 122 123 105 53 255 1 -24 -31
7919 -31 -78 -117 -101 167 -97 67 3 -137 -69 -41 137 -77 -36 -100 16 137 0 -176 58 158 92 -124 -42 172
7943 172 21 130 -184 -172 -90 -13 -4 360 -240 -13 5 202 8 93 338 -186 216 -147 88 134 338 -164 -25
7966 -25 143 -129 0 471 -12 107 -303 93 283 89 105 36 -51 -212 162 -149 215 -312 -206 53 89 -147
7988 -147 -156 115 115 73 189 -3 -147 31 152 -28 -101 18 31 -39 -168 -197 97 330 125 -58 0 -55 -105 -285
8012 -285 -44 -151 -270 56 -3 -172 -264 -110 19 205 83 246 -191 -195 -126 -124 -241 -29 -202 92 -330 -277 55
8035 55 -20 167 20 102 -232 31 65 99 167 135 76 -19 23 -146 22 49 -238 284 -45 158 98 -310 79 11
8059A1J12J16m31K33P1k58P9J51M6j60K55l4k27J88j59n8j32j55M91j75M22k61
8081A25M9l1n8K01m89j29L02P5j8j6m1J28j19QLR1o0L04l24j00J17J78m78R3K43
8106E4n9K11k67k30L3Q6N60p17L52k21L23l65P1J09K21j33j14J38l06J50L47M0
8128B83k29j40M8P7Q5q6j71J25J01r7l40M00J50k27Mq6K97m43o8K14k51N22l89
8151b21M95l53K64k06j67J0L78k36J73j21l60N18l33J66j20N0q7J63p1L22j36
8172A28l25J05M1r4k06N46L9q8j66P7j65L5nK15k92N2L59l98L06
$$ plain form
8059 11 123 239 -192 41 112 -146 -67 84 130 -30 225 191 -36 152 -7 -65 -197 -352 139 -36 386 125
8081 125 174 143 85 286 -203 -332 -30 45 27 11 -30 98 -21 -13 -10 81 21 325 1 -99 18 196 -282 -189 54
8106 54 -5 206 -61 -291 -258 -172 388 -329 23 -198 125 -240 -169 -60 161 28 -86 52 -254 -104 243 283
8128 283 54 -86 -38 39 124 38 -133 -8 93 -4 -344 56 206 -21 -17 -103 194 -249 -317 -103 -354 168 -221
8151 -221 274 -79 185 -21 -188 -178 200 -36 137 16 -344 174 -159 7 -113 -63 -150 13 -58 264 128
8172 128 -197 -92 -51 -145 -351 195 234 146 -20 57 -108 -73 -78 137 -155 -103 256 -142 164
8191A64
$$ Imaginary data points
##PAGE= N=2
##DATA TABLE= (X++(I..I)), XYDATA
0@%%%%%%%%%%%Qj6J6j6J6j6K4l2L2m0M8n2O0p0P8q8J02j15J30j46J63j81K04k28
35a19K52k81L12l45L84m26M69n19N76o38P08p87Q78r83J105j249J421j638J915
54A035k279K784l532M749p046J2795n0348q4917J56358L5308j20231O003R4718
67D5397k7537n7279J8763L1232j4296k9170L789M3741j0628n6222K9106N9599
79C6495n1152l6467O5679N461o0413K1890L2443l4967M216L2857k4389m770K8330
92A5213k4099j5040L8577j2003l2553L6274J2266m5923R746L4745k1971j2461
104a7229K1586j277n287p50j4187J6322K1784l6426n652N6035k2227n8187M6379
117H84L5901o3055k643O1525k4727m2158L6505J5185l1131K610J5586j240J446
$$ plain form
0 0 0 0 0 0 0 0 0 0 0 0 0 8 -8 8 -8 8 -8 16 -16 16 -24 24 -28 32 -38 40 -48 54 -61 69 -77 86 -95 109 -119
35 -119 133 -148 164 -181 203 -223 246 -273 303 -335 373 -414 464 -519 586 -663 758 -880 1035
54 1035 -1244 1540 -1992 2757 -4289 8506 -41842 -126759 29599 64907 -55324 -49321 45397
67 45397 17860 -39419 -20656 10576 -3720 -32890 -29101 14640 4012 -52210 -23104 36495
79 36495 -14657 -51124 14555 20016 -40397 -18507 13936 -21031 -16815 16042 -8347 -13117 15213
92 15213 -8886 -23926 14651 2648 -29905 6369 18635 -27288 -17542 17203 -4768 -17229
104 -17229 4357 3080 -2207 -2957 -17144 -822 20962 -15464 -21116 34919 12692 -45495 884
117 884 36785 -26270 -28913 32612 7885 -34273 2232 17417 -13714 -11104 4482 3242 4688
130D688j4303o363L1901m055l6783K7235L0024m4665q089M4234k0806k9148L9967
143A3837O636l5973J5569J5818k4805P770J4916k2588Q512K5693k8633j2152L5583
156B0183q540k5495K5640O806k5630R731R361j8091R342Q884j8489J2881J3810
169B0393l4216J620L8604k6565k7238M4801O216m5763J5820K9204k9967p151K6611
182A2369q738j1459J0508p376j474J3204j5991l988K9549j5013k9226L1231J0469
195A4065m0164J3324L4279k7904j3707L0160r731j8404K0697j172j5820J9051
207D674q02k1981J7357R774k6819J1964K3364k7605p777K9417j2081j8672K2604
220C417K156j4926J5133k531j9396J9815O782k8713J4504K4527l0570o011L3418
$$ plain form
130 4688 -9615 -15978 15923 11868 -24915 2320 32344 -12321 -20410 23824 3018 -26130 13837
143 13837 20473 -15500 69 15887 -8918 -1148 13768 -8820 -308 25385 -3248 -15400 20183
156 20183 11643 -13852 11788 18594 -7036 2695 12056 -6035 3307 12191 -6298 6583 20393
169 20393 -13823 -12203 26401 -164 -27402 17399 23615 -22148 -6328 22876 -7091 -14242 12369
182 12369 3631 -7828 2680 -4696 -6170 7034 -8957 -12945 16604 1591 -27635 3596 14065
195 14065 -26099 -12775 21504 -6400 -20107 10053 322 -18082 2615 1443 -14377 4674
207 4674 3872 -18109 -752 9022 -17797 -5833 17531 -10074 -17851 11566 -515 -19187 3417
220 3417 5573 -9353 5780 3249 -16147 3668 10450 -18263 -3759 20768 -9802 -15813 17605
233A7605j6301k4038L1040O570k9802R781J4437j6195L101Q475j2163J0384J1022
246A3916k4636K497K4460k0646j2656L3642m945l0069K3496J3778l1223M355K3995
259A5964j6538m872J6570j2530m415J7985j2093r194K5235n975k3769K0890Q400
272A5658k7868R576K2243k0141m048K0536j3218j0211J7502p177j0060K1021o195
285G618k0324K1830O481k9768J1819K4523k4773q328K5834j1140j6117J9384J16
298G155j3269J2727l08j5470J3139K287k0820J5383J5626k7241L00K8271j8998
311a218j8100K6969N36k1842J4484P258j9158P485J0110j5382O164J2630j8670
324h734R40J9024j9344j0289K8385l748k3341J7661R096k2909O299J3724j5840
$$ plain form
233 17605 1304 -22734 8306 14876 -14926 -5145 9292 -6903 -3802 4673 -7490 2894 13916
246 13916 -10720 -8223 16237 -4409 -17065 16577 11632 -18437 5059 18837 -12386 -8031 15964
259 15964 -574 -5446 11124 -1406 -5821 12164 71 -9123 16112 10137 -13632 7258 15658
272 15658 -12210 -2634 19609 -532 -4580 15956 2738 -7473 10029 2852 -7208 13813 7618
285 7618 -12706 9124 15605 -14163 -2344 22179 -2594 -10922 14912 3772 -12345 7039 7155
298 7155 -6114 6613 6305 -9165 3974 6261 -14559 824 16450 -10791 -10491 17780 -1218
311 -1218 -19318 7651 8187 -13655 829 8087 -11071 -3586 6524 -8858 -2694 9936 -8734
324 -8734 -7794 11230 -8114 -18403 9982 6234 -17107 554 9650 -13259 -6960 6764 -9076
337i076K521J4720j4734l208J7604j3159q245K3557p463k0479K0720O847k6405
350a6800Q306K0035j7878k703J6971j0895o615J4242q626p326J8896n274j5762
363a3429J8860L164k4042J2845J7620k3040j796K2935j2870j2719J8340k069j1122
376g323J3948j141j4206J3864K113k0067J3468J4473k1484J097K1757j6062j1903
389a1466K2133l354j7091J5270M945j6462Q266O105j4399R108J0158j9673K794
402c666J9421j7022j0368K3280m085j7545J7723M803k0473P355J1337j5162K603
415a799J1690j2501R14J3611j4717o161K1594p773j7270J8829M533k2222R513
428a759J3594j6905P29J5627j2290m926J3386r460o128J6809o607j3145J8571
$$ plain form
337 -9076 -6555 8165 -6569 -9777 7827 -5332 -13577 9980 2517 -17962 2758 9605 -16800
350 -16800 -8494 11541 -6337 -9040 7931 -2964 -9579 4663 -3963 -11289 7607 2333 -13429
363 -13429 5431 8595 -15447 -2602 15018 -8022 -9818 13117 247 -12472 5868 3799 -7323
376 -7323 6625 5484 -8722 5142 7255 -12812 656 15129 -6355 -5258 16499 437 -11466
389 -11466 10667 7313 -9778 5492 10437 -6025 2241 8346 -6053 3055 13213 -6460 -3666
402 -3666 15755 -1267 -11635 11645 7560 -9985 7738 12541 -7932 -577 10760 -4402 -1799
415 -1799 9891 -2610 -1696 11915 -2802 -8963 12631 4858 -12412 6417 10950 -11272 -1759
428 -1759 11835 -5070 -4341 11286 -1004 -5930 7456 -2004 -8132 8677 2070 -11075 7496
441G496Q63k2251J1915J4234k0161K09J8331j2263q668J6135n565r358J3879k401
455B395j1920J3081J31j7550J2615J0566k0081L677J9141j5759r783J9553m917
468A149j3786J4451K121j3774R790L964j4226Q789R048j6511L835J5444j6369
481f075o319K0627o020j4814J6779L574j6905P876P105j3619N586J0291j3744
494e658K010J4244j3566n209J8306p934j2804J7693J936j9198J0125J1001j5231
507d285J797J2404j0293j571J0936j0879m031J5930o951j0414J6541J61j8138
520h793J1476R853j8566K573J6459j2340o148J4445o216p330J2377l537r336J2656
534G573p41j5995J1735Q540j7149M404J5152j4498n472J5943p125j0383J4461
$$ plain form
441 7496 8359 -13892 -1977 12257 -7904 -7695 10636 -1627 -10295 5840 275 -9083 4796 2395
455 2395 -9525 3556 3687 -13863 -1248 9318 -10763 -7086 12055 -3704 -13487 6066 1149
468 1149 -12637 1814 3935 -9839 -49 3915 -10311 -1522 7526 -8985 -5150 10294 -6075
481 -6075 -12394 8233 2213 -12601 4178 7752 -9153 -1277 5828 -7791 -2205 8086 -5658
494 -5658 -3648 10596 -2970 -8179 10127 2193 -10611 7082 9018 -10180 -55 10946 -4285
507 -4285 -2488 9916 -377 -1948 8988 -1891 -5922 10008 3057 -7357 9184 9345 -8793
520 -8793 2683 12536 -6030 -3457 13002 662 -5486 8959 2743 -4587 7790 4253 -5083 7573
534 7573 6832 -9163 2572 11112 -6037 -1633 13519 -979 -6451 9492 2367 -8016 6445
547F445n61j1780J0330J666j3195R426O772j6307M548J4184j4683n612J7789o509
561B513j1570J4708O12j3703Q689M451j3076N980P461j2045L640J1249j3679k966
575g736J6506r386j1756J7484K30j6535R627P853j4028L270J0153j0961k79J0564
589E006r984l474J3199p475p490J5341j824j5649J1554O770j6060M151J2789j1565
603d711k938J2910p740o144J2766m750q640J2704q45j3391J0868O363j5544N226
617c866J3059j2588m072J4188p061p916J2338k390q360J1231j15j2213R968N152
631G355j4925N715J2196j4169k703J6163p877j0263J4624k44j1378Q335L120j1099
645e150O272N801j1507M908R816j3131q42J4299r695q704J5309j350j3355J0952
$$ plain form
547 6445 5884 -5896 4434 6100 -7095 2331 9103 -7204 -2656 11528 -3155 -8767 9022 2513
561 2513 -9057 5651 6263 -7440 1249 5700 -7376 -1396 6065 -5980 -2340 8909 -4770 -7736
575 -7736 8770 -616 -12372 5112 5342 -11193 -1566 6287 -7741 -4471 5682 -5279 -5558 5006
589 5006 -4978 -8452 4747 -2728 -10218 5123 3299 -12350 -796 5974 -10086 -5935 6854 -4711
603 -4711 -7649 5261 -2479 -8623 4143 -607 -9247 3457 2612 -10779 89 6452 -9092 -3866
617 -3866 9193 -3395 -7467 6721 -340 -8256 4082 1692 -6668 4563 4448 -7765 2203 7355
631 7355 -7570 -1855 10341 -3828 -6531 9632 1755 -8508 6116 5872 -5506 2829 5949 -5150
645 -5150 1122 6923 -4584 324 10140 -2991 -3833 10466 771 -7933 7376 6026 -7329 3623
659C623N650j4468M740R016j0623P07R038r400k428J2503p474p338J4067j847
673E766j2809J0590L562j3747N328R620j1468n5J1015q548l706J1141o422p268
687g001J3412k899j2666J1445N145j5388N459J1270j2239k340J1932p407o186
700g463J0884l351o983J0388j502r873R695K339j3909P292J0139j4644m97J4669
714G184q905p871J3775k383j0529R336K107j0996O908M413j0336M797P946j1335
728e889N91J1491r604n967J4044l468j0972J1772K459j2253O487O245j1066L556
742b574Q875j0675j329J2031p617o231J3200k323j1194J0246L508j2585N039P979
756F350r981J493Q749q495q44R787p908m557J2353m312j0304J2262K309j3767
$$ plain form
659 3623 9273 -5195 -455 8561 -2062 -1355 7683 -1717 -4145 8358 884 -6454 7613 5766
673 5766 -7043 3547 7109 -6638 -1310 8310 -3158 -3213 7802 -746 -4452 6689 267 -7001
687 -7001 6411 3512 -9154 2291 7436 -7952 -2493 8777 -3462 -5802 6130 -1277 -7463
700 -7463 3421 70 -6913 3475 1973 -7900 1795 4134 -9775 -2483 7656 -6988 -7485 7184
714 7184 -1721 -9592 4183 1800 -8729 607 2714 -8282 -1374 3039 -7297 -2500 5446 -5889
728 -5889 -5298 6193 -3411 -9378 4666 1198 -9774 1998 4457 -7796 -1309 4936 -6130 -2574
742 -2574 6301 -4374 -5703 6328 -1289 -7520 5680 3357 -7837 2409 5917 -6668 -1629 6350
756 6350 -3631 -2138 6611 -1884 -2728 7059 -849 -5406 6947 2635 -7669 4593 6902 -6865
770f865P430R264j2985j93J1955q052n084J0325l589o201R658j601q698R395R60
785E719j1495P234O891j2686K342J1615j0227m325J2247m388q756J0779j80j0554
799e784Q305L560j1628N843P613j0994J52J0760q508n414J1786l900q345J0272
813C718N01r460O515L321r997M705O525j1083J639J0746j0075m109J3386m594
827A738j0745J1588K010j2403N850O508r947J991Q102p946o86P869p097k926J0042
842C948n037p201J1143k2j1929Q558N943j2217K766R653r752k562J0988n919n256
857f896J0268k229q183Q930R14j0637P090N595j0634K408Q910q385k118J0215
871E248n804n446R883k764p749R556O24j0582P937O007j2006K485J0421r618l753
$$ plain form
770 -6865 565 9829 -3156 -3349 8606 554 -4530 5795 2206 -3995 5663 4062 -4636 4759 5719
785 5719 -5776 1458 8349 -4337 -1995 9620 -607 -4932 7315 2927 -5829 4950 4770 -5784
799 -5784 2521 6081 -5547 296 7909 -3085 -2933 7827 -681 -6095 5691 1791 -6554 3718
813 3718 4219 -5241 1274 4595 -5402 -697 5828 -5255 -3616 7130 -2945 -7054 6332 1738
827 1738 -9007 2581 4591 -7812 -1962 4546 -5401 -3410 4692 -3254 -3940 3929 -3168 -6094 3948
842 3948 -1089 -8290 2853 2831 -9098 -540 5403 -6814 -4048 5605 -4147 -6709 4279 -1640 -6896
857 -6896 3372 1143 -7040 1890 2804 -7833 -743 4852 -5782 -3374 5536 -2849 -4967 5248
871 5248 -556 -6002 3881 1117 -6632 2924 3548 -7034 903 6910 -5096 -2611 7810 -1808 -5561
886e561J1871m579p728R766O59q447O028K730q344M780M743r495L003Q485r751
901a840j111J1190o685p133J1551j180j0743P535N238j0735L772P622q897P9Q364
916G027p197k907R109m284o916J0218n63r180P176L692j0306M006O861r535j3
931b812Q974p165l171J0377m688p440J0494m01j0946P373N162j0915K758Q851
945F451q847j916R524n622m778Q655l280o038Q550q97q441P899L243j0876M209
960b164Q252j0799j242J1310o526o008J0829j953q379P675J898r126N111M383
974C261q899L024O826q620k07R732o580n067R896k319q349Q624J720r640N793
989h05N437r296K222P807q565j687J0079o075n965J0260q39q543P582K976r307
$$ plain form
886 -5561 6310 1731 -5997 3769 4428 -4019 2009 4739 -3605 1175 5918 -3577 -574 7911 -1840
901 -1840 -2951 8239 1554 -5579 5972 4792 -5951 1584 6822 -3913 -141 7481 -1416 -1337 7027
916 7027 -170 -3077 6032 1748 -5168 5050 4487 -4693 2483 6175 -4131 -125 6736 -2799 -2812
931 -2812 6162 -1003 -4174 6203 1515 -5925 4569 4168 -6778 595 5757 -5158 -2400 6451
945 6451 -2396 -4312 5212 -410 -5188 3467 187 -5851 2699 1802 -6639 1260 4503 -6373 -2164
960 -2164 6088 -4711 -5953 5357 -1169 -7177 3652 1699 -6680 995 2893 -6233 -1122 3261
974 3261 -5638 -2614 4212 -4408 -4615 5117 -1463 -6530 3366 1047 -7302 1322 3042 -6598 -805
989 -805 4632 -4664 -2442 5365 -3200 -4887 5192 -883 -6848 3412 2573 -5970 1612 4588 -4719
1004d719L721O092q444J163P259o958j384R127n267n400R989k093r203R035K753
1019E671j0867N147P205r152n01Q964o247l855R005l564o097Q700r40p576P735
1034C628J959r820N306N938r692M14R286p297l533J0075l821o191P885j2q471
1049d346O345L011r224L844O948q857K6Q901o835m168R024k555p467Q038N14q005
1065d806O140L210q641L472N819q568J78Q561o686m346R804k829p656Q332J606
1080C590r384N088M511q383J713O780p239k95P823n620l991R042l222p492Q459
1095A380J379r385N534N429r407J846Q112p877j847Q781n595m466R117k269o948
1110f216P754J371q905N346N036r209J187Q373p389k189R211m677n005Q602j679
$$ plain form
1004 -4719 -998 5094 -3350 -2187 5072 -1886 -3270 5857 590 -4810 5179 3086 -6117 2918 5671
1019 5671 -5196 -49 7156 -1996 -2497 6467 220 -3635 5370 1806 -4291 4409 3469 -4107 3628
1034 3628 5587 -4233 1073 7011 -2681 -2267 7019 -278 -3811 6264 2443 -3748 4137 4125 -4346
1049 -4346 1999 5010 -4214 -370 6578 -2279 -2253 6648 -187 -4355 4669 2114 -5353 2685 3199 -4806
1065 -4806 1334 4544 -4097 -625 5194 -3374 -3196 5365 -1321 -5667 4137 1308 -6348 1984 3590
1080 3590 -5794 -706 3805 -4578 -2865 3915 -3324 -3619 4204 -1416 -5407 3635 413 -7079 1380
1095 1380 2759 -6626 -1092 4337 -5070 -3224 4888 -2989 -4836 3945 -1650 -6116 3001 732 -6216
1110 -6216 1538 2909 -5996 -650 4386 -4823 -3636 4737 -2652 -4841 4370 -307 -5312 3290 1611
1125A611p244P239J560q430M882N619r272J644Q033o852l037R049l669o299Q095
1140B929q2p589O848K426p971L964N139q527J187P719p093k654R435l754o412
1155d435Q721j81q414O152L401q540L031O047p796P56P480o508k477Q577m045
1170A769o091Q091Oq302O269L618q261K311O519p825k40P805o161l319Q548l475
1186A262n936Q398n7q615O048L892r347K873O340p475j070Q473n172l933Q121
1201C802k803o504P497N66q454N831M103r060K543P698q224j307Q507m948n173
1216e926Q318j659o486P074J050p509M734L690q120K141O690p480j226Q821m842
1231g30n033Q618j568p249O591K007q186M140M955p770J384P090o739j189P661
$$ plain form
1125 1611 -5633 1606 3166 -5264 -382 5237 -4035 -2391 5642 -1210 -4247 4802 1133 -5166 2929
1140 2929 2847 -4742 2106 4532 -3439 525 5664 -2863 -1676 6043 -1050 -3704 5731 1977 -4435
1155 -4435 4286 4105 -4309 1843 5244 -3296 -265 5782 -2014 -1258 6222 -286 -2763 5814 1769
1170 1769 -4322 3769 3775 -4527 1742 5360 -2901 -590 5929 -1896 -2136 5669 -492 -3811 4737 1262
1186 1262 -4674 3724 3667 -4948 1100 4992 -4355 -1482 4858 -2617 -3687 4786 -386 -4319 3802
1201 3802 999 -5505 1992 2558 -5896 -65 4038 -5022 -2479 5219 -3005 -4312 4195 -753 -5926
1216 -5926 2392 733 -5753 1321 2371 -5138 -404 3286 -4834 -2693 3997 -3483 -4709 4112 -730
1231 -730 -5763 2855 1287 -5962 629 2636 -5550 -1410 3545 -4225 -2841 4249 -2490 -3679 3982
1246C982m762m582P798j092o937O837K445q147L834N478q294J300O864o426j662
1261c364P762l805m962Q405j155p470O251K899q666L526N625p179K5P434n486
1276a60k629P485l413n460P881q34o709O070K852q560L420O479q285j09P491n512
1292Gl488P748k077o001P232M85p252N254K578p867K786N818p241j38P791n900
1308b65l206Q023k937n852O560P51p576N350L475p871K411N882o511j388P890
1323D736n531l786P800j978o110O456J724p880M517L794p549J776N781o823n60
1338c633P409m816l996Q005j922o914P025J804q752M243N018p330P33O620n703
1353b209j712O937l762m205P091j247o521O612J713p707M351M594p808R90O715
$$ plain form
1246 3982 -780 -5362 2436 1344 -5593 1244 3689 -4458 -624 4854 -3440 -2140 4724 -1702 -3364
1261 -3364 4398 593 -4369 4036 2881 -4589 1662 4561 -4105 -579 5046 -2133 -2108 5326 -160
1276 -160 -2789 4696 1283 -4177 3704 2870 -3839 2231 5083 -3477 -57 6422 -1863 -1972 5519 7
1292 7 -3481 4267 2190 -3811 3421 3906 -3346 1908 4486 -3381 -595 5223 -2018 -2156 5635 -265
1308 -265 -3471 4552 1615 -4237 2323 3074 -4502 848 4323 -3548 -1137 4745 -1766 -3154 4736
1323 4736 -795 -4581 3219 1241 -4869 1587 3311 -4569 -52 3742 -3807 -2031 3750 -3073 -3633
1338 -3633 3776 -1040 -5036 2969 1047 -5867 1158 2962 -5790 -1547 3471 -3859 -3126 3494 -2209
1353 -2209 -3921 3016 -746 -4951 2140 893 -5628 984 2697 -5010 -659 3935 -3873 -2883 3832
1368C832n756k557P790l449m736P311l30o717N350K830p878L450M710o950N15
1383b585P318n221l048P556l096n190P011l93o473N486K638p550L500N285p225
1398a987K40P436n656l969Q308k720n291O519P65o785M732L077p148J998N217
1413D736o268k60O703m852k410O776k384n576O787M84p300M472M127p633J911
1428f87O136o521j085O963m462m027P150j586n764N946J164o730M251L747p478
1443b983J407O258o398j261P019m247l610P097j751o224O463J284p564L626M562
1458C678p462J260O647n881j800P181l759m558O594p61n877N131J755o274L302
1473h24M095o814N89O654n708k603P568l293m728O959k94o560N184K723p140K544
$$ plain form
1368 3832 -1924 -4481 3309 -140 -4876 2435 2105 -4612 738 3568 -4310 -860 3850 -3100 -2585
1383 -2585 4733 -488 -3536 4020 924 -4266 2745 2352 -4121 1365 4003 -3547 -47 5238 -1987
1398 -1987 -1747 5689 33 -3936 4372 1652 -3639 2880 3645 -3140 1592 4669 -2479 -481 4736
1413 4736 -1532 -1792 4911 59 -2351 4425 2041 -3535 3252 3736 -3564 908 5035 -2598 -687
1428 -687 5449 -1072 -2157 4806 344 -3683 3467 1881 -3883 2063 3227 -3503 748 4495 -2983
1443 -2983 -1576 4682 -1716 -2977 4042 -205 -3815 3282 1531 -4693 1770 3054 -4510 -884 3678
1458 3678 -3784 -2524 4123 -1758 -3558 3623 -136 -4694 1900 1139 -4738 393 2148 -4126 -824
1473 -824 3271 -3543 -2954 3700 -2008 -4611 2957 -336 -5064 1895 1601 -4959 225 2948 -4192 -1648
1489a648M725o356L78O203m542k551O838k662m945O387o5o362M687K868o961L108
1505h98M843o559J38O541m859k925P315k826n213P046L14o591M684K995o952K114
1521h33N249n967p78O550l887l201O550j954n015O011N61o652M395L299p248K283
1537f37N800o117j113O685l781m148O702j210n629N728J459o800M285K996o178
1552a958J370N278n849j410P054l757m216O817j116n475N452J173o693L100L979
1567C749o193J178N605n640j207O466l335m315O001l22o244N148J986o201K544
1582g80M023n998J117N253n586j671O824l234m583O679n95o186N168K471p031
1597d129K879M547o268j04O223m777j853N874k605m276O054j26o051M783K519
$$ plain form
1489 -1648 3077 -3279 -2901 3302 -1240 -3791 3047 385 -4560 1827 1762 -4600 87 2955 -4006 -898
1505 -898 3945 -2614 -2476 4065 -794 -3719 3596 770 -4443 2603 2917 -3674 1010 4005 -2947 -833
1521 -833 4416 -1551 -2329 4221 334 -2867 3683 1729 -3286 2725 3286 -3366 1029 4328 -2920 -637
1537 -637 5163 -954 -2067 4618 837 -3311 3391 2181 -3448 2280 3739 -3061 1224 4220 -1958
1552 -1958 -588 4690 -1159 -2569 4485 728 -3488 3329 2213 -3262 2190 3363 -3330 -230 3749
1567 3749 -2444 -1266 4339 -1301 -2508 3958 623 -3692 2309 1987 -4257 891 2877 -3324 -780
1582 -780 3243 -2755 -1638 3615 -1971 -3642 3182 -52 -4635 2044 1449 -4737 431 2902 -4129
1597 -4129 -1250 3297 -2971 -3075 3148 -1629 -3482 2392 -213 -4489 1565 1439 -4612 171 2690
1612B690o801K644M653n778q6O118m423k981O605k361m919N853O35n801M052K811
1628B911o232J988M659n458m94N941l854k946O668j919m995N888M14o143M070
1643D98K851o283J949N272n733n15O433m117l822O337r94n242N156J349n846L243
1659E36L566n972J375M811n044j185N787l546l387O530j121n447N421J426o555
1674b805L250L555o090R36N574m883j439N880l128l581N592o33n636N131J488
1689C211o237L149M166o079L61N316m396k068N891l154l762N823l20n796M704
1704H09K213o153K347M241n987K84N515m366k466O031k052m031N301l40n067L923
1720B02K218n658J919M453n577m90O150m335k612N966k043m773N199J156n711
$$ plain form
1612 2690 -4111 -1467 3186 -2592 -2678 3440 -983 -3964 2641 280 -4639 1214 1849 -3952 100 2911
1628 2911 -3321 -1333 3326 -2132 -2626 3315 -539 -3485 3183 1264 -3731 2157 2571 -3572 498
1643 498 3349 -2934 -985 4287 -1446 -1961 4472 355 -3467 2870 1876 -3366 1790 3139 -2707 536
1659 536 4102 -1870 -495 4316 -728 -1913 3874 328 -3059 3471 2350 -3097 2324 3750 -2805
1674 -2805 445 4000 -2090 -1154 4420 -463 -1902 3978 850 -2731 2861 2228 -3408 1723 3211
1689 3211 -3026 123 4289 -1790 -1429 3887 -509 -2577 3314 160 -3602 2221 1901 -3895 809
1704 809 3022 -3131 -784 3457 -2530 -2246 3269 -1097 -3563 2468 416 -3615 1686 1346 -3721 202
1720 202 2420 -3238 -1319 3134 -2443 -2933 3217 -1118 -3730 2236 193 -4580 619 1775 -3936
1735c936L562K639n630J614M403n073m67N386l819k615O038j608m505N496O13
1750B098n794L614K980o360J582N203m702j234N803l256l107N667j753m415M421
1765G47J642n451L072L116n336J080M790m537j563N873l451k929N711j198m608
1780c042M623J264n784L315L315n442N81N013m040j940N814k713l148M705l46
1795B175m928M169J945n914K828L381n041P82M439l777k476N596k193l800M865
1810B051J19m995L953J735n018J910L598m672O6M400l304k383N500j860m177M785
1826A708M65n177L555K251n509J601M290m864n75N230l366k321M929j506m289
1841c578M870J61m820L148K787n242J068M136m331o15N024l621k305M953j257
$$ plain form
1735 -3936 -374 2265 -3365 -1751 2652 -2421 -2888 2498 -1321 -3936 2102 494 -4011 1485 2098
1750 2098 -3696 -82 2898 -3462 -1880 3323 -1379 -2613 3190 -66 -3173 2494 741 -3674 747
1765 747 2389 -3062 10 3126 -2210 -1130 3660 -877 -2440 3433 -18 -2947 2764 1566 -3042
1780 -3042 1581 2845 -2939 376 3691 -1751 -1170 3843 -197 -2137 3677 964 -2184 2521 2175
1795 2175 -2753 1416 3361 -2553 275 3656 -1385 -603 3836 59 -2417 3179 986 -2814 2051
1810 2051 2170 -2825 1128 2863 -2155 -245 3353 -1319 -1253 3147 -157 -2540 2960 1100 -3077 1708
1826 1708 2173 -3004 551 2802 -2707 -1106 3184 -1680 -2255 2975 -391 -2712 2217 711 -3578
1841 -3578 1292 1453 -3367 -219 2568 -2674 -1606 2530 -1801 -2416 2608 -1013 -3318 1635 378
1856C78m159M908N96n203L234K577n396J260M383m335j209N177k646l010N166
1871A721j040m215M040O15m652K784L420n106O40M620m058j199M797k569k914
1886c116M989o93m297L767J364m405K410K875n103Q36M398l841j267M876k313
1901D80l248M911j11m543L222J969m919K131L344m831O95M146l545j442N098k334
1917A023l641M753r8m312L385K128m921K174K840m563K51M321l435j859M881j655
1933A272l412M539l38m367L123K036n206K043L537m220k52M375k932k225M556
1948B529j481l696M054P16m775L193K254m704J277L485m283m71M480k953k487
1963b862N194j775l609M498j5m333K706K279m559R05L850l881o90M481k321k765
$$ plain form
1856 378 -3781 1127 1723 -3480 -246 2331 -3065 -1805 2578 -1757 -2966 2211 -435 -3445 1721
1871 1721 681 -3534 506 1121 -3531 -747 2673 -2433 -1793 2827 -1231 -2430 2367 -202 -3116
1886 -3116 1873 1180 -3117 650 2014 -2391 19 2894 -2209 -1373 3025 -816 -2083 2793 480
1901 480 -2768 2143 2032 -2511 711 2680 -2239 -108 3236 -1595 -900 3246 -299 -1741 3357 1023
1917 1023 -2618 2135 2037 -2275 1110 3238 -1683 491 3331 -1232 -981 3340 -95 -1954 2927 1272
1933 1272 -2140 2399 2061 -2306 817 2853 -2353 -310 3227 -993 -1245 3130 198 -2027 2529
1948 2529 1048 -2648 1406 2122 -2653 540 2794 -1910 -633 2852 -1431 -1902 2578 -375 -2862
1963 -2862 2332 557 -3052 1446 1431 -2902 -196 2083 -2476 -1571 2279 -1602 -2292 2189 -132 -2897
1979b897M470p96m131L948P17m626K525K634m223Q09L775l791j056M757k719k497
1995c101M477p79l541L311J178m414K643K646m538K10L971l206j158M312j963
2010D8k828M203J38m420L520J433n083K411L099m103M93L685l197j285M427j840
2026G01l108L926Q7m227L338J905m391J743K953m104MM342l201j924M313j271
2042A086l324M048K85l917K597J625l929J179L249l846j64M459k593k816M557
2057B496j168l474L530O99m401K772K316m384J179L237l454o37L992k858j648
2072a803L997j045l431L285J050l968K490K049m380P71L792l704p13L670k155
2087i5k071L928p97l479L269O63m205K421K333m084J176L059k964j167L933k172
$$ plain form
1979 -2897 1573 777 -3354 594 1311 -3315 -790 1844 -2379 -1570 2205 -1586 -2642 2115 -604 -3101
1995 -3101 1376 597 -2944 367 1545 -2869 -226 2420 -2118 -1908 2063 -1143 -2301 2011 48
2010 48 -2780 1423 1561 -2859 661 2094 -2989 -578 2521 -1582 -1089 2596 -601 -1886 2541 701
2026 701 -2407 1519 1606 -2621 717 2622 -1769 -26 2927 -1177 -1173 3169 -32 -1956 2357 1086
2042 1086 -2238 1810 2095 -1822 775 2400 -1529 -350 2899 -947 -1111 3348 755 -2061 2496
2057 2496 1328 -2146 1384 2083 -2318 454 2770 -1614 -435 2802 -652 -1289 2703 -155 -1803
2072 -1803 2194 1149 -2282 1003 2053 -1915 575 2624 -1756 -985 2807 -897 -1610 2060 -95
2087 -95 -2166 1762 965 -2514 755 1418 -2787 -366 1967 -2117 -941 2118 -846 -2013 1920 -252
2103b52k518L921p45l493L313J542m458K185K281l660O14L334l325j302M159j680
2119h4k838L781k24l415L113J008l982J887K523l672N88L705l169j695M332j681
2135A77k588L616l2l850K944J442l658J106L379l447o48L600k231k000L928j029
2151G09k968L588N25m034K537K095l916J090K779l332k19L869k836j586M121j142
2167A280l116L382K89l818K816J532l657R59K926l001n83L576k440j931L973j148
2183A039l003L185Q72l882K291K029l723P02K960l007q97L713j606k554L874m16
2199A577l372K662Q34l644J700K369l802Q07L315l301o28L857k381k198L722p14
2215H03l481L104J086l501J780K265l771K76L221k701j264L571j462k515L444
$$ plain form
2103 -252 -2770 1151 406 -3087 226 1768 -2690 -505 1776 -1884 -1270 2064 -1261 -2563 1596 -84
2119 -84 -2922 859 635 -2780 333 1341 -2641 -754 1769 -1903 -1315 2390 -779 -2474 1858 177
2135 177 -2411 1205 1173 -2677 267 1709 -1949 -843 2536 -911 -1559 2041 -190 -2190 1738 709
2151 709 -2259 1329 1854 -2180 357 2452 -1464 -374 2405 -927 -1146 2723 -113 -1699 2422 1280
2167 1280 -1836 1546 1835 -1983 833 2365 -1292 -333 2593 -408 -991 2585 145 -1786 2187 1039
2183 1039 -1964 1221 2093 -1789 502 2531 -1192 -490 2470 -537 -1434 2279 673 -1881 1993 1577
2199 1577 -1795 867 1701 -1943 -243 2126 -1676 -869 2446 -855 -1483 2374 -7 -2205 1517 803
2215 803 -2678 426 1512 -1989 -209 2056 -1715 -1439 1782 -919 -2183 1388 -74 -2589 855
2230H55o9l116K629J223m022J687K590l345J29L087k441j306L569j388k494L487
2246A075l98l705K834J403l640J334L070l347m47L437k397j358L288q62k721L408
2262I74M81l726K710J415l797J103K916l397j51L659k311j599L339q18l024L619
2278A393k33l147K415J393l353N82L119k608p02L404j981j971L482n91k969K920
2294A153O30l696K348K036l439O05L163l274p00L537j850k011L272o19k637K657
2310A175J023l724J349K429l506J033K768k996r55L887j859k461L601p20k827
2325a783K575Q66l312J802K052l479L61L178k940j121L577j523j921L142l58l166
2341b050K452J160l193J651J768l169K66L086k593j274L424j333k478L336k03
$$ plain form
2230 855 786 -2330 299 1522 -2500 -813 1777 -1568 -1439 1648 -793 -2099 1470 82 -2412 1075
2246 1075 677 -3028 -194 1209 -2431 -1097 1973 -1374 -1821 1616 -781 -2139 1149 287 -2434 974
2262 974 1455 -2271 439 1854 -1943 -840 2076 -1321 -1472 2187 -124 -1723 1616 798 -2226 1393
2278 1393 1160 -1987 428 1821 -1532 -950 2169 -439 -1141 2263 282 -1689 1793 1202 -1767 1153
2294 1153 1783 -1913 435 2471 -968 -363 2800 -474 -1174 2363 513 -1498 1774 1155 -1482 1175
2310 1175 2198 -1526 -177 2252 -1254 -221 2547 -449 -1404 2483 624 -1837 1764 1044 -1783
2325 -1783 792 1658 -1654 148 2200 -1279 -918 2260 -680 -1801 1776 253 -1668 1474 1116 -2050
2341 -2050 402 1562 -1631 20 1788 -1381 -1115 1971 -622 -1896 1528 195 -2283 1053 850
2356H50l107K219J236l526J811K514l134m41L231k434j297L066q44k827L264L57
2372I38l515K492J471l364J337K321l185k19L383k344j541L407m59l231K913R41
2388A345l295K157J240l264J017K823k723r07L433j807j690L208j238k222K631
2403G08P84l375K275J672l235O28K843k837p23L456k090j891L526o94k578K714
2419A183P63l360J756J708l295P08K850k758n28L002j610j888L166m68k883K565
2435I11J172l731J657K437l286P6L145k436j245L380j774j696K803k30k877K432
2451G38J008l038J467J982l227L12K856k380j175L248j310k143K641R3k997K075
2467A50J226l387J258K583l064j28L200k111j677L387j294k375K770M34l133K496
$$ plain form
2356 850 -2257 -38 1198 -2328 -517 1997 -1137 -1578 1653 -781 -2078 988 144 -2683 581 938
2372 938 -2577 -85 1386 -1978 -641 1680 -1505 -1724 1659 -685 -2226 1181 722 -2509 404 1345
2388 1345 -1950 207 1447 -1817 -800 2023 -700 -1607 1826 19 -1671 1537 299 -1923 708
2403 708 1492 -1883 392 2064 -1171 -543 2300 -537 -1260 2196 106 -1785 1741 1047 -1531 1183
2419 1183 1946 -1414 342 2050 -1245 -537 2313 -445 -973 2029 419 -1469 1697 1229 -1654 911
2435 911 2083 -1648 9 2446 -840 -764 2381 -55 -1300 2080 306 -1390 1413 1183 -1694 738
2451 738 1746 -1292 175 2157 -1070 -758 2098 -282 -1457 1791 481 -1662 979 1072 -1925 150
2467 150 1376 -2011 -753 1830 -1234 -1362 1838 -273 -1950 1437 143 -2232 538 972 -2161 335
2483C35J327l294Q82K503k978l34K960j938j480K941r38k381K941M34l282J898
2499d04J482k991Q42K545k796p01L676j787j855L035r10k201K175J074l301J998
2515a19J818l007N34K558k753n42L197k067j627L454p80k851K685J099l460J805
2531e6K023l082J79K749k204j197L480j226k489L204j34l093K667O90k881J179
2547a91K312k609J11K243j715j383L099j527j726K578K75k771J858J467l149R22
2563b06K431k973k00L150k167j369L486j194k384K737L36l113J652J601k913P54
2579c72K400k861j14K858k114j188L011r75k526L171j48l005J908J697l163R55
2595d66K530k823p32L039j714j824L231p70k595L138K27l195J723J423l214J143
$$ plain form
2483 335 1662 -1632 -750 1753 -1225 -1559 1401 -537 -2017 924 -14 -2395 546 980 -2302 -404
2499 -404 1078 -1913 -1071 1474 -1322 -2023 1653 -134 -1989 1046 136 -2065 110 1184 -2117 -119
2515 -119 1699 -1308 -774 1784 -969 -1511 1686 -381 -2008 1446 666 -2185 500 1599 -1861 -56
2531 -56 1967 -1115 -936 1813 -391 -1588 1892 666 -1823 1381 1247 -1846 821 1511 -1370 -191
2547 -191 2121 -488 -377 1866 151 -1232 1867 340 -1386 1192 1467 -1304 554 2021 -1128 -206
2563 -206 2225 -748 -948 2202 35 -1334 2152 958 -1426 1311 1647 -1466 186 1787 -1126 -372
2579 -372 2028 -833 -947 1911 -203 -1391 1620 645 -1881 1290 1142 -1863 45 1742 -1421 -466
2595 -466 2064 -759 -1491 1548 -166 -1990 1241 471 -2124 1014 1241 -1954 -231 1192 -2022 -879
2611h79K844l160m72L225j841j824L061o15k658K500R80l119J572J542k523N37
2627h30K426k370q42K927j483k073L141j57k296K231L92k791J422J611l052O15
2643a129K828k497o61K725j290j717K859l93k785K596Q27l122J569J749k763M85
2659g19K671k236r25K875j254k051K723l05k370K147J424l234R99K117k733k8
2675h99L063k394j102L291j430j750K854j53k769J872J179k550R97J515k591J96
2691f71L191k598j188K793q31k455K850K80k865J822R82k316R70K042k657m52
2707a103K743j407j660L132j203k514K959K96k706J676J397k740N08K163k525
2722i84l11L031j590j780K830o65k256K234L53k665J892J187k808P27K515k624
$$ plain form
2611 -879 1965 -1195 -1667 1558 -283 -2107 954 339 -2319 181 1161 -1958 -386 1156 -1367 -830
2627 -830 1596 -774 -1616 1311 -172 -2245 896 739 -1557 674 1066 -1725 -303 1308 -1744 -1129
2643 -1129 1699 -798 -1459 1266 -24 -1741 1118 725 -2060 536 1363 -1759 -190 1559 -1204 -719
2659 -719 1952 -284 -1209 1666 412 -1639 1084 779 -1591 556 1980 -1254 -255 1862 -871 -899
2675 -899 2164 -230 -1332 1959 529 -1221 1633 1480 -1289 583 1762 -788 209 1724 -867 -671
2691 -671 2520 -78 -1266 1527 696 -1759 1091 1371 -1494 328 1310 -1006 -36 2006 -651 -1103
2707 -1103 1640 233 -1427 1705 502 -2012 947 1243 -1463 213 1610 -1130 -622 1541 -984
2722 -984 -1295 1736 146 -1634 1196 531 -1725 509 862 -1803 89 1276 -1532 -805 1710 -914
2738i14n93L028j705j926L001l55k345K229O07k734J309J769k641J84K489k313
2754i10m55K476j152j946L004n97k231K047P02k764J369J815k690M55K469k102
2770e10r19K735j203k140K769j75k203K138O75k478J096J817k384l5K470k064
2786d11j007L065j311j758K409K29k642J761J395k951J095J968k534k46K691j848
2802i5j005K738j111j805K423j15k384J989J102k755J116K026k783m00K949j810
2818H0j338K766p98j625J875L74k587J739J298k988R02K235k291p63K735j295
2834C19j617K432m49k051K095R1k399J520J228k377O29K298k229n93K846j832
2850h9j512K613p54j984K235M74k398J150J663k562K2K722k555m81K547j041j636
$$ plain form
2738 -914 -1507 1521 -184 -2110 891 536 -1809 420 1027 -1707 -398 1371 -1270 -1086 1403 -910
2754 -910 -1365 1111 -41 -1987 1017 420 -1811 236 938 -1826 -457 1358 -1332 -877 1592 -510
2770 -510 -1429 1306 103 -2037 732 557 -1646 492 1167 -1311 -215 1602 -782 -817 1653 -411
2786 -411 -1418 1647 336 -1422 987 1216 -1426 335 1730 -1221 -126 1842 -692 -938 1753 -95
2802 -95 -1100 1638 527 -1278 1145 1030 -1354 635 1737 -1018 98 2124 -659 -1059 1890 80
2818 80 -1258 1508 710 -915 960 1334 -1253 486 1784 -1204 -302 1933 -358 -1121 1614 319
2834 319 -1298 1134 685 -1366 729 820 -1579 -59 1169 -1208 -579 1719 -510 -1103 1743 -89
2850 -89 -1601 1012 258 -1726 509 983 -1415 -265 1398 -1164 -1142 1580 -975 -1456 1091 50 -1586
2867a586K403k69k211J859M31k602J507J617k295K37K398k227n10K320j255j600
2883a783K682o54k186K272O47k332R65J568k498M46K130j883j160L076j382j341
2899a433K503m91j998J765P13k355R12J707k032l15K567j954q93K995j287j824
2915a420K254K4k429K145P42k392P56K093k289j56K371j773j226K539p17k046
2931a524K254L65k351J912J290k933R32J817k030m36K624j854j321K507q41j530
2947a119K028L90k539J493J684k774N03J833j651r50K754j526j274K472q91j826
2963a393J996O49k601J661J334k803P11J912j908o91K660j477j407K426m53k167
2979a551K028L38k157J368J126k143N8K262k067l95K262j239j332K052r4k101
$$ plain form
2867 -1586 817 548 -1663 196 627 -1975 -468 1149 -1146 -909 1489 -738 -1248 1072 -183 -1783
2883 -1783 899 245 -1941 331 978 -1354 -389 1179 -1319 -873 1257 -626 -1786 1290 -92 -1433
2899 -1433 1070 579 -1419 346 1059 -1296 -384 1323 -709 -1024 1543 -411 -1304 1691 404 -1420
2915 -1420 834 858 -1571 574 1316 -1076 -320 1773 -516 -672 1699 -74 -1300 1239 522 -1524
2931 -1524 730 1095 -1256 656 1946 -987 -55 1762 -268 -704 1920 66 -1255 1252 411 -1119
2947 -1119 909 1299 -1240 253 1937 -837 -334 1499 -152 -1102 1652 126 -1148 1324 433 -1393
2963 -1393 603 1252 -1349 312 1646 -1157 -446 1466 -442 -1133 1527 50 -1357 1069 616 -1551
2979 -1551 477 815 -1342 26 1152 -991 -933 1329 -738 -1133 1129 -110 -1442 610 516 -1585
2995a585J797P03k340J242J446k265j99K454k106m54K148q93j397K029J07k347
3011a660J684Q89k627J048J953k272n0K026j546p18K639j399j513K131q8j954
3027a457J837O06k418J344J609k371p5K305j583q11K211j011j471K087M1k083
3043a240J525Q62j850L48K028k505L0K323j354j117K174o92j619J971K21k245
3059a140J213R98k025P34J819j617o18K354j887r79K340m71k008J861O20k224
3075a030J371J377k553L35K113j901l82K200j151j512K197j75k190K114L57k296
3091a126J063J122j931J3K094j713m38K366j151j936K801o62j834J500P26k228
3107a334R55J675k035j08K041j770o79K052j073j104J890Rj867J479P47k218J006
$$ plain form
2995 -1585 212 915 -1425 -183 1263 -1002 -1201 1253 -853 -1307 841 -52 -1449 580 687 -1660
3011 -1660 24 913 -1714 -666 1287 -985 -1035 991 -555 -1273 1366 -33 -1546 585 497 -1457
3027 -1457 380 986 -1432 -88 1521 -850 -925 1380 -203 -1014 1197 186 -1285 802 843 -1240
3043 -1240 285 1147 -703 -355 1673 -832 -802 1521 167 -950 1224 532 -1087 884 1105 -1140
3059 -1140 73 1071 -954 -220 1599 -18 -636 1718 -169 -1148 1192 721 -1287 574 1194 -1030
3075 -1030 341 1718 -835 -500 1613 -288 -670 1530 379 -1133 1064 889 -1301 813 1170 -1126
3091 -1126 -63 1059 -872 -859 1235 -478 -916 1450 299 -1637 1164 502 -1332 168 894 -1334
3107 -1334 -379 1296 -739 -847 1194 -576 -1255 797 -276 -1380 510 519 -1348 131 878 -1340 -334
3124c34J460j945l74K271j373r87K066q44j359J863j7k036J742N55k039J131J476
3141A256k342K71J948j707p00J952l28j759J932N9j965J270J082k213J068J368
3157A192j997j39K108j436r31K349o06j611J751J93j959J478Q40k091N36J810
3173A487j880j82J990j284j155K137n90j924J958L23j530R92Q84j923M47J603
3189A353j653k72J987j312r35J746m8j886J594K40j964J426R96k267M69K012j731
3206b45n06J775r26r69J967k40j854J323P07k119Q83J454j933R0J760j651n17
3223a001K275j178j238J601N13k156J555M54k032J248J104k080J71J853j722o22
3239a255K039n97j304J531L97k366J811M38k083Q14J718j968k8K210j593j064
$$ plain form
3124 -334 1126 -819 -1193 1078 -295 -1282 784 -60 -1419 444 427 -1609 133 688 -1351 -220 1256
3141 1256 -1086 -815 1133 -574 -1274 678 350 -1409 523 582 -1383 -113 969 -1244 -176 1192
3157 1192 -805 -944 1164 -272 -1203 1146 540 -1071 680 873 -1086 392 1232 -859 -323 1487
3173 1487 -393 -575 1415 131 -1024 1113 523 -1401 557 880 -650 342 1226 -697 -250 1353
3189 1353 -300 -572 1415 103 -832 914 866 -1020 574 814 -1150 276 1272 -995 -526 1486 -245
3206 -245 -751 1024 98 -871 1096 856 -998 325 1032 -1087 -204 1250 -683 -593 1167 -484 -1001
3223 -1001 1274 96 -1142 459 972 -1184 371 825 -1207 41 1145 -935 -764 1089 -633 -1255
3239 -1255 784 187 -1117 414 811 -1555 256 694 -1389 -575 1143 -825 -853 1357 -236 -1300
3255a300K339q91j605K004R5j750J175Q40k203Q24J485j722l07J931j167j027
3271a279K375p86j500J796L6j965J341J055k118M15J709j547r3J429r95n40J522
3288H55n72j480J708J91j804J122R92j557K70J672j682m04J919j253j286K028
3304G19q6j700J790M61k010P18J250j656L51J370j613n56K070q68j227K284m41
3321H56j823J488N05j957R42J156j608J46J649j391p07J490k47j496J684P2j794
3338a035J513M28j903J030J078j574j43J905j371p85J713n74j118J429N0j708
3354a065J392N18j927P89J268j650J81J641j528m55J498o23j342J787M6j537R47
3371f0J018j813K53J484j593n0J625j272n30J515n68j296J861O6k147J456R10
$$ plain form
3255 -1300 1039 148 -1457 547 642 -1108 67 907 -1296 -472 1013 -709 -1016 915 -252 -1279
3271 -1279 1096 310 -1190 606 642 -1323 18 1073 -1045 -630 1079 -468 -561 868 -127 -667 855
3288 855 283 -1197 511 702 -1102 20 1012 -545 -275 1397 -285 -689 1230 -23 -1309 719
3304 719 633 -1067 723 1184 -826 -108 1142 -514 -163 1207 -406 -962 1108 240 -987 1297 856
3321 856 -967 521 1026 -931 11 1167 -441 -295 1354 -37 -744 746 499 -997 687 759 -1035
3338 -1035 478 906 -997 33 1111 -463 -606 1299 -72 -857 856 282 -836 593 643 -1065
3354 -1065 327 845 -1082 -293 975 -675 -494 1147 -381 -836 662 39 -1303 484 530 -1007 -60
3371 -60 958 -855 -602 882 -711 -761 864 -408 -938 577 9 -1287 574 640 -1507 -51 859
3388H59j893M48J444j501l0J516j191p64K243j161j187J598K08j919J275R95j659
3405g19M81J131j242n87J662j016p01J594j88j608J633N01j974J168J110j980
3421g35J55J453j237j74J527o82j408J791j23j534J383N08j578Q85N01j286J67
3438c87J588j329o29K162j013j024J306k05j267J216M18j468P33J326j880J3J569
3455A129j367m74J828q48j173J787j34j423J284N54j848L22J453j577J25J029
3471F67p53o05J729n88j482J615J1j614J046P06j741Q62J188j265k22J521j487
3488d12p35J712m75j058R60N25j643J487O13j663Q8J521j420k72J599j074p64
3505a011J467k08j418J592J70j945J099J060j890O01J492j456n76J731r34q15
$$ plain form
3388 859 -1034 -586 858 -643 -673 843 -348 -1112 1131 -30 -1217 381 589 -1330 -55 940 -719
3405 -719 -238 893 -349 -936 726 -290 -991 603 415 -1193 440 941 -1033 135 1245 -735
3421 -735 -580 873 -364 -538 989 307 -1101 690 567 -967 416 924 -654 231 732 -554 -387
3438 -387 1201 -128 -757 1405 392 -632 674 469 -798 418 836 -632 101 1427 -453 -440 1129
3455 1129 -238 -712 1116 268 -905 882 748 -675 609 1163 -685 -363 1090 -487 -362 667
3471 667 -86 -691 1038 450 -1032 583 594 -1020 26 732 -1009 -147 1041 -224 -446 1075 -412
3488 -412 -1147 565 90 -968 -8 517 -1126 361 974 -689 -601 920 -500 -772 827 -247 -1011
3505 -1011 456 248 -1170 422 592 -1353 -254 806 -1084 -483 1009 -447 -1023 708 -226 -1041
3521a041J292r7j338J108N98j471O37J129j604M19J057j025n95J483n20j099J778
3538G11j32j448J221N47j648O04J002j534K22J563r03j033J660p98p51J427m39
3555B71j216J144O80j239M30Q88j160K3J047j063l52J469n53j317J658n4j326
3572f70R06P72j594O87P93j413j12J564r40m53J685r24j139J468m7j328J050M07
3590G12j273K40J224j486M2J648r77j092J850o09j283J814k89j409Q14J016j825
3607h83N91J047j280k43J502r09o92J803o27j637J512M94j460O92R77j627J48
3624e92J422j280l9J172q86m79J049m15q78J041M03j143M68Q93j560M55J008r44
3642c05m95J530r16o89J245L0j444J488j09j142O43R15j156n2J155q97l92J628
$$ plain form
3521 -1041 251 154 -1184 -76 522 -949 -312 817 -787 -368 689 -336 -931 552 32 -1067 711
3538 711 579 -869 352 899 -749 -145 857 -677 -455 1108 205 -828 832 34 -717 710 271
3555 271 -945 199 879 -360 70 958 -202 -179 868 -195 -547 922 369 -948 710 656 -670
3572 -670 236 1008 -586 101 894 -519 -631 933 -7 -460 1225 301 -838 630 583 -745 305 712
3590 712 -561 -321 903 -583 -541 1107 130 -962 888 279 -1004 810 521 -888 -74 942 -883
3607 -883 -292 755 -525 -768 734 -175 -867 936 309 -1328 184 678 -782 -90 887 -740 -592
3624 -592 830 -450 -489 683 -203 -682 367 -48 -926 115 518 -625 -157 736 -824 -369 639 -305
3642 -305 -800 730 -186 -875 370 400 -1044 444 335 -807 -164 751 -405 -457 698 -199 -591 1037
3660A037q97q00R20L02j559J064O19j364N26Q60j301J42J296r13k00J345j063
3677A4q02J303N6j270O46R43j508P12Q17j344r3J140q24m96J542m43q91J212N3
3696G67j359P83P24j511P35R48j489K29J227j132m14J163o21q63J494l57r69P79
3714A34P42j248k4J428j422l1J306j001p68J352O6j061R27L08j584Q90P02j404
3732f88L35R85j058o1J463r67o77J501n38j039J092j49r74Q25N27r78k39J193
3750E53r13l21J341p89q09J446k64j178P74N29j201N82R26j231l34J419q69m57
3768g96J341n41n87Q47k46j097J160J14j091Q34M37j121L71J039j011k64J086
3785D75o01o56J049r9r20Q22O20j318O67N81j057J97Q93p84m64J358n49r50J033
$$ plain form
3660 1037 140 -660 260 562 -997 67 686 -678 -152 708 -593 -451 845 -68 -268 1077 14
3677 14 -788 515 571 -699 -53 890 -618 94 911 -433 -526 614 -210 -706 836 393 -498 714 767
3696 767 -592 191 915 -596 139 1087 -402 -173 1054 -78 -492 671 50 -813 681 324 -645 134
3714 134 876 -372 -396 1032 -390 -421 885 -116 -884 468 534 -527 400 708 -876 14 716 -688
3732 -688 -353 632 -426 -487 976 9 -668 833 295 -744 348 199 -775 50 577 -401 -640 553
3750 553 -360 -681 660 -129 -938 508 244 -934 -160 369 -832 -250 676 -555 -889 530 -339 -796
3768 -796 545 4 -583 264 18 -1079 81 195 -896 -62 375 -746 -375 664 -347 -611 475
3785 475 -126 -782 267 168 -752 70 690 -628 39 620 -437 -240 653 -131 -595 763 214 -736 297
3804B97J50j148R41P06j508N35R48j159l10J362q40n29J379n58j001J353j95j115
3822f92J166O17j555L07J241j406O0R68n98o21J400l42j154J282k66p90N82O70
3840H69j539L15J126j011n3J033o77n73J078m20r38J147J80j633Q35J239j330
3857c52J20R45p40n55J276m99q81J304k13j108R83L53j283N35P10j246J13J203
3875F65j246JJ161r41j79R36k15q18O89L50j060N66N72r59J87R10p80m66J234
3894F07n57j050J346l19o67N82N31j253P92L08p77j95J292q42p23J700o93o64
3912e82P32R6q71O84N05j120L65Q87j015N4J107n74p85J139j36j084J076L56j423
3931e89Q43O80j414L77P63r36k40J268n81p37J339n93p92J131k13j094Q78M99
$$ plain form
3804 297 447 -701 240 946 -562 -27 921 -238 -548 814 -26 -555 824 266 -735 618 423 -692
3822 -692 474 1091 -464 -157 1084 -322 -262 706 108 -513 887 545 -609 673 407 -383 199 869
3840 869 -670 -355 771 -240 -293 740 63 -510 568 148 -790 357 537 -1096 -261 978 -352
3857 -352 -232 713 -27 -582 694 195 -686 618 405 -703 280 633 -650 -115 595 -651 -538 665
3875 665 -581 -580 581 -360 -539 397 182 -636 53 403 -657 -91 481 -478 -291 619 -161 -627 607
3894 607 50 -1000 346 27 -640 -58 473 -780 12 320 -457 -652 640 -202 -925 775 82 -582
3912 -582 150 246 -625 59 564 -556 -191 696 -319 -265 842 268 -517 622 486 -598 478 834 -589
3931 -589 254 934 -480 -103 660 -276 -516 752 171 -566 773 180 -612 519 306 -788 90 589
3949E89j151P09M10o90l70J161m74r51J422k65q73Q70K19j429J175M56j192P6
3967c08J031q56o5O98l29p89J175j04j125J106jj237P90O71j163J00J062q07p5
3986b26O88l93p78J041K0j257O99J004j656P30P86j027J03O09p08l32J236o23
4004h4p87J172P4j356J015M67j116O19P81j271m3J002p28m58J202j86j097J366
4022E72k92j087O11O99q68L0P58q68J33J024q76m96J174k50j157J137J74j268
4040h50Q74N81j119K14J078j141o9R47n03o18J132l41n49N38L46j109O70O08j290
4059f01O41P62j119L1R56p30k95J101n14r63R95J50j018L93Q63j257L47Q03p45
4078b00n5R33l70p96R17j18q52R63J5r41M52P25j070Q7Q74n53m89R72m90o40J011
$$ plain form
3949 589 -562 147 557 -133 -503 658 184 -767 655 390 -483 387 606 -823 352 808 -384 -308
3967 -308 723 -133 -198 500 171 -618 557 453 -672 434 433 -804 -14 657 -506 -406 656 -151 -226
3986 -226 462 69 -709 332 352 -905 -206 798 -858 -128 658 -369 -266 343 -365 -697 539 -84
4004 -84 -871 301 375 -981 34 501 -615 4 785 -486 -529 473 -255 -713 489 303 -794 572
4022 572 280 -807 -196 503 -365 -335 423 -445 -312 712 -164 -660 514 264 -893 244 418 -850
4040 -850 24 605 -514 -300 778 -363 -432 515 12 -606 526 185 -364 174 520 -589 81 689 -601
4059 -601 40 802 -317 -286 670 -60 -355 746 232 -731 264 414 -604 -211 652 -605 -258 545 -200
4078 -200 -255 678 308 -488 429 311 -541 422 437 -504 -52 673 -397 -310 564 11 -478 494 4 -636 375
4099C75O3j083P42L30p76J55R73j141J56P92q76R2P09m17p07J027j96r05N82O39
4119E34j070J78R20j177L0J040r47J4J135o13p00Q78K0p75O64K15r25M42N63p65
4139c39k69J172p74l46J192n55j020Q18K77r89R61K96j092N01P12j218M75P37
4157E39r52l69J144m4j141R90M41j190M55Q35j127L82P09q17k23Q22l94q31J139
4176C68m3p63Q94K7j106P43M81r84J88R79n48p17R47m86k42P59k10j008P92M51
4196E22r51N47L96r45K29P23o95j50R04n37p97J641l17j208Q74M4p36L97O86r56
4216c29j66J242j046J17O73l88m20N43N0q51N66L78p38M68L28p15M9P92o53m58
4236e58J076k20q93Q50j73o40N67M58j225N36Q00r58K47O45q40k04R14m80o10
$$ plain form
4099 375 438 -645 97 427 -349 -194 779 -362 -206 586 -290 -198 511 94 -613 414 218 -687 -105 534
4119 534 -536 -358 562 -615 -585 455 -492 -478 657 44 -656 222 242 -533 131 346 -579 -137 426 -339
4139 -339 -608 564 -210 -556 636 81 -939 -121 156 -833 128 424 -668 -167 545 -673 -198 539
4157 539 -413 -782 362 318 -823 167 608 -582 -127 708 -419 -37 672 -145 -368 454 60 -771 368
4176 368 325 -438 456 483 -623 120 601 -383 -195 784 236 -481 466 -20 -262 497 287 -721 71 522
4196 522 -429 118 514 -431 -202 521 -174 -324 580 43 -754 887 570 -638 236 280 -456 -59 627 -329
4216 -329 -495 747 -299 -182 491 103 -317 226 276 -575 -9 369 -369 99 427 -288 -239 553 -100 -558
4236 -558 518 298 -595 255 82 -558 9 467 -758 -222 578 -380 -133 512 -328 -532 382 -98 -708
4255g08Q04J05o83O33L21p42K23N80q31k16R04n11k06N26Np76O77K74j157P42
4275c6P4n39K88N70q68K30J029n66p97R84k13p40P61j34p70P76L57q11K42O29
4295D66n29j46N08n21k65Q39N6q48P79N3r97Q42L44j267M43R06q33l20J198n46
4315A62n08O28J45j005Q01L33j243O09O73q29j69P84m46m43J173m63l03O57j54
4334D02p50N34J45p11O29M89q85l9O80p42k76Q44j1r72R11J30q50N45P20j081
4354b88J75N00p31l6J074o07l76Q71p01k31N94j88q96P39Q61j241L52N52p41o3
4374c81P20k52o05Q00j82n74P05J74p93N35K91r82K01N12p47J10Q22n61n47J104
4394C50j76q82R88K02j008N68L50q55J70O78n61l86Q51m37m25R19k95j100J088
$$ plain form
4255 -708 96 201 -482 151 472 -270 -47 533 -298 -514 390 -121 -327 199 204 -572 105 379 -778 -36
4275 -36 38 -501 -213 357 -511 -281 748 182 -615 369 156 -584 177 43 -727 49 406 -405 -163 466
4295 466 -63 -209 299 -222 -487 352 408 -440 339 392 -605 237 581 -686 -243 663 -170 -490 708 162
4315 162 -346 282 427 -578 223 556 -687 -78 595 -234 -403 381 -65 -508 665 202 -101 556 402
4334 402 -348 186 331 -380 249 738 -147 -186 494 -248 -524 320 309 -663 248 378 -472 73 793 -288
4354 -288 -113 387 -344 -380 694 87 -289 582 -119 -350 244 56 -840 -101 760 -481 -129 423 -318 -381
4374 -381 339 87 -518 282 100 -474 231 405 -388 147 438 -544 -343 169 -578 -468 354 -207 -754 350
4394 350 174 -708 280 482 -526 42 392 -463 -293 385 -176 -562 289 -148 -573 346 51 -1049 39
4413C9L23j185O12Q17q05J84L74m66l82R33p85m37J233k43n61N86K68r58K51N81
4433C79o79J11O59p12j86R18m19l15L91k0n46O03L4p01J82P67n77j34P86m94n05
4454d58J248p52l92O61J86j142J095p4p68M31N05r09K14N20m73k68Q00J49j352
4473g79J183p0q98L90L66r18P01K91m33k84J160q11m46J144n98o33P11K29p39
4492d34K30O04q30L20P22j048J22Q67m31l97O41k16p20N59K92p68L04N50r16N20
4512b9O25q87k0P54m87n56O85l6n97K83O76j019N47N57p23LO20r20N4O89p29l7
4534e47R22k40p11O21M22j004M04O01p90r2Q39n92n8Q09p78j89O97n0q18P48O9
4555B63n48j28O77n97K33P21o68o23J165m17m89Q92k26m68L86K39o52K64O37p23
$$ plain form
4413 39 362 -823 -211 606 -199 -15 359 -107 -489 444 -341 -778 455 212 -349 237 505 -453 -202 379
4433 379 -300 -189 470 -242 -428 490 71 -244 147 127 -419 184 218 -483 -301 466 -111 -245 541 47 -458
4454 -458 790 38 -354 307 493 -649 446 372 -396 35 540 -369 -155 365 -108 -376 424 573 -779
4473 -779 404 334 -564 -174 192 -726 -25 266 -167 -451 709 -102 -548 596 -2 -635 76 305 -434
4492 -434 -204 400 -430 -110 612 -436 -314 553 122 -275 366 150 -570 -11 281 -487 -183 367 -549 -29
4512 -29 596 -291 -311 443 -44 -600 85 49 -548 -265 411 -608 -61 496 -227 -224 396 -524 -470 219 -510 -547
4534 -547 375 135 -576 45 467 -537 -133 468 -322 -414 425 -167 -225 584 -194 -383 314 264 -554 194 263
4555 263 -285 -413 264 -333 -100 621 -47 -670 495 78 -411 481 255 -213 173 412 -240 24 661 -62
4575f2j15O51o04l16J538j180k35O72K6n55J77K80p37K17L89k19K13L83m50m59
4595c86Q94j38p92O35M3l44J22L52q22N03N77p51l34P59l23m55R90J3p55N95J21
4616E04q21O95o5o77J41Q23p04j92Q08o35j46M63m0p48P19L80q84K06Q08j064
4636d29J43M71m87J74K91N2o23O67j1o68K63N95p06L99K77r01L9O07l37k98O64
4657A82k56l89P53l94o44J096k83o06P8J072q13oM42l82p7N54m93n00R92m8r59
4678f81J064l55k16L48K99q02J06N70m34m04Q16K9p15R98k86n56O83o5q88M55
4698c4N24o55k79R66o02l96J080o34m32P86J9p09O27K19m05L33km11j68O22k09
4719B40o65Q49O6r61R56k34l08K28P5n31PP28o92n1O54j30o90N87n5o38P55K94
$$ plain form
4575 -62 -177 474 -130 -446 1092 -88 -323 349 375 -180 -3 277 -460 -243 146 -73 140 523 73 -386
4595 -386 508 370 -422 213 256 -88 34 386 -436 67 644 -107 -441 318 -5 -460 530 543 -212 383 504
4616 504 -317 378 313 -364 -223 600 -104 -296 512 -123 -269 194 154 -594 125 505 -379 -173 635 -429
4636 -429 -286 185 -302 -128 163 215 -408 259 248 -420 -157 438 -268 131 408 -493 -454 153 -184 -482 182
4657 182 -74 -463 290 -104 -748 348 65 -541 -463 609 -204 -210 232 -150 -227 327 -166 -666 326 278 -681
4678 -681 383 28 -188 160 459 -343 -237 333 -101 -505 311 340 -375 623 337 -219 464 399 -489 -34
4698 -34 490 -165 -444 522 -80 -476 604 -30 -462 324 343 -366 261 480 75 408 406 -5 -173 449 240
4719 240 -425 424 490 -471 485 251 -57 171 246 -285 -278 450 -242 -293 361 231 -459 128 73 -565 190 484
4741D84r21N03M27o89j24O96p20k92J096m11o24Q74j14o40N82K7k41j30N35n89
$$ plain form
4741 484 -437 66 493 -196 -320 376 -344 -636 460 49 -575 299 185 -455 127 154 -87 -217 318 -271
$$ [...]
8191i0
##END NTUPLES=NMR FID
##END=
