##TITLE=1H_TG-2257-0
 DMSO, 8 sc, 
 18.10.2019
##JCAMPDX= 6.0         $$ Bruker NMR JCAMP-DX V2.0
##DATA TYPE= NMR FID
##DATA CLASS= NTUPLES
##ORIGIN= UXNMR, Bruker Analytische Messtechnik GmbH
##OWNER= root
$$ XWIN-NMR		Version 3.5
$$ Fri Oct 18 14:15:38 2019 Russian Standard Time (UT+4h)  she@DPX200
##.OBSERVE FREQUENCY= 200.1315
##.OBSERVE NUCLEUS= ^1H
##.DELAY= (6, 6)
##.ACQUISITION MODE= SIMULTANEOUS
##.ACQUISITION SCHEME= undefined
##.AVERAGES= 8
##.DIGITISER RES= 18
##SPECTROMETER/DATA SYSTEM= spect
##.PULSE SEQUENCE= zg30
##.SOLVENT NAME= DMSO
##.SHIFT REFERENCE= (INTERNAL, DMSO, 0, 15.7039)
##AUDIT TRAIL= $$ (NUMBER, WHEN, WHO, WHERE, WHAT)
$$ ##TITLE= Audit trail, XWIN-NMR		Version 3.5
$$ ##JCAMPDX= 5.01
$$ ##ORIGIN= Bruker BioSpin GmbH
$$ ##OWNER= she
$$ F:/spectra/data/she/nmr/H-F/1/audita.txt
$$ ##AUDIT TRAIL=  $$ (NUMBER, WHEN, WHO, WHERE, WHAT)
(   1,<2019-10-18 14:14:24.93 +0400>,<she>,<DPX200>,
      <created by zg, POWCHK disabled, PULCHK disabled
       configuration hash MD5:
       00 E9 B6 7A A2 85 ED C7 34 08 36 98 17 FE 4E 26
       data hash MD5: 16K
       D2 2C 3D 66 64 94 DE 00 FA CC 1C A3 60 CF 26 FD>)
$$ ##END=
$$ 
$$ hash MD5
$$ C4 E5 D3 EA 5B E7 F0 92 2C 1E 90 36 47 90 38 A2
##$RELAX= 
##$RELAX= 
##$RELAX= 
##$RELAX= 
##$RELAX= 
##$RELAX= 
$$ Bruker specific parameters
$$ --------------------------
##$DU= <F:/spectra>
##$EXPNO= 1
##$NAME= <H-F>
##$PROCNO= 1
##$TYPE= <nmr>
##$USER= <she>
##$AMP= (0..31)
100 100 100 100 100 100 100 100 100 100 100 100 100 100 100 100 100 100 
100 100 100 100 100 100 100 100 100 100 100 100 100 100 
##$AQSEQ= 0
##$AQ_mod= 1
##$AUNM= <au_zg>
##$AUTOPOS= <>
##$BF1= 200.13
##$BF2= 200.13
##$BF3= 200.13
##$BF4= 200.13
##$BF5= 200.13
##$BF6= 200.13
##$BF7= 200.13
##$BF8= 200.13
##$BYTORDA= 1
##$CFDGTYP= 0
##$CFRGTYP= 5
##$CHEMSTR= <none>
##$CNST= (0..31)
1 1 145 1 1 1 1 1 1 1 1 1 1 1 1 1 1 1 1 1 1 1 1 1 1 1 1 1 1 1 1 1 
##$CPDPRG= <>
##$CPDPRG1= <>
##$CPDPRG2= <>
##$CPDPRG3= <>
##$CPDPRG4= <mlev>
##$CPDPRG5= <mlev>
##$CPDPRG6= <mlev>
##$CPDPRG7= <mlev>
##$CPDPRG8= <mlev>
##$CPDPRGB= <>
##$CPDPRGT= <>
##$D= (0..31)
0 1.2 0 0 0 0 0 0 0 0.06 0 0.03 0 0 0 0 0.0002 0 0 0 0 0 0 0 0 0 0 0 0 
0 0 0 
##$DATE= 1571393664
##$DBL= (0..7)
120 120 120 120 120 120 120 120 
##$DBP= (0..7)
150 150 150 150 150 150 150 150 
##$DBP07= 0
##$DBPNAM0= <>
##$DBPNAM1= <>
##$DBPNAM2= <>
##$DBPNAM3= <>
##$DBPNAM4= <>
##$DBPNAM5= <>
##$DBPNAM6= <>
##$DBPNAM7= <>
##$DBPOAL= (0..7)
0.5 0.5 0.5 0.5 0.5 0.5 0.5 0.5 
##$DBPOFFS= (0..7)
0 0 0 0 0 0 0 0 
##$DE= 6
##$DECBNUC= <off>
##$DECIM= 24
##$DECNUC= <off>
##$DECSTAT= 4
##$DIGMOD= 1
##$DIGTYP= 9
##$DL= (0..7)
0 120 120 120 120 120 120 120 
##$DP= (0..7)
150 150 150 150 150 150 150 150 
##$DP07= 0
##$DPNAME0= <>
##$DPNAME1= <>
##$DPNAME2= <>
##$DPNAME3= <>
##$DPNAME4= <>
##$DPNAME5= <>
##$DPNAME6= <>
##$DPNAME7= <>
##$DPOAL= (0..7)
0.5 0.5 0.5 0.5 0.5 0.5 0.5 0.5 
##$DPOFFS= (0..7)
0 0 0 0 0 0 0 0 
##$DQDMODE= 0
##$DR= 18
##$DS= 0
##$DSLIST= <SSSSSSSSSSSSSSS>
$$ [...]
##$SUBNAM2= <"">
##$SUBNAM3= <"">
##$SUBNAM4= <"">
##$SUBNAM5= <"">
##$SUBNAM6= <"">
##$SUBNAM7= <"">
##$SUBNAM8= <"">
##$SUBNAM9= <"">
##$SW= 24.0689530833862
##$SWIBOX= (0..15)
0 0 2 0 0 0 0 0 0 0 0 0 0 0 0 0 
##$SW_h= 4816.95568400771
##$TD= 16384
##$TD0= 1
##$TE= 0
##$TE2= 300
##$TE3= 300
##$TEG= 300
##$TL= (0..7)
0 120 120 120 120 120 120 120 
##$TP= (0..7)
150 150 150 150 150 150 150 150 
##$TP07= 0
##$TPNAME0= <>
##$TPNAME1= <>
##$TPNAME2= <>
##$TPNAME3= <>
##$TPNAME4= <>
##$TPNAME5= <>
##$TPNAME6= <>
##$TPNAME7= <>
##$TPOAL= (0..7)
0.5 0.5 0.5 0.5 0.5 0.5 0.5 0.5 
##$TPOFFS= (0..7)
0 0 0 0 0 0 0 0 
##$TUNHIN= 0
##$TUNHOUT= 0
##$TUNXOUT= 0
##$USERA1= <user>
##$USERA2= <user>
##$USERA3= <user>
##$USERA4= <user>
##$USERA5= <user>
##$V9= 5
##$VALIST= <valist>
##$VCLIST= <CCCCCCCCCCCCCCC>
##$VD= 0
##$VDLIST= <DDDDDDDDDDDDDDD>
##$VPLIST= <PPPPPPPPPPPPPPP>
##$VTLIST= <TTTTTTTTTTTTTTT>
##$WBST= 1024
##$WBSW= 4
##$XGAIN= (0..3)
0 0 0 0 
##$XL= 0
##$YL= 0
##$YMAX_a= 68076
##$YMIN_a= -116628
##$ZGOPTNS= <>
##$ZL1= 120
##$ZL2= 120
##$ZL3= 120
##$ZL4= 120
##$ABSF1= 10
##$ABSF2= 0
##$ABSG= 5
##$ABSL= 3
##$ALPHA= 0
##$AQORDER= 0
##$ASSFAC= 0
##$ASSFACI= 0
##$ASSFACX= 0
##$ASSWID= 0
##$AUNMP= <proc_1d>
##$AZFE= 0.1
##$AZFW= 0.1
##$BCFW= 1
##$BC_mod= 2
##$BYTORDP= 1
##$COROFFS= 0
##$CY= 11.3945322036743
##$DATMOD= 1
##$DC= 2
##$DFILT= <>
##$DTYPP= 0
##$F1P= 20.1720416913024
##$F2P= 0.152960286110954
##$FCOR= 0.5
##$FTSIZE= 0
##$FT_mod= 4
##$GAMMA= 1
##$GB= 0.15
##$INTBC= 1
##$INTSCL= 1
##$ISEN= 128
##$LB= 0.24
##$LEV0= 0
##$LPBIN= 0
##$MAXI= 10000
##$MC2= 0
##$MEAN= 0
##$ME_mod= 0
##$MI= 1.114404
##$NCOEF= 0
##$NC_proc= 0
##$NLEV= 6
##$NOISF1= 3.799351
##$NOISF2= 2.8
##$NSP= 1
##$NTH_PI= 0
##$NZP= 0
##$OFFSET= 15.70392
##$PC= 1
##$PHC0= -9585.003
##$PHC1= 30.60089
##$PH_mod= 1
##$PKNL= yes
##$PPARMOD= 0
##$PSCAL= 0
##$PSIGN= 0
##$REVERSE= no
##$SF= 200.130013532006
##$SI= 16384
##$SIGF1= 3
##$SIGF2= 2
##$SINO= 400
##$SIOLD= 16384
##$SREGLST= <1H.CDCl3>
##$SSB= 0
##$STSI= 0
##$STSR= 0
##$SW_p= 3612.71676300578
##$SYMM= 0
##$S_DEV= 0
##$TDeff= 0
##$TDoff= 0
##$TI= <>
##$TILT= no
##$TM1= 0
##$TM2= 0
##$TOPLEV= 0
##$USERP1= <user>
##$USERP2= <user>
##$USERP3= <user>
##$USERP4= <user>
##$USERP5= <user>
##$WDW= 1
##$XDIM= 8192
##$YMAX_p= 0
##$YMIN_p= 0
$$ End of Bruker specific parameters
$$ ---------------------------------
##NTUPLES= NMR FID
##VAR_NAME=  TIME,          FID/REAL,        FID/IMAG
##SYMBOL=    X,             R,               I
##VAR_TYPE=  INDEPENDENT,   DEPENDENT,       DEPENDENT
##VAR_FORM=  AFFN,          ASDF,            ASDF
##VAR_DIM=   8192,          8192,            8192
##UNITS=     SECONDS,       ARBITRARY UNITS, ARBITRARY UNITS
##FACTOR=    0.0002076,     1,               1
##FIRST=     0,             0,               0
##LAST=      1.7004516,     0,               0
##MIN=       0,             -116628,         0
##MAX=       1.7004516,     68076,           0
$$ Real data points
##PAGE= N=1
##DATA TABLE= (X++(R..R)), XYDATA
$$ [...]
1834C5k27Q6J06j27J36j28K13k80L21mk81K8L6k47K07L38P1q6j75k95L75r8K17
1857B21l77J15N4j29Q7P7o0J7K2J93j72l40N15p7n8R8j41j80Q4J8Q9L2O5j09J57
1882B01j11k04j85K66k76M29Q7m57J77p3J30PL8j28J93k5Q5l30J82J23k52J6O5
1905d2K12L5j16k82R9L77l00k75K93J51m8M3k64L07j8L6l41J09J49l08k04O03
1927B16l10K26q1j55K31j39J18l30J97j24J02J59Mk53J39j88n5L91m09O6O2o7
1949b00L89m26N69k4r1l29J55J21k46L6j22L03p2k8J22n2j28k3J70j64l1m3J88
1972G4j13l4J20J71j52J15k90N5K1K44k02J75l63J93K75l12j37M8J90l26J44l4
1994a38K46k49J23N5Lr0L6k20K39J4K55n54L21L96l29j6k14K0r0J75K28k78O4
$$ y = [35, -192, -106, 0, -127, 9, -119, 94, -186, 135, 131, -150, -122, -86, -333, -126, 212, 283, 197, 22, -273, 102, 4, 221, -156, -41, 13, -116, -29, 48, -12, 5, 27, 220, 48, -292, 223, 146, 88, 186, 45, -135, -51, -33, 56, 88, 153, 44, 201, 90, -114, -299, -33, -309, 120, 207, -250, -73, -146, -16, -9, 29, -99, 94, 69, 154, -176, 6, 129, -123, -107, -42, 170, 205, 89, -193, -94, 283, -17, -292, 1, 152, 104, 147, -117, 190, 172, 208, -133, -24, 125, -183, -387, 216, -94, 132, 51, -104, 127, -12, 106, -224, -27, -151, -49, 110, 114, -139, 0, -188, -243, 148, -261, -195, -133, -200, 189, -237, 332, 308, 217, -112, 43, 164, -82, -46, -168, 135, 63, 35, 157, 105, -23, -46, 124, -40, -71, -114, 74, -39, -73, 47, 218, 66, 181, -109, -54, -33, 211, 9, 184, -179, 14, 289, -23, -160, -112, 78, -248, -104, -138, 108, -141, -18, 37, 40, -50, -14, -234, 5, 19, 274, -280, 41, 437, 108, 92, -122, -102, -192, -17, 211, -67, -3]
2017cr0o4J73K44k25J2o6j10K86j03p4k94M12n2k04R0O1j87J82J96k92J55k06
2040a59J9L81J00l74j3J5k57L96N8j98J21R7j9k82mO3j8K49j81O5J06j95j71O0
2064a41l1R6j67K21l81M95R8j81k7M6J04k57J08n5L02j21j99J99O1KJl15O5K34
2088A57n3j1l0K32k41l56M04M6n46L13O7j47Q8J49q6L4k8J85j16R9J9l36J32j55
2112a80L3oK60j50N6k83L7M03p7J7k67L57k85J29K38j60j01L01l67q5l0N40m27
2135d7n6P7K5j25K06m6k12KJ85J92Q0j81k61M00m62j0K77J07K0q2q1j68K65J67
2159B72k82n0K60L1k10k68J05J06J20k49K39k67m4J08l27M54l3n8j98L30k39J71
2181b9P1p4q6K33P8n1j34j28N43m72J46j20J1k36K30P9l7N1q6Jk63K58K94l35
$$ y = [-3, -93, -157, 16, 260, 35, 47, -19, -129, 157, 54, -20, -314, 98, 46, -158, -68, -7, -194, -12, 184, -108, 47, -159, -140, 241, 341, -33, -46, -31, -288, 108, 166, -32, 89, 186, 167, -115, -119, -56, -74, 175, -6, 59, 165, -30, -201, -141, -172, -76, -243, -22, -403, 92, 190, 9, -18, 28, 132, -125, -17, -72, 230, 109, -90, 109, 170, 172, 173, -142, -77, 157, 104, 93, 63, 295, 54, -302, 102, 148, -398, -85, -18, -165, -77, 72, -14, 20, -8, 177, 61, 160, 179, -157, -25, -180, -147, -153, 107, -43, 13, -270, -233, 170, 93, 110, -157, 200, -85, 44, 282, 122, 21, 322, -45, -130, -160, 380, -47, -103, -26, -1, -126, 80, 34, -178, -176, 9, 201, 281, 100, -161, 239, -223, -233, 44, 151, 171, 89, 8, -160, 105, 272, -10, -60, 200, 231, 21, -247, -142, -36, 84, -165, 74, -193, -237, -129, -456, -2, -35, -93, -291, 39, -200, -29, 42, -32, -118, 115, 193, 142, 8, -120, 423, -49, 97, -23, -12, -248, -18, 61, 24, 75, -11, -10, -273, -15, 279, -56]
2205e6j60J19O0K41O1o2k06k60l7J41M22j58j47R4qM9q7Jn1K30o8r0M8K11j36
2230A51p8l2j62J12K0j65jL67l83K23K02j20j25k00K12K08j20l1l07K09O0k96
2252b56M61j39j80M6p2L29R8k78j56P2R1K2M9l5Ll8JK77l59L1L9m5J41o7k99M97
2278B33j93m6K99j95l10K23K37p8m62K18J78j64j42K55l01J17J65j33K0J58p7
2299Bj44K20N2k6r1M0k56J53R5p4j37M30m57K73R5l03n6K48J77l50J9j55K10M0
2323Ek48K32Q5j31j63K53n9J15j94J33K87l91N3J17J35l06p6P7J69k26L3j12J42
2346g0M6k44J94j58P7l57N92j81L11N5l11J67k28q1J65p1K44j09r4j35J56K01
2368A69m14K07j4N0O6K4j13QP8j01J88j28K4K88l61K47j76K13j87k37J70O6n6
$$ y = [-56, -216, -97, -37, 204, 265, 203, -3, -263, -300, -159, 263, 105, -42, 52, 44, 93, 6, 7, -44, 186, 118, 28, 76, 287, 151, 73, 41, -121, -9, 11, -154, -155, 212, -171, 52, 254, 134, 9, -191, 21, 229, 109, 78, -229, -20, 40, -256, 205, 66, -114, -68, -140, 189, 287, 9, -147, -75, 16, 38, 87, 52, 55, 17, 18, 295, -64, -33, 6, -39, 102, 35, -264, 233, 40, -6, 293, 98, -212, 11, 248, 170, -292, -74, 104, -60, -202, 53, -248, -131, 34, -99, -79, 79, 2, -142, 78, 130, 104, 13, 53, -203, -50, 45, -29, -166, 264, -193, 80, 175, -128, -184, 64, 241, -109, -90, -245, -35, 5, -243, -11, 74, -57, -220, 33, -26, 89, -105, 28, 315, -76, -23, 94, 229, -77, -153, -76, 93, -133, -100, -212, -70, -24, -268, -74, -232, -155, -512, 80, -101, 210, 265, -46, 121, -107, -188, -23, -94, 150, 41, -53, -188, -32, 169, -245, -38, -52, -2, 64, 88, -25, -17, 61, -40, 148, 20, 44, 332, -29, 218, 42, 255, 68, -169, 1, 67, 11]
2391A1j8%R5l71O31k73r8Q5j2k92J60j40J05K3J56L0k51K61J37l09K61k66q5l
2415a63P3l8K46l52RK23Q8O7j78M8O1l2p0j66M43k91L2J10l28M6K37j0k24o8K18
2440a9k04K99j8m11K35K28J2J37k92J17O7K5m78K05M00k06J86k11p8K2k23K59
2462E2L5j74J20oO1j89J67L5j80R3J3L65k71n0k0j56M94o7n36J5L03J43l84j84
2486c21L00k48M01j87J6J80j48M4J4J57r2M1j95J86k5r7K82l17o2L65j39L9J47
2509C41m38K50m05P5J64j50N2J70l6k17K53n0K5Rk71k9K05K00M9j54oo6k57L28
2533D2n1J32j34J9j34L06l58O6K35l17L5P0J18n4o1J74l8J57j34J5M8l15J32P4
2557B7J16j70J03j11k90L03J52k97J90P3j26j89M27r2l65M2K03k91J31L40L20
$$ y = [11, -7, -7, 88, -283, 348, 75, -23, 62, 50, -242, -82, -222, -117, -94, 62, 92, -159, 102, 239, -70, 191, -75, -160, -163, -90, -128, 118, -234, -225, -2, 86, 153, -25, 23, 84, 52, -18, -184, 259, -32, 0, 110, -218, -172, 65, 55, -169, -237, -19, -223, 76, 58, -353, -118, 110, 122, 259, -33, 84, 151, 176, -302, -97, 303, 97, 283, 72, -6, 16, -207, 52, 87, -87, 33, 27, 88, -101, 66, 101, -79, 14, 27, 392, 121, 71, 51, -105, 389, 322, -214, -199, 104, 247, -137, -321, -21, -269, 132, -55, -39, 141, -7, 37, 51, 208, 116, 157, -38, 148, 123, 26, 308, -9, -71, 294, 155, 194, 341, -97, 153, -252, -177, -13, -163, -111, 59, 23, -194, 59, 9, 34, 43, -228, -257, -52, 148, 197, 43, 37, -29, -286, 42, -9, 123, -11, 8, -126, 180, -178, -112, 123, -194, -159, -89, 29, -25, -86, 88, 50, 207, 73, 88, 136, -179, -47, 27, 143, -27, 76, -35, -325, -22, 130, -167, 23, 96, -30, -219, 208, 116, -249, -207, -4, -295, -164, 176, 496]
2578D96o29K68m1k09R4M4J16j90j02j10M01j44Q5J3l04K14M2J78m66J77l9J78
2600G2j0j34R4K60l44M2Q3p5J0K57j69J63k02j63O9L2r4O6R4P0l4j13K28K06o41
2625b33K20O3j56J17r3n0N3O5lN7k62M57l09n3K51k46N3J68k15L16j12l96N51
2648B43l36K43P7j76m3l00M23j48R1R6j39L0j0R0p7l03K27j47L12j3P1p1j55n2
2672f7J03Rk26K48K0j71j69M72j83K1K54m35L81m09M63m03j16Q3K57k12M0j69
2694b09K38k5l93K45K05K5K62m10k30Q4O35o09oK85k17K96l2m9K7m1p3j8k1N3
2718B2L0r2K7j8k54J53L66k23l1K97l86M74n12l29N63Q9j39j19j04K8M08m09M16
2741B57l12j00L24j07K6L8k08K80r8k81N3L87j20j55J24k17K33j99L02m36K31
$$ y = [496, -133, 135, 94, -115, -21, 23, 139, -51, -153, -263, 138, -6, 79, 92, -212, 2, 44, 222, -244, -67, -106, 72, 62, -72, 22, 282, -62, -20, 63, -12, -2, 255, 86, 249, 47, -116, -47, -15, -109, -43, 51, 121, 87, -26, 202, 408, -233, -13, 50, -106, 11, -82, -132, -79, -14, -17, 40, -222, 235, -74, -127, 124, -122, -69, 99, -116, 200, 88, -308, 243, -93, 150, 227, 51, 8, -292, 131, -17, 74, 170, 31, 61, 51, 141, 64, -239, -12, -159, 153, 140, 211, 140, -15, -67, 36, 45, -181, 67, 87, -84, -253, 219, 36, 57, 311, -124, 257, -152, 311, -92, -208, -125, 132, -80, -40, -209, 29, 4, -389, -144, 61, 86, 348, -62, -292, -208, 427, -182, -188, 97, -120, 176, 144, 95, 122, 81, 8, -10, -31, 22, 52, -40, -13, -31, -285, -132, 234, 11, -20, 277, -109, 365, -147, -476, 87, 176, 37, -82, -186, -158, 250, -159, 257, -55, -155, 169, 62, 88, 126, -82, 198, 100, -181, -128, 259, 139, -16, 108, -109, 124, -75, 227, -209, 22]
2762B2p7P9j3J78k41k89K59q4M7k88M10m2J01O8k78K50K23k91j1j11K75n03J80
2785a36J62K26l44J36k32J38M33l64J46l78K43J34m6k23J48l02M47k77m0J1J48
2806C0k11J49k09M6K28l1K42j85j03n1N5k08L47k03k03J93L5k21J65J22J0m0J22
2829G9j00M8N5o4P9K6k03J93j06Q2k36J00J55J1o6P5l20K20l9N8l2m6j91K61O
2854D5N0l33K92Kk40L15j95M3J40J7k1j65K18K0j32O3J00j35j37J03l9J03l14
2877b00N1O8j06R2j0K67l39K07K16m59K95M6k68K92r4O7j23m1M2Q2N1l62L23j85
2901h8K01l34Q4J09J87o5j23PK7J77l39R4J52N8j91k09J03K6N0J66M2m0j77J11
2925B8l23K73K72n00J72Q9J62j86K2k09j17L42k54L16p9J26J71o9J8k93K02l6
$$ y = [22, -55, 24, 11, 189, -52, -341, -82, -166, -119, -407, 3, -39, 62, 130, -148, 102, 325, 34, 23, -88, 187, -316, -136, 26, 252, -92, 44, -188, -50, 383, 19, 165, -213, 30, 164, 118, -105, 43, -259, 188, -89, -129, -118, 30, -181, -32, -241, -195, 33, 2, 244, 59, -44, -95, -40, -248, 99, -104, -307, -114, -79, -300, -135, -13, -3, -43, 79, -21, 27, 82, 18, 97, 123, -80, 113, 7, 89, -147, -47, 108, 119, 53, 128, -192, 28, -11, 47, 15, -31, -222, 39, 45, 95, -238, 54, 56, -184, 131, -64, -21, 119, 136, 115, -50, 168, 188, 56, 119, 219, 84, -53, 50, 11, 114, -200, -149, -81, -187, -95, -105, 162, -177, 30, 246, -213, 82, 128, -140, 152, 58, 125, 2, -39, 3, 85, 136, -226, 97, -88, 113, -221, -137, -28, 159, 94, -29, -22, 5, 182, -157, -63, 89, 147, -44, -253, -150, -124, -74, 92, 134, 94, -83, 28, -295, -22, 250, -250, -78, 11, 173, -13, 9, -200, -317, 25, -229, 87, 8, 134, 305, 236, 254, -39, 163, 127]
2947A27l23R5n3KK21J03j16p8j56L51k21q3R5L15l0j59k05j45L70J07l02j4j09
2970b08J75J37J4j13j91L80p8j30o1N0o1J62j48O9J06J98j43m46J51K7K6J45N6
2993A17q2m16L57j98M5K13j25O8J2Ok43K62Q0K1n6j73j04J68j03j36O5L21qM2
3017A33J45l52n8m8J86J8k16K88j18J48j97q6L16k47j9J76k61J42j74K43o5p5
3039a21L39k68J07N5r6J30p9r7O1J47k50pR3L7j0j1j42J23k36K65L8m5J27m8J83
3064B95k74j13J23j99L91j62J13j43j54k0p1L69j02J28l8J1j78j5J4n1J74k07
3086a09%J89O0j51j8J7k68J86k27N10k96l1N3qM8m9K70l11J99k23j57L30J11k59
3110a34J86N4k16J59Jj6K5k4p9j44L08k0Mp6J28l73K46o2K4l6p7M53l26K03l76
$$ y = [127, -196, -101, -154, -152, 69, 172, 56, -22, -178, 173, -48, -131, -36, 279, 249, 90, -115, -260, 110, 217, -85, -99, -208, -33, 104, 118, 5, -186, 194, 116, -14, -75, -25, -86, 76, -72, -3, 103, 301, 158, -288, -137, -110, -84, 61, 117, 35, -381, -24, -222, -177, 36, -89, -21, -9, -3, -246, 16, 96, 117, 61, -112, -216, -48, -151, -287, -222, 99, 91, 133, 278, -74, -132, -180, 6, 24, -192, 96, -22, 126, -71, -157, 159, -88, -107, 69, -192, -50, -224, 19, -46, -121, 218, -50, 57, 112, 16, 146, 67, -30, 31, 178, -72, -79, 14, 51, 41, 30, -112, 11, -225, 40, 78, 33, 160, 112, 295, 21, -92, 31, -168, 223, 61, 174, 31, -123, -143, -214, 155, 53, 181, 143, 154, -24, -39, -25, -76, 98, -109, -109, 80, 140, -11, -29, -12, -280, -94, -321, 189, -107, -138, -85, -93, -45, -94, 176, -135, 64, -159, -316, 14, 125, -134, 52, 106, -110, 49, 50, 34, 59, 35, -44, -188, 120, 100, 104, 28, 156, -217, 29, -33, -9, -45, -122, 331, 5, 208, -168]
3135a68K01L40l14q4j18j96M23j71J10j88M27l54q1L10j2k00k50M98j41N7k50
3156a61L12m9k31j11L74j52M1J85k39l2r3o8N6K10j24M08q4o9j84k63J11K39j04
3179b8R4N5j91j49M23k64oj49M09j74Lr9J25n0J84j74k3j05J0j26M87j94k15j4
3203a71k39L80N3Q4m03L23k10J91k28J82J47k3k44J31j40J4J32PK3oJ38j56KO5
3227E2o3k3K02m44J04M4J55k65k34K54M60j10q4j8j2j07J67O7k90Q8q8K17K76
3250C48m96K35q7q7L2J09J01k92R0O6kJ3K60n24K70j84L94l68K16k62o0N15k37
3273E0K10j63j89L40j74k2k56L06m1Q8L6o2l74L08k7j7J86l67L47j65n2n6K57
3296A63j80J76m0p3j10R7J22j71N2NK97j45j26J14n02j44K29j15M03K7p6j68O5
$$ y = [-168, 33, 373, 59, -25, -143, -339, 84, -87, 23, -165, 262, -92, -173, 137, 125, -75, -325, 173, 32, 89, -161, 151, 102, -129, -240, 134, -18, 23, 208, -31, -63, -156, -224, -168, 42, -82, 326, 242, 173, -11, -274, -163, 76, -28, 66, 121, -70, -219, 204, -60, -66, -215, 194, 20, 23, -76, 49, -1, 183, 9, -14, -119, -109, -235, 252, 58, -157, -171, -410, -30, 23, 107, -296, 27, -183, 8, -220, -38, 109, 86, -158, -27, -167, -153, -21, -14, 9, 3, 141, -15, -13, 52, -11, -34, 168, -276, -172, -128, 27, -238, -472, -218, 242, 132, 48, 30, 18, -89, 78, 145, -145, -57, -145, 72, 348, -148, 87, 0, -87, -55, 54, 155, -137, -47, 19, 17, 30, 290, -234, 36, -148, 246, -122, 94, -168, -228, 287, 50, 260, 97, -92, 248, 74, 52, -204, 102, 61, 149, 185, 123, -251, 57, 30, 13, 199, -168, 179, 14, -38, -94, 163, -17, 159, 119, 46, -64, 33, 155, -16, 36, 41, 338, 193, 67, 181, -321, -465, -236, -351, 52, 79, 3, -165, -100]
3319a00J24M6j68M35pl85J87j48j12K07R3l48QK60k12M11m7j20M9j51N2J98m79
3342b07j6M05j33k07M7J90k08J04j4p7k4o0L49r9k43M38k63K16m07J07J74m3k80
3365b51J39J19p3Q5J91k50qJ65k03j20J95Q5o9J59k68PJ11O1k21K76M19m09J27
3388B67k59n2N1MO4J00q3j44J10l38Q4M01k45N5J02k87J83l3j75J93O6p3J00L5
3412A26j24j9P1j15o7O8L33j11r2R3nj91J21m3J53J62n14L46k98J56J2J64k91
3435f5L4J53k2p9j08J83j44R6J74l11M1J44j44P5nk22J83k7R5k37M76k78r8Q8
3459BR0j30k3L6K12l35R6l77K28J55o9J76q7J22k8j60n1K37j71j53P1K94k09M39
3483C65m13J47Kk13N3K29m23J82K56k79K0N1m1M9J0K1K12n09P0L72j67K7J06o9
$$ y = [-100, 24, 70, -98, 337, 330, -55, 132, -16, -128, 79, 172, -176, -168, 92, -120, 291, 244, 124, 173, 22, 74, 272, -207, -223, 182, 49, -158, -111, 79, -129, -25, -39, -116, -140, -200, 149, 50, -193, 245, -18, 198, -209, -102, 72, 29, -251, -112, 7, -66, 19, 210, -40, -48, 117, -86, -206, -11, 74, 5, 164, -104, -97, 14, 75, -146, 130, 549, 140, 267, 8, -44, 7, 11, 75, 175, 92, -52, 58, -280, -196, 205, -40, 15, 117, -170, 13, -20, -195, -2, 64, -9, 91, 126, 2, -17, 54, -61, -128, -60, 273, 162, 70, 163, 158, -33, 88, 45, 198, 360, -154, 192, -106, 50, 62, 226, -65, -31, 122, 100, 21, -87, 96, -48, 48, 222, -89, -48, 96, -48, 27, 22, -200, -17, -44, 51, -186, 290, 12, -86, 2, 92, -38, -61, -25, 187, -148, -52, -429, -201, -46, -115, 61, -26, 96, 68, -92, -143, 94, -77, -230, -159, 135, -74, 365, -48, 99, 101, -112, -59, 170, -253, -71, 185, -94, -74, -23, -64, -15, -5, 16, 228, -281, -211, 161, -6, 21, 127, 58]
3507E8J10k76l79J74J83J46j39Q9O7j15n2L5M6L70j96P6k95qL6K11k94J07j81
3530b27L40n7j27N1j01L56n97M31m09N80k1k33k03J31J63j14K54k39K43j40N1
3551A32k17M2J4j04N71n00Q8O3j10K6j61J72L1j36O5K8o9n8K7R9N6Q0R0l54J65
3576D0J46k92j54L20L1K02m88J32J94j58L7m1J80m4J15m62J74J1K88j61m3p7l6
3599h6M1k8K29k38L05k91Q9j1O2K3p7K6J86j83J78r3j66J26K26k71p7Q3P7o1J32
3624B01k16J5l14m6L58p0N12o53M3L23l08J65p4K06l10l3J62p9P8J23k56K43J66
3647B36m78J63K5j45K73k2J09m9o0j38k2Q6OL77j56k26p3j10j11N52j62j20K25
3670A80k41o6J16j79K30O7r9J32j55p1M3K73j35j18J09j14m7O59m99l18J96j6
$$ y = [58, 168, -108, -487, -313, -130, 16, -123, -34, 33, -82, -134, -99, -53, 317, 121, 197, -98, -106, -70, 141, -153, -46, -227, 113, 56, -71, -20, -121, 235, -362, 69, -340, 240, 219, -14, -217, -86, 77, -37, 217, -22, 221, 81, 132, -85, -43, -29, -133, 438, -62, 26, 89, -21, 5, -156, 16, 47, -89, -24, 4, -65, -123, -96, 3, 59, 139, 229, -125, 40, 186, -106, -260, 60, 91, 293, -195, -63, 131, -27, 10, -31, 149, 105, 220, -242, -68, -57, 231, 70, 27, -50, -86, -45, -73, 156, -82, 223, -68, 21, 10, 72, 95, 18, 44, 230, 47, 225, 132, -34, 92, 318, 47, -30, 53, 130, 69, 201, -15, 0, -314, -360, -2, -72, 440, -213, -170, 153, -155, 10, -64, 142, -168, -201, -39, -118, -40, 83, -173, 70, 236, -242, -79, -54, -199, 74, 52, 161, 112, 52, -86, -108, -22, -16, 361, 205, -21, -94, -204, -315, 237, 75, -45, 180, -61, -127, -11, -190, 40, 107, 8, 140, -15, -86, -43, 230, 95, -23, 86, -28, -75, 584, 85, -233, -37, -53]
3692e3J47k07M5M8R8j69J62j79R0K36k88o2J46O7Q1k02l1o4J42RK31r0k65rK26
3717A09L7j96K1J10NJ30J84l43J2j29j45K71R9n0j4j40J90j09j78q7J33O3K1k4
3741c0k40%L16L7j35O1J66j45j17j1L94l00o3k7J42O0rn6Q6j22J87k85q1K94j94
3766g2J44j43M0Q5l18M83m9Nl64j07OJ39k0K64p6l5K63k46q9Q4j13R9m6P5L7o6
3792b0J09p5J34n8n2o3l3p2Q5J4L22k09J08k09Ln5q5J62j08r0L82l45J71M3ok37
3818a84L10k14J70k06K36p2q6J49j02p6J17mk46J06j9L17l2l25J99j44J06J54
3840A54J00k90j69q4K07P8J20k25J49K5l12L98j70P5k85L1j61J56O54o28L57j65
3862A5N0L9j35J44m4l18M92m10L32j01J28j08j4m4o5J26n1k4n8o6Q7k81j2L85
$$ y = [-53, 94, -113, -68, -20, 78, -91, 71, -108, -18, 218, -70, -132, 14, 81, 162, -40, -71, -135, 7, 16, 247, 157, -108, -117, 109, 146, -50, -29, 81, 86, 216, 400, 57, 69, -60, -205, 66, 165, 115, 101, -39, 151, 42, -136, -223, -90, -27, -6, -30, -270, -270, 46, 83, -52, 9, 175, 30, -87, -98, 296, -4, -67, -94, 48, 108, 99, 43, 129, 7, 194, -91, -172, 122, -72, 72, -71, -31, 54, -264, 219, 170, 175, -189, -296, -290, -151, -171, 93, 17, -18, 245, -1, -90, -6, -119, -20, -66, 9, 46, -20, 89, 14, 148, 90, 38, -25, -58, -130, -45, -31, 291, 82, 190, -19, -16, -71, -156, 6, -102, -192, 190, -155, 16, 59, 53, -184, 126, -88, 82, -124, 112, 40, -46, 103, 1, -75, 42, 38, -208, -102, -121, 196, 164, -161, 38, -106, 0, 154, 254, -36, -205, -289, -82, -4, 116, -109, 40, 65, -247, 151, -19, 56, -229, -198, -359, -203, 451, -177, 180, 15, 65, 104, -31, 113, 69, -249, 243, -167, 165, 64, 192, 84, 70, 26, -39, 87, 36, 12, -46, -112, -25, -306, -318, 67]
3886F7m33L68K6NP2M1l63J81K34l36J16R3qJ42k71p2K50k94R8m1R0p7j73L44r3
3911c4j10O3L54r4l90J42rK69j89m0k6K72j25j19K16J73o40L96k08J54j04j92
3933b41K75J3j97M69l78j6o7K48q6l0j22Q5l8r9n4L17Op5J07k59K84J73m03J94
3957A06j8o2j65J53J11m20M27l81K9P3P6K82k51K44q1l31J50L4k4k76K60Q2j1
3980GM5K8p0l1q3m7L1M5J66r7n5K15j80k02K89O4J48m67J67k58M38l47j7K54k22
4005a79P0J17J7m6L5j80J38j16K07n6N8J2l3k73K49k14L15k26J02K7M0k39n2L21
4029I4l16K53k44J18J10J31l07j4K20Mj08k6l1J92l6J66j96k8j44K14k8k20N5
4052a41J31K2j49K3k3P7o7K97m39K15j99J91J03q1R3J79l28K14l41J50J38j04
$$ y = [67, -366, 2, 28, 33, 105, 146, -217, -36, 198, -138, -22, 71, 63, 205, -66, -138, 112, -182, -84, -125, -35, -112, -285, 59, -34, -144, -81, 273, 179, -211, -69, -78, 191, 2, -38, -64, 208, 83, -36, 180, 353, -287, 109, -99, 55, -49, -241, 34, 47, -150, 319, -59, -75, -142, 106, 20, -10, -132, -47, -85, -184, -238, 79, 85, 10, 117, -142, 142, 315, -88, 106, 88, 26, -139, 14, 125, -295, 132, -249, -220, -147, -71, 211, -40, 204, 123, -208, -58, -24, -48, -324, -64, 18, 7, 52, 80, 10, -21, -104, -151, -120, -75, 91, -6, -61, 154, -26, -228, 61, 125, 273, -194, -27, -285, 153, -194, -211, 43, -179, -109, 8, 25, -21, 14, -166, -28, -144, 63, 7, 65, 77, 44, -229, 20, -194, 121, -105, -3, 24, 64, -175, -227, 94, -222, 31, -213, -95, 15, 146, -161, -175, 45, 49, -59, -85, -116, 76, 40, 206, 10, -18, -162, 52, 24, -196, -141, -10, 12, -137, -114, -137, -60, -127, 170, -269, -54, -253, -62, 41, -40, 53, 232, -96, 118, -223, -73, 65, -39]
4074c9L42m49K96j09j11p5l5j10L94j26O1n9Q2p1K00j76q3q4J16k93L99K18l03
4097a5o3K2P1oJ8K1kJ16k58k08J90OL59l05N5mj51J34J23J07r0m84M42q6J05j80
4123h3k9J54j12Q8J34J09m01J81j79m1M40k30N0K1Q3rm52L65nJ60l48L21j73M4
4147H8k4m56J64l3l4K90k1j47R5j43L30j74r8K06N60o16J2P6O3k19O4Q5k65P2
4171a25J13J19R3l7j87O5L0l21L65k14k16J65J17K88l65J75k60K63lj4k10K34
4193G5J40j81m6R9k76N09k64j41j12J40j71L05k13q2K39K01k47p0K7q2K35r2J4
4216Gr4K0PK4j66J68J32J22j18j90J21L9j17K1l5l6rL59m99L2J37r6J06j39J78
4241b6O3O0l1O5k15Q6j45Q6K8P7j93K37N43q71K34k35J92K34k88p7K20j77J26
$$ y = [-39, 303, -146, 150, 41, -70, -145, -180, -290, 104, -22, 39, -20, 62, -9, 191, 15, -68, -152, -36, -329, 70, 288, -15, -78, -56, 15, 9, 27, 48, 46, 162, -96, -304, -114, -108, 251, -54, 1, -3, -154, -20, 103, 210, 120, -364, 78, -8, 97, -83, -112, 42, -70, 18, 152, 261, -140, 41, -138, -179, 261, 31, 81, 102, 185, 176, -276, 89, 84, 244, -104, 217, 44, 88, 64, -392, -228, -261, -295, -5, -26, -173, -78, -221, 109, -65, -163, 43, 603, -13, -1, 75, 138, -81, -17, 68, -197, -125, -12, 107, 200, 163, -24, 41, 71, -250, 115, -99, -315, -150, -33, 255, -110, 65, -195, 68, 65, 51, -159, 75, 215, 34, -12, 87, -189, 320, 56, -85, -197, -57, -228, 77, -136, -218, 21, 222, -25, -95, -68, -150, 85, -7, 7, -87, -67, -60, -36, -202, -34, 98, 220, 102, -88, 33, 72, -45, -24, -59, -95, -104, 255, -244, -212, -75, -171, -65, -204, -26, 37, 97, 66, 131, -84, 2, -143, -57, -29, 48, -145, 92, 635, -236, -2, -237, -45, 189, -99, -176, 44, -133, -7]
4264gk19K44J03k7J53l31J9j34M7J00NL41k26n3r4o2j77O8L38pr1o7K12j56j01
4289a22K53l54K77n6j52J20m45N62j76K08q6Q5k03j62J99o5P0j49J71O4r3J2k9
4312g1n5J57j48K40k43J78j33Q3J2q8J96j06m2m08N31P6J4j81p2J21M2j33J36
4335A06k99K65l13K29q1J05N7m7K46m16K92j58m04M50L9%K2l08J90lMp0L16k40
4359a8Kq3J73M5rj67k6P8M9jK7M7j37N1K93l91p7K50k22J63r7J22k53K33r2j2
4385e2R8q3J3k78M03R1j71j9J17M9j53k23M01k24nk0j37K74J23L9n33J71J52n0
4409a7j02l08K97J64r8j70K22j66K89M5k03K80j39r8J70Q8l09K57j60j6j58L17
4431A85k42p0K11Kj94K51J10r8p2j42p1K40p4lJ4N2O8m58J66M79l52M6j79k1J66
$$ y = [-7, -226, 18, 121, 94, 247, -84, -65, -199, -152, -52, -47, 294, 68, 15, -79, -141, -318, -250, 88, 81, -10, -77, 135, -21, -122, 131, -223, 54, -2, -154, -34, -479, 83, -93, 115, 29, 114, -89, -251, -52, -117, -47, -196, -25, 39, -54, -42, -71, -126, 31, -117, 123, -120, 58, -75, 8, 20, -68, 128, 22, -20, -428, 103, 179, 193, 12, -60, 61, 103, -30, 106, -193, 72, -241, -12, -93, 12, 69, 22, 268, -148, 144, -14, -418, 32, 71, 71, 93, -215, -25, -28, -24, -94, 222, -18, -16, -99, 74, 119, 110, -57, -83, -5, 44, 43, 70, 117, -20, 31, 324, -67, -144, 106, -116, 47, -50, 72, -181, 52, -40, -52, 46, -37, -24, -302, 101, 192, 21, 2, 119, 168, 15, -208, 193, -31, -36, -56, -193, 81, 204, 243, -290, -119, 33, -17, -119, -427, -130, 34, -64, -234, -12, -178, 111, 156, -47, 233, 94, -4, 166, 254, -55, 202, 42, 26, -132, 185, -57, -127, 84, 86, -108, 143, 253, 155, 83, -59, -130, 110, 36, 33, 47, 99, 167, -291, -125, 354, 2, 48, -131, -152, 14]
4456A4L4L7j9R0L00n08j94J33N9M36n49M16k40Q1o5K13l12O1N2J23q8P9j79l5
4480f1N2M2j31J83j09R8j9L42l35J06Rj89J70p8O1J42k46j26J66J06k94J59j3
4503C5q6N4j56L3N1K02l32K77K35l79J97l37K66l9Or0k13K52Q9j93J38%l61K73
4527g8K75R1l72J01q7J59k0j93J81M2k39R6J14m23L76RNj39K86k58K44j11l33
4550b74K02P1J55k28OK26R6j81J72l91J99j05OK61j99j48J88j90j88L36J07j08
4572A3r3J26J97j91k64rK92mo5j38J26lO2k01K71q4J4j08P7j28j22J13m5M67k00
4597A03j46rK38j92j51J60J6l0k14J81J20J34j69L6o4L8j09R8K20k48k42Q2J66
4620A8K00k76j3N55l04l9j55J58n54M31k74K39L60l20J06k09M7M6O6j72j34L38
$$ y = [14, 48, 85, 66, 156, 456, -52, -246, -113, -54, 382, -167, 249, 9, 90, 25, 238, -74, -13, 39, 162, 74, 153, -26, -61, -9, 33, -98, 85, -24, 74, 55, 397, 62, 168, 177, -12, 158, 80, 141, 283, 37, -89, 77, 183, -111, 48, 35, -51, 3, -153, -120, -69, 133, -199, 78, 313, -66, 131, -206, 60, 21, 27, -63, -276, -24, 65, -128, 10, 10, -351, -78, 197, 288, -84, 17, -70, 89, 69, -124, 57, 99, -140, -44, 70, -353, 23, 32, 37, -102, 184, -74, 170, 59, -274, -72, -1, 154, -74, -68, 158, 254, 73, 245, -146, 53, -52, -46, 215, 16, -132, 56, -134, -322, 14, 121, 13, -80, 46, 243, 52, -212, -221, 71, 67, 2, -136, -10, -13, 49, -152, 119, 35, 49, -59, 18, -110, -232, -119, -164, 303, 103, -43, -52, 186, -6, -157, 3, 19, -11, -225, -44, 76, 210, 41, 77, 13, 51, -58, 40, 260, 12, -230, -148, 18, 218, -58, -71, 484, 180, 141, -14, 144, -410, 21, -253, -14, 346, 26, 132, -77, -30, 16, 82, -90, -224, 114]
4642A14P5O2l97K67J0l05J89j14L00l0k99J01k94L65l19R8NL40j78R1k91J87p
4665c0j54K87l71J73K53J03j06j23j2j14N20m55K7K81l61j89M20q8j82l6J77J49
4687A69j80j43j86K18J36Q1q9K57l59L74k61Q4j9%N9j60J70j95K30J3j49K53k69
4710C4k27M5L06O3j71k28L04j76r0K05j82K41j20K24j42q9o7J62j34n1K24l49
4732b18R6J95j10J20j67n2J95NJ7j36J66j65k6J58k46K55j84K44%j76jj30K13
4755E3j59o4n2L77l50j14L02J14p9j00j48L46k25J46q9J27j0k46M20l82qK82r3
4778D8j50K68k17J1J15J94m30J79j5j19K6J06k19M03k60K2J17k35M0J44j08J57
4800G7k84j55L36J56q8j63k11K98K19m04K23N0p4L0K53k59k29M60l49k5J4oL40
$$ y = [114, 189, 251, -146, 121, 131, -174, 15, -99, 201, 171, -128, -27, -321, 44, -275, -177, -172, 168, -10, 81, -210, -23, -30, -184, 103, -268, -95, 158, 261, 155, 32, 20, -94, 426, -29, -2, 279, -82, -271, 149, 61, -121, -157, 20, 169, -11, -154, -340, -122, 14, 95, 6, 263, -96, 278, 17, 101, 82, 82, 141, -19, 151, -44, 186, 199, 50, 303, 34, -193, -148, 158, 221, 50, -178, 126, -50, -140, 65, -117, 124, 4, 228, 86, -3, -70, 92, -42, -93, 131, -218, -122, 73, -37, 83, -84, -136, 59, 64, 81, -55, 111, -54, -80, 78, -168, 87, -97, 147, 147, -29, -30, -160, 53, -106, -170, -222, 155, -195, -309, -7, 107, 28, -72, -220, 126, -99, 47, -42, 85, 75, -171, 249, -133, -141, 141, 48, -102, 166, -51, -40, 75, 269, -161, 18, 3, -116, -90, 16, -203, 200, -60, -38, 79, -156, -116, 28, -80, 77, -207, -362, -26, 130, 42, -121, -332, -34, 185, -219, 4, 54, -20, 10, 263, 4, -225, 235, -114, -139, -125, -131, 209]
4823B09k20J71l20k6J19oj2L9O1j4p6K54m63M44p0k79K53l02J72J69M4k87J10
4846c0rM0k2N4M1p1m8K11k22l3r5J46J69j73K6J77m0q1p8q6J16P2J71o3n45J42
4872b31K41Q5Q9q1k8o7r1q7K67j43O6Qj07P8q0q3O0K31k97j77J42J85k00J21K36
4897A37l35K74r7J62p1Qj72K46l70k3M44k4n9J17j47r6q1j70K21M7p6MK08p7j59
4922h9J05j25lM53l85j4r8M16k18k68J98j63O33m82L1J83k22L64lk84q7L1r6L0
4946i3K70j21j43J53n6k20J10Mq4N1K0P9l8J54q7m2L6JK52k77K32j76l8n8R4J64
4972A87r0P7jj18j97J58j63n4K72Kr7j81L01K01n34L03j20K06m37P7K4J39K06
4995A61j53p4L13l22K28m0k50J31M3J09j65k51L63l86M24j47r5J23J7oJ74k27
$$ y = [209, -11, 160, -160, -186, -67, -73, -85, -46, 15, 1, -75, 179, -284, 160, 90, -189, 64, -238, -66, 103, 147, -140, -30, -39, 1, -21, 33, 74, 3, -45, 166, -56, -89, -184, -38, 131, -42, -16, 161, 121, 40, -38, -124, -8, 64, 235, 172, -373, -231, 10, 95, 184, 103, 75, 8, -83, -170, 97, -46, 20, 28, -79, -1, -81, -164, -104, 127, -170, -347, -205, -20, -220, -99, 137, -198, 76, -21, 141, 70, 78, -94, 152, -218, -241, 203, 179, 120, 237, 90, -6, -87, -257, -36, 11, -65, -61, 147, 70, -89, 16, -109, -112, 341, -44, -58, -156, 260, 42, -226, -28, -191, 442, -40, -9, 174, -48, 316, 313, 29, -58, -27, -123, -93, 177, 56, -87, 66, 10, -210, -100, -96, -180, -129, -109, -30, -68, 86, -1, -43, -7, -6, 246, -31, 201, 25, -13, -71, 23, 187, 97, 174, 173, 55, -142, 16, -147, -201, 71, 73, -24, -205, 96, 297, -237, 66, -54, 152, -285, -208, -184, -45, 161, 8, -66, 247, -75, 153, 113, -137, -6, 37, 146, -19, -270, 93, -293, 131, -16, -111, 12, 29, 23, 197, -30]
5017c0j4q4M07j09m08J62K24J5l76K99k8K8rO4J7j68J02k48J83J37n6k56j84L1
5041c01K69q3J54Q8k58l5K63l3k85R0r4M59j86J09k47J23j70K72k79LJ99j35K10
5064A33q7j90K14j87J61J26j4j54k50J54p5K36q0j04K66R3n56L75J53l95km3P9
5087a47J55J59l19L23p4j47j18K08Mj44k2l5QK37k8Lj26p0K89l61O6j25K25lL03
5112B61k99J64m8n6n2p6K89j25l59J46L07k83L82j95k79L55K4P1m06J45j05J3
5134a26k6K88K2m15L57K6l25K65k03J5J55k09J64k16K08p9L13k83j11K13L5m2
5156B6j81J2R2K42M5r5l6N7k04J8j20J13O2J06m50M08k54R4j45J3m5J31M49k24
5180A14k19k7o6K29L8j49L66l57k71K78RJ64l42P5K72l5K88l73L7l43K48m2R1
$$ y = [-30, -44, -128, 279, 170, -238, -76, 148, 163, -213, 86, 58, 86, 77, 141, 158, -10, 92, -156, 27, 164, 108, -148, -332, -301, -32, -115, 39, 127, -131, -166, 97, 64, -221, -131, -225, 234, 48, 157, -90, 33, -137, 135, -144, -141, 58, -77, 133, 46, -144, 70, -117, 44, 170, 156, 2, -248, -94, -169, 67, -13, -117, 149, 242, -314, 61, 214, -181, -183, -226, -147, 8, 167, -152, 171, 97, -50, -168, 40, 44, -100, -122, -157, -149, 88, 60, 63, -63, -133, 156, -205, -139, -264, -39, -42, 261, -38, 126, 78, 22, -30, -106, 183, 58, -301, -155, 152, -131, 251, 56, -223, 132, 156, 227, -179, -34, -139, -126, -152, 136, 158, -257, 100, 126, -199, 66, -137, -122, 33, -176, -12, -228, -20, -99, 214, -69, -180, 33, 68, 26, -155, -143, -51, 191, 236, 141, 105, 162, -42, -24, -144, -31, 31, 137, -313, 95, -159, -65, -210, -197, -242, -111, 338, 114, -105, -132, -198, 31, 69, -80, 286, -71, -342, -64, -55, 109, -233, -158, 114, 79, 367, -6, 31, -312, -64, -106, -15]
5203a5o8k9O04n46p1K44o0q3K7k24K42O6jPJ39m41n9k3J70P6K87k11r7K08j93
5228e1j77K55j13q3Q3j57K19j04M26o53L11K0l7jQ3J56k70j24M21q9n3k48K05
5251A9j84O2n3J95j18J60Q2l6Rj3L2P0q7j62n8N1oj6N6K3k5o2l4K43p1l8J12m8
5279A03l34R9K13j2n3j50n8K45P7n8K1q7K08l36J35n6K69m80M25m87M75n2j27
5302b0q4L65k70N1P3k59L8J04J65o9j49j18J65J18k37J64m3j07m9J55L28l11q0
5325g0K63n92J61K82r7K67j72r6p5M0J49J90o03O3K48K29k5m9L0j70j5K18k42
5348f6k62L93K3K8k97K50m4L90n48J50K68j17m6p3J40l15P6r9M13K2m36P4J39
5371F3L9j86M76j38k85K9j15K00k65K76J5j72K49j07j81L24k63J57k1l2j14KM08
$$ y = [-15, -83, -112, 492, -54, -125, 119, 59, -24, 3, -221, 21, 87, 86, 93, 232, -209, -268, -291, -121, -45, 242, 31, -66, 142, -51, -228, 27, -86, -169, -86, -243, -24, -128, 298, -355, -44, -24, -61, -62, 21, 177, -93, -217, 204, 115, 62, -186, 19, -165, -103, -156, 39, -79, 81, 163, 127, 136, 123, 155, 225, 138, -24, -82, -31, -37, -53, 3, 26, 1, -61, -95, 148, 77, 39, 151, 103, -231, -132, 81, 69, 16, -134, -192, 53, 130, 72, 93, 6, 214, -122, 13, -43, 226, -254, 171, -316, 159, 107, -20, -104, 261, -9, 42, 115, -144, -106, -2, 163, 94, -55, -173, -8, 110, -127, 37, -6, -113, -162, -7, 321, 10, -70, 193, -399, -238, 44, -53, 214, 42, -54, -129, -89, 60, 250, -353, -290, -42, 187, 162, 113, 143, -27, -42, 176, -66, -328, 65, 88, 116, -181, 69, 25, 415, -133, 17, 285, 168, 122, 49, 189, -126, -50, -149, 264, 286, -150, -76, 63, 102, -84, 392, 254, -31, -2, -117, 83, -182, 94, 109, -63, 186, 79, -102, 222, -41, 116, 95, 63, -51, -49, 359]
5394C59m73J96j9k82J16M7J82l67M20p0j91p8J57lr4K59k25L2r5K42J86l03L5
5417C1k0o1p2R9k16M92j3k45mK0r5j43L25J99l10qj38J67K02m18J74J18L1k71
5441a56o1K55Oj03K96pk74J08J0J3lj92J32kn0j34J01P9N0JJ0l53L21j72L00L40
5467E15l16j98r1K17j39L74l63j04J62J05k06j79M24j02k9j31o6J2Q7J83P3j66
5489F2J1k95J13n7j24J35Q0J87k48Q0j77P8L65k38q3J10j28K55m3J2q6m9K16q9
5513H7j57J16k98L85l65K36K7k6P1J33j96J23k7j41K86l79O9j38K62L61j23j93
5535A13k48K62o6p3K26p3Q4m16R0M53l30o9k8L31j94k69J71J24r1R1o4m2J23k80
5559a75J20J07p2j7k80K46P4k96M54j03j85o2L1K79n4p4rj90K94l28K03K03k37
$$ y = [359, -114, 82, 63, -219, -103, -56, 126, -241, 179, 109, -82, -160, -3, -6, -100, 159, -66, -34, -129, 113, 299, -4, 31, 11, -50, -122, -23, -239, 253, 240, -5, -9, 11, -84, -227, 98, 297, -13, -21, -159, 8, 210, -208, -34, 84, 115, -156, -217, 38, 44, -59, 237, 230, -44, 64, 74, 87, 84, -108, 24, 22, -28, -162, -61, 18, 68, 69, 79, -274, 47, -125, 175, 515, 199, 1, -90, 127, -12, 362, -1, -105, 57, 162, -44, -223, 201, 99, 70, -61, -127, -115, -28, 155, 228, 62, 73, -222, -109, -166, -290, -155, -75, 112, -136, -56, -233, -155, 210, -28, -111, -1, -129, 126, 83, 95, 9, -40, 176, 87, -70, 46, -252, 133, -232, 4, 31, 5, 76, 209, 13, 136, 109, -32, 254, -125, -56, -194, 68, 429, 306, 113, -135, 127, 61, -12, 214, 141, 225, -191, -101, 352, 22, -47, -75, 256, 62, -207, -36, 88, -3, 88, 24, -18, 105, -175, -55, 52, -20, -37, -317, -71, 3, -293, 161, 58, -127, -189, -158, 121, 67, -7, -16, -206, 88, -240, -37, 166, -71]
5582g1J29M9l75K28J10l73L37k30J75k40L40j90M07m6k10m03L82j79M7J70m3N6
5604G0k69J26J7J5J28j68J97L5j85J70p0j00j1J46k32L20m88K74J80q9J12m1q6
5627E1l1N8K2k57L4K68j67K49k59j08J70k16L42l22K22j39O3j31q5o1L77J08k41
5650e3J48j95N0j21M22jN4l41j04K09l1M2j69K63k52P0J56l48L46l84L06O9Jk2
5674A15J8l54K17q5R2P9PL9j35k21K44j32J66k86K15o5J36j77O1L43n44M8J94
5697b5k55O05l62K74k37j13k13K95p1j86P50l30q4k60L66j92J22j31n3M9j32J99
5719A6K53k72J07o8RJ21j51j35L63l57K05Q7J30k58m3K32m80M21j4k87K49l96
5741b68K65K54k20P6j11O8l70M06Q2k78m8K9K12r9l76L95k54k2M20J06m88K59
$$ y = [-71, 58, 107, -268, -40, 70, -303, 34, -196, -21, -261, 79, -111, 296, 250, 40, -363, 19, -160, -113, 57, 14, 70, -199, -73, -56, -41, 87, -81, 116, 151, -34, 136, 66, -34, -45, 101, -131, 189, -299, -25, 155, 66, 178, 137, 51, 20, 78, 100, -157, -123, 145, -22, 227, -32, -140, 30, -186, 156, -166, 56, -83, -20, -151, -236, -297, 80, 188, -53, 95, -100, -50, -171, 251, 250, 304, -37, -141, 68, 37, 79, -90, 173, -79, -9, 147, -201, 145, -239, 67, 136, 137, 115, 133, -221, -4, -89, 3, 82, 89, 128, -7, -228, 16, -116, 50, -236, -21, -86, 50, -127, -66, 277, -267, -219, -25, -280, 325, -37, 237, 0, -113, -326, -31, -102, -288, 462, 132, 48, -212, 154, -38, 84, -47, -100, -51, -183, 16, 269, -3, 104, 36, 45, 166, 15, -120, 243, -114, 91, 178, 308, 50, 7, 239, -241, 180, 166, -121, 128, -268, -3, 251, 31, 107, -4, 64, -306, 100, 182, -96, -144, -115, 97, -2, -378, 17, -237, -259, 161, 267, -221, 38]
5763C8K2j35M5O8J3j45J1m9K38k03K83k86K36K6ko0j13J27j69o0J56J16R0k21
5787B6j14L16r8j27k32n4J07p3L40j20l00L65J4R3oj56Q9Q8k46J38n5K51k73Q8
5811F1k13P0K40k34K41j14j2J65l75K88j9l04K78l51M77L4k46k42J58L82l17K48
5833B15k13J46k3l57L75n1M6j90J97j22j29k22N33l29K50J17l20K69k85r5M38
5854B50L3l30K52p3l31K04j69j88J88M43l6l44p5j17L02J84j12j57j78L74k80
5875a60J10K74m55K73j73N02j46k09j6J05j32J54j28R5k18J6K60m41J52K28l2
5896E9p2J00p7J45k35N03k75l24M18n00K17j99L20j02l13K27N6k17L35M2R3l17
5918a16K6O7j01M27m01Jj49Q8j0Q6K48j84L53j99k30J8J97k90J31k5L14m69M45
$$ y = [38, 60, -75, -30, 38, 51, -94, -83, -132, 106, -97, 186, -100, 136, 162, 160, 100, -13, 114, -55, -115, 41, 157, 247, 26, -88, 228, 130, 3, -229, -283, -176, -249, 91, -29, -329, 36, 50, 143, 137, -19, 70, 158, -88, 50, -5, 246, -27, 61, -152, -82, 158, -76, 165, 51, 39, 204, -171, 117, 98, -206, 72, -279, 198, 232, -14, -256, -98, 284, -33, 215, 2, 148, 125, -232, 143, 92, 138, -52, 145, 23, -106, -328, 205, -124, 126, 243, -77, 192, -93, -188, 250, 283, -47, 205, 132, -199, 5, -164, -352, -164, 279, 243, -101, -176, -293, 9, 193, 81, -76, -254, 120, -160, -50, 224, -231, 42, -131, 371, 225, 16, 0, 105, -27, 127, -1, 94, -124, -108, 152, -289, -137, 91, 59, -13, 87, 10, 155, -80, 423, 148, -176, 242, -258, -41, -240, 80, -22, -335, -108, -52, -269, 66, 108, 201, -116, -90, -23, -124, 303, -98, -97, -246, -158, -168, -82, 166, -18, 335, 136, -94, -76, 121, -169, -38, -63, 251, -218, 227]
5941B27l92M4L97l08p3K67j93K63l49J62m4O2k63L30J81l94M19l80j33L03j38
5962a2o7K36J9m6j99K28j65J32k88j22L99k30j1Ok24M41l35L72Q0j31r8Q4J52
5985B21m45K82J35j53m4n9J05K39k98qQ4J18rm1k9J6q5Q7r0P7j96j81K82J17N1
6010A76k35p3l6J71j54J88N8O4N4l39j8K71j38n7K03j15m8O1J37j07J12k84J7
6033i2J41k78Q1K09n8O3j74OJ34J1n6q1k41K61J84p7o6N3N2J35k95J18p0J49j53
6058d4k59J18J85K1N0l43J67N1q2L24j75J7q0O4k9ml00K44J37J31p5L4k44L67
6082B75k72j05K17k87J63j2J13k7j80K50j00J27k69K19q4k06K0J01J4K96l77K24
6104A00K0k68j7K87j16O5j08n4J45P7m6j87R9J25M5j54j30J80L9L6o2j01O3k41
$$ y = [227, -165, -121, 276, -32, -105, 162, -31, 232, -117, 45, 1, 63, -200, 130, 311, -83, 336, -44, -177, 126, -12, -79, 157, 176, 130, -69, 159, -6, 126, -162, -284, 115, -115, -126, -120, -344, 97, -238, 134, 214, 83, -15, 69, 221, -224, 58, 193, 40, -4, -63, 42, 281, -17, -25, 59, 177, 168, 127, 98, 114, 29, 116, 26, 103, -93, -274, 8, 125, 176, -59, -132, -168, 3, -151, 37, 95, 159, 213, -126, -144, 127, -11, -68, 135, 20, -28, 33, 170, 63, 175, -109, -92, 49, -229, -148, 61, 3, 66, -108, -102, 32, 43, -13, -94, -335, -74, 110, 33, -33, 20, 72, 207, -88, 30, -40, 109, -44, -303, -185, 0, 21, 71, -272, -105, -54, -136, 188, 13, 30, -50, 14, -15, -19, -319, -75, 62, 193, 118, 152, -92, 275, 3, -102, 115, -172, -9, -21, 92, 65, -115, 135, 35, 162, -107, 112, 28, -178, -158, -57, -43, 253, -124, 100, 120, -148, -165, 122, 6, 71, -37, -91, 54, 131, 85, -102, -3, 122, 167, 13, -117, 63, 102, 138, 76, -25, 38, -203]
6128b03K07k27K33O3j33NJ73j74P5j46J58j02kQ9k91L25K09m57R4K07j3K99n93
6151b04L55j02K8O8j05j77J9K96n2j68j01J48l04M28k37L36k63K09k35J19J03
6172A61l61K34j12j45L54L4m9j75K80j15J37k86k0jl8j33J90N3n07M18J71K08
6194B98l72J50J5J49k42L0MM8Ol00K1j0M21k16rR3n8k88P8K31l33K25k32M12K49
6219C70l64O3M3k42K05j42r5P7k44N27j98k68K84n6K17n9J61m49J01k94K26K76
6241A39q4p3K0k57L20qJ46j50k47J02L03k26J79j05J5K50m53M07j36l42K23J9
6263D2N2j22j54L61k13J06n7Rj03R0l7m9J14n6j76L43j50m7j53K38J38j27N8j73
6287f6M2k2rL23n02Q3L34k46K3q5J54j97K6P8J94k00K1J40l33k2L57j99j39K89
$$ y = [-203, 4, -223, 10, 73, -60, -55, 118, -56, 19, -127, 31, -71, -73, 16, -275, 50, 259, -198, -104, 103, 90, 389, -204, 151, 49, 77, 145, 40, -137, -118, 178, 126, -42, -143, 5, -299, 129, -108, 228, -35, 174, -61, 58, 161, -200, 34, -78, -223, 131, 165, 116, -59, 221, 106, 243, -43, -63, -64, -102, -235, -45, 8, -499, -81, 90, 298, -74, 76, 91, 240, -2, 28, 32, 80, 86, -214, -193, -203, 218, 2, -7, 86, 28, -260, -182, 49, -284, -59, -291, 121, 370, 6, 69, 112, -130, 75, -67, -162, -85, -329, 198, 0, -268, 16, -40, 177, 118, 279, -170, -69, -363, -137, 139, 55, -18, 2, -255, 65, 57, 203, 53, -194, -92, 211, -15, 164, 59, 74, 324, -129, 278, 142, -200, 23, 42, 94, -28, -182, 179, -34, 72, 15, 24, -79, 11, -26, -75, 39, -17, -193, 150, 0, -47, -200, 38, 176, 49, 107, -66, -24, -46, -55, 268, -234, -151, 183, -63, -40, -125, 29, -168, -142, -64, 130, -70, -49, 91, -242, -264, 93, -106, -245, 44]
6311D4m7K13k57J95j03Kp5O3j91Q9k74L80k59j6O4J51K43J20m18jO8Q0q0K58k51
6336bj4Q4k78L83k53P2L0J78J39l59k15K09J79j47j51J96N1j73M40n98M87m33
6358a75L53K0n7j62RPK8K00k73K82n55K51J21J05Q6k68k04J59K58k30J81o9j66
6381i9L54k29QK85n00K35O1J6k15L7l4J54nj16J80N5j60l10K77L42o09L56j24
6404d1M84m15o6o0O0m6j6L65k43KJ80q6L8j05l93M36l16M91r1J3j38j20l2J54
6428E5n4M2j97J56J07k30J00L5k87K81l2k38J09j0J83m2P5r4l3q3k8J56k17L61
6452A15n5N0k03P0J08k95RP9L02q1OR9p1j16r2j83K92jKp7j41L19j28K86k33O0
6478A21K61k82jm46L00q7L19m4O9k93J03L2m78L40O2p1j45L26o5O8j08L8k5L9
$$ y = [44, -3, 210, -47, 148, 45, 47, -28, 35, -156, -67, -341, 39, -220, -236, -172, -21, 222, 342, -76, -77, -9, 71, -9, 249, -2, -16, 68, -210, 173, -80, -8, 22, 200, 339, -20, -235, -26, 153, 6, -145, 51, 102, -71, 369, -229, 258, -175, 178, 198, 141, -21, -12, -5, 23, 223, -50, 232, -323, -72, 49, 154, 240, -28, -232, -73, 185, -45, 136, 67, -99, 255, 26, 34, 319, -181, 54, 115, 131, -84, -47, -81, 73, 68, -48, 132, 187, 27, -283, -6, 336, -273, 83, -41, 443, 28, -38, -98, -38, -84, -100, 265, 22, 24, 204, 118, 156, 51, -342, 94, -222, 269, 178, 191, 53, -67, -99, 55, 1, 43, -154, 2, 109, -121, -21, 14, -273, 8, -24, -262, -153, -163, 20, -22, 53, -41, -74, -157, -185, -29, -246, 115, 60, 110, -93, -23, 85, -210, -201, -122, 180, 99, 105, 204, 133, 17, -75, -258, 34, 33, 35, -42, -183, 136, 8, 294, 61, 121, 382, 100, 99, -347, -47, -134, 185, 141, 210, -83, 20, 52, -426, -86, -24, -95, -240, 86, 21, 89, -19, 19, -6, 33]
6502C3o3j6j14J36l3O04p26K10q2K60l43J9r7J93k89K56p7J17K43k59n7J19j59
6525a25K27Q2k09R2j28l34N1O89n38N17n34K83J01n75M56o9K68l69L38k01LR0
6547A15mj46j1Q5Q5k84K0J10J3O0J67n7j98J25q5RP1m4j4j2j31j17L20j42J25
6572F0q2j67k6J63K58k70K1j39R3j6L98l20Q1j24OJ72j17K11m45K97J18l75J20
6595h3K38L71n99K31k63k5j20L37r8k4N7O9p3q7L3pj65J56K9qJ17j44J26Q0l6
6620A12j55P5Q5j43Q2J66j52K59m45M14l49J22Nj50j15K45j65k0L21J05j60k11
6642g4k4J18n2J70O2j50Q6l07L46k56J4l9K20m06N63k47kJ23R7m28J91J96O8l25
6666e6K1OK8N2k48M52j44J71k83j0j0L42k65j76j6J30K0k48J89J16j67q3M87l44
$$ y = [33, -30, -46, -160, -24, -57, 547, -179, 31, -51, 209, -134, -115, -212, -19, -308, -52, -129, -12, 231, -28, -85, 34, -125, 102, 184, -25, 67, -61, -395, -344, 345, -193, 324, -210, 73, 174, -401, 55, -14, 254, -115, 223, 22, 25, 115, 111, -35, -46, 39, 124, -160, -140, -30, -17, 43, 210, 153, -45, 80, -5, 4, 75, 31, 17, 5, -126, -243, 77, -65, 60, -22, -189, -215, -52, 206, -64, -43, -182, -89, -105, 293, -27, 54, -70, -64, 108, -9, 202, -243, 54, 172, -203, -83, 155, 526, -73, 158, -105, -130, -250, 87, -11, -35, 22, 91, 18, -69, -36, -43, -208, -52, -23, -31, 86, -58, 68, 148, 112, -43, 32, 117, -26, 56, 222, 70, 329, -116, 298, -51, 71, 76, -74, -189, 56, -109, -129, 192, 297, 137, -74, -98, 20, -32, 138, 200, 50, 136, -171, 175, -81, -67, -106, 114, -292, 271, 24, 22, 145, 242, -186, 5, 201, 269, -56, -35, -29, -1, 51, -197, 255, 111, 282, -1, -11, -21, 321, 56, -120, -136, -6, 14, -234, -45, 71, -96, -179, 308, -36]
6690c6J06R3k53Q7n6J15k00L04J6k35j03m2k7L68q4J23K1j31j10J12K36j44j48
6713A2K7J2j43r5K9L53k96J59Q2l19K47K69k19j05j12K29j15j70J10j42K87k29
6735a29J0R1k76K38O0K28j25m66J94L85o48L74N3j48K24K42k43k54L54k64J38
6756C8J18ol52L73r0r8k48L66q6q3j58M25l12K60n0o0J45l5P0k48l1J15k10L76
6780B19j0P2l97M43m63M8l9J1k32N80n22K41k04Q0J00N6K05q8m6K8J2j77J84k85
6804a84l6K65O1j17K25j04j95k28N49k05P9Q7k7N4k02M3K10k78j04K45j04k70
6826b36M66l02j34K24R9p7j08L62l70k14R6L81k18j55K60L1k6K25m81R8K61N9
6848B41n08J67J61j69K3L50Ql51j55L17%k28L79k65o5l2N0Q9oM0L25m73J94K27
$$ y = [-36, 70, 163, -90, -3, -59, 56, -144, 160, 176, -59, -162, -204, -231, 137, 53, 176, 197, 66, -44, 68, 304, 160, 12, 39, 51, -92, -187, -158, 195, -101, 58, 140, -179, 68, 337, 118, 13, -99, 130, 15, -155, -45, -187, 100, -129, -119, -28, -304, -66, -6, 222, 97, -369, -175, 210, -438, -64, -11, -159, 65, 307, 64, -190, 164, -100, 38, 156, 150, -202, 171, 81, -17, -265, 101, 15, -68, -226, 199, -113, 147, 97, 37, 182, 147, 217, -31, -62, 53, -157, 219, 209, 281, -116, 327, -136, -88, -127, -116, -348, 232, -290, -49, -253, -173, -73, -17, 188, 100, 54, 82, 94, -83, 101, -184, -220, 45, 106, -11, 214, 110, -85, -313, 236, 31, 110, 197, 170, 224, 22, 65, 275, -3, -107, 138, 34, -236, 230, -72, -206, 18, 117, 40, -68, 294, -76, -290, -194, 187, -31, -186, 74, 105, 79, 304, -177, -79, 182, 241, -267, -100, 61, -108, -85, 265, 273, -78, -233, 84, 84, -144, 235, -30, -95, -127, -77, 12, 6, 46, 371, -102, 92, 319]
6872C19k86j06K93j64O1j30O5J75k09n6M3m7O9P8p6L14l98oK80m97R7K74j19P6
6896E0Q8k07j3j09M36l75L72k86K0J45L8j17n5p5J40J15k97K12k04k0M13k74j10
6919a13J3J84L21m44J70O8k58P9j89p6K14J77l05J66kK00p8j41M5j53r0K05k1
6942b8Q4K40k94J12j57L41k17k27J05jL0Pj97L51j24N2k57K92PJ43n77L28L67
6965C80n78K75j50N9o2oL45j71o5j50K77r2k70J6O5l9J56J45j44L25l39k62J75
6988a10M9j37J34P8J3O9l8q4m2J3l3J52J79k43LOj1Q3l41K33q9J6J38K58k27j91
7014a22M5J83k92p7L20n4m5r0J9n7O2M4q1L19j95j22P1Q2J01O0j45n9k16J6P6
7039a57J31K0k63K01k8k70K50M3J29j9OJ32q6j13k2K01j94L35l76j05J06O23n16
$$ y = [319, 33, -73, 220, 56, 117, -13, 52, 227, 18, -38, 5, -42, 27, 105, 29, 343, -55, -61, 219, -278, -181, 93, -26, 50, 138, -69, -82, -191, 245, -130, 242, -44, -24, 121, 159, 42, -13, -88, 52, 167, -130, 82, -122, -142, 271, -3, -113, -100, 84, 405, -39, 131, 199, -59, 20, -169, -245, -31, 146, -159, 7, 5, 205, 127, -14, 31, -122, -212, -7, -28, 56, 296, 2, 114, -43, 298, 81, -146, -41, -42, -12, -5, -202, 149, 25, 77, -180, 112, 119, 262, -315, 13, 380, -198, 77, -73, -14, -76, -82, 263, 92, 27, -123, 154, 62, -208, -192, -127, -166, -10, 135, -9, 316, -23, -285, -110, -61, -198, -64, 14, 27, 96, 58, -26, -68, -55, -88, 64, 243, 0, 3, 9, -2, 81, -260, -27, -116, -100, 38, 296, 69, -122, -77, 106, -186, -263, 57, 3, -42, -132, -113, -170, -108, -64, -145, 174, -21, -143, -72, 10, 111, 171, 26, -33, -249, -233, -157, -26, -6, -269, -68, -96, -366, -116, -73, 56, 37, 43, 175, 89, -24, -46, 155, -39, 296, -80, -185, -79, 544, 28]
7062B8j42K23j67j4M2J58J53j82j07nJ27L17p33J56M84k86M6r2M50m67m9L2K06
7085A78q3j84K3J49k29J09Q4J60j87p3K3j43J84o7J2k20L90j41J77p8j08O5m74
7108d33N68k85K13J68m99M51J11m84J67p6J23k75J85r4P8L09k58r4P5M0j9R1J22
7131A84J0k23J05j28J54q1j96J49l34J94K56M1k60n7L95l70j10J59J93j1O4k05
7153g1K18k10o0K4J89J7k04M5O2J00j67L04l02k1L84l27k02K89K22k91n6J95J61
7176B99k96k40J30J62pj05j52J18l65P06l97M4l10L02K13l64J39M18l39j16K97
7197A37P2j20L08m35J39n0p4j05J73k74J76K19j81J75k31r9M28k95pJ72L4j98
7219c6o3J13k96O2J72n1j09M60k06N4m60K41K0J75L1j2j6j02J49k73R4P0k0q0
$$ y = [28, -114, 109, -58, -72, -30, 128, 281, 99, -8, -13, 114, 431, -302, -146, 338, 52, 98, 6, 456, -11, -60, -28, 178, 95, -89, -66, 83, -146, -37, 47, 207, 20, -53, -30, -173, 11, -56, -44, -264, 126, -15, 162, 84, -24, 41, -433, 135, -150, 63, 231, -268, 183, 294, -190, -23, -99, 24, -251, -66, -160, -82, 227, -31, -125, -50, -10, -29, 62, 184, 194, -29, 76, -52, 102, 21, -175, -26, -360, -166, 90, 131, -129, -186, 209, -161, -271, -112, 81, 70, 134, -71, 147, -63, -123, -99, 90, 107, -97, -52, 10, 110, -57, 247, -55, -76, 308, -19, -221, 68, 290, -1, -57, 138, 299, 3, -237, -107, 55, 48, -57, -209, -91, -456, 250, -147, -103, -413, -111, 102, -262, -123, 295, -44, -160, 137, 209, 89, 397, -38, 101, 51, -23, -128, 45, -229, -53, 166, -15, 160, -71, -170, 258, -37, -44, 128, 162, -36, -99, 14, -282, -220, -48, -99, -208, 252, 46, 100, -360, -119, -99, 76, 107, 95, 79, -23, 126, -147, -53, 17, -3, -83]
7243h3J98o4l17K11J93k21k6j14J55J33k19J73j4J6k61M27j27J09j36j08L3J49
7265A07o7K41l08K69j79j64J99R4J7l54J58j63J46l38M13J0j66j84R1J46J99k86
7287a19j27K32K67k87J1j46K37R2j96J74j0j5j25m5k01J32l2k3L44j83P3K27j58
7310A22N2m8l0Jn78O73l45R2J02Q1j32j06J4r9L47n3k12M5j44K27N3J12l75K87
7334H6j97k87N02R6l01J0j02R1P6p4j9N4J72J44n04K82J9j63m1j8J08J39k63M29
7358B39k17J47m6l56J67J27L1Rk58P7j80M00kp9K4k28J15K2J88j9m02N34m38O5
7382h0L04k04q3P4R7k41L3K66l56L45m1k40J99J09j41L3k49K38O7j74n5o9M2N9
7406f7J30q9J83k69K63m17M50j76k00P14m67j22J67J53l07j14j45L99q5J26m13
$$ y = [-83, 115, 51, -266, -55, 138, -83, -109, -223, -68, 65, -154, 19, 5, 21, -240, 187, 60, 169, 33, -75, -42, 107, 40, 281, -27, 242, 63, -101, 98, 192, 209, -145, 13, -150, -4, -342, 71, 81, -85, -269, -178, -32, 167, -119, -246, -14, 253, -34, -23, -169, 68, 160, -36, 138, 128, 113, -12, -57, -258, -126, -158, -181, 163, -20, 53, 280, 122, 174, 126, 96, 97, -481, 192, -153, -61, 41, 122, -10, -116, -102, -201, 146, 93, -119, -74, -218, 9, 62, 174, -201, 86, -111, -398, 104, 200, -101, -91, -193, -102, -26, -100, -119, -65, 107, 251, -253, 29, 48, -115, -156, -174, -66, 73, -190, 239, 22, 169, 123, -233, -66, 61, 92, 101, -157, -80, -260, 140, 138, 59, 83, -145, -30, -8, 180, 161, -241, 293, -145, -80, 224, 20, -63, 11, 108, -133, -100, 166, -190, 155, 114, -126, 73, 182, 41, 74, -175, 63, 130, -44, -99, -168, -126, -67, 63, -26, 157, -112, 151, -266, 184, 8, -192, 522, 55, -67, 100, 253, -54, -168, -313, 86, 1, 127, -286]
7427b86N11j71J11L2k71L28j43m7M6N2j11j1J21j09m61K67K37j75J24l86L01j09
7449a50Q9p4k8L15k13J24j43J31j96J52K78k13j87J58k8K26j97P8J19j55k5k97
7471b36M93q6o4R9l64O6O5K68k81J8J04J07o9k90L33J2N2k91Q0l8j34R6J96j12
7495B4M7J4j39N3J39m84M40k9K83n69K80J9j26O5m4Q0N4l57R6K95m1p6r1L83k23
7520I3j4k13j76K85K56l88J84J83j29P0m0j54n3q8J35J74k45J11J6M1K32j57M
7543A27k2J7J32j63j82K42m09M0K96j88K32M0j70Q6j4oP8j49M8K78l68J57n4J7
7567F5k0n0j57oJ06k0K54k90N4k1j34M22j95k68K21Rj34K45j57J09j39Q6k76K22
7591g4Q9P4K2k8o1Q3l4J69L9m51K43k76K84R1r7r8j93l66N87N8J68k18L4N7o7
$$ y = [-286, 225, 54, 165, 197, -74, 254, 111, 64, 110, 162, 51, 40, 161, 52, -409, -142, 95, -80, 44, -342, -41, -150, -61, -135, -163, 152, -61, 63, -80, 51, -145, 7, 285, 72, -115, 43, 15, 241, 44, 122, 241, 86, 61, -236, 257, 171, 107, 206, -158, -92, -27, 241, -40, -22, 82, 189, 120, -170, 163, 175, 227, -64, 16, -22, -156, -60, 136, 24, 71, 85, -54, -1, 138, -346, 94, 65, 348, -221, 59, 78, -48, 17, -27, 53, 107, -250, -154, 141, 100, 24, -67, 316, 93, 79, -134, -310, -25, 231, -157, 27, 210, 81, 151, 111, -43, -96, -184, -49, 125, -120, -9, 7, 48, 280, 123, 127, 105, 122, 254, 91, -91, 151, -258, -218, 78, -110, 122, 162, -8, 78, 64, 58, 136, -13, 35, 313, -55, 102, 48, 65, 45, -5, -162, -168, -62, -82, 172, -118, -64, -85, -219, 203, 8, -260, -39, -30, -164, 81, -76, 33, -106, -20, -296, -74, 15, 89, 111, 83, 22, 105, 71, 240, 279, -172, 71, -205, 79, 170, 73, -25, -218, -584, 3, 61, 229, 11, 45, 102, 35]
7616C5q6L0J49k17N5l8J24j49Q7m2Ro8M08j04n80K33O6J71j67K54m0J06k51o4
7640g9K75l18K22k54K14R0l71K78K45k95l12J75K63k4l23l14O20k38O1k8j12K15
7662a0k38L69J7l59K96L37k25j61j51J61nj02M19l37K5O6k41N0L9l1M86m24k42
7685b61K28J24J3K2J29q3j27O8L6j19J90J24k78J51k23l0m5q3n2K26K0p6P0m56
7709d32M11M5p1J73p9q1m8L0j30P9k27M65k23L25j91r4l2j56J63J17n9k71J96
7732i0n1N17j74p3o1Oq5j8J67k92J59J36j58K22j01j05j55oK15R3m4J43m83L06
7756F8n7o9o1Q3K61j61J47k36j91R2K28j73L11k03l08k4N27l29K77J1n7j81K30
7779A85l41p3K86j07o3q9J94Q3l71K14R0O6j72j77K89K23j9k42J41j05J46j6k34
$$ y = [35, -51, -21, 128, -89, -34, -72, 52, -97, -10, -52, -43, -111, 297, 193, -387, -154, -88, 83, -84, 170, 130, 236, -15, -79, 196, -122, 100, -154, 60, 150, -221, 57, 302, 7, -305, -130, 133, 109, -214, -528, 92, -146, -85, -113, -225, -10, -248, 121, 138, -221, 75, 412, 187, 26, -125, 36, 31, -71, 348, 11, 36, 102, -139, -89, -50, -81, 405, -19, -261, -33, 91, 104, 126, 255, 172, 45, 113, 149, 30, 220, 344, 66, 217, -6, -36, -81, -164, -216, 10, 30, -46, 24, -432, -21, 24, -47, 126, 47, -34, -82, -52, -182, -103, -330, 135, -88, 237, 46, -48, -80, -236, -73, 44, -15, -286, -90, -141, 376, 202, 129, 68, 74, -11, -29, 138, -154, 5, 141, -17, 205, 104, -1, -156, -162, 53, 146, 102, 245, -238, 68, 11, -58, -119, -36, 225, 64, 211, -25, -216, -124, 104, -69, 242, 39, -269, -293, 234, -95, 182, 193, 136, -45, 185, -156, -229, 57, -50, -113, -202, -8, 75, -296, -82, 8, 74, -98, -275, 14, 237, 218, -24, 117, 12, 158, 142, -92]
7802i2J05P3k11K66l15J20K15k91K4K67m1n1q3j24l6K56L5j72l1J44N8k4O0J69
7826C21j25lj9j72L3J30J34k34K8l24k5K62N0p1M5r6L93k43k73L02l1Ol4k60K26
7851B0K71l71l3j2Q9L47m78K3l2R1J53K17j39J22m85Q6n7K61p2jJ09k5k37O3M29
7876C39k18k93M05k10Jj63L06M0j13n2j06j7M89n67K59j18k48J05P0J73k95M71
7898B58j52l0QNr2p2p1K00j88P3K35k35K04j98lJ62r0J0j98Q4J05PJ16j42R0P
7924I3Q6j75j51L71l86R0L4j24K81R0k72J69k28J71n0PJ82n7j43L8k06L08j19
7947IL17j91j33J2Q1r9k22J34J88j45J04j00N0K7J04m14J23Q8J38R1k35K82n5
7970A54l81Q6K56q4J03m0J48l87j1K17r3J99k06K9K91l68K95k33J6j2k57K09r7
$$ y = [-92, 13, 86, -125, 141, -174, -54, 161, -130, -106, 161, 120, 69, -14, -138, -174, 82, 117, -55, -86, 58, 116, 92, 152, 321, 196, 193, 174, 2, 35, 165, 299, 65, 93, -231, -256, 6, 56, -15, 30, -66, 327, 84, -189, 113, 82, 88, 54, -206, 20, 291, -80, -113, -125, -36, 311, -167, -144, -176, -85, 68, 285, 146, 268, -217, -131, -188, 73, 1, 0, 109, 84, -153, -90, 339, 121, -172, 233, 23, 24, -139, 167, 207, 94, 42, -64, -81, 408, -159, 100, -18, -266, -161, -91, 82, -213, 258, 106, 76, 84, 89, -3, -75, -146, 54, -134, -61, 174, -61, 143, -55, -58, 104, 14, 24, -174, -90, 15, 22, 138, -4, 86, 93, 179, 4, -147, 224, -162, -72, -38, -162, 119, 209, -63, 106, -122, 49, -1, 6, 188, 131, -12, 26, -180, 128, 9, 326, 135, 2, 14, 95, -4, -226, -92, 96, -49, 55, -45, 5, 32, 136, -278, -155, -67, 71, 162, -73, 209, 154, -227, -141, 115, 31, 134, 94, 242, -145, -156, 61, -32, 167, -39, -10, 281, -87, 208, -25, -9, -21, -278, -69, -166]
7993a66j41K06L49m23K91j58j19q6O4J32O9k4M5R6j27k1K3j19m8J68j45L33k16
8016a7L21l79J78l59J06Q5OJ33R5p8L0%Oj61J8J5l0R8N3k16p7J89k07K18J8l5
8042A0J87l35K5m6J5p3M35r6n0L31n02j07M99k45O5j90K02m10J00K01K19M8j04
8065A79j90j03k26L33L12l43j38L19j65L79k13k35k69M76J30k16o7j21J51L7j29
8086i9K61k0k83k75L27j66N55l45l9K1oK90k78k3J13K1m4k22K83o2K64k79J41
8109A35P9k53K39j27k91L09l69K84j64R8J46q1J10P5k55P7K5r9K8n3J48k57J50
8132d6K94j13J16k55J18j38q2j26M51k2j36j55K94r9l51K80l25L74j78K33o4j53
8154h3J14J76L1l07K72K4n57K41J07K57l86pj15K21m0O7M5j35J26K16m91K07L78
$$ y = [-166, -307, -101, 248, -175, 116, -42, -161, -247, -183, -51, 18, -6, 39, 135, 8, -13, 10, -109, -157, 11, -134, 199, -17, 304, -75, 103, -256, -150, -65, -59, 74, 169, 91, 121, 121, 127, -34, -16, -1, -31, 67, 120, -96, -173, 16, -191, 27, 45, 10, 197, -138, -113, -159, -144, -217, 218, 122, 72, 403, -99, -206, 293, 48, 113, -77, 125, -285, -185, 16, 235, 283, 179, -11, -114, -340, -7, 305, -38, -176, 143, -22, 357, 144, -91, -360, 116, 246, 30, -37, -158, -7, 30, -99, 162, 142, -141, -416, -89, -255, 300, -45, -84, -63, -69, 221, -57, -80, 33, 54, 10, -212, 71, 9, 273, -6, 135, 214, -39, 200, 73, -218, 91, -278, 6, -158, -60, 86, 5, 115, 190, -65, 12, 37, -62, -34, -87, 61, -196, -46, 248, 135, 251, -4, 114, -24, -106, -232, 219, 197, 61, -94, 200, 101, -250, 30, -295, 79, -99, 134, 70, -83, 31, 207, 238, -69, 203, 227, -330, -89, 18, 275, -111, -118, -233, -12, -52, 15, 60, -75, 51, 267, -224, -17, 361]
8177C61l93j3P3p4K2p8J42K48k94l21J43M53k28r3
$$ y = [361, -32, -45, 28, -46, -24, -102, 40, 288, -6, -327, -184, 269, 41, -52]
8191e2
$$ Imaginary data points
##PAGE= N=2
##DATA TABLE= (X++(I..I)), XYDATA
0@%%%%%%%%%%%%qJ6j6J6j6J8k6L2l4M2m8N5o3P1q1R2j06J19j34J52j70J90k14
35a13K37k61K90l22L59l99M40m88N42n99O64p40Q24r21J034j165J325j522J768
54I53k090K532l177M214o142J0906m1840q1984Q4138P7598r521m9470j0977J5631
68i229K4056N403j6886k0849M580K2967Q304k6256j5723L2200K7780l8932m0633
81d3218K7324M6008q156l4837j2629J4679K1995K607k5961j9457J4173K9226R592
94B1346k3067k8699J4349L9527o471m5545n216M1216J8376k2056k1083L576J9542
107E795J1496j4271k0672K227K2861J6888j2080l2942l019L9456J5373l8697k3091
120c0676L0298K7062j2889k2721o422J0967J7460J591k0970j1488J5989K2590
$$ y = [0, 0, 0, 0, 0, 0, 0, 0, 0, 0, 0, 0, 0, -8, 8, -8, 8, -8, 10, -16, 16, -18, 24, -24, 31, -32, 39, -42, 50, -56, 63, -71, 81, -89, 101, -113, 124, -137, 153, -169, 190, -209, 231, -257, 285, -314, 350, -390, 434, -487, 547, -618, 707, -815, 953, -1137, 1395, -1782, 2432, -3710, 7196, -34644, -116628, -32490, 45108, 35587, -13883, -24860, -9229, 14827, 20230, 3344, -17505, -12925, 10042, 18346, -7910, -23633, 8567, 36347, -2585, -43218, -15894, 30114, 21958, -12879, -25508, -10829, 11166, 13773, -12188, -31645, -17472, 11754, 21346, -1721, -30420, -16071, 23456, 16985, -28560, -33776, 7440, 25816, 3760, -17323, -13747, 5795, 17291, 3020, -17652, -15425, 7436, 24324, 12244, -20698, -23717, 15739, 31112, -7585, -30676, -378, 26684, 13795, -8926, -15348, -4381, 13079, 14670, -6300, -17788, -1799, 20791]
132B0791k107k9468j5644K8249K7439k2560l0621J1768K7566J323j7032j4052
144a4348J186J8831J1179j6207j9485P761K1545N944j9385k1785J1294L0277j434
157A5373l0653o004K3082J2469j0318j6229m842J4655J6519o558j9457k571J6088
170A554J3799p225k3425l428K8057J3920k4277j8163J5142J7988k736j3150r325
183a1269N461J6972M479j7145j2938J0125J7576R89k0420j3117J9154K0961j2846
196G982k2784L665J6738N194p956j2145k846J4694J2454j1821j6888K607J6363
209E257P426j1850j6737N842K2717R43k1418p156J3586J0475j925j1284p953Q721
223c356J5239l115j6160m352J1521J2170k941j7184n004J8551J1437j5208j3557
$$ y = [20791, 18684, -10784, -26428, 1821, 29260, 6700, -23921, -12153, 15413, 16736, -296, -14348, -13162, 5669, 16848, 641, -18844, -11083, 10462, 16406, -2979, -24764, -13470, 16807, 15373, -15280, -21284, 1798, 14267, 3949, -12280, -17122, -2467, 14052, 7494, -11963, -14534, 1554, 15353, 8128, -15297, -18725, 9332, 23252, -1025, -19188, -4046, 13942, 11206, -1944, -11269, -5808, 11164, 15643, -1502, -14440, -4315, 13261, 14250, -6170, -19287, -133, 20828, 7982, -14802, -11137, 5601, 10795, 2839, -9306, -12152, 2542, 14996, 3175, -13713, -11106, 5257, 12683, 833, -15904, -10062, 12655, 13598, -7820, -14976, -1390, 9085, 7160, -4124, -12077, -3356, 11883, 8768, -7392, -11744, -223, 11947, 9006, -8178, -13182, 5369, 16806, 1598, -11959]
236a1959P313J2248J740p063r673N52J3886N417j2878j0483N624J3492L214j3435
250b005j1527J0982J6002o788j5923M37J0045N837j584j0067n496R712J0941p241
264C325j2735J99J1779P543p162j3925K285J5937K621j3539o167P432P700J800
278G093p122r158M785J2662j71j2043m493P366R823o30j2769n423J2205Q985r030
293B080r383L192P469L559l154r309j406J0063N694q512p899K739R374M044q916
308c65r612N979J1944l053r762r96N372M483J114p524o369O907R369l652r502
323e667j181P693O648m180j0070q7J0866L110p764n007L111N138L022l824q236
338f428K280R937J269q373m328L744P610M90q864m619P897P037m931o338j59M002
$$ y = [-11959, -4646, 7602, 9342, 2279, -7394, -6842, 7044, 12461, -417, -10900, -5276, 8216, 11430, -2005, -13532, -2550, 13452, 6664, -9259, -8822, 1223, 7060, 5476, -4591, -10087, -375, 10566, 3325, -9410, -9211, 2568, 10111, 2949, -10976, -8691, 7246, 9867, -3672, -9839, -2407, 5293, 7093, -29, -9187, -4402, 8260, 8089, -3954, -8447, -1081, 8742, 8112, -4657, -10080, 2125, 11110, 2080, -7303, -4111, 3358, 6917, 3763, -5546, -6952, 3111, 8805, 293, -7606, -4867, 4507, 8551, -365, -9977, -3998, 7946, 4893, -4869, -5865, -493, 3990, 5104, -2420, -8789, -1882, 7487, 3835, -5667, -6848, 845, 7493, 3313, -6757, -6844, 4022, 7132, -632, -5639, -2528, 2610, 5632, 1808, -6428, -4148, 5789, 7058, -1315, -5643, -1899, 5711, 6201, -2663, -7282, 615, 7652, 2721, -3617, -3776, 226]
354B26M467n23p771k516P798N045n659o024R45O061L898n165p728L375Q192j074
370C547n950j760J833M340K455n188n813M801O840j815o315j500L961N256j502
385C190p187n85O906K597m780k853L88K639L937j836o898O98P425R68m938l619
401c948K001M937J765n557m467M837N077k575m011q55J690M129N98n968l017O056
417F92L687l270m067k41L539L500k595n939J714N771L0l709j257k13L124K915
433C681l583m528K824N000q66m050j651K113L856K76m984j527M343K610k541k373
449a400l99J126L431m35n350J6M986J161k920k506N47L029K097l485l463K768
465g97L541j368j916j344K55K965J287l741k551L618K550j498k538k96J271L013
$$ y = [226, 4693, 4170, -3601, -6117, 1681, 6726, 1067, -4957, -4012, 2049, 5947, 782, -6946, -3571, 4621, 3547, -2403, -4163, -2330, 2010, 4465, -723, -6536, -1735, 5105, 3290, -3025, -4525, -564, 4692, 3190, -3997, -4582, 2324, 4921, 141, -2712, -2324, 315, 4252, 2416, -4482, -3784, 3641, 4609, -329, -3948, -1947, 2990, 4755, -802, -5269, -432, 4645, 2070, -1941, -2796, -1106, 3023, 3621, -2347, -5364, 692, 4379, 1109, -2958, -3199, 340, 3840, 1245, -4694, -2980, 2791, 2821, -888, -2145, -2358, 766, 3681, 98, -4430, -1606, 3394, 2528, -1522, -3173, -1060, 2796, 3072, -1912, -3439, 904, 3514, 973, -1400, -1799, -673, 2758, 2323, -3027, -3011, 1975, 3136, 216, -2290, -1743, 1286, 3383, -102, -3565, -797, 2744, 1376, -540, -1884, -1629, 1336, 2623, -1118, -3669, -51, 2499, 1001, -1537, -1833, -562, 2451]
481B451j240l870N00L639L33j976j209k60J632K955k533l459J923L421o48k258
497e99j135P51K674O54l355j361K870J667j388j071j043L03L235k8l966q4L066
514A190P88j782j174n75J926J965k158k411J458K446q29o98j016m50K143J511
530B334k866j800K254J630r12j372q45P72K257k44k909K25K289K08r63l80j495
547a817J764K234j462k523J013J811k46n93r11k55K040P20k178j094J912O17n34
564D98oj295j01K308K12k712l16J846O45r93k33q73O17J599q37j796R33J084j40
583D40m26p52r24J817J633j991j541J523P78k41m78n24p4K071n34j884J37J173
601B03p2P5m9j397Q74J655r33j434M01J483o4l09o72m97R43R46j079r89J028L68
$$ y = [2451, 1211, -2659, -2159, 1480, 1813, -163, -1372, -1632, 0, 2955, 422, -3037, -1114, 2307, 1659, -599, -1734, -983, 1691, 2345, -1010, -2371, 499, 2166, 778, -293, -1336, -1033, 2202, 2174, -1792, -1876, 1190, 1978, 196, -978, -1553, 373, 2338, 180, -2231, -773, 1673, 844, 146, -870, -1320, 823, 2334, -532, -2332, -78, 1552, 640, -732, -1577, -805, 1452, 1208, -1701, -1476, 813, 1021, 58, -322, -1817, -53, 2181, 719, -1804, -791, 1020, 774, 181, -730, -985, 1055, 1775, -403, -1497, 415, 1032, 498, 492, -803, -904, 1404, 1616, -1096, -1412, 434, 1079, 86, -147, -1020, -403, 1196, 359, -1437, -504, 580, 440, 14, -738, -1662, 155, 1788, -203, -1744, -221, 557, 316, -162, -686, -760, 1311, 777, -1107, -970, 203, 131, 206, 157, -1240, -366, 1289, 356, -1078, -677, 806, 742, 433, -239, -736, 207, 1153, 74, -915, 113, 481]
621D81k05L72j250j92J877J95k157J2J205O8k06m76n47L31J460q14r33N12P15
640D48k83M88q66p66J026J161j496o09R43J34p7K24o61l06J190J9j297M23K02
659a03j45M82J68j125O65P52k63j118P13L94l17J87n99m39O19O35m41q31R39j65
679Hq6N34j039j26J408R4j135j08N81L98n97K58n98K39P86n23p15O20k2J0N05
700D92k47j167R68N97o09m59N79j94j73M85l90o15R14K34p23L5L45k31J54K70
720B65m31j97R24m12l62K88K49p00O24k86l16M74O78j059J35J40l24J51N22m26
740f3l36P64Nj57o00O97j78k19N6l14J25P63n65k73M20q4m35Q00l30o99N04N18
762C99n74%L82o0j92K37k66k34P48l16m20M37M6k06J71J58o49J37O31j66m67L83
$$ y = [481, 276, 648, -602, -794, 1083, 1278, -879, -867, 338, 406, 200, -276, -823, -492, 968, 154, -779, -267, 448, 165, 653, -213, -979, 47, 1208, -288, -897, 46, 180, 103, 327, -334, -640, 550, 569, -728, -305, -103, -248, 234, 402, -723, -58, 694, 431, -687, 26, 420, 103, 290, -309, -748, -129, 506, 65, -766, 173, 8, -78, 456, -583, -709, 699, 793, -342, -450, 131, 529, -68, 190, -408, -169, 617, 94, -621, -1, -23, -13, 492, 245, -922, 46, 643, 34, -425, 154, -40, -213, 272, -118, -733, 181, 415, -308, -273, 72, -159, -5, 265, -166, -363, 561, 149, -213, 75, 324, -376, 248, -38, -354, 120, 798, -261, -126, 14, -310, -159, 363, -63, -399, 365, 370, 213, -387, 310, 132, -87, -31, -345, -220, 543, -22, -295, 125, 41, -394, 406, 76, -623, -119, 399, -175, -175, 207, 147, -45, 192, -74, -308, 440, 124, -296, 141, 187, -19, 152, 310, -339, -202, 429, 263, -204, 179]
784A79p8n10Q34l71o10P01j09j95p3K93j29l31P13m69j83L50M91r47L13L38k61
805e4J45K62q33N04L47m91k11N74n55Q9N14J61r86L06P87o86N4L38k91j09L33
826A98l00l0K09J9l17M03J9l31L71J4o16K67K44q2n39P02k18j23J29K7j84J60
848B2R5l53J97K11j22j86M49m39r5N25J73n75J31J24Rk27L77m83J10M37n92K44
870C2K68m92l2L92J6l97J48K24m94L22L01n51j43O61j81l55M50j16j47J64j07
891c7j73K97jj32k61O64l63k13P98p53K2M45j73m48M49j68j52J72K89p32N52J77
913B59l43QJ99m1n66O76j44k5J19R3m60M05kl17J58J62m05k9L29J11m71K53R1
936F0l67N6M48l08j4L29l58jJ96J65j88K28j28j90K11K60l14kM72l71n35N36m33
$$ y = [179, 101, -409, 425, 54, -556, 145, 36, -159, -232, 61, -68, -399, 314, -155, -338, 12, 503, -444, -131, 207, -54, 91, 353, -480, 24, 371, -120, -331, 243, -312, -223, 291, 452, -534, -228, 559, -127, -73, 265, -26, -135, 198, -102, -132, 77, 96, -221, 182, 201, -130, 241, 255, -361, -94, 150, 68, -471, 231, 13, -110, 19, 46, -138, 22, 117, -236, -39, 172, 50, -136, 313, -126, -221, 304, 477, -98, 33, 157, 166, -61, 316, -167, -57, 380, -212, 32, 300, -192, -224, 168, 184, -213, -65, 159, -335, -13, 288, -263, -406, 255, 74, -281, 169, 53, -94, 70, -37, -210, 87, 86, -46, -307, 357, -6, -219, 579, -174, -152, 293, 120, -328, 121, -47, -199, -27, 262, -470, 82, 259, -84, -76, 123, 82, -484, 192, 48, 23, 142, 235, -225, 180, 178, -139, 19, 181, -224, -253, 76, 187, -284, -31, 60, -307, -251, 197, -111, -125, 204, -154, -155, 41, 206, 18, 246, 118, -72, 139, 399, 85, 83, 555, 184, -351, 185, -248]
959b48J19L06n04P7K14k0J33q8M4j48k99N88j79k14L82J15n82L86k50K06J33m9
981A22j11K91j5k94o8J12l14j64L81M18l44J02P7l75J93K81k29o6J3k68K03o5
1003a20j70J13O08k69l29J43j4j78K59J85o28K11N21n02N9K11p3j76L49m13L43
1024A30M7j14k74J27n1r2J36M99k84j56n4lj0k18K48k55J82L93k23q8K82J7j58
1047H1m1j14n1J84k41K9K57O8j96J21jl91L29O0k5l00N37l08q5K61l32K05O2l53
1071b44J34pK05j95l4J92q3j70M55j22l66N57k02m07J98J40k97K00L23k37k84
1092b44M76j99k29O48l62J8l30O46n03n6L09n28N98j97m47K22M03j88k29J39L12
1113B59m79L24J1m72K91L3L0J37Kj71j19L06j05k72mJ32j12J89M11l88o8K13n1
$$ y = [-248, -129, 177, -327, -250, -36, -56, 77, -11, 33, -115, -414, 174, -5, -219, 163, 278, -304, 82, -168, 38, 171, 122, 11, 302, 287, -7, -75, 37, -277, -441, -60, 358, 14, 116, 193, -182, 11, 292, 63, -3, 10, -258, -55, -120, -290, -177, 431, 162, -167, -24, -38, -216, 43, 228, -400, -189, 332, -170, -111, 100, 27, -149, 200, -213, 130, 177, 63, -211, -84, -135, -227, -91, 408, 124, -32, -86, -89, -99, -317, -69, -324, -142, 251, 28, -60, 222, 239, 81, 40, -74, -125, 59, -182, -153, 104, 172, -24, 97, 96, -295, 34, 94, 69, -231, 306, -2, -87, 174, -158, 47, 109, -244, -110, -117, 88, -107, -141, 51, -32, -202, 253, 131, -235, 322, 120, -287, -89, 51, -246, -46, 277, 40, -244, 232, 33, -196, 452, 90, 108, -222, 424, -79, -135, 174, -354, 244, 47, -400, -178, 225, 37, -192, -53, 259, -220, 104, 115, -357, -66, -33, -3, 134, 136, -35, -154, 152, 47, -225, -229, -97, -209, -20, 391, 3, -65, 148, 97]
1136I7l03N14m27r1J64J88m72N88j34k15K0L18l93j87O21m38K03J0j56k03N41
1157B45l24j16N14j22m85L39J79j4l26K57j77j85K68l02L86j6j05n2j06K87M2
1178A87p8j98km3oJ36R2k09K97n43L41L03n11JK48M3l5J18j55j73K34j02m9R9
1202eL0j92J13M77l05k91L22k99j84L21J31r0j05J70n4p5%LL4k1j02j05L94l18
1226a51P0m0K43k56K43K60l16J8j52J08J85j12l07L65M9j37k1j94j20K65J19O2
1248A81j84l5q8K02k6J72p5l54P2N9j63L93p3k67R5J90l28P2K57j62K37Q1o8l40
1272a52J29p0K70r7q1j12q4K58J34n51L97l9j22K31K3j52ql8J74k00R8k57L38
1295H9p9j74N6j4L10m90M73j19j16j82L52k7k16K99J08l93L66m48r0N07j85l10
$$ y = [97, -206, 308, -119, -210, -46, 142, -330, 258, 124, -91, -71, 247, -146, -333, 288, -150, 53, 63, -93, -296, 245, -79, -195, 319, 197, -288, 51, 230, 216, -110, 147, -30, -215, 53, -249, 137, 121, 16, -36, -142, 145, 187, 109, -89, -91, -134, -140, -4, 88, -121, 176, -367, -26, 277, -234, -233, 15, 58, 23, 141, -14, -187, 47, -55, -104, -5, 25, -167, -54, 423, 118, -173, 149, -150, -334, -13, 118, 28, -77, 93, 39, -36, -36, -33, 1, -20, -122, -227, 167, -151, -81, -121, 122, -134, 109, 369, 53, 71, -81, 27, 212, 100, -207, 158, 207, 70, 49, -145, -265, 0, 119, 181, -3, -38, -126, 76, 50, 222, 147, -207, -135, -76, -239, 154, 81, -186, -91, 99, -229, -157, 100, -62, 175, 256, 188, -152, -23, -93, 177, 80, -1, -113, -197, 61, 195, -356, 41, 2, -120, 111, 134, -18, -26, -64, 110, -90, 8, -249, 89, 10, -164, -108, -122, 188, -302, 171, 52, -64, -246, 106, 79, -137, 162, 270, -123, 243, -205, -295, 212, 27, -283]
1317b83M87J10m68K29j86O6q0K52n54J41K75J60l99J97J51j3k0n8k14J60J03m13
1339c57L1M32K2j61K75k32l62M68k36j27J62K14l33K38k3k57M00l50K23k8n0J01
1361E0L8j12R0k12j14J58j47L39K7k32K38r8k2R9r4o5k74M26K5j10j07N6P5k39
1385b05K37J18k30L45j31p7MN0k05R6k1M9k6L8j26M6J65j87J10k07J81j34J27
1408A7J82k57n3L95l98j23K63J2rl83L99om5N1p6q4R2k2J43K66l15J25k73j22
1432b21J87Kj73K33J98o6r9L1j41K27k45J81PJ78j96l0j85L03n7n6O1K7l4j12
1456B0p3J4j7J91O3k98j00J85j43K51k00L7O5J96j16j92K54j11J45k96M04l08
1478b9n5K72l40K07j56J30q4N5k02K54J06j91j3Q5k56k0N11p3k84l8L08j84J4
$$ y = [-283, 204, 314, -154, 75, -111, -45, -125, 127, -427, -286, -11, 149, -250, -53, 98, 85, 65, 7, -207, -47, 56, -357, -326, 106, 128, -33, 242, 10, -352, 116, -120, -247, -85, 129, -204, 34, 11, -246, 154, -196, 27, -1, -51, 50, 88, -24, 66, -146, -260, -102, -249, 90, 117, -115, 123, 25, 3, 102, 8, -57, -331, 95, 120, 10, -97, -41, 34, -205, 32, 150, -80, 265, 134, 57, 61, 111, -94, 2, -19, 30, 4, 42, -84, -38, 127, -60, 50, -157, 24, -110, 17, 199, -58, -111, 284, -114, -237, 26, 38, 29, -354, 45, 39, -6, 45, -31, -115, -23, -45, 98, 364, 49, 174, -99, -221, -34, -32, -205, 28, 226, 160, 61, 92, -49, 178, -67, 114, 121, 299, 103, 73, -112, 191, 134, 78, 139, 166, 132, 20, -53, -39, -56, 135, 198, -100, -200, -15, -158, 93, -107, -70, -5, 191, 75, -117, 137, 26, 171, -125, 279, -29, -84, 188, -152, 55, -101, 29, -55, 0, -202, 52, 158, -33, -46, 39, -217, -237, 274, 201, -83, -121, 187, 3, 17]
1501A7j42L64l30J38j21J02r8K64l15J04L40m22k6M09m4m78L09N3k42L09j11J78
1523B58M0l39j28P3N49m09l22J35N5k25L21P5k97J76k00k10M51J59j42j04J70
1544H6j74K28L1k89K40p4j18j3r1J56j65K49j10k43N08Q0k31k52K52nj88L12J1
1567B00o5o8K02k39l79N11o9K04k03l4j85J33qR0k61K20k50J2j06M83j90Q4j83
1590a01l6J22J88l71K15J47q7P3n2j04k24J49k04N95l19J42o6m3l3O7K88l4l16
1613dK16j83j73K34j91J14L5ML3j0J35j98K3p3j88Q5L7J72k48J34j6L12k07l6
1637Gl4j17J26j02j92M49k01J51%k8j75Q0j33O1J15j22K46j83J30o6L5k13M81
1660C15m28K74j29j37p3J42q5L13k98M40m39K81j60k20K58J70O5o3k11j64L07
$$ y = [17, -125, 239, -91, 47, -74, 28, -70, 194, -121, -17, 323, -99, -125, 284, 240, -238, 71, 124, -118, 191, 80, 258, 298, -41, -169, -96, 453, 44, -278, -143, -88, -313, 8, 83, -214, -38, -238, -448, 3, 162, 20, -84, 86, -88, 140, 171, -118, 122, 48, -70, -83, -174, -18, -183, 66, -44, -287, 221, 301, 70, -182, 70, 65, -123, 189, 200, 135, 67, 269, 30, -349, 162, 93, 297, 94, 60, -125, 8, 0, 90, -171, 49, -201, -189, -295, 188, -2, 82, -101, -137, -15, 173, -198, 17, 164, 77, 150, 98, -6, -230, -81, -285, 310, -9, 133, 67, 24, -9, 58, 346, 312, -4, 212, 29, -144, 90, -101, 13, 48, 52, 85, 75, 210, 12, 35, -38, -226, -141, -104, 68, -180, -46, -62, 250, 43, 7, -27, -144, -18, -120, -312, 137, -64, 87, 87, 59, -116, -36, -169, -108, 7, -115, 131, -52, 78, 12, 47, -166, 315, -113, 161, 32, -105, -178, -36, -121, 192, -106, 334, -105, 176, 16, -204, 54, 224, 289, 226, 15, -149, 158]
1681A58p7l07j8K71J86j73k61K85K99k16pK04l25k1L08n60K60j16J22k13L10j44
1703c5o6m9K26J10j84K1K68j03k15K0J54K0j27P8Pj65J96k02j77J03m1K44J77
1726B60l06l27L60J29n1k4j94M82m54K67j87K28k75m2Q0M4M7J9k7J88Pk60K73
1749B37k48K08q6o0lN9M5L8k32k78K05K15k33J96k47K47L5j57o2K62j1k55J82
1772E7j23J70l30J48o1j27K33l03L40Kk39J23p0K40M0j68MJ4j75J76k54o4L23
1795d4q5q1L01k50J54j26J59K99k98j7r1QK25k44L4j64L51j40j22K22L5l48J77
1818d5lJ95M2m81J67%L25k29J43j91r8o2J37J6L14l99L53j31m7J97j75q2J04m6
1842Dm2P6n4j11L02P8j21j32r1J0L6l1M30k62m7j51K27k37J4P2J4j03L63j42k94
$$ y = [158, 81, -226, -244, 27, 213, 40, -221, 64, 363, 147, 140, 344, 19, -2, 306, -254, 6, -110, 12, -201, 109, -35, -101, -150, 76, 186, 2, 23, 291, 188, -27, -7, 147, 167, 40, 118, 125, -40, 156, -46, -223, -120, -161, 83, 260, -46, -373, -13, 116, 65, 41, -153, 329, -125, 142, -45, 183, -92, -134, -54, -10, 37, 56, 29, 217, 224, -36, 237, -11, 197, 111, 51, 48, 107, 152, 190, -42, -320, -115, 100, -133, 63, -184, 63, 98, -59, -121, 141, 130, -125, 57, -66, 104, -226, -78, -139, -266, -33, -336, 4, 6, -233, -110, -180, 60, 100, -68, -64, -50, -225, -49, -303, -367, -44, -129, -210, 91, -159, -5, -131, 28, 327, 29, 12, -79, -71, 154, -90, -56, -220, 131, -9, -131, 91, 126, -222, -45, -48, 147, 189, -292, -125, -125, 200, -29, 114, -77, -175, -237, -100, -84, 230, -169, 184, 53, 6, 203, 28, -54, 50, 4, -38, 38, -16, -127, 175, 253, 132, 0, -91, -81, -45, -76, 354, 92, 45, -106, 121, -116, -102, -30, -16, -119, 244, 102, -192]
1867a92o3M62j73j34J84j13pK40k82J34J82m72P3L66n6j57K49m19J79o1J93j0
1889A23k36J81J77j33o3L0j35k7N5L57l42J48j97k20J16J51K3K05k28L38l84l9
1911a00J91j35K4J29r7j02j09K8L73k77l7J75k4l26L32Rq8j57J47k4j68J08Q2
1934d6J6J48k04J63l02J94J11k27L24p11P09k63K03J16l1j98J10k05J56k5j58
1955a20K82l18Q4m4P4N9j28j7n6L30l03K0R3P4J76k06J14J18l88K95Jj05l9j80
1979a84K62m2n7l8R5j09M7R5j58l32K56L77j86K1K29j13j08j43P2j02J33J34n4
2002I5j51P4J2P6l82J88L5J17k34L5m1n8K30l0K8O2K7o9j01J20k86K08R1J52l0
2027A68j95J44K32l56OJ12j1j86p6L93j3k06J29l57K85M7j5k04J51k5j84K04k10
$$ y = [-192, -255, 207, 34, -100, 84, -29, -36, 204, -78, 56, 238, -234, -161, 205, 149, -8, 241, -178, 1, -60, 133, 123, -113, 68, 245, 112, 49, 79, -56, -83, -28, 329, -13, 135, -62, -282, -166, -15, 8, 213, -15, 323, -61, -100, 91, -44, -20, 109, 12, -90, -199, -171, 202, -75, -112, 63, 39, -287, 45, 54, -34, -191, -44, -68, -236, -128, -46, -30, 118, -86, 77, -225, -31, 80, -147, 177, -534, 175, -88, 115, 231, 200, 2, 112, -93, 63, 38, -120, 162, -156, -72, -116, -42, 17, -111, -128, -184, 146, -157, -137, -44, 30, 206, 0, 114, 232, -156, 139, 140, 35, -4, -184, 78, 36, -21, -59, 36, -73, -26, 69, -89, -421, -165, 212, 26, 47, 276, 163, 55, -88, -16, -118, 15, 149, 95, -56, 18, 30, 106, -276, -88, -53, 64, -170, -135, -176, -234, -4, -34, -6, 56, 83, 14, -87, 33, -253, -45, 46, 198, 168, -27, 117, 349, -7, -1, 111, 100, -86, -162, 231, 218, 12, 141, -216, 69, 116, 101, -103, 48, 23, -161, 43, -167]
2050a67J90O6k72K9K01q5j85L67k12L18o8j07l17K29J62l04J82J4k00J18k31M27
2072A55k26r9J78K70l26q1KJ80p1J43q8pj6k1K33j86ok56L53j60J80k87K1J23
2096Hp8J69jM9q8K19k14km11J91K10P0q7K29j69j94M64l27j1L4N8k34P7J66n23
2121c95J76K06J33k31J76J1O3j48O2Nj82j0j22J88ML10l12l0m5K12k40J91k38
2144b16r0K19rr4P5J9J38j76K45k85K07l4J96j53m8L8k0k2K10j95k93M35o9N9
2168A37j25o6m24M29j97M29j82j9M5j36K03p8J61r1J22r6j25k4Q7p7K2O3n9J6
2192A5l28J79J01M8Lk21P4K2Q8l56L95M7r7j56J93J4k2oQ0N5l04J42J80k35K36
2217A47lj8p4k85L48j42J58j78m7o1J69J14k4p2J5J88l49L51J19m91J94r0r3J24
$$ y = [-167, 23, 89, -183, -154, 47, -38, -223, 144, -68, 250, 182, 75, -242, -13, 149, -155, 27, 41, -159, -41, -272, 155, -71, -170, 8, 278, -48, -129, -127, 53, -18, 125, 37, 30, 14, -7, 226, 40, 34, -222, 131, -29, 151, -136, -115, 8, -70, 99, 98, 147, 59, 278, 64, 62, -349, -158, 52, 122, 35, 264, 95, -99, 365, 38, 27, 61, 119, -115, -38, 128, -395, -219, -13, 120, -111, 65, 76, 139, -9, 53, 58, -124, -134, -256, -68, -64, 246, -66, -96, -141, 71, -169, 22, -216, -306, -87, -96, -190, -115, -96, 42, -134, 111, -174, 33, -1, 195, 42, -6, 32, 12, -10, 200, 5, -288, 147, 78, 137, 12, -54, -478, -49, -246, 183, 1, -18, 27, -109, 94, 16, 177, 86, 208, 112, -13, -37, 50, -27, -5, 58, -1, 15, -313, -134, -33, 15, 18, -203, -129, -107, -19, -375, 20, 67, -30, -186, 7, 21, -1, -7, 73, 128, -176, -34, 146, -89, 147, 144, 126, 52, -233, 115, -27, 131, -47, -94, -155, 14, 128, 104, 32, 47, 235, -114, 237, 356, -135, 59, -31, -124, 0]
2241@j74J34q3N0J70J60k93K5Q1l14k9R7N85k04j02j71J96k43J29j70K30K45l05
2264A4O1l34J22J01j30K29k2j5J31j33k73m5K18M13n23L04k30J36k0q3J86k9L
2287H1J01l95K19J28k68J10o4j9K07j58K19J91k93p2J22J2j59n0j14L72j75j26
2309a31M1L42l01j7M2Mj17k5j34J73J67r7K31m38L69J65k2n7k2j53J80Kj37j00
2333c5r2O5J70j9j09j31J09J43l9R1k21M20j22k18K55l41j04J56o5P1J00J07Q5
2356B76l71O3n7j5K41n6K36j62k99L62l01J14j23j00L74k22p6pk21P67k74k30
2378h1K19j85n3M11j78jj51R8j22q5L31k27J40j79P6q4R2j16K09j58J51k60j21
2401b74L40l11K64N6R5n47M08n6J85j11k5M9O4J48m58L64o66N35k10K51n2K62
$$ y = [0, -174, -40, -123, -73, 97, 257, -36, -11, 70, -244, -273, -176, 409, 205, 103, -68, 128, -115, 14, -156, 74, 319, 14, 75, -259, -137, -36, -166, 63, 41, 26, 157, 24, -249, -294, -76, 337, -186, 118, -112, 24, 4, -79, 107, 78, 81, 182, -213, 6, 134, -134, -24, -88, -107, 100, -58, 161, 352, 59, -13, 109, 121, -38, -88, -202, 170, -5, -131, -90, 252, -49, -66, -24, -20, -137, -162, -296, -123, 44, -53, 178, -260, 109, 274, 252, 195, 173, 20, 200, 202, 65, -35, -127, -62, 108, 89, -20, -151, -42, 101, 62, 153, -68, 352, 230, 12, 267, -74, -178, -22, -87, -16, 84, 191, 276, -95, -32, -89, -104, 137, 81, 317, 155, -144, 218, -83, 31, -92, -192, 182, -40, -116, -123, -344, 423, 149, -81, 138, -47, -100, 311, 133, 132, -19, 79, -43, -128, 203, -24, 116, -63, 13, -71, 21, -95, 114, -44, 107, -153, -274, 66, -245, 19, 75, 170, -377, 31, -25, 160, 49, 24, 73, 137, 285, -173, 191, -475, 60, -150, 101, 49, 311]
2423C11l23j64J66n0p2N7L29k65K6o2k3J60o9j33K70j77l04K84K97l60j02K22
2445A8l1J7K98k48m3O3rrJ05r5m8K4n1k19J68L14K7l40J36J35k4k81M7L33l42
2470e5N0Q0M9j12n4K36k9j43j99K28K8l16L15J02l04j44L10K43l14J83k47J17
2492B4J96l57J94K19j22j62K01j66k48nK7J75j89K26L0l33K11J26JJ50j82j24
2514a08K37J4j41O0L2j69J29j26J24j24J4O8k58J04K14J3o8qn0K15k84K13K51
2537C52m90K14j58k43J88M45j57N0j82L4m32N1M7J16J14j16J52J81l28r3jj39
2559c95M57j61J64p2r2m3J01J5J46k10LO1K72j94J90l98K62J13k26N7p2k8L6K20
2583B06l54N8K71P8l95O8P9j66L67m72N80m94K07l1j51J57k60J57j34K71P1j57
$$ y = [311, -12, -176, -10, -60, -132, -75, 254, -11, 15, -47, -70, 90, 21, -112, 158, -19, -323, -39, 258, -102, -204, 18, -13, 4, 302, 54, 11, 74, 65, 56, 161, 66, 18, 42, -9, -228, -60, 254, 281, -59, 77, 212, 188, -93, -46, 287, -55, -5, 75, 124, 12, -42, 194, 165, 22, -177, 51, 79, -237, 78, 180, -124, -268, 42, 285, -29, 154, -93, 24, 220, -137, 57, 276, 154, -8, 193, 27, -221, -226, -199, -24, -213, 13, 43, -290, -79, 47, 48, 198, 16, -108, 129, 143, 2, 62, 94, -75, 54, -72, 52, -72, -58, 10, -248, -144, 70, 83, 15, 7, -43, 172, -112, 101, 352, -138, 76, -82, -325, -137, 308, 151, 201, 19, 53, -379, -328, -281, -165, -51, -167, -15, 166, -162, -255, -256, -395, 62, -99, 65, -7, -99, -142, -41, -26, 120, -90, -87, -26, 246, 52, 242, -156, 106, 219, -7, 50, -22, -50, -14, 206, -148, -90, 181, 259, -136, -68, 11, -155, 212, -260, 320, -174, 33, 2, -149, 8, -252, -95, -229, 42, 113, -44]
2605d4L3J2J29p2l4j04J4P0KJ64l5j61nK54k34J28j23k5OQ4j44r3K69Rj95q7K27
2632D5J25l67O8k9J55j17N27l89n4j16K43J79k08J76r9j97J30K76j12j58n9P6
2654I5Pj27M22m35N8j79R2M4q7J47p7j18J73p3j64N64l72J59j56R8J43l36L88
2677B66Pl05j60J19J9j61J3P2K23l8j33J59J21k35Lj41L38l99K57P5j58J13l0
2700B5l41K13j5J63j44m4J43j43P4o4j3J75N5j95J31j49L79P9l71Q2l5L23n77
2723b49N7J25K95m08K7M13j45m14K88J22j3k64J51O1L4k7j5J00j77j86L09L0j16
2746bq2P2L0k59J70J62j55K49m0j28j04K28n82O17j11r2j59j37K34o5j22K76K34
2769B34j39j07K01j68J06l71L21k95M80l08J50J01j96j85j92L53N5K09j62M4o5
$$ y = [-44, -11, 1, 130, 58, 24, -80, -66, 4, 6, 170, 135, -26, -31, 223, -11, 117, -6, -31, -25, 59, -85, -178, 91, 100, -95, -182, 45, 170, -197, -129, -158, -3, -120, 407, 18, -36, -152, 91, 270, 62, 238, 139, -58, 72, 348, 236, 78, 19, 95, 102, -25, 397, -38, 20, -159, -67, -23, -110, 37, -40, -158, 15, -58, -222, 342, -30, 129, -27, 71, 214, -122, 266, 273, -32, -192, -73, -54, -215, -202, -130, 93, 55, -78, 81, 202, -33, -30, -171, 167, -232, 25, 100, -58, 55, 25, -316, -103, -118, 45, -99, -143, 0, -143, -69, -133, -146, 29, 84, -111, 20, -129, 250, 329, -42, 40, 5, 328, -249, -192, -67, 228, -180, -153, 260, 115, -299, -11, 111, 98, -166, -15, 46, 80, 53, 38, 138, -39, -225, 84, 114, -2, -84, -12, 18, -241, -71, 91, -64, 185, 145, 17, -87, 141, -441, 176, 65, -27, -186, -323, -89, -154, -276, 0, 234, 95, -12, 189, 21, 127, -244, 77, -218, 262, -46, 104, 205, 9, -176, -368, -15, 40, 249, 87, 131, 66]
2790F6p5j12K70j42m14K29J26j98K33L7j9o3mK3J53j65L2j46R8J71k15K34P0k26
2814c7J79k68r0k0L18j32K74m86N57j81k06L16j96k99l2M33K5l55q6J15K5K72
2836A26J18l53K3K71l07j1J17l0K29j51j20K20j32n0Q3J96L5m92R6L5pj00K25
2859B1K64o15O19n21J9J64k41L60l60M20J7k06K35J27k83k10J68l47K76J36j49
2880a06K21m26L27o0J46l03Q9L36k02L28l07j67j59M56p2k94L89nj94k61M2M25
2902B03l22K42K2J54l71L05j08p3J20k63O4r9J04MJ44j89J77j52j1L59n14L74
2924A70k57J07r1L15k11L0j5j00L04j89L31k71K22n57J21K51m9J02k56j07M8K45
2946A43O9l2l53j21K05j16J4M14j63P4M5k56K95l31J13j68J75K28l52K4K70j04
$$ y = [66, -9, -121, 149, 7, -407, -178, -52, -250, -17, 20, 1, -62, -66, -43, 110, -55, -23, -169, -71, 100, -115, 119, 189, -37, 142, -126, -216, -236, 82, -50, 224, -262, 295, 114, -92, 224, 28, -271, -303, 130, 155, -200, -286, -171, -146, 126, 244, -109, -86, 185, -122, -133, -16, -46, 183, 32, -88, 132, 0, -50, 33, 229, 264, -228, -132, -97, -104, -204, 21, 285, -330, 289, -232, -213, -49, -290, 70, -290, 130, 147, -59, 176, 303, 20, -190, -22, -369, -93, 43, -106, 115, -311, 16, -44, 102, -201, -112, 224, 22, 350, 43, -124, -283, 173, 101, -193, 196, 191, -3, -264, -222, 203, -119, 123, 145, 299, -72, 233, 125, 52, 172, -91, -27, -126, -22, -18, 126, -63, 114, -38, -49, 310, -204, 170, -87, 20, -71, 244, 33, 63, 48, -52, 252, 63, 394, 123, 345, -212, -91, 160, 111, 213, -43, -150, -102, 143, 212, 180, -173, -294, -89, -205, -191, 223, 60, 134, 179, -77, 218, -113, 0, -168, 7, 235, -117, -93, 177, 73]
2968G3L9R2j40M0k0k05Q9J8O%K41j22L2p8Q2k94j27K16MM91n00J16q1K29l40P9
2994f0J29j03J09m34M07r5L04m07m8L19j61O1K01l05J8JJ73O9l28K98O9k10J86
3017A93q5k30J45j74J63n1k98J24K26Q0j89J48J19l20M07Q8k53k05R7J78j98K95
3039B60k15j09O9J35M5j60m4K07q8k15PJ70q7j92N1J07R6k27K96O1K1j62j34J58
3063E0K26l67K1J03O4p1J31P6m6M4k8l28N8M03p04M79k00R7k22L46j6k58M53l07
3087DO9oL4Mj09q8O1R1R3j07k09%K61J81p14N77k61QP8n9n5P5MJ01J43K6k08o6
3115g2j34J17J45k44L4J26N3j19j52K22K63k02k3m2O1R8l43K94J58R1m81L15k72
3138a07j12K44k2qR7j17J14j55K32k39K34j44k17K85m2p1N7j60J68O1j49K67j72
$$ y = [73, 112, 204, 64, 104, 84, -121, -32, -14, -8, -8, 233, 111, 143, 65, 147, -147, -274, -58, -54, 437, -63, 53, -28, 201, -139, -60, 69, -34, 75, -359, 48, -47, 257, -150, -198, 121, -40, 21, 222, -83, -65, -64, 109, 178, -150, 148, 217, 7, 193, 108, -122, 23, -151, 12, -39, -337, -213, 13, 93, -96, 52, 171, -149, 258, 346, 93, -112, -15, 163, -35, 260, 45, -64, 5, 140, 185, 25, -19, 188, 100, -115, -108, 62, -25, -217, -166, -59, 37, -190, 106, 167, 188, 26, -108, 50, 276, -91, -70, 33, 97, 26, 157, 233, 187, 231, 203, -125, -67, 336, -368, 111, -89, 8, -214, 132, 116, -142, 311, 4, 73, 67, 101, 105, -4, -92, -31, 60, 153, 46, -163, -163, 98, 279, -435, 142, -119, -111, -33, -92, -147, -72, -68, 33, 176, 202, -6, -72, -206, -89, 56, -188, -154, -28, 25, -94, -246, -24, 239, 37, 14, -28, 33, 131, -212, 82, 240, 331, -150, 165, -107, -219, 25, 3, -5, 92, -25, 89, -66, 166, -73, 161, 17, -200, 85, 43, -28, 29, -131, 37, 98, -51, 216, 44]
3161D4q9J34J51j86j54M48n10rL07j56J0M0j68N92l62j57q%J63j5L8Lm51N20J56
3186C41j79k23n4K42j49J60j29L80m08j04R4O0K44k72P7J5Qk40L6N7P9j17j71
3209b53M32K06l42j23J32j88M4o5J25N7K66l47k40L77m7k20L54j13r6J08R7j19
3231D5j43J41r5K2o3J99m9l39J65J48j21J70J88j11k18J17m6q6j4N4l4O1K25l59
3255a43J23k19K85l50K63q0M0J44K11l36L4K2m15K46L63J21j33j30k89l4J94J8
3277f5j06Q3j59o5K59K03L2k16L1K06l37J65K29k2n53K75K5n0J25mj40M2J09k07
3301a40L0O4K1Pj92j7K38ONO2k59N04j13m77M7K85J8k4qK2l45K40J66K7N3l58
3327a38L9K85j35n3J37p3J59l59K3k54M09K0Q6p4j58K61l57K16M5l39K21j0K42
$$ y = [44, -45, 89, 240, 54, -100, 348, -162, -171, 136, -20, -10, 30, -138, 454, 92, -65, -73, -73, 90, 75, 113, 116, -335, 185, 341, 162, -61, -115, 127, -22, 138, 9, 389, -19, -123, -29, 31, 275, 3, 80, 95, 103, -137, -101, -44, 35, -82, -253, 179, 385, 43, -80, 52, -136, -92, -157, -32, 25, 291, -56, -296, 81, 34, -186, 168, 55, -41, 67, 164, 45, -98, 43, -52, -30, -93, 106, 57, -282, -117, 31, -90, 80, 268, 157, -61, 56, 10, -76, -90, -36, -70, -9, 216, -143, -20, -239, 46, -304, -41, -121, -81, 63, 274, -62, -28, -6, -421, -175, 188, 309, 176, 46, -243, -277, -83, -65, -171, -88, -247, -312, -53, 150, 182, -34, -3, 203, -134, 31, 260, 238, -315, -40, -15, -65, 60, 56, -84, -42, 67, -140, -110, -46, -25, -18, -210, -227, 11, 17, 22, 84, -175, 329, 216, -261, -214, 71, 89, 65, 57, 79, -266, -26, 140, 167, 220, -138, -99, 186, 51, -2, 135, 62, 221, -138, -115, -369, 40, 60, 146, 72, -86, 175, -182, 34, 79, -260, -39, -49, 193]
3350A93p8j29n8j10O1O7K58k04P2j30K76l20j03J94J1J75l84M52Qj61n0j96K47
3373I1j05J45j16P4k9r8L4j28M65l33j47L06k10j28L47K71m51J25j82R7k54PO7
3396a52K27n1K0k69J65J83j18j47o5j27K50j21K02j70K71L1J73m83J75j01K6K5
3418e6M2J84j35J30k89J8P3J20l26K34K3Q6O0j51L14o67M32j1k60K28jk09M46
3441B85k33m0m3jJ04j29k5K32pk66M72k02k92K14n5L74k46q3OK1j1j47KK0M91
3466D41m62m1Q1J23j90p8K80K5k79J09k15K31m8L12l45j1J08k26K1Q9PJ85k75
3489a58K12j59J40M2j36J69j12K77k62P8j72L9J5l96L12L32k98o7j71L24j81j28
3511c00J84K31L3j38k76j60K22K53K45o6k30P6K01k41J4M3o5l93M91j24Q8J24
$$ y = [193, 115, -14, -72, -182, -121, -54, 204, 0, 72, -58, 218, -102, -205, -11, 0, 175, -209, 243, 251, 90, 40, -156, 91, -14, 131, 15, 89, 60, -38, -4, -132, 333, 0, -147, 159, -51, -179, 168, 439, -12, 113, -69, 28, -226, -219, -152, 75, 24, 44, -225, -60, 123, 5, -142, -207, -334, -84, -205, -3, -173, 98, 129, 302, -181, -6, -107, -81, -56, -14, 170, 35, 165, -124, -106, -33, 87, -239, -5, 18, 104, 164, 13, 327, -340, 92, 81, -179, 49, 48, -161, 285, 52, 12, -31, -32, 72, -57, -82, 150, 143, -123, 349, 147, -145, 69, 14, 388, 142, 59, 65, 86, 75, -72, -70, -50, 441, -21, -62, 19, 142, -48, -126, 154, 179, -100, 9, -206, 25, -23, 289, -56, -67, 41, -185, -164, -75, -68, 117, -158, 54, -105, 35, 77, -59, 110, -2, 275, 13, 91, -81, -42, -27, -423, -111, 221, -77, -144, -315, 9, -172, -300, -116, 115, 148, 10, -266, -426, -204, 49, 294, 228, -2, 74, 275, 34, 48, 91, 26, -367, 124, 0, 88, 212]
3533B12l39P5m6K07J62j49k40N8R4j63J91k85M83l99K09l8r6pj93m2M71q7k97
3556b19J89l9J19l00K41kk71K56j1k80N72l28k67M17KJ81j14n2j54L16j66j28
3578c8K29jk10j7j41K96j59J6J84m11K35N8J12j40J07r0Rk97N77k25j73J24O7
3601A12M6l49n6K41R6O9R6j52j09k41K76j23K4Q9j1p0J14J8N6k28J92L9k13nJ63
3626G4j92K03l80N16k50j41L77l35J20l84M08k58K07K05k29K37j79KK71q0J27
3647C19k74k62K60j02R7K3K3o5r2qO3L9k55K48n9J87j09m0k30L18k67J14J80l62
3671b54J80N5n5JK66l55J36J61k11r9J46Om32O63o36K97L38k30J17j65J48J35
3693B12l6k21l4p5KL60k31Q9j77O2M6j42K56o1K4j30j42m0J13J33L96m91P6m0
$$ y = [212, -127, -52, -98, 109, 271, 122, -118, -60, 34, -129, 62, -223, 260, -139, 70, 32, -64, -71, -264, -306, 165, 78, -219, -30, -69, 50, -250, -9, -11, -282, -26, -37, -317, 255, -73, -340, 77, 79, 260, 146, 94, -60, 256, 90, -38, 191, 190, -20, -37, -178, 118, -41, -25, 159, -252, -17, 41, 153, 13, 120, 30, 39, -258, 319, 94, -79, 45, 112, 158, -191, -247, -6, 90, 159, 255, 103, -6, -247, 29, -94, -70, 19, 8, -62, 52, 70, 126, -102, 90, 129, -84, -89, 74, -118, 85, -295, 221, -29, -170, 207, -128, -8, -392, 16, -242, -35, 170, -59, 178, -1, 1, 272, 192, 319, 45, -217, 43, -59, 38, 61, 84, 19, -73, -81, -18, 21, -234, 14, -45, 142, 33, -7, -237, 81, -186, -72, 108, -254, -74, -19, -74, -73, 193, -162, -26, 135, -76, -175, -29, -23, -455, 208, -428, -131, 207, -23, 94, -71, 77, 212, 176, -45, -79, -154, -152, 208, -23, 66, -111, -49, -3, -145, 111, 50, 74, -56, -198, -238, -125, 8, 404, -87, -11, -51]
3717e1J15O8k43J87j87P8k86L99O8k61L57j95NL1j47J52j69N5L52m65j46N74m10
3740a19J44j3l20L19j31j82J04N8M9K36k03o5J76n8Pj89K69n3K60l71k1L26k75
3763e2R8m1J57j57k3K91k7k28p4R8j65J94k34Q3k00K12L93m33Q0J3o4o6J21K1
3787cJ09k1k11K82r2Nk38k0J6q8M82j72j83L30k54N4n6K03k10J05J37m98L24N2
3811E3j01j57K91k47K29Mj6J54m06K13J53j36j90L63J42l96J67l64J88J75p6O8
3833A11k35K36j21j8j47K14j59R3J10k39q1K13N6j67KJ92m2K09l05K7J09m4n1
3856c7j10K14j44J56j43R8P8l62J81j1j55K75Q4j6j4l24L53q4k8O9p2j22n7L4
3880a37J98j75K47j84l68M05K39k39jK03j82J95%p0j33L5Q0k52RJ5q7m7K30lK25
$$ y = [-51, 64, 132, -111, 76, -111, -33, -319, 80, 148, -113, 244, 49, 54, 85, -62, 90, -79, -24, 328, -137, -283, 291, -119, 25, 12, -308, 11, -120, -302, -198, -140, -91, 145, -58, -123, 53, -5, 2, -187, 82, 29, 289, -82, -103, 223, -52, 46, 5, 162, 5, -18, 273, 246, 18, -56, 42, -123, 71, -163, -80, -280, -68, 325, -108, -28, -15, -79, -145, -24, -3, 106, 85, -126, 156, 64, 69, -169, -189, -173, -261, 221, 49, -134, 196, -58, -4, -60, 143, -67, 38, 175, -323, 1, 53, -48, -205, 86, -161, 68, 72, 56, 210, -196, 17, 170, 34, -156, 207, 349, -47, 120, -244, -56, 119, 43, 111, -124, 112, -9, -27, -174, 40, -119, -26, 84, -155, -236, -23, 33, -134, -132, 60, 18, 227, -78, -51, 58, 14, -37, -147, 67, -77, 79, -64, 34, 112, -250, -69, -80, -235, 40, 124, 108, 94, -230, 123, 39, 11, 80, 8, -114, -171, -137, 61, -114, 133, -51, -419, -14, 225, -14, -15, 188, 6, 201, 201, 131, -2, 33, 113, -139, -130, -115, -202, -249, -19, -22, 203]
3905B03k81M7l5m4q5J21J14k08K10J35j87j75L27k35K85l7l15nK74j3r6Q8j70
3928h2j84M40j77p3p8J52k53J23L12o3K36k79j92R7k20m1L81Q6N7L4k17o1k43
3951b45K72l17M17n1P2j55O6kk45J24J02J56k56l8P4K17j35J02k29j16K93l96
3973b90M92l69J29J48j90J26j47j16J80j9P3o9L80m56J89Jj68J11r8J53j89J59
3995C0j48j14K32N2o7j14L9Q5j39P4R6k8j36J73J62k14j91L98M9l77L13j96O8
4018D7j86K98k34q2K73k08J96j43J11J36k15j76p1K16K78j77mJ3r3J72J2k85k0
4041a42n0J80J7M6r5L78l63Q9L9q0K53j42k67O8N6O8O1R8lk01Nq1J25L3o7J07
4067A32k48m8K56j92Nj08J63J70k16m2k08K50L4J85j5l2J68j84j60M3j87N28k45
$$ y = [203, -78, -31, -66, -110, -195, -74, 40, -168, 42, 177, -10, -185, 142, -93, 192, 155, -160, -165, 109, 96, 0, 88, -82, -266, 174, -3, -76, -154, -2, -255, -132, 180, 117, 353, 74, -118, -21, -241, -282, 99, 185, 242, 276, 59, -2, -245, 27, -290, 127, 76, 148, -7, 59, 57, -188, -64, 38, 194, -62, -100, -26, 191, 56, 158, -71, -187, 106, -290, 202, -167, -38, 110, -80, 46, -101, -217, -37, -56, 17, -52, 328, -128, 61, 62, -106, 5, -93, 60, -129, 30, -118, -232, 0, 52, -15, -129, -90, -5, -144, -70, 26, -2, -138, 35, 197, -17, -208, 190, 239, -138, 175, -21, 47, -139, 159, -75, -157, 116, -92, 104, -39, 72, 208, -7, -183, -254, -38, 240, 63, 59, 72, -21, 151, 163, -122, -142, -192, -12, 5, 51, -44, 334, -29, 60, 99, 19, 272, 130, -137, -69, -13, 55, 116, 214, 211, 10, 15, -66, 59, 92, 25, 132, -116, -164, 92, -100, -95, -203, -40, 130, -86, -128, -336, -86, -52, 133, 118, 86, 254, 70, -90, -47, -234, 294, 49]
4090D9r4K1J02jJ04k12j73J50J51J05j75j49L39l46J00N0J84k46o4J55k28K70
4112I2O8O9k57L17o38K05M07k80j7K06j63J02j75L54l35o0K20m21L32k86J94j59
4134b25P7l0N1R0J32o3q1M9P2j67M8M08m62J94P1l50L84n58N26q4j99J07J29k24
4158a05L85P2n65M13l87o5K35L09m50K56k77J55o7%L8M1p9L62l80L26l46L3R0
4181fJ74lo2k82O5q1J88O9j78l4M59L5m72M61m65J57k70K23l43M18j88P0J14J54
4205B03Q9k43j25R8j41K92N8k66Q7l0j7j85L64j34k54K36O3lM7k22j89M03J7k56
4229a08K01j46k4l5L84j47j75mK4K19j34j67o8J32K92n81N25Qj16j18J3Jn8n1
4253a33M1L33l71J58o2P6L21k96j67N5lR1j81M22m64K74J2j58j08L96k36j7J89
$$ y = [49, -45, -24, 78, 77, 181, -31, -204, -54, 97, 202, 27, -122, 217, -129, -29, 21, 205, -41, -105, 50, -178, 92, 160, 229, -28, 289, -349, -144, 263, -17, -34, 172, 9, 111, -64, 290, -45, -105, 115, -306, 26, -260, -66, -225, -148, -178, -127, -37, 95, 32, -49, 0, 72, -95, -47, 361, -101, 93, 164, -186, 198, -360, 166, 82, -117, -10, 119, -105, 280, 352, -213, 200, -187, -252, -17, 292, -158, 98, -179, -24, -91, -91, -53, -12, -91, 271, -109, 217, -129, -96, -6, 168, 165, 103, -179, -114, -195, -7, 62, -116, -150, 309, 344, -128, 333, -132, 25, -245, -22, -365, 53, -135, -65, 49, 203, 292, 49, -76, 22, -119, 173, 231, -35, 52, 22, 5, -180, 184, 50, -204, 32, 95, 92, 139, -83, -272, 131, 148, -108, 93, -53, -77, -112, 272, 125, -50, -54, -30, 189, 55, -112, -180, -48, 244, -337, 188, 196, 80, -38, -25, -24, -82, -133, -92, 241, -130, 28, -34, 42, 363, 67, -100, -45, -48, 43, -138, 284, -180, 94, 106, -52, -160, 236, 0, -17, 172]
4276A72k16J54l18K81n2l6L7j12J98m4o3L03k43o2O4J9o2p8J87J27o5j65J25j73
4300b2J7j5L0Nn3k28K00j48j18K10Pl5J85k47M66m77L02k24L30k25K17j9k29K39
4324A68l60K61q7Q3K2l88M46l3k31M12j0j77o4q9k6L1LL3j27J26j33J93L10m38
4348g5L2oJ11m5J1J25l45J96j3k65K24Q3j02K49k59L08k62j15K73k35o3J75j89
4371a87j68L2K92L34N3o45Q5J2K83M3l9J6k63NK15j03K45j29j42J04j01M8J51
4394A41q3m2K0m3%k33M56l41K90k12R3j44j0m4L00j34o2J51l80J92K24j60J84
4417A63q8O4j94J67J69j21k60J28L21m51q5L37J68k34p5k25P3K16m41L98k46J30
4439h6L26l67J88J87m34N25m78k15L10J08K40p41J46L82J45j96P2p9j28j4J62
$$ y = [172, -44, 110, -208, 73, 21, -15, 22, -90, 108, 64, 1, 304, 61, -1, 63, 82, 20, -58, 129, 256, 191, 26, 151, -22, -5, -20, 10, 15, -38, -266, -66, -214, -332, -122, -115, -150, 35, -212, 254, -223, 79, -145, 185, -40, 177, 158, -71, 168, -192, 69, -18, 65, 87, -301, 145, 112, -119, 293, 283, 106, 42, -47, -73, -42, -39, -6, -133, -7, -140, 53, 363, -75, -43, -49, 62, 17, 28, 153, -192, 4, -9, -274, -50, 33, -69, 180, -79, 229, -33, -148, 125, -110, -173, 2, -187, -355, -323, -31, 303, 356, -289, -204, -192, 91, 134, 95, 111, -152, -147, 68, -35, 210, 81, -61, 43, -58, -10, 141, 58, 16, 36, -7, -7, -240, 216, -125, 165, -47, 46, -98, -108, -152, 148, 14, -48, 103, -277, -85, 139, -21, 163, 75, 139, -55, 112, 281, 160, -100, 28, 349, -102, -187, 150, 318, 84, 9, -216, -143, 73, -368, 30, -216, -86, 240, -127, 61, 248, -186, 339, -139, -354, -44, 64, 304, -437, -291, 91, 236, 40, 112, 33, -95, -109, 53]
4460E3k74N3K45k28L22q3o7j42k60Q5L37p0J49l71O5M15m30J10j26J89J12n5L5
4483F4j78L48k17j71K68m09L64M3J70k47J7j51Q5K35l16J05J99r3l45J90q3L01
4505A79k58k6L3J34l29L07o4K9j07K47k62Q6K50l26j30L96k71K22j54J45j45k91
4527c35J64m4L24j58N9j97K61j3n9J03j85M3O0J7P7j02j57L53q7j64K5K5p8P3
4551EK81q3j75J47l15J01j4j56K38o6J30M9J55k42N1j83M2K47j98k65J42P3K6
4574a0J04q0J97J8j40l05J99K1q6K13L4K4j55J53q0k21lq0K66l72K16L30l31q8
4598a76J98p2K95k71r8K5k5J28j48L14l13M09l32P7j31N5K02j59L32l01J10j23
4620dn9J37P0k3j06n6r4K77j90L7j17J83k52L65j32jq2p7R7J23j04K9l67L11M1
$$ y = [53, -221, -168, 77, -151, 171, 88, 21, -121, -381, -296, 41, -29, 120, -251, -186, 229, -201, -91, -217, -28, 84, 29, 64, -114, 234, 17, -154, 114, -295, 69, 112, 282, 35, 52, -99, -14, 221, -95, 10, 209, 116, -229, -39, -122, 179, -79, -105, -72, 62, -267, 40, -24, 5, -102, 145, -117, -31, 219, -107, -237, 159, -112, 110, -44, 101, -44, -335, -171, -215, 109, -49, 10, -187, 74, 61, 2, 105, -80, -37, 23, 40, 117, 15, -142, 211, 124, -40, -15, 10, -68, 5, 286, 203, 28, 175, -140, -39, -53, -209, 29, -37, 93, 142, 297, 55, 106, -77, -35, 212, 14, -251, -109, -36, -10, 94, 14, 211, 229, 89, -216, -17, 4, -82, 131, 165, 189, 34, 187, 107, -114, -117, -197, 69, -303, -87, 243, -88, -176, 22, -50, 245, -26, -124, -99, -124, 4, -144, 170, -143, 266, -66, 11, -120, -65, 137, -22, 310, 9, 119, -4, -63, 74, 144, 121, 15, -41, -135, 142, -48, -11, -128, 55, -197, 168, 36, 35, -47, -124, -27, 96, -8, 21, -346, -35, 6]
4645Fo8J94k30M01k9k17K4M3k70J51J80j63L05n7l24Kj09L08l46J34K7J0L0m4
4669d2p6J58N5P6M5l49J92j05K1P2l2Q1l10J71O1k21j14K72L6l54M39l9k66N08
4693B79k47P4m7j0nj6J40n9j1j89J66k08O4K0m12N68r3Jj51m8J01j54K98j43J87
4718A05L8m2l1l75K88j03J99j59K10j85J72r3J6n7m7M0O1lN4j86Q4J76k90J99
4742G1j76RQ6L74n48J37j15J42KJ10j32q3K3L9lJ51M07o01O6M1O0k1j82J33J39
4767A29j66K54m9m7k84j85N74j42j44J85r3q4L7j38k21M74J96k62r4o9j7L05n35
4790c76K03K49k67PJ1K58j05J23J0N5J00k36J61k60m4K26k3j11J91k47J72Q3k86
4813a06J61k76K05n1N5k6Q1k0p9K30J28m24l6J26k9j98K85j82L30j11J3j13r6
$$ y = [6, -62, 132, -98, 303, 274, 57, 81, 124, -146, 5, 185, 22, 327, 270, -54, -52, -161, 147, -199, -65, -38, -28, 2, -42, -118, 40, 95, 171, 216, -133, 59, -46, -25, 47, 15, 96, -214, -43, 18, -203, -317, -45, -9, -363, 76, 37, -229, 279, 32, 106, 59, 49, 44, 28, 168, 109, 98, -91, 75, -133, -69, -49, -461, 107, 14, 15, -136, -184, -83, -237, 61, -82, 105, 143, 101, 70, -305, -17, -120, 79, -80, 130, -55, 117, 24, 40, -17, -64, -24, 37, 34, 88, -98, -14, 162, -128, 71, -105, -96, -10, 364, -184, -47, -162, -20, -18, 92, -40, -123, -100, -61, -64, 87, 494, -107, -41, 0, 60, 39, -143, -10, 129, -37, 217, 168, 121, -163, -348, 226, 84, -60, 125, 32, -52, -15, -153, -374, 100, 296, 34, -60, -129, -146, 159, -376, -173, 76, -191, -184, -173, 85, -20, 103, 113, 168, 268, 32, 193, -67, -111, 115, 92, -19, 172, -75, 97, 180, -106, 55, -221, -16, -67, -12, -38, 43, 23, -56, 174, 302, -122, -158, -32, -61, -259, 26, -156, 174, 63, 76, -37, -133]
4836a33j55J88J17%m68N09J03k01K80l07J31j23m5P6O3J15j32p4K15k00Rq0J29
4859A7K0J84m52L39J3k92K29J4k63O5J03L28o80L67P1K90o16L13j91M2R9p2N4
4882a8l9K53l95J80J1K8k16r7K41km41M96K03J43l71L46l11l31M26J45l45K8Q3
4905A7J12j65m4J41L7j54j38K8J93j07j77L50j84p6J53J74k25r3J21m4j15J42
4927e4Pr4L18l99L53J24n74K95K5j55R1L59n8l64N74o49P8NJ10j67N2J60K61m61
4951a63N29k03n35M73q4O6L19l88o5j17R6J95pk51J87M3j86j69L81l56K96J1k52
4974a80n4K05R8%j02K53j21L5k97J27k43M55r6J35k38J77p1j63n9N5Q1j73R2J07
4998B3n5M27n33J72q6p1J31M7j30j4J81j04j63K22K9j65J97q4J07m01O38m11K00
$$ y = [-133, -288, -100, 17, 17, -451, 58, 161, -40, 240, -67, 64, -59, -104, -28, 35, 150, 18, -56, 159, -41, -32, -112, 17, 37, 221, -231, 108, 121, -171, 58, 72, -191, -126, -23, 305, -375, -8, 63, 353, -263, 50, -141, -99, 0, -72, -18, -57, 196, -199, -19, -8, 20, -196, -293, -52, -54, -495, 1, 204, 347, -24, 322, 11, -320, 106, 251, -94, -66, 17, 129, -36, -80, 61, 98, -56, -194, -166, 27, -80, -257, 93, -91, -167, -14, 160, -65, -158, -37, -81, -196, -54, -47, -141, 177, -222, 131, 255, -319, -24, 1, -154, -63, 296, 238, -126, 448, -201, -123, -118, -8, -175, -123, 37, 298, -163, 366, 163, -372, 101, 17, 83, 402, 14, -51, -168, -72, 123, 116, -135, 52, 95, -91, -260, 121, -235, 61, 72, -180, -234, -29, 69, 69, -33, 220, 99, 134, -163, -36, -279, 176, 80, 215, -23, 154, 83, -80, -139, -84, -3, -176, -84, 23, -32, 395, -138, 34, -52, -123, 8, 55, -75, -89, 92, -12, -175, 47, 76, -89, 108, 24, 131, -270, 368, -43, 157]
5021A57j3k5j02J64j96R2j79p0M29L0k87k52L19Q0l69M55j9j38j07j18J61q7R9
5044B4Q5l5j16K4o2j05P1L18m56L27J11n49O21l20J2n5K38j93N2m0K00l00J77
5067B9j62m6K0J80j35QL13l01L19k75K07J9k14Q6j47J39j11O8RQ5k46K46K5J40
5091B56j71j5k27p6L04k83K84j90n0K13L7j30J6M8J86j14j95J61M8j84l4J12K59
5114B55j15n4k48K46o9k11J80k0K70k50J1J31r4m0K11k89R9J40m7J69j10r5J60
5137B30j37j76O1J20j36J17l69L89q5L87o45K75j16K46l5n8o3K18j48r2R9O7l53
5160b04K85j82J93j68K46j96K10j61P1j71j22L66k05K65l05Q2J42p3j02m0Q0M49
5182D60n49J89j03K18j68O2o3K5m6j02o9P5q2L63k75L21o8k18N05o26Q8J01L6
$$ y = [157, 144, 119, 17, 181, -15, 77, -102, -172, 257, 287, 0, -252, 67, 147, -222, 233, 214, 76, -31, -149, 12, -75, 24, 109, 74, -42, -18, -80, -185, -114, 204, -252, 75, 186, -363, 258, -62, -50, -105, 133, -60, -8, -48, 152, -148, 29, -133, -179, -159, 21, -114, -106, 207, -94, 225, -50, 157, 176, -38, 48, -99, 40, -71, -3, 6, 91, -155, 91, 116, 256, 85, 70, -157, -233, 71, -212, 72, -118, -168, 45, 82, -48, -32, 16, 202, 88, -107, 54, 102, -82, -116, -4, 255, 140, 86, -162, 84, 15, -196, -16, -36, 234, -16, -5, 126, 32, -8, 203, -86, 13, 153, 106, 275, 165, 70, 230, 93, -83, -22, 98, -38, 79, -290, 99, 14, 401, -244, 31, -85, 161, 126, 68, 5, 223, 75, -17, 82, 149, -204, 81, -101, 92, -76, 170, -26, 184, 23, 94, -77, -199, 167, -38, 227, -78, 4, 146, 73, -29, -69, 11, 460, -89, 100, -3, 215, 47, 109, 46, 71, 25, -77, -146, -71, -153, 210, -65, 256, 188, -30, 475, -151, -63, 38, 74]
5205G4J1m8qk9j51J69n3J56j75J25q3j16L8oM10n01L68j99p8M60n10Q2K29j47
5229A8k18P5j54l8L80J8J15J9p7m9l93L42p1r9J05L24j69j72n8K66j89L2p0L5
5253b8J62j58J2j54K8P0jJ77r2m7k24N9q2K34K52j39r9k04N62j89j7r3j45k69
5277c85O41k21qP8J60k2j91m7n5J64j41K18k71K79q6K30j83n3j59j60L42j01K5
5300E4nL1p4J31K36k82L7l4Q2k77j2J01j46j34M11k65J25R2j22R8j33K04j74K19
5324A63j77J1J7J26k40N8J26K37n20J34M9j36K72l69J57J54K17l71Q6J07j34L6
5346Cj2k27M02l64j41M28l52K61J45j00j00J88J30m11K69j76l7K20l06O6K84j41
5368B9k8j70M24l79M5J02O4O4j10m5n1J62lj3k67K24K7k56K48j62J7L48k47k58
$$ y = [74, 85, 37, 29, 0, -151, 18, -35, 121, -54, 71, -12, -128, -90, -96, 314, -187, 181, -18, -96, 364, -146, -64, 165, 18, -200, -125, -279, -317, 63, 81, 196, 215, 138, 89, -304, 38, -33, -132, -27, 297, 128, -44, -102, 164, -25, 7, -63, -28, 134, -24, -12, -166, -138, -68, -69, 108, 16, -31, -255, -196, -278, -44, 208, 69, -30, -234, 328, 139, 122, 29, -116, -385, 256, 35, 27, 105, 265, 243, 52, 5, -50, 114, -27, 191, -80, 199, 113, 343, 160, 107, -52, -212, 130, 29, 54, 49, 80, 6, 137, 373, 91, 128, 94, 176, -101, -113, -12, -158, -292, 119, -146, -21, 71, -51, 47, -86, 118, -56, 163, -14, -3, 14, 140, -100, -42, 84, 321, -199, -65, -16, -152, 120, -249, -92, 62, 279, -92, -6, 101, -33, 3, -9, -236, 166, -198, -339, 89, -263, -2, 143, 43, -57, 131, 261, -150, 119, -57, -94, 126, -180, -114, 170, 29, 1, -169, 255, -124, -79, 23, 87, 151, 41, -4, -55, 107, 104, 91, -176, 48, 75, -181, 67, -95, -78, 270, 23, -235]
5392b35K28R6m06L86K6k63J81j13nK27J8J44m61kM73m28L66Q9l51k13K44m6j77
5415b22p6J52M0K83j79K92j95N7j82J46k9J35j8r3L1k60J14k0l0k09L6J2J08J25
5439A8j62K17Q5j93K53l38J87l40j5L27j30J0K49j30K0k49L04k67L75k12j69L06
5461A46k36K41r3L8p5M4n1l19J37K38p2j54J06K79n9n1j22j51J69Q9r5J17k99
5484a73J31m3J47j70Q1j86J93J53j69M6O8j2j63L9J79j98J67j19k98K90K26K5
5506B14m1j38O7m23K17MOK74k34j20om6Q5J48j22J58K03p0qL7j27J6J37j78J04
5531A57l58J11M1L21m14J50k34J88K53l69L87l04K6p0K27Q2j89kj44j46P0J69
5553d8Nq6J15o6N6j48P1L1R4L02n07L65j34j60K87n42J13K76O9omk38rJ65J09
$$ y = [-235, -7, 89, -317, 69, 95, -168, 13, -100, -105, 122, 140, 284, -177, -179, 294, -134, 232, 321, -30, -243, 1, -45, -222, -298, -146, -106, 177, -2, 290, 95, 152, -30, 116, 87, 222, 204, 111, 142, -118, -4, -24, -54, -263, -227, -215, -107, 18, -144, 73, 158, -35, 218, -120, 67, -273, -288, 39, -91, -81, 168, 38, 58, -191, 113, -154, 221, 9, -160, 146, -90, 151, 58, 96, 21, 65, 14, -305, -168, 70, -2, -156, -50, 229, 170, 119, -3, -154, 15, 104, 9, 126, -173, -42, -85, 62, -108, -27, -213, -20, 133, -36, 10, 78, 66, -97, -58, 121, -77, 90, -29, -327, -37, 189, 214, 173, 35, 102, -321, -104, -100, -94, 180, -54, -174, -180, -226, -141, 7, -115, 43, 246, 176, 168, 205, 78, 94, 231, 53, 157, -201, -90, -49, 272, -142, 8, -226, -38, 215, -154, 233, -71, -45, -115, 112, 194, 5, 3, -141, -287, -217, -48, -43, -129, -14, -80, -24, -172, -101, -70, 24, 326, -181, 184, 50, -110, 177, -365, -252, 24, 93, 87, 83, -155, -164, 1, 110]
5578A10k71K02j85L14l24J30m8J20K40l25k21K44l17J26k4K35K95j28jj23j98
5599a49q0J33K87j15m2J45N0j45j02Ok04M33j02j21r5K8q4L72l35L4j78L51k86
5622a99M14l7kRk03K37q9n2J50q2j13j98J77K16j29r8pK73k16J2J18l08N1J86
5646A10j53nJ43m7k95K50j55M01j60m17L35k1o4J59p4mk21M30j45k95L13k71n9
5669b45L98l33pK14P2K2j28l35L00K42l30Q7o3J24m06N69l8l48k9K60M5j79J68
5692F0k55L80m2j17n0m8J78l19J43J08J75k49O3R3n0j75J10Q8k05K6k17k1J43
5715a81K75k06K59j21m4J28lj55k56L55R3r6r4j89L01j63R3k19J25J82K2k37L82
5738B51k46R6l07K19J60l1j27k28J16L1%J79K1k64L0L31j50k05J41j50K66n9J84
$$ y = [110, -161, 41, -144, 170, -154, -24, -72, 48, 288, -37, -258, -14, -331, -205, -229, 6, 301, 173, 172, 49, -149, -229, -96, 191, 76, 34, 179, 229, 84, -18, -12, -216, 217, 115, -6, -101, -73, -157, 215, -120, -86, -264, 87, -199, 215, 178, 176, 185, -18, 219, 130, 78, 228, 146, 33, -165, 12, 228, 99, 1, -6, 267, 51, 63, 181, -127, -76, 110, -43, -48, 95, 48, -247, 3, -152, 249, 89, -328, 7, -14, -78, 81, 7, 3, -218, 212, 67, -228, 85, -186, -245, 153, -180, -187, 27, 99, 121, -7, -342, -42, 200, -130, -43, -106, 18, -388, 181, 143, -205, -234, 26, 71, -108, 60, -195, 185, 143, 26, -24, -72, 106, -213, -70, 38, 213, -36, 27, 120, 70, -105, 5, 93, -112, -86, -303, -324, -181, 94, -112, 147, 26, -18, 110, 107, -48, -304, 51, 144, 48, -46, -235, 66, -97, -4, -223, -98, 84, 106, -131, 251, 5, 101, -206, 13, 173, 142, 15, -213, -97, -66, -66, 113, 134, -130, -100, 231, 81, -124, 17, -133, 133, 74, 258]
5761B58j53J16k26n5l01r2L24J56k48J98j00K87j18J57o05M21k15J41J48m9j64
5782a20k4M9J14J61k02k0L38l39k58N09q1l53K85N4N2k24J08m0j68J93j16J5L4
5805c3l3RK49k97N8P6J92m65Q6M0J38l10L22o1O2k87J88J01J76j70j52o4K79l06
5829b02J14K63j99k09K06k99L70k6mJ19k57O3J14J18k39k79M25jk94L93m62M22
5851A36m82N67l11M0K85j90n29O89k80K0J42L3l99J38J00K08j68j68L43R5j76
5872I3j74K35q5J01n0k65J12K04j55jj76L5K24j63n2Q2N1L8k70K94j28k09M21
5895A62k87R0L23p32K80K18J6j79K47j79K4J60m75J58o9L51J3N0j8R0k63J89m36
5918b67J90J77j18l6K6Q9k66K87k4J53k00Qj76K53m4n2Q2j35k64R6L96m23J54
$$ y = [258, 105, 221, -5, -60, -361, -453, -129, 27, -221, -23, -123, 164, 46, 203, -402, 19, -196, -55, 93, 44, -120, -144, -95, 19, 180, -22, -42, 296, -43, -301, 208, 127, -226, 59, 113, 165, -59, 49, 9, -159, 34, -82, -67, -33, -66, -57, 192, -105, -47, 29, 221, -244, -158, -118, 20, -290, 32, -29, 33, -254, -66, 35, 211, 41, -111, -175, 104, -202, -88, 175, -24, -233, -27, -326, 44, 18, 14, 133, -124, -61, 53, 171, -68, -347, 78, 77, -217, 176, -286, 136, -346, 221, -90, -50, 235, 45, -484, 205, -75, -55, 87, 120, -279, -141, -41, 167, -1, -169, 174, 269, 93, -81, 154, 69, 170, 120, -145, -33, 171, 16, 15, -161, -126, 98, -65, -117, -35, 16, 54, -216, 78, -50, -259, 162, -125, -35, 288, -444, -164, 54, 70, -109, 138, -41, -17, 143, -332, -174, -243, 108, 121, 171, 153, 243, -20, 169, -267, -77, 100, -18, -54, -28, 61, -205, 82, 58, 211, 11, 19, -157, 96, 52, 0, 82, -53, -317, -221, 175, -248, -94]
5941i4J26j21K21j6J61l74J59R9j67R3Q5m3j86j8K39k53K40k36o4K26j21L23n88
5964c09L02qm1R7Rp1o3Q7r2L21k61p5R7O9j65M0j37L63l44K13R9J13j53j06K52
5989B37jm5m24K62j39l8J55L31k37j90K14n3L03j91j56L08k91M1qK57j69k98j01
6012b33L53p2J59k99J28M2m4N9n9j38J03k19K46k40J26j41L89j71j42J89K20P1
6034C27l09j30O5j9N9R4j68O2J13K86m09Q8k72P7K78m36M03j04J1j24m3J21n7
6057h7J71k74K0K45R0J54l84j74J75R8j07J06j20K1K16k08J83K8j01R5j49J44
6079A42j61k68L31r7K00n9n9j92K89k56L48l82j65K16L6k5P8q0N4n5N9J03J9j49
6103g3o1L37k32J25j21J6K40m90L46j07J69k07M7n4j98J27J10Q3J17j86J7p2k3
$$ y = [-94, 32, -89, 132, 116, 277, -97, 62, 161, -6, 87, 172, 129, -57, -75, 164, -89, 151, -85, -149, 77, -44, 279, -309, -7, -15, -56, 41, 50, -21, -84, 3, -89, 232, -29, -104, -7, 62, -103, -63, -200, 163, -181, 32, 131, 244, 91, -15, 237, 236, 191, -233, 29, -110, -148, 7, 338, 101, -89, 125, 72, 375, 184, 28, 336, 45, 86, 78, 335, 166, -132, -233, 120, 48, 207, -92, 36, 78, 34, 93, 34, -104, -1, -220, 26, -214, -88, -229, 160, -11, -153, 36, 256, 327, 18, -112, -47, -66, -7, 87, -81, -19, 94, 380, -29, 59, -213, -136, 142, -294, 109, 5, 16, -108, -151, -30, -87, 84, -190, -170, 75, 165, 319, -65, -239, -64, 34, -73, 33, -87, -66, 150, -58, 125, 153, 52, 147, -2, 142, -19, -287, 44, -53, 147, 88, 29, -163, 126, -130, 218, -164, -329, -113, -77, -102, -24, -104, -50, -105, -46, 57, 76, -73, -134, 203, -29, 96, -25, -9, 231, -259, 87, -20, 149, -58, -11, -65, -263, -136, -26, 57, 174, -12, 5, -67, -90]
6126i0k23J49K35k4M9l24K27m2O1p5O5j0j14N1K7P5P0J48n57P8R6J88l1o6j33
6151a70L66Q8k25J9m4K1J33n53M54p3J36p5J9j62j10J6K55j93J1J7Q2J68o63J69
6175c14M68m05M37o6J62l2l06j59K96j37K94j86J13n93L17L53j92j6J00j36r1
6196i3M08k76J28k06n6J60p5L27n83K06J03K9m3q6j29P5J7J88k35K10k59kK17
6219B5p9j82J83k7j83M20j62K70l57J86j9P6l5m7o7l0j1p%PJ14j21L2j81K39J13
6245A57m05O01k46L7j72j97J95K8J52j85J19j92L10j57j99J34J13k37L14j68J6
6266A8R3p4j68K67N1k59o2J38L0J05j73J44m4J19j02Mj24J82k5J35j28p0Mj04
$$ y = [-90, -313, -164, 71, 47, 96, -228, -1, -43, 18, -57, 8, -2, -116, -65, -38, 37, 107, 255, -302, -224, -128, 60, 29, -37, -170, 196, 284, 59, 78, 34, 55, 188, -365, 89, 16, 152, 77, 96, -66, -176, -160, 95, -98, -87, -70, 12, 180, -483, -314, 154, -251, 186, 120, 282, 250, -56, -215, 81, -56, 238, 52, 165, -428, -111, 242, 50, 34, 134, -2, -93, 315, 39, 167, -39, -95, 65, -10, 317, -266, -60, 43, 72, 29, -57, -186, -111, -94, 94, -141, 69, -190, -192, 25, -54, -236, -53, -80, -263, 157, -5, 265, -92, 94, 75, 151, 116, 69, 2, -28, -39, -46, -46, -39, 75, -46, -14, -195, 44, 157, -248, 353, 107, 144, -28, -225, -30, -2, 150, -35, 84, -108, 202, 45, -154, -20, 93, -144, 170, 2, 18, 111, 37, -131, 136, 187, -72, -134, 4, 34, 139, -34, 110, 66, 185, 83, 87, -37, 145, 120, 255, 127, 57, 61, -43]
$$ [...]
8191h1
##END NTUPLES=NMR FID
##END=
