##TITLE=1H_TG-2256
 DMSO, 8 sc, 
 16.10.2019
##JCAMPDX= 6.0         $$ Bruker NMR JCAMP-DX V2.0
##DATA TYPE= NMR FID
##DATA CLASS= NTUPLES
##ORIGIN= UXNMR, Bruker Analytische Messtechnik GmbH
##OWNER= root
$$ XWIN-NMR		Version 3.5
$$ Wed Oct 16 14:57:12 2019 Russian Standard Time (UT+4h)  she@DPX200
##.OBSERVE FREQUENCY= 200.1315
##.OBSERVE NUCLEUS= ^1H
##.DELAY= (6, 6)
##.ACQUISITION MODE= SIMULTANEOUS
##.ACQUISITION SCHEME= undefined
##.AVERAGES= 8
##.DIGITISER RES= 18
##SPECTROMETER/DATA SYSTEM= spect
##.PULSE SEQUENCE= zg30
##.SOLVENT NAME= DMSO
##.SHIFT REFERENCE= (INTERNAL, DMSO, 0, 15.7039)
##AUDIT TRAIL= $$ (NUMBER, WHEN, WHO, WHERE, WHAT)
$$ ##TITLE= Audit trail, XWIN-NMR		Version 3.5
$$ ##JCAMPDX= 5.01
$$ ##ORIGIN= Bruker BioSpin GmbH
$$ ##OWNER= she
$$ F:/spectra/data/she/nmr/H-F/1/audita.txt
$$ ##AUDIT TRAIL=  $$ (NUMBER, WHEN, WHO, WHERE, WHAT)
(   1,<2019-10-16 14:56:21.42 +0400>,<she>,<DPX200>,
      <created by zg, POWCHK disabled, PULCHK disabled
       configuration hash MD5:
       00 E9 B6 7A A2 85 ED C7 34 08 36 98 17 FE 4E 26
       data hash MD5: 16K
       A8 F9 B7 36 9B 26 5C 5D 33 45 8E 9A 71 4C 49 E7>)
$$ ##END=
$$ 
$$ hash MD5
$$ 83 A1 D4 F9 F3 16 5F 81 3C 3E 41 F2 BE 23 0A ED
##$RELAX= 
##$RELAX= 
##$RELAX= 
##$RELAX= 
##$RELAX= 
##$RELAX= 
$$ Bruker specific parameters
$$ --------------------------
##$DU= <F:/spectra>
##$EXPNO= 1
##$NAME= <H-F>
##$PROCNO= 1
##$TYPE= <nmr>
##$USER= <she>
##$AMP= (0..31)
100 100 100 100 100 100 100 100 100 100 100 100 100 100 100 100 100 100 
100 100 100 100 100 100 100 100 100 100 100 100 100 100 
##$AQSEQ= 0
##$AQ_mod= 1
##$AUNM= <au_zg>
##$AUTOPOS= <>
##$BF1= 200.13
##$BF2= 200.13
##$BF3= 200.13
##$BF4= 200.13
##$BF5= 200.13
##$BF6= 200.13
##$BF7= 200.13
##$BF8= 200.13
##$BYTORDA= 1
##$CFDGTYP= 0
##$CFRGTYP= 5
##$CHEMSTR= <none>
##$CNST= (0..31)
1 1 145 1 1 1 1 1 1 1 1 1 1 1 1 1 1 1 1 1 1 1 1 1 1 1 1 1 1 1 1 1 
##$CPDPRG= <>
##$CPDPRG1= <>
##$CPDPRG2= <>
##$CPDPRG3= <>
##$CPDPRG4= <mlev>
##$CPDPRG5= <mlev>
##$CPDPRG6= <mlev>
##$CPDPRG7= <mlev>
##$CPDPRG8= <mlev>
##$CPDPRGB= <>
##$CPDPRGT= <>
##$D= (0..31)
0 1.2 0 0 0 0 0 0 0 0.06 0 0.03 0 0 0 0 0.0002 0 0 0 0 0 0 0 0 0 0 0 0 
0 0 0 
##$DATE= 1571223381
##$DBL= (0..7)
120 120 120 120 120 120 120 120 
##$DBP= (0..7)
150 150 150 150 150 150 150 150 
##$DBP07= 0
##$DBPNAM0= <>
##$DBPNAM1= <>
##$DBPNAM2= <>
##$DBPNAM3= <>
##$DBPNAM4= <>
##$DBPNAM5= <>
##$DBPNAM6= <>
##$DBPNAM7= <>
##$DBPOAL= (0..7)
0.5 0.5 0.5 0.5 0.5 0.5 0.5 0.5 
##$DBPOFFS= (0..7)
0 0 0 0 0 0 0 0 
##$DE= 6
##$DECBNUC= <off>
##$DECIM= 24
##$DECNUC= <off>
##$DECSTAT= 4
##$DIGMOD= 1
##$DIGTYP= 9
##$DL= (0..7)
0 120 120 120 120 120 120 120 
##$DP= (0..7)
150 150 150 150 150 150 150 150 
##$DP07= 0
##$DPNAME0= <>
##$DPNAME1= <>
##$DPNAME2= <>
##$DPNAME3= <>
##$DPNAME4= <>
##$DPNAME5= <>
##$DPNAME6= <>
##$DPNAME7= <>
##$DPOAL= (0..7)
0.5 0.5 0.5 0.5 0.5 0.5 0.5 0.5 
##$DPOFFS= (0..7)
0 0 0 0 0 0 0 0 
##$DQDMODE= 0
##$DR= 18
##$DS= 0
##$DSLIST= <SSSSSSSSSSSSSSS>
$$ [...]
##$SUBNAM2= <"">
##$SUBNAM3= <"">
##$SUBNAM4= <"">
##$SUBNAM5= <"">
##$SUBNAM6= <"">
##$SUBNAM7= <"">
##$SUBNAM8= <"">
##$SUBNAM9= <"">
##$SW= 24.0689530833862
##$SWIBOX= (0..15)
0 0 2 0 0 0 0 0 0 0 0 0 0 0 0 0 
##$SW_h= 4816.95568400771
##$TD= 16384
##$TD0= 1
##$TE= 0
##$TE2= 300
##$TE3= 300
##$TEG= 300
##$TL= (0..7)
0 120 120 120 120 120 120 120 
##$TP= (0..7)
150 150 150 150 150 150 150 150 
##$TP07= 0
##$TPNAME0= <>
##$TPNAME1= <>
##$TPNAME2= <>
##$TPNAME3= <>
##$TPNAME4= <>
##$TPNAME5= <>
##$TPNAME6= <>
##$TPNAME7= <>
##$TPOAL= (0..7)
0.5 0.5 0.5 0.5 0.5 0.5 0.5 0.5 
##$TPOFFS= (0..7)
0 0 0 0 0 0 0 0 
##$TUNHIN= 0
##$TUNHOUT= 0
##$TUNXOUT= 0
##$USERA1= <user>
##$USERA2= <user>
##$USERA3= <user>
##$USERA4= <user>
##$USERA5= <user>
##$V9= 5
##$VALIST= <valist>
##$VCLIST= <CCCCCCCCCCCCCCC>
##$VD= 0
##$VDLIST= <DDDDDDDDDDDDDDD>
##$VPLIST= <PPPPPPPPPPPPPPP>
##$VTLIST= <TTTTTTTTTTTTTTT>
##$WBST= 1024
##$WBSW= 4
##$XGAIN= (0..3)
0 0 0 0 
##$XL= 0
##$YL= 0
##$YMAX_a= 96945
##$YMIN_a= -187317
##$ZGOPTNS= <>
##$ZL1= 120
##$ZL2= 120
##$ZL3= 120
##$ZL4= 120
##$ABSF1= 10
##$ABSF2= 0
##$ABSG= 5
##$ABSL= 3
##$ALPHA= 0
##$AQORDER= 0
##$ASSFAC= 0
##$ASSFACI= 0
##$ASSFACX= 0
##$ASSWID= 0
##$AUNMP= <proc_1d>
##$AZFE= 0.1
##$AZFW= 0.1
##$BCFW= 1
##$BC_mod= 2
##$BYTORDP= 1
##$COROFFS= 0
##$CY= 11.3945322036743
##$DATMOD= 1
##$DC= 2
##$DFILT= <>
##$DTYPP= 0
##$F1P= 20.1720416913024
##$F2P= 0.152960286110954
##$FCOR= 0.5
##$FTSIZE= 0
##$FT_mod= 4
##$GAMMA= 1
##$GB= 0.15
##$INTBC= 1
##$INTSCL= 1
##$ISEN= 128
##$LB= 0.24
##$LEV0= 0
##$LPBIN= 0
##$MAXI= 10000
##$MC2= 0
##$MEAN= 0
##$ME_mod= 0
##$MI= 1.114404
##$NCOEF= 0
##$NC_proc= 0
##$NLEV= 6
##$NOISF1= 3.799351
##$NOISF2= 2.8
##$NSP= 1
##$NTH_PI= 0
##$NZP= 0
##$OFFSET= 15.70392
##$PC= 1
##$PHC0= -9573.621
##$PHC1= 17.00093
##$PH_mod= 1
##$PKNL= yes
##$PPARMOD= 0
##$PSCAL= 0
##$PSIGN= 0
##$REVERSE= no
##$SF= 200.130013532006
##$SI= 16384
##$SIGF1= 3
##$SIGF2= 2
##$SINO= 400
##$SIOLD= 16384
##$SREGLST= <1H.CDCl3>
##$SSB= 0
##$STSI= 0
##$STSR= 0
##$SW_p= 3612.71676300578
##$SYMM= 0
##$S_DEV= 0
##$TDeff= 0
##$TDoff= 0
##$TI= <>
##$TILT= no
##$TM1= 0
##$TM2= 0
##$TOPLEV= 0
##$USERP1= <user>
##$USERP2= <user>
##$USERP3= <user>
##$USERP4= <user>
##$USERP5= <user>
##$WDW= 1
##$XDIM= 8192
##$YMAX_p= 0
##$YMIN_p= 0
$$ End of Bruker specific parameters
$$ ---------------------------------
##NTUPLES= NMR FID
##VAR_NAME=  TIME,          FID/REAL,        FID/IMAG
##SYMBOL=    X,             R,               I
##VAR_TYPE=  INDEPENDENT,   DEPENDENT,       DEPENDENT
##VAR_FORM=  AFFN,          ASDF,            ASDF
##VAR_DIM=   8192,          8192,            8192
##UNITS=     SECONDS,       ARBITRARY UNITS, ARBITRARY UNITS
##FACTOR=    0.0002076,     1,               1
##FIRST=     0,             0,               0
##LAST=      1.7004516,     0,               0
##MIN=       0,             -187317,         0
##MAX=       1.7004516,     96945,           0
$$ Real data points
##PAGE= N=1
##DATA TABLE= (X++(R..R)), XYDATA
0 0 0 0 0 0 0 0 0 -8 8 -8 8 -16 16 -23 24 -32 40 -41 49 -60 72 -81 96 -112 128 -145 166 -188 214 -241 273
31 273 -305 343 -383 429 -477 532 -589 654 -726 804 -891 986 -1093 1208 -1342 1489 -1658
48 -1658 1852 -2078 2342 -2660 3049 -3535 4171 -5034 6285 -8268 11913 -20845 91992 48759
62 48759 -129658 -9281 90661 40791 -57842 3271 84009 50427 -50324 -37834 40299 54598
74 54598 -4701 -13962 13012 5997 -29094 -13425 24467 22379 -17858 -23611 12067 26230 -15239
87 -15239 -34845 7026 36631 -3606 -41316 -14728 26430 18593 -13799 -18597 4710 13634 -3691
100 -3691 -12845 -553 3592 -4718 532 7807 -7769 -18672 3974 24636 3010 -30350 -18318
113 -18318 24911 25212 -23784 -36599 13164 36672 -7075 -36891 -4825 25082 9615 -16207
125 -16207 -14549 2024 9136 2796 -5417 -7406 -4580 4125 10120 -1484 -16643 -6060 14834 9709
139 9709 -11988 -15000 1057 13056 6579 -11935 -14818 4498 14659 -1047 -14577 -6394 6255
152 6255 8069 -115 -10305 -7930 5342 9747 -221 -9762 -7692 4236 12447 1798 -15796 -8860
166 -8860 13522 14192 -7721 -17056 -1039 16543 9498 -13665 -15300 8174 16580 -2299 -13122
179 -13122 -2940 6480 5881 1902 -5795 -7943 2433 11632 3825 -11424 -11240 7185 16770 -1635
193 -1635 -19071 -4398 17454 8996 -11621 -11497 3603 10743 3893 -7816 -9425 3737 10639 1547
207 1547 -7301 -5222 1950 7408 4492 -6215 -8622 3092 10551 2867 -8386 -8458 4034 12926 2071
222 2071 -14092 -7612 11869 11654 -6163 -12637 -1120 12081 7945 -8316 -11121 4288 11396 634
236 634 -7856 -3553 2391 5706 3639 -4762 -8276 1823 9723 3805 -7768 -8419 4463 12602 512
251 512 -13154 -4849 11247 7833 -5425 -8384 -566 7355 6207 -3910 -9067 247 8873 4378
265 4378 -5361 -6714 389 8105 5107 -6509 -8327 3282 9306 2313 -6401 -6501 3068 9955 2408
280 2408 -10325 -5556 7980 8586 -2896 -8185 -2305 6679 7392 -3445 -8693 621 8099 3414 -3864
295 -3864 -5357 -702 6138 5928 -4248 -8223 1664 8588 3178 -6245 -6600 3140 9053 1343 -8990
310 -8990 -4413 6672 5850 -2475 -5669 -2433 4026 6486 -644 -7814 -1859 6879 4648 -3241 -6419
325 -6419 -906 6756 4925 -5092 -7035 1953 6623 1588 -4193 -5373 936 7115 2727 -7043 -5447
340 -5447 4713 6231 -867 -6259 -3644 3411 6365 -1134 -7644 -1953 5637 3808 -2310 -5570 -2475
355 -2475 5000 5681 -3965 -7642 971 6590 2122 -4744 -5166 1132 6167 1367 -6184 -3971 3423 3995
371 3995 -119 -3371 -3750 999 5521 562 -6605 -3147 4159 4621 -1107 -5816 -2413 4694 4894 -4063
387 -4063 -6300 829 5088 1485 -2943 -4320 -347 5094 2505 -4714 -4690 2369 4497 421 -3562 -3521
403 -3521 1624 5109 90 -5277 -2239 3390 3629 -445 -4401 -2806 3372 4887 -2391 -5829 -42
418 -42 4637 2292 -2261 -4284 -144 4617 2853 -4122 -3703 1828 3398 833 -2447 -3393 786 5010
434 5010 907 -4857 -2257 3051 3343 -591 -3480 -2271 3120 3751 -1626 -4398 -119 3354 1918 -708
450 -708 -3244 -1013 3757 2811 -2892 -3641 1449 3294 1095 -1637 -2873 752 4119 1268 -3618 -1980
466 -1980 2241 3054 559 -2959 -2468 2570 4450 -1284 -4231 -198 3037 1979 -1096 -2695 -513 3648
482 3648 2415 -2574 -2916 1040 2303 1190 -1078 -2858 365 3577 1636 -3228 -1875 1795 2805
497 2805 831 -2036 -1815 1758 3333 -535 -2997 -401 1784 1946 116 -2405 -1556 2855 2875 -1883
513 -1883 -2568 653 2570 1099 -1267 -2488 397 3090 810 -2449 -1011 1326 1427 729 -1406 -2465
529 -2465 1330 3192 -323 -2830 -614 1482 1615 136 -2248 -1355 2249 2414 -1456 -2120 155 1543
545 1543 1405 -727 -2193 -466 2577 891 -2372 -1443 732 1755 584 -1509 -1971 923 2108 -563
561 -563 -2151 -520 713 904 413 -1430 -1788 1826 1856 -1414 -1910 173 973 1057 -705 -1961 -411 2143
579 2143 816 -1775 -1170 504 779 807 -983 -2147 682 1878 -30 -1822 -496 722 1060 548 -1509
596 -1509 -1578 1408 1429 -1190 -1171 -134 645 876 -294 -1855 -665 1767 680 -1304 -1147 84 508 663
614 663 -896 -1700 309 1894 -147 -1317 -453 162 747 443 -1160 -1484 1036 1444 -885 -1295 -81
631 -81 274 976 71 -1267 -445 1210 700 -1112 -690 -190 583 855 -452 -1587 371 1457 -12 -873
649 -873 -196 141 313 511 -916 -1062 651 1331 -427 -605 -77 194 730 651 -1401 -418 1031 511 -844
668 -844 -774 -73 144 692 -267 -1257 333 1679 -62 -516 128 330 403 874 -595 -1036 809 1266 -404
687 -404 -616 79 149 482 431 -752 -311 1208 93 -472 107 68 267 876 225 -747 -1 1387 -49 -390
707 -390 49 -178 275 763 -333 -836 741 1001 -238 -328 66 41 540 602 -637 -235 764 458 -309 -77
727 -77 -251 -11 905 176 -717 558 1031 23 -268 181 -195 227 725 -48 -593 362 617 -26 73 -157
747 -157 -127 598 511 -550 -482 549 328 -330 100 148 113 709 271 -1033 283 724 -280 -275 171 -277 -81
768 -81 521 -201 -675 404 522 -265 9 53 -397 291 335 -573 -478 323 -107 -532 175 47 -270 423 60
789 60 -759 456 -14 -410 -96 109 -254 -259 644 -337 -944 351 319 -204 49 4 -274 364 503 -364 -474
810 -474 187 -162 -106 -10 -266 -391 713 91 -614 96 439 -403 -258 252 -487 -216 452 -230 -242 279 254
831 254 -173 18 -177 -689 126 522 -839 -261 303 -171 -434 104 -38 -227 298 261 -211 -78 270 -418
851 -418 -86 232 -122 -226 234 -290 -523 190 225 -119 273 84 -319 21 103 -451 -172 604 -266 -329 578
872 578 -238 -463 615 339 -563 58 362 -451 -84 280 115 142 270 -430 -294 64 -95 -362 207 131 -309
893 -309 119 372 -355 -137 156 -275 -39 316 -111 36 272 84 -743 311 326 -389 310 263 -243 -57 272
914 272 37 -336 308 -138 -25 123 220 -261 131 456 -48 -12 223 -154 -289 292 -211 -25 333 418 -548
935 -548 210 413 -85 76 223 -149 -96 439 218 66 157 102 -50 345 -76 -119 177 309 -283 26 345 -60
957 -60 -313 421 -12 -309 222 105 44 254 153 -483 41 361 -640 -63 447 -219 -13 441 -120 -315 382
978 382 164 -79 54 398 -498 136 314 -406 -9 435 -73 -470 244 66 -94 198 24 -174 187 224 -513
999 -513 -16 142 -322 51 272 -220 -58 131 -359 -329 41 249 -117 -175 83 -389 -140 297 -7 -350 141
1020 141 10 -323 -2 -103 -387 201 174 -273 59 366 41 -153 359 216 -368 55 87 -620 428 104
1040 104 -257 296 162 -587 -53 319 -246 -616 526 -240 -447 54 -219 -205 -129 -25 -345 -16 -62 -286 169
1061 169 173 -217 -146 245 -56 -304 12 -16 -296 -97 466 -321 -209 232 -200 -286 223 8 -227 -1 147 -131
1083 -131 218 164 -278 -48 333 -204 -220 -9 -221 -228 392 241 -432 360 195 -242 -15 112 -139 -36 446
1104 446 -219 -226 207 -237 -491 -6 163 -233 87 -29 -312 118 108 -81 -147 321 -50 -54 416 -133 -301 90
1126 90 -391 -28 133 530 -316 80 177 -155 -206 227 169 -53 117 270 -289 56 275 -381 326 513 -204
1147 -204 -120 419 -99 37 396 138 -36 130 -46 -184 -46 188 -173 124 69 194 -9 492 -41 -198 103
1168 103 -2 -33 -89 390 -149 -23 413 -217 48 177 -76 -111 275 -114 -184 430 392 -387 124 343 141 -11
1190 -11 -8 -230 -28 387 160 -26 237 91 -395 1 31 -487 252 207 -236 -203 329 79 -311 -124 -55 -56 121
1213 121 210 56 187 82 -125 -131 477 -289 -294 417 -134 -316 99 -33 -216 216 63 52 -307 33 -84 51
1235 51 359 -161 -220 160 1 -48 372 60 -284 154 57 -310 36 34 -46 42 159 -286 -44 146 -179 -426 239
1258 239 245 -273 -50 125 -60 -75 -397 -401 -201 154 -85 -502 1 76 -241 -16 128 -535 390 458 -371 5
1280 5 228 -34 -72 -29 0 -142 125 -310 0 19 -44 -198 65 105 -358 -178 202 -218 -284 340 -4 -170 -188
1303 -188 85 -248 9 280 -204 -63 284 -51 -19 81 -237 -355 -17 -146 -102 -8 -11 -236 28 127 -243 -160
1325 -160 -81 -19 -295 170 -32 -83 13 62 -237 124 205 11 -137 367 -269 -196 124 -270 -28 336 125 -128
1347 -128 50 89 177 58 278 -167 34 148 -12 -212 -79 152 -39 -121 187 -51 71 53 -158 -214 135 199
1369 199 112 310 -239 -12 255 145 159 265 156 -131 64 247 117 69 501 197 106 561 22 -284 -4
1390 -4 55 -175 288 109 -276 112 226 -87 46 -7 11 -265 250 -104 -110 342 56 -87 31 163 -59 24 288
1413 288 -114 -234 55 464 87 -107 -86 -4 240 459 -333 57 307 -156 -4 133 68 -189 429 33 -425
1434 -425 -351 25 -32 100 -117 -303 -86 380 -18 -44 163 51 3 141 -172 -21 46 114 -284 -242 378 -249
1456 -249 71 244 144 -189 -176 -55 -181 45 -51 -117 358 -23 -96 246 291 -37 -332 198 -381 -169 183 -101
1478 -101 139 5 111 -163 -159 -194 161 -45 119 -209 -319 37 321 -31 250 52 -410 -30 226 -179 77
1499 77 234 -330 -389 96 193 -31 51 -97 -93 167 1 -112 -138 -82 -38 -78 91 -76 -308 113 -124 -373 91
1522 91 141 -166 218 118 7 124 193 24 -106 108 2 174 71 40 -86 103 259 -173 0 -124 24
1543 24 29 243 92 -40 225 61 -295 83 221 -37 146 54 -394 127 553 -236 -68 143 312 -34 292
1564 292 -7 -4 87 -129 210 288 25 58 170 -108 -119 191 -39 -234 -183 -18 141 -100 -18 -148 -95 218 -174
1587 -174 -38 211 357 -112 125 -98 118 66 100 394 -180 -200 58 39 17 286 181 -204 266 208 -174 152
1609 152 -90 -93 -152 201 -252 238 107 -136 -146 89 59 107 259 101 -332 108 -84 167 157 75 10 -54 107
1632 107 -224 -129 -111 7 -178 114 -156 -187 136 -96 -126 73 64 -184 -36 46 -270 189 317 177 -55 104
1654 104 135 -29 428 -159 -88 81 155 69 -107 250 -45 -1 182 -188 -218 -21 176 -105 171 293 -61 22
1676 22 172 64 180 327 -84 -41 271 145 -175 -48 -2 -135 -134 228 173 -372 -86 37 -221 -6 105 -303
1698 -303 -141 109 17 42 104 237 -196 241 132 -27 -212 138 -220 -274 -36 -95 -125 174 -171 -5 114 -23
1720 -23 -10 -9 26 103 248 -5 -439 299 -65 77 79 -44 -97 -204 12 95 -170 56 -212 -9 301 -225 27
1743 27 -78 61 -118 76 73 -263 85 -46 -150 -138 142 -6 37 -339 150 -200 8 84 -161 -86 165 65
1765 65 -79 60 -89 107 238 -131 -27 331 -169 -131 108 -2 -105 -21 13 -121 -165 25 56 -3 -158 233
1787 233 -207 118 -21 -144 223 307 -49 -181 22 -59 164 315 -6 86 29 227 209 -156 116 -218 250 142
1809 142 -233 -294 -118 4 -57 107 -92 -96 79 182 122 154 252 22 80 203 -233 -20 52 -80 -100 -27 9 -30
1833 -30 199 249 34 -228 210 -58 336 95 113 5 -59 150 -66 151 38 -12 -14 -154 -207 43 -49 155 -157
1856 -157 226 -4 -146 1 224 -203 -167 -65 79 38 82 162 -10 260 -115 -209 310 12 -49 23 217 142 127
1879 127 146 -248 35 143 87 59 79 -211 253 -69 175 -87 113 -44 -168 11 -111 90 -119 274 -76
1900 -76 -15 237 67 -282 14 250 41 40 -102 -59 42 33 -269 102 36 12 60 67 -18 25 224 -273 57 113 84
1925 84 116 1 161 46 -184 94 72 -373 24 247 -232 138 22 127 -279 14 -211 71 -73 -190 176
1946 176 13 -81 -171 185 -6 -217 -92 89 148 51 90 -43 -266 224 205 3 204 200 -208 64 60 135 -37 -140
1970 -140 -40 71 210 -234 -275 243 -30 -109 17 -38 -233 -1 88 54 -78 149 297 173 -51 206 -50 -140
1992 -140 117 -15 -176 4 18 -223 3 177 33 291 252 75 225 -56 2 59 131 -74 -51 146 137 -147 -178
2015 -178 36 -87 -189 -223 -292 403 -286 -22 199 -57 -135 -93 -80 -133 66 59 -125 -163 -66 -32 180 -182 -62 -386
2039 -386 -74 2 30 9 365 -351 82 -125 -80 -429 124 224 -186 231 187 -53 -190 -20 72 -193 -11 -82
2061 -82 4 4 87 -257 -53 126 15 53 89 106 -76 139 -150 -364 -72 49 -218 197 -67 -183 162 126 -77
2084 -77 -118 252 -172 33 -87 -160 -249 222 -336 43 -43 164 -3 -10 214 -102 -14 -211 -86 -97 -120 195 -157
2107 -157 -48 107 -109 115 -122 69 -230 -50 53 -186 -26 -97 65 -151 -236 110 59 16 -109 -217 -115
2128 -115 -64 139 -167 -219 -99 -84 100 -195 -31 111 -37 44 -106 -162 172 -197 301 -94 57 -49 148 -87
2150 -87 -367 -1 120 8 -177 -189 222 -202 62 8 -293 -94 292 -23 216 -39 -313 91 218 16 -318
2171 -318 85 115 -58 184 -10 -239 20 -234 206 -57 41 209 -252 -184 143 -97 -163 91 159 -97 -12 224
2193 224 -88 -15 167 128 213 280 63 -122 194 -89 96 41 -193 -251 -93 8 32 355 177 335 -99 394
2215 394 -43 103 -10 -203 150 -68 -121 -130 143 -56 -112 72 173 120 -142 -20 83 -148 336 -224 329 48
2237 48 -229 50 -96 -69 -37 -41 -230 -30 -130 285 -244 -183 -145 0 27 12 112 -111 117 313 -98 -110 51
2260 51 -149 -207 -104 -312 96 -194 -153 -189 -89 152 -82 151 55 -267 70 -246 17 -23 -321 -9 223 223 33
2283 33 5 53 -152 -87 -29 -71 15 -47 -121 -186 -75 105 -25 -58 -14 -171 68 -183 -286 -158 2 262 22 -293
2307 -293 225 -15 -85 -116 -28 -128 79 -172 -117 117 177 307 -174 8 332 -91 -138 -141 -166 -170 112 -25 -164 157
2331 157 -124 94 75 -2 200 129 -131 -76 162 17 169 146 126 -269 319 -183 -107 120 -176 -95 201 54 20
2354 20 218 67 -122 190 110 -79 126 40 -136 -130 -28 234 -116 26 239 -221 -193 -149 -214 9 69 182 -51
2377 -51 140 -191 39 80 -228 -37 91 -5 158 -5 -229 -371 -248 29 -39 2 -61 186 213 119 8 89 -39
2400 -39 34 42 -91 54 -103 -83 75 140 172 -99 151 -199 -271 80 -178 222 -6 119 140 160 365 -140 -33
2423 -33 -330 -126 -100 -137 -113 115 -124 -194 -233 -187 161 -31 -129 -153 -365 132 243 75 -62 97 378 -331 94
2446 94 -169 -124 -173 -166 85 271 252 -104 -85 11 125 -169 385 244 8 -78 -264 -141 -305 -39 -86 -24 -278 -233
2470 -233 -162 230 -51 -17 -65 118 -116 217 -176 -213 -91 -91 -293 215 -221 90 1 -227 -60 -34 -8 -238 286
2493 286 -97 -23 -38 -58 220 113 270 128 139 359 -43 -47 -101 44 5 57 -167 -18 106 31 -4 216 34 165
2517 165 -91 -74 278 -388 -61 38 -101 187 -121 252 181 81 58 -82 134 40 98 -31 -52 -39 16 -57 44
2540 44 70 198 190 -320 200 349 -102 -203 -248 57 -147 130 196 -170 169 99 -62 -100 172 121 -67 -14 76 -5
2564 -5 23 74 -315 -210 -62 181 -132 143 -117 -130 200 70 168 -294 -34 -268 -115 -136 -64 -93 185 -182 -414
2587 -414 49 -86 -128 13 93 -164 7 176 31 183 163 -97 256 -152 98 -95 190 104 -73 149 124 -90
2609 -90 169 -190 19 -94 217 -213 -174 101 160 162 -320 -37 -83 -7 -68 117 113 -158 149 182 -15 -273 90 87
2633 87 120 -137 83 -227 156 201 -24 76 19 -136 0 -48 200 57 139 62 -131 66 -37 52 243 -177 -89
2656 -89 30 -54 56 -202 -87 -135 -71 -153 -147 -23 -33 81 -87 -141 -165 210 200 53 -81 112 137 -162 132 175
2680 175 -98 145 75 147 -41 139 243 67 -9 -90 -5 -148 -37 120 137 34 5 376 -79 113 -207 -41
2702 -41 -166 -245 -92 220 2 -74 -50 -38 38 -102 140 14 -162 -56 181 -314 47 -60 193 177 142 162 -102
2725 -102 -46 126 105 -32 25 -6 46 -191 45 -36 -22 173 -8 -325 199 139 140 -76 4 36 94 96 -143 136 185
2750 185 146 58 104 -185 -101 -20 180 69 -255 141 -236 112 95 179 -105 -167 -60 559 -7 -26 92 60 -234
2773 -234 322 -36 -241 22 -143 77 8 61 -66 36 88 11 -15 -7 -95 38 -88 114 81 -88 131 -213 46
2796 46 -49 23 -260 131 -128 -54 -63 -156 1 91 -63 129 206 -41 -85 -56 164 68 90 -51 179 322 98 123 -329
2821 -329 242 -19 -173 -132 -77 -100 45 -111 51 226 325 -132 -127 -51 186 -82 -71 -94 64 74 -121 -116 -109 -174 107
2846 107 68 -305 69 101 202 59 215 -12 362 176 -93 14 -62 369 -39 -59 -5 74 111 144 378 -3 52
2869 52 -317 490 -117 12 -47 -117 -173 -125 -90 8 75 -120 37 49 -46 227 -103 -169 85 31 86 29 278 98 -106
2894 -106 365 254 9 270 -5 121 49 203 -133 28 -162 129 152 -29 -99 38 -309 54 155 24 -44
2915 -44 60 145 -136 -282 193 75 156 33 -25 -13 105 406 -203 52 -140 -185 -100 2 55 200 -10 41 16
2938 16 -109 243 -139 -5 -123 -21 248 102 55 37 -45 106 62 -212 -154 -124 206 -87 -193 -14 11 196 -124
2961 -124 -31 80 86 -83 25 -155 -7 231 -211 289 25 -154 55 -150 192 -43 -76 -151 44 -10 106 3
2983 3 -1 137 -115 18 2 8 -128 -102 -237 -48 -93 -225 -30 -162 80 -213 41 276 29 -112 -24 63 392 53
3007 53 13 -148 32 -170 97 -214 187 79 86 197 -122 223 -94 133 -130 -26 -19 -30 80 37 15 172 -99
3030 -99 -115 328 7 2 -68 53 118 -90 51 -45 13 -338 -324 -160 -1 210 174 -167 104 -39 25 3 289 -113
3054 -113 -61 -121 156 21 -55 -157 91 -53 -110 -134 -15 -27 18 30 155 -157 -164 -209 41 -151 77 -65 -85 28
3078 28 135 298 191 130 12 5 140 15 -135 -262 112 118 48 -64 -27 245 116 19 -74 -33 -54 -96 117 -98
3102 -98 163 80 -107 223 79 -28 -1 196 118 126 -61 146 17 87 -51 -53 67 34 -199 -131 -82 253 118 224
3126 224 180 149 -176 -27 -14 107 204 -125 -11 52 69 -17 167 -329 -39 -58 22 41 -105 82 199 44 -14 59
3150 59 42 -30 -64 -204 -120 -4 -120 -175 -66 -98 -82 -194 158 -142 -120 -243 -25 -81 -48 -7 -114 -39 -22 32 163
3175 163 -106 120 135 100 -255 -239 11 -51 -82 126 -266 34 116 -228 -81 122 -138 151 109 6 23 -66 6
3198 6 -87 -79 12 2 117 298 178 -96 -68 -145 66 139 160 -6 -92 -266 -17 108 -37 -407 -149 -4 -132 241
3222 241 117 -41 -235 -42 198 52 72 -58 35 58 67 69 -91 2 36 -87 2 -42 332 -249 -88 162 44 62
3246 62 87 33 -265 -199 141 -115 3 -21 2 54 27 294 -59 177 -255 6 207 -105 -11 -3 151 -23 -198 -126
3270 -126 -202 76 257 -312 -92 -48 -67 111 36 -138 -67 -86 244 -400 -110 151 325 70 -150 66 -220 -79
3292 -79 60 -112 -107 124 -87 -17 -297 -44 61 -44 -4 -137 -50 -130 493 271 142 -245 20 199 88 13 -216
3315 -216 113 339 244 11 209 150 -67 -220 -295 49 -123 33 218 -186 -174 -41 336 134 235 -204 90
3336 90 99 -101 35 125 156 193 -160 -188 -218 142 -166 128 -81 -26 -29 50 31 -145 288 -28 5 163 12 -70 -12
3361 -12 -25 58 29 -34 -163 -124 -41 156 186 164 -251 189 -36 49 -35 171 115 179 -9 -253 24 -109 -81 252 -110
3386 -110 -18 -249 -62 -13 147 206 -92 112 -27 53 -70 31 -54 93 -178 -41 124 12 89 225 10 127
3408 127 -196 37 11 241 -9 -3 -51 99 58 77 180 -261 164 -146 165 -23 -116 89 269 174 34 -39 50
3431 50 164 131 -277 200 -5 197 29 -153 -34 -104 406 171 56 81 129 -131 -179 28 131 -140 73 -175
3453 -175 -41 -18 -170 -53 145 131 37 -327 43 70 -342 -234 93 -50 106 -9 -65 27 279 -113 473 -73
3475 -73 102 43 95 -66 -199 77 42 -7 12 -115 -242 316 97 -89 -54 -102 127 61 -86 -29 91 120 -155 275
3499 275 -65 148 -8 -153 -141 -153 219 -281 153 -91 -15 89 147 -2 -9 -56 -57 31 8 2 -146 -150 -20 -58 -126 -80
3525 -80 27 109 -287 85 58 115 103 167 -155 -47 -200 249 0 58 -111 -197 70 -137 158 31 -19 -131 -139 16
3549 16 -228 154 123 217 -142 6 95 46 150 -91 18 -140 -105 14 353 106 -81 -87 146 42 -33 8 50 -66
3573 -66 -46 -133 122 -268 249 -141 -77 42 330 57 -167 -50 81 -30 9 80 -42 61 -54 264 -206 -202 84
3596 84 191 -76 -76 220 13 131 -75 145 115 -3 126 48 -90 -54 -113 132 -39 115 58 -102 25 171 -62
3619 -62 -55 -278 258 -223 -120 186 -31 -12 29 57 139 -38 57 246 215 -79 105 147 128 164 -203 -101 53 -171
3643 -171 299 -260 -134 -10 83 -81 -94 265 48 19 -48 238 82 56 -54 155 -346 -263 168 62 -70 -129
3665 -129 -160 32 84 -142 50 -61 105 -106 -33 -258 323 -221 -73 -187 -220 -60 -80 171 56 212 27 -160
3687 -160 -5 93 -131 -62 4 355 -182 170 -240 64 -87 44 -19 58 146 186 -216 8 59 -221 -105 36 -237
3710 -237 -145 186 -149 35 -105 -56 165 -30 -8 11 38 4 220 -3 -131 102 -188 -3 250 55 -20 158
3732 158 -4 151 25 19 129 328 134 -75 -160 -136 -213 -98 -278 153 -156 -233 292 -109 -31 28 -427 56 -289
3755 -289 7 -72 118 56 -123 -100 -73 88 -308 70 -192 -196 67 102 -39 -2 -181 -54 48 -53 -9 9 -184
3778 -184 -12 95 1 47 -129 278 89 -178 -4 26 -45 11 -300 -120 -185 -98 -4 -295 -145 174 -144 -159 85
3801 85 0 -129 -25 17 -14 -8 -127 -56 35 -191 295 -131 -246 41 55 4 -443 355 249 143 160 25 10 130
3825 130 -251 -27 132 -100 -112 217 156 -13 155 105 37 -9 -180 -371 -168 48 -297 47 -16 -165 -151 -126 28
3848 28 -60 216 38 -35 56 141 -131 -112 -152 -74 -40 225 -140 -64 -131 39 -105 -53 23 -101 36 -30 120 -205 166
3873 166 9 185 -102 -3 -105 -8 49 111 91 182 -55 134 122 -83 39 307 -321 -116 226 0 -58 -36 195
3896 195 129 -33 -79 -51 -316 52 165 -70 143 -186 149 -26 197 151 116 -31 106 -105 -214 103 -13 320
3918 320 229 152 -72 -137 -138 168 -121 -193 -66 109 -104 -3 -173 -71 -79 -43 -55 86 -28 219 16 328 -184
3941 -184 305 -72 -248 191 -71 59 187 158 65 45 -304 71 90 -45 97 127 -20 215 14 166 191 -93
3963 -93 8 -130 108 9 74 -150 -126 -51 28 174 -122 40 299 262 -232 96 -150 -48 -112 -187 -48 -386 48
3986 48 21 -43 157 52 -27 224 -111 40 -95 -181 -153 45 77 -196 -53 74 -131 132 105 123 282 -65 -98
4009 -98 -37 261 -9 145 -46 -50 -5 -14 -32 -17 145 -57 -21 39 -307 -141 73 -204 -87 150 -255 -176 -101 -36 55
4034 55 -121 157 40 -191 -8 -87 127 -261 108 -149 -118 253 172 168 26 -190 -224 37 -150 154 -178 28
4056 28 175 -84 70 -199 -196 110 198 -260 139 -101 -59 27 89 252 88 268 -269 57 189 29 68 -32 192
4079 192 -4 44 12 -217 -22 -13 -11 -17 47 -79 -51 267 -233 -283 -67 -65 268 -162 41 117 -191 251 -115 -11 310
4104 310 53 43 52 93 74 154 183 -7 43 -77 71 97 -133 -258 2 135 -30 -197 -59 38 89 113 98 389
4128 389 410 113 50 1 -34 59 -36 93 -50 -280 -23 -100 26 225 -186 -322 -282 32 -181 64 -443 -187 -163
4151 -163 -71 -78 -111 -12 263 -129 254 6 -7 -248 10 49 -95 81 63 -171 -135 29 -31 -71 23 -45 19 -17 70
4176 70 42 -219 240 124 -105 -269 145 -264 -28 -78 -163 120 -14 176 -245 59 132 16 145 -96 -169 -40
4198 -40 -124 76 -35 232 -171 218 -197 -286 -327 -20 -53 176 116 2 -69 88 75 -250 -43 2 26 -72 -16 -148
4222 -148 188 266 -35 -113 35 -16 12 26 110 -7 -224 -177 210 127 20 1 49 -134 269 -240 -231 86 191 -114
4246 -114 -186 419 -86 -179 4 9 -182 16 180 -212 121 -95 -47 -153 175 123 -100 41 -243 -190 86 -1 -105
4269 -105 215 2 6 -326 151 50 -2 -198 47 91 87 84 -17 147 110 4 120 -79 -99 171 -18 39 -14 -98
4293 -98 87 41 -75 -100 92 218 97 158 -84 -137 -176 -111 -58 45 127 167 -40 218 -67 264 -124 9 -19 -365
4317 -365 61 -100 7 -53 -97 19 -129 122 -20 58 -140 74 1 -71 -19 -60 113 4 -67 -144 303 -56 7
4340 7 124 384 157 -193 -68 -116 42 -120 -176 -39 -30 76 -132 -102 -77 5 -160 -218 -213 -263 -213 82 38 -172 207
4365 207 -539 -39 -27 -170 294 -122 -401 65 47 83 231 -37 -39 -119 130 113 110 167 48 -288 32 362 38
4388 38 -140 -13 78 -45 -7 -203 -48 199 -46 129 -443 -114 67 71 -167 -119 -180 1 -27 -158 21 -24 -58
4411 -58 -258 -46 180 0 -260 -50 49 66 108 -89 -37 -213 138 -58 178 -67 84 -128 -62 18 -117 177
4433 177 -63 48 314 71 -45 79 -144 110 -166 -120 -481 -253 -147 -62 97 173 37 -124 30 -50 -17 -220
4455 -220 -4 192 356 -140 30 78 -49 87 -19 -285 -286 -16 -22 -85 -79 -154 92 455 -97 -11 21 93 16 -280
4479 -280 -88 75 135 -209 29 66 227 83 -338 221 -18 -208 120 -130 9 -56 -194 20 -142 50 -31
4500 -31 13 3 116 112 -222 240 -276 -21 54 -36 18 -18 114 -51 -205 18 -45 -17 112 -85 -231 37 90 -46
4524 -46 -66 353 -62 65 151 112 77 357 -86 -55 -47 210 -112 131 268 -144 -172 73 -68 -249 -78 -8 -172
4547 -172 59 216 -38 -12 -156 298 -33 313 53 -35 -178 112 42 -146 -282 73 84 -196 165 197 158 -35
4569 -35 173 88 152 -25 -103 58 -356 52 59 130 253 97 -121 -246 10 -205 192 -25 -78 -24 176 -295 39
4592 39 85 -25 180 3 460 -103 -218 -107 182 187 29 -150 17 47 -168 -97 11 31 -79 185 18 101 -28
4615 -28 78 -199 68 -2 82 -127 -226 -136 -220 -105 89 -65 -186 -75 -76 92 -68 79 -105 44 29 -73 -92
4638 -92 181 -97 -29 -12 -4 -124 165 -7 182 166 214 79 -152 -126 -301 -59 52 89 -4 213 -44 22 -138 -234
4662 -234 -46 143 -145 67 197 28 20 -34 257 103 -42 -61 0 -43 152 34 45 59 123 -330 -208 54 -314
4685 -314 -290 -9 184 43 -161 54 95 -289 -116 50 -114 17 -60 19 133 -121 -58 -208 -234 333 -12 319
4707 319 89 94 -212 139 -527 -17 -170 86 -16 245 162 -319 -59 363 -226 212 132 174 81 -506 101 174
4729 174 -110 -242 105 64 -194 1 241 -341 -102 87 57 82 31 -133 59 -78 -259 -40 -144 137 -219
4750 -219 213 -40 -68 40 8 139 -55 -159 35 193 -88 174 57 -35 -4 165 26 102 214 145 -58 6
4772 6 -18 -135 -26 -260 69 42 32 -44 -141 46 -171 -15 -68 -163 -148 -40 -52 -18 -276 219 -142 226 -108 36
4796 36 -7 -33 -22 -127 7 -147 -13 -256 -101 93 233 -5 37 -116 -55 -134 296 78 -73 158 31 -83
4818 -83 -50 -52 63 115 27 197 -317 -92 79 35 -291 -41 163 -294 -120 81 -102 48 127 -17 36 39 134 -301
4842 -301 -143 -82 15 110 -25 102 62 54 -117 172 82 19 65 417 -45 -49 57 112 -24 -94 -260 -199 126 37 -69
4867 -69 52 66 72 54 -217 92 80 -65 169 128 243 96 -265 19 -149 -110 41 59 -94 -37 196 84 -85
4890 -85 -50 204 -162 117 -38 73 -94 170 103 59 -51 -315 -258 -96 71 -143 8 -16 -261 -5 -167 85
4912 85 220 118 -64 -39 86 8 -181 -293 206 320 80 24 -156 218 -117 -81 -68 -76 160 227 -98 11 90
4935 90 16 87 71 14 -90 -181 249 261 26 128 -138 -25 202 57 -153 -160 104 42 -92 58 213 -47 107
4958 107 -334 -315 39 66 148 -43 151 -126 -144 265 -230 -63 123 77 -101 -123 -214 58 -197 311 151 -252
4980 -252 -207 -367 104 -237 152 3 29 100 43 -33 135 -22 -12 -18 -16 14 135 -172 94 41 42 -96 74 103 -50
5005 -50 -212 109 -49 47 19 -46 -70 224 167 -31 -177 -230 101 -66 132 -168 2 -36 154 132 -150 -90 192
5028 192 363 -61 -168 198 387 -27 -170 287 -166 -6 -174 -100 393 -248 123 -17 41 9 -97 203 104
5049 104 -81 181 22 136 58 -97 8 -78 76 -173 40 117 -102 -166 45 220 156 63 119 46 78 -60 -226
5072 -226 57 -269 -129 -111 -230 -72 -83 102 -141 63 -135 -36 210 4 -291 142 -327 -56 150 56 50 215
5094 215 -32 -65 66 -121 37 125 -96 -102 114 45 119 63 38 -136 -79 91 218 -28 246 102 -175 90 -69
5117 -69 -188 162 263 282 -74 -65 -111 -40 170 -59 -56 5 -159 15 78 -155 137 -108 35 -1 -85 -218 -122 57
5141 57 -66 -139 -147 -199 214 -114 -186 224 -204 257 -125 147 31 88 -105 -128 -36 57 -1 -128 -24 81 121 -51
5165 -51 76 -8 -384 -23 66 -168 -260 -217 -93 -14 121 -144 -44 117 -137 -185 -92 -79 -48 158 -20 65 -92 -110
5189 -110 122 -9 262 -59 -198 251 -211 -82 146 -224 -103 193 66 -1 -174 -258 115 50 -145 123 47
5210 47 -24 -145 -257 133 -130 -261 -85 38 -227 -93 132 2 47 -152 48 202 57 -74 -240 -19 -282
5231 -282 69 414 172 255 64 310 -17 288 104 248 213 269 321 -118 -141 55 175 -197 112 100 39 -188
5253 -188 90 -202 -121 240 67 123 71 -39 -172 125 125 -179 -17 -158 -96 137 153 255 -165 9 -143 25
5275 25 120 -315 146 182 -401 -147 260 -70 142 -120 -129 197 136 -135 -99 -271 253 160 136 185 148 -107 63 19
5299 19 -87 33 -35 194 95 -28 107 -226 22 10 -295 52 -25 57 141 -74 98 -78 -216 -170 31 -168 49
5322 49 -1 -292 -343 -78 -56 7 -321 -73 64 94 191 -141 -65 2 262 129 -160 -113 55 -320 -45 -141 209 73
5346 73 -231 -2 -86 91 -9 218 39 -20 -179 -44 66 166 336 -173 25 -105 110 36 -45 69 -268 85
5368 85 -112 68 -71 -280 104 1 29 135 -191 95 190 -191 119 22 -69 205 281 -133 -152 126 -109 -194 -7
5391 -7 -152 79 -297 -167 -230 189 197 -90 55 -41 -278 213 -113 -12 115 -53 -124 236 -198 178 -49 -47 120
5414 120 -316 -42 146 -135 -304 29 -125 12 -9 -30 -31 -42 -31 14 73 147 36 -80 -119 -107 155 -201 -178 -115
5438 -115 71 -168 -36 93 120 98 169 -225 -168 73 -188 30 -278 111 114 20 -15 -150 98 38 -273 32 -3
5461 -3 210 19 69 -82 242 68 -263 26 -63 -3 -40 -68 -4 47 -151 -80 198 -112 70 185 136 -84 -94 -11
5485 -11 -65 -103 104 -163 267 168 15 -85 99 -57 103 120 -89 -265 -87 117 -160 103 156 71 244 31
5507 31 214 -95 -277 129 227 -238 -72 351 -199 -15 26 0 -93 -206 74 99 -64 36 256 114 248 -135
5529 -135 -113 56 -42 -127 123 181 -146 -20 -150 40 -71 62 -205 -78 253 -63 16 -73 66 110 272 -107
5551 -107 155 -55 -13 37 8 20 361 6 -48 -41 -207 145 -99 139 124 -169 57 -96 398 -236 90 -103 203
5574 203 -87 -4 183 22 -11 54 109 215 43 119 -50 49 0 -49 156 187 54 -398 148 -7 139 22 88
5597 88 349 144 325 -18 270 -98 293 80 241 -3 -168 111 -19 -79 24 -45 97 377 -206 -305 36
5618 36 194 178 185 -78 32 28 -188 -14 -8 -60 -252 -222 210 -297 209 160 21 -39 -237 -75 -72 -113 161 76 -147
5643 -147 32 -183 113 107 40 -114 105 8 98 -50 -115 -138 54 241 93 30 -113 -358 61 -194 150 26 412
5666 412 247 1 165 77 -234 -127 51 50 29 -41 104 -17 -124 -123 112 100 217 -173 194 -63 -14 -57 84
5689 84 -31 -361 11 -40 79 -94 -199 53 -165 -213 112 -51 -165 -129 306 -30 -24 76 30 39 -75 114 -233
5712 -233 -94 112 2 -31 351 37 -48 -117 144 377 108 55 87 -144 -31 211 153 251 -75 -119 119 -38 73
5735 73 -15 287 -53 -128 -123 -136 -89 37 36 -237 -25 103 -143 -61 -267 131 -175 -62 79 -148 191 93 -95 -248
5759 -248 211 -118 299 -62 -179 33 -124 233 65 147 -62 -60 -411 -34 -115 -36 -303 -9 42 140 146 140 -59 70
5783 70 -437 -124 52 272 -176 145 14 12 188 -289 -221 -15 195 -9 -80 178 45 15 36 198 -111 -3
5805 -3 -14 91 -27 -51 -37 -292 243 -49 -64 -227 -82 63 201 32 -146 70 118 -165 98 -57 -105 -225 99
5828 99 273 -33 -141 68 -40 128 -125 -192 101 -146 43 76 -176 65 333 105 262 18 151 24 161
5849 161 -64 162 -153 143 195 -184 38 75 49 227 194 121 109 -357 -95 245 -119 147 62 -86 -53 -61 59
5872 59 79 -7 72 38 -100 70 61 -67 125 131 -106 -252 -44 -157 -12 -139 233 -165 62 215 -88 -62 -264
5895 -264 -133 -103 2 275 130 113 -155 177 147 64 -244 99 -61 -358 98 -261 -192 -52 50 126 -29 -113
5917 -113 189 -206 -52 35 405 -271 -85 -115 55 -3 -140 140 139 210 -170 -4 8 -2 -182 306 93 -38 93
5940 93 -74 18 -77 -91 275 -133 -80 131 -29 119 175 -75 -119 77 125 -276 -130 -58 -281 149 294 63 -27
5963 -27 253 -97 -163 -86 -16 148 -16 125 281 -133 -111 73 354 -81 192 -152 -63 134 -188 -74 253 -108
5985 -108 -254 -115 25 76 -224 71 -124 155 -164 116 27 -12 19 -20 198 -57 -35 -305 163 74 155 -96 44
6008 44 184 37 80 56 -119 -87 155 -105 -51 67 -103 180 197 -170 -97 237 103 -94 -118 236 44 -4 -49
6031 -49 -25 297 271 -30 133 -209 91 78 17 -178 -249 66 -314 -13 -177 126 77 -23 80 142 -178 244 121
6054 121 20 45 -18 -226 -120 87 103 43 22 82 32 191 -221 -63 -30 151 279 226 12 55 -241 -81 -151 -7
6078 -7 -44 3 -89 -98 239 -64 -116 121 -78 -372 46 -134 132 25 -248 190 -159 -172 -136 32 -230 -410 111
6101 111 -187 190 -22 -281 168 -186 79 177 -178 324 -149 -249 50 -144 -103 69 128 15 -138 -355 -12
6122 -12 13 20 -56 321 222 -87 108 186 -47 121 148 116 29 122 47 -16 -161 45 -203 116 -213 -42 -28 149 112
6147 112 -39 28 154 148 -61 246 -164 -156 80 174 -131 51 -240 118 -104 -213 -265 153 -227 -177 372 154 196
6170 196 254 -72 -245 -256 304 140 -38 -190 -68 70 -137 253 -85 179 -87 21 -127 -61 146 106 -50
6191 -50 60 -170 -189 -94 31 -309 66 -96 -270 98 -122 -250 -112 22 -44 97 163 -117 280 56 -8 25
6213 25 93 384 -278 -51 -23 -131 -156 151 -21 136 -144 -148 9 -53 -78 2 -107 -438 105 177 -81 258 -23
6236 -23 272 214 -97 48 2 225 49 97 154 -367 287 -273 154 56 87 -160 195 27 95 68 -17 -27 71 174
6260 174 159 93 315 46 291 6 66 37 -209 31 40 2 37 82 136 42 -1 238 245 141 185 -94 -38 269 -51
6285 -51 -28 -162 -82 11 122 406 123 -202 225 12 -116 -80 -166 233 -111 -34 -52 -146 -22 95 -19 -16 -23 -88 393
6310 393 -252 10 -70 -203 -14 315 162 -194 -11 33 -135 -162 -190 125 14 -11 85 52 -25 63 -211 58 70
6333 70 -94 75 68 -201 -180 -186 -26 244 -156 83 -27 -53 -127 -148 -21 -152 21 112 -342 -43 164 13 -172
6356 -172 75 113 207 104 -56 -52 33 144 -72 12 42 90 -28 -251 -109 46 223 25 -54 185 188 -131 14 -127
6380 -127 148 -27 -140 135 188 -90 -1 86 -177 -246 53 244 -42 -207 57 261 302 97 -36 239 213 169
6402 169 13 -32 111 156 -64 -60 -347 245 13 92 -173 123 -9 -214 -68 -312 149 -52 -141 -72 -83 -222 240
6425 240 -120 -184 205 22 -162 32 6 154 113 46 115 -157 -284 -230 197 258 77 18 182 -77 -150 -119 -29 104
6449 104 -282 -244 -73 209 230 -23 238 272 -200 -134 39 152 213 28 164 -119 -72 13 143 167 20 14 -198
6472 -198 -158 193 -41 36 -179 -159 59 148 -79 116 43 243 -146 101 169 48 227 303 -320 -213 12 -78 -226
6495 -226 77 218 -55 19 -159 62 -146 143 35 -229 292 126 134 -16 -269 331 65 119 69 -99 -419 -61
6517 -61 97 -53 120 0 194 77 -85 -151 -32 162 -166 28 -202 66 76 67 -211 -42 74 88 -15 -316
6539 -316 -65 -138 186 47 56 -386 104 -135 28 -55 98 204 -23 261 -207 -25 3 -292 189 -98 -13 -144
6561 -144 -147 198 80 -36 -57 -54 235 -143 -5 66 -445 346 242 159 145 303 -315 99 226 35 -67 50 -189
6584 -189 59 135 108 152 -166 -131 -63 -142 81 -243 -279 -64 -118 68 54 196 135 67 187 -7 63 107 -120 47
6608 47 -135 -110 0 -204 -242 -228 -1 -144 207 -63 19 -134 -57 -163 27 -85 -262 -23 135 41 -116 -57 11
6631 11 276 -283 -102 -166 106 13 69 -55 173 -105 103 190 40 -283 -31 -24 255 -111 78 -350 -143 258
6653 258 41 207 -104 -151 -11 29 140 -116 -12 -130 -152 208 -168 -4 -16 44 -118 81 -133 26 89 -305
6675 -305 -151 -169 -176 -117 -74 57 56 220 -329 -82 281 -296 15 17 14 99 -115 43 8 144 -3 161 -120 226
6699 226 -26 -77 -17 -16 10 89 30 220 70 4 110 -183 136 142 276 -15 -121 101 -190 75 -151 -249 29 -85
6723 -85 -79 -268 -14 184 -84 -79 94 -165 218 -238 -112 -65 331 176 298 -65 -52 170 -157 90 -109 -100 216
6746 216 -14 -290 -51 191 -100 -106 315 -456 144 -180 -124 160 457 146 5 159 32 -42 269 206 -136 156
6768 156 -71 -36 -25 179 -196 171 -213 161 256 -12 -144 -260 152 226 6 130 -118 95 -312 -102 -255
6789 -255 -80 -20 -267 6 -161 46 178 -106 44 -83 119 80 162 22 127 93 -126 17 -225 -34 -54 23
6811 23 15 68 -35 108 -91 -115 -7 109 -94 245 -336 -161 39 184 -9 -150 46 -220 -14 342 283 -18
6833 -18 -125 -79 36 -47 -35 -306 111 114 -157 84 -188 -25 -28 -186 -82 305 247 -53 -11 29 17 69 84 -200 38
6858 38 -46 -260 131 53 11 40 111 -12 43 128 111 -6 -60 -87 -290 -51 111 -151 -51 -140 -128 -45 -277 77 209
6883 209 -431 -71 34 107 -17 -66 171 -43 315 203 165 31 146 -183 -46 6 -376 104 245 -140 87
6904 87 171 -271 91 -240 -19 168 -70 311 82 114 286 217 101 -91 -11 -95 95 239 -153 95 201 127
6926 127 86 -160 43 -161 -141 44 31 100 77 -82 57 75 -156 62 -278 63 -173 257 328 -105 -234 83
6948 83 36 -74 112 -62 83 32 -1 -221 351 -157 -40 -18 -221 -73 -35 -268 -121 -172 39 379 142 -57
6970 -57 194 -12 -413 -192 -122 179 42 -391 216 -22 -19 27 -245 -2 -11 -137 -96 191 48 13 -61 25 108 201
6994 201 -122 46 -269 16 -127 -126 -46 -75 -270 7 223 -40 -150 147 -223 -22 -139 -183 55 170 62 49
7016 49 140 146 -70 -30 -330 66 -148 -198 35 -194 -19 -81 -107 -105 -148 20 56 73 -280 58 -131 141 11 -136
7040 -136 26 -7 -77 -17 14 -83 -116 176 -61 -60 160 5 -147 -87 -19 73 40 71 50 -51 -441 -120 -247 -180 186
7065 186 118 -107 168 254 -17 -90 90 5 -159 -44 -116 -3 -138 217 -218 -149 70 -29 -131 -72 123 308 -15
7088 -15 -100 -56 131 11 88 181 -12 -98 325 -127 -100 -119 -109 132 55 312 -23 62 -37 301 -90 184 -28 132
7112 132 -181 56 63 -141 -238 -118 -260 41 96 59 -34 -205 -81 -218 -239 115 4 397 258 -61 -198 72
7134 72 -201 184 62 -17 32 151 -37 -163 -211 -158 -323 -17 270 -232 -131 144 201 -63 121 280 -208 177
7156 177 11 -83 38 144 -209 -59 55 -65 320 205 -42 -388 -207 -1 6 425 102 -50 -69 115 122 113 -122
7179 -122 -33 314 -96 -279 -70 -113 -24 -37 -196 -82 259 -18 -4 -92 -251 113 -74 61 -151 -108 112 233
7201 233 -270 -19 410 -22 108 18 -212 -126 154 200 -197 -24 -90 106 -78 -188 261 134 168 -147 48 20
7223 20 -31 216 10 -258 91 40 -162 -27 -246 85 -40 229 -90 54 147 381 120 186 117 42 74 -267 -114
7246 -114 155 -42 77 94 270 -44 11 -53 -338 146 15 -6 -26 -259 -29 128 84 -104 58 125 -217 126
7268 126 67 -15 406 40 50 189 -172 -113 180 5 -110 188 -148 57 68 -94 -167 -86 232 156 -22 242 -97
7291 -97 -3 -70 8 105 -5 292 258 -58 -126 78 -13 -140 34 -271 160 170 -24 -50 -45 -105 13 -32 54 -243 114
7316 114 -76 132 159 121 -86 -232 -107 -165 -33 -102 56 -32 -65 -36 65 -88 97 -106 -41 18 -56 90 168 -228
7340 -228 129 -187 -323 -203 -107 197 -241 -101 -143 17 -160 -226 222 89 24 -21 62 224 109 75 131 100 -195
7363 -195 238 -43 19 47 -51 292 -94 -243 152 -140 -82 149 69 -113 15 -129 183 128 -185 57 302 99
7385 99 -324 -200 128 66 -246 18 118 196 -74 -141 149 119 -22 -147 -85 -220 287 232 -11 35 -259 -15 110
7408 110 -119 77 239 136 -4 -237 48 280 129 290 6 236 -80 294 -117 42 -154 -312 -172 153
7428 153 -34 83 83 -43 360 3 298 -4 -49 57 106 152 50 164 219 -76 124 28 -138 -150 123 52 -203
7451 -203 -252 -115 -263 74 -194 -3 196 231 -36 145 -119 90 -66 297 36 24 -235 2 80 -99 -285
7472 -285 -34 370 -161 -136 -366 204 -120 -355 45 8 170 -96 70 -63 -310 -25 -85 395 290 172 -157
7493 -157 72 180 43 -149 88 205 -98 -48 59 -135 62 -334 96 -57 35 -377 -24 -130 -174 34 12
7514 12 -33 -16 280 182 -161 -178 -227 -34 60 -99 -69 -52 -30 24 -213 131 -130 -117 45 -16 -3 -78 349 12 4 -8
7540 -8 -285 -12 112 86 -73 -297 11 419 -92 172 121 32 162 -236 112 262 -170 -151 -139 15 203 225 -131
7563 -131 66 85 4 333 -105 221 -265 175 71 -16 211 64 181 175 -62 -291 -103 200 321 239 -98 34
7585 34 -268 268 -8 277 -227 34 125 -36 181 -9 140 8 -310 5 35 161 173 -72 81 -65 155
7606 155 223 129 -34 -55 34 71 2 222 -238 53 100 -49 149 53 -41 59 -352 32 -90 -35 -412 -293 -14
7629 -14 142 -197 257 -88 -185 148 226 8 233 217 125 58 -49 -91 -91 -120 158 -248 -225 113 35 -138 -71 172
7653 172 -106 53 -77 -312 134 -424 220 -4 -140 34 151 165 -23 117 -240 -57 117 -155 -51 -77 -93
7674 -93 184 16 150 -142 -196 36 -200 46 361 -54 53 80 30 -257 292 21 241 -169 25 18 -210 43
7696 43 -72 -56 -38 -38 -49 28 41 211 37 -150 -149 -90 42 -54 212 -38 120 -4 86 -314 -45 -107 30 209 143
7721 143 477 81 21 -215 168 1 -91 -159 50 254 -109 -120 81 -33 -51 178 -240 -79 -140 -94 240 24
7743 24 227 -52 -423 -202 -418 46 155 70 313 150 206 206 -151 330 -86 -169 157 69 -33 15 54 81 168 3
7767 3 -154 26 44 -301 10 -56 82 37 71 -174 -154 -165 -217 67 126 39 -37 32 -35 17 161 -64 147 92 66 92
7793 92 -182 -148 261 65 210 141 26 11 -293 420 108 -181 -183 228 25 92 128 -22 221 11 75 -227 -28
7816 -28 178 -125 -31 13 147 -26 -142 6 -28 127 -111 -292 155 123 -102 143 41 18 41 -52 62 -36 69
7839 69 232 103 221 76 33 300 -2 5 168 333 231 122 -169 -134 -216 55 -13 127 1 -63 140 125 238
7862 238 -171 -27 -63 -119 -50 -134 -7 83 -201 310 29 160 135 153 544 49 128 -63 247 -293 -164 172 -87
7885 -87 -67 6 70 -124 -199 48 85 -246 53 171 150 -56 -11 -6 -188 94 251 99 141 3 -52 -128 -20 -99 93
7910 93 209 -114 -182 41 -178 219 241 -126 -7 318 -27 268 -322 45 118 113 179 -42 8 168 232 -15 67
7933 67 -128 -67 22 -230 -100 70 -72 -45 102 -53 14 204 -129 -96 -214 46 -19 -429 84 -110 143 -46
7955 -46 48 87 355 -279 -13 365 -47 3 -208 -149 42 59 42 -159 -9 85 -40 -126 -71 -321 40 208 -110
7978 -110 -193 -259 -254 -178 43 127 -70 -240 -126 -125 167 320 -90 -185 -69 33 74 -223 -82 154 -85 -248 185
8001 185 -2 155 -159 -38 -17 155 -8 -34 297 -27 -199 -49 -207 5 371 -95 400 53 135 -121 -291
8022 -291 23 -299 -120 -485 43 -259 140 -110 -135 -137 -117 -76 -133 52 118 87 -268 198 -142 47 -19 -82 -54 -216
8046 -216 70 169 154 71 -84 -182 185 -110 167 -18 256 233 192 -101 427 140 -121 -59 25 -67 -212 171 -41
8069 -41 -218 -136 -143 32 -81 -115 81 -265 54 -85 149 36 51 26 0 116 -231 217 -146 151 219 176 -251
8092 -251 -320 213 51 -26 -347 153 11 -77 21 94 178 94 -83 -272 -150 -197 -125 9 -173 102 8 -166 146
8115 146 102 -221 -63 122 -11 131 -295 -126 71 235 -35 114 -174 -189 -101 -131 275 77 4 -126 -271 108
8137 108 -114 34 268 73 93 31 -63 21 4 -138 -117 -78 16 50 -211 -92 284 -134 7 7 142 43 -70 -85
8161 -85 74 270 -184 155 -316 -111 186 -425 79 30 47 -137 -213 -229 170 -19 -66 217 -46 199 -357 45
8183 45 25 -23 88 -85 -44 35 -126 126
8191A26
$$ Imaginary data points
##PAGE= N=2
##DATA TABLE= (X++(I..I)), XYDATA
0 0 0 0 0 0 0 0 0 0 0 0 -8 8 -8 8 -8 15 -16 16 -22 24 -26 32 -39 41 -48 56 -64 72 -81 93 -103 117 -130 144
34 144 -162 181 -200 222 -246 273 -302 335 -371 411 -455 506 -564 629 -705 793 -897 1025 -1184
53 -1184 1387 -1661 2044 -2623 3600 -5547 10929 -55411 -187317 -34585 96945 30254 -70404
66 -70404 -9273 75518 29164 -64849 -38160 51646 56033 -15939 -30478 8569 10046 -19258 -4686
79 -4686 30901 21975 -19729 -22539 13839 23576 -16175 -33060 8194 32671 -9689 -43519 -8787
92 -8787 31949 14848 -22937 -22637 5349 12587 -7054 -16972 -1621 5988 -4353 -3868 3594 -6449
106 -6449 -14870 5384 20500 -3017 -29788 -11864 26721 20701 -25850 -32077 17785 36079 -11325
119 -11325 -38271 119 30596 6918 -22190 -13582 8100 12201 479 -8019 -5675 488 5922
132 5922 7372 -2859 -13638 -2023 16508 8415 -13333 -12137 7633 15359 3452 -12084 -10309
145 -10309 9138 15929 -2256 -14599 -2492 11078 7859 -3513 -9252 -3776 8645 9483 -3043
158 -3043 -10135 -3129 7519 10443 -1427 -14443 -5408 15637 11998 -10887 -15461 4014 17319
171 17319 5745 -14829 -12347 11452 16876 -4855 -14919 -155 10334 5240 -1792 -5526 -4749
184 -4749 4555 10714 959 -11541 -7183 10161 14657 -3892 -18051 -1242 18904 7256 -14457
197 -14457 -9927 7884 11500 805 -9585 -6948 6235 10755 -572 -9134 -3322 5279 6917 1553
211 1553 -6899 -6969 5655 10109 -137 -9373 -5088 6677 11298 -618 -13711 -4955 13617 10119
225 10119 -8978 -12217 2788 12784 4733 -10219 -9807 6488 12038 -1688 -10097 -2229 5638 5058
239 5058 1093 -5285 -6173 3367 9431 1247 -9147 -6184 6375 10699 -1731 -12923 -3133 12649
253 12649 6723 -8532 -8165 2566 7981 3655 -5873 -8300 1733 9411 2392 -7461 -5800 3005
267 3005 7598 2452 -7445 -7247 4871 9143 -685 -8474 -4519 4797 8172 -404 -10551 -4212 9379
282 9379 7216 -5570 -8502 297 7598 4804 -5382 -8342 1720 8708 1455 -6196 -4549 1543
296 1543 5760 3161 -5776 -7264 2642 8672 448 -8144 -5034 4757 8081 -1101 -9753 -3198 8202
311 8202 5127 -4816 -6006 -229 4330 4280 -2908 -7732 -872 7461 3451 -5396 -5996 1057 6359 2757
327 2757 -6295 -6584 3579 7127 -519 -6011 -3841 2377 5992 991 -7696 -4673 5897 5856 -2814
342 -2814 -6589 -1419 4891 5027 -2577 -7718 -303 6765 2438 -4388 -4898 106 5223 4208 -4927 -7030
358 -7030 2323 7217 547 -6162 -3907 2711 5557 -19 -6440 -2854 4898 3921 -1839 -3821 -1994
373 -1994 2224 4640 -159 -6479 -2215 5694 4161 -3253 -5374 -575 5651 3577 -4592 -5690 2345
388 2345 5938 502 -4312 -3128 1417 5106 1205 -5111 -3331 4054 4532 -1075 -4167 -1885 2867
403 2867 4605 -479 -5431 -1300 4591 3106 -2090 -3490 -941 4031 3859 -2775 -5407 1389 5507
418 5507 1199 -3110 -3156 1315 4787 1867 -4305 -2806 3239 3867 -242 -2939 -2261 1684 4610 107
434 107 -4671 -1416 4298 3148 -1592 -3368 -934 3355 3343 -2201 -4368 1011 4008 1246 -2052 -2988
450 -2988 112 3810 2258 -3744 -3264 2593 3681 22 -2613 -1636 1749 4018 467 -4170 -1353 3230
466 3230 2569 -688 -2843 -1706 2729 3580 -1927 -4066 645 3710 1479 -1823 -2338 -34 3298 1683
482 1683 -2868 -2468 2042 2617 -23 -2217 -2227 723 3609 636 -3491 -1314 2432 2090 -758 -2320
498 -2320 -1327 1880 2651 -1373 -3330 180 2302 914 -909 -2362 -844 2796 1982 -2811 -3218 1304
514 1304 2501 -74 -2046 -2179 603 2595 290 -2912 -1310 1580 1321 -262 -1451 -1833 1432 2466
530 2466 -974 -3046 -326 1955 887 -819 -2121 -1039 2151 1822 -2388 -2284 772 2039 147 -1028
546 -1028 -1983 304 2610 559 -2852 -1378 1555 1495 -51 -1659 -1587 1253 2302 -940 -2350 -226
562 -226 1585 663 -29 -1621 -1138 1654 1567 -1760 -2197 579 1682 485 -848 -1653 -176 2216 709
579 709 -2150 -1307 1075 1015 -75 -942 -1418 638 2336 -638 -2075 -215 974 585 -54 -1460 -1242
596 -1242 1559 1567 -1096 -1816 632 1031 401 -398 -1569 -308 1821 587 -1586 -897 913 682 303 -770
614 -770 -937 354 1834 -238 -1497 -156 907 466 362 -902 -1178 1028 1545 -1073 -1425 491 1012
631 1012 538 -153 -1055 -338 1601 690 -1164 -394 730 806 781 -306 -1206 690 1876 104 -1322 -24
649 -24 959 444 273 -285 -1054 701 1410 -503 -765 56 398 577 365 -738 -481 1567 427 -1124 -421
668 -421 603 499 596 -58 -1123 686 1514 -225 -946 450 291 226 512 -505 -1025 899 1128 -681
686 -681 -1046 269 916 300 -158 -800 -343 863 359 -596 -60 128 62 634 -171 -1168 -135 1158 211
705 211 -713 -33 373 190 79 -487 -925 539 1011 -810 -548 58 -20 322 336 -560 -312 795 533 -1016
725 -1016 -176 118 -272 454 -180 -929 70 998 -401 -635 168 258 -349 290 -389 -676 48 706 -328 -192
745 -192 207 -224 126 -349 -881 -423 815 -6 -299 -106 -98 -89 3 34 -1152 43 612 -213 -727 142 176 -168
767 -168 604 -274 -551 310 426 -632 -500 273 -240 5 151 -626 -223 387 -37 -850 305 -88 -147 307
787 307 362 -922 -303 716 -473 -734 226 -187 -290 278 14 -915 419 485 -488 -242 360 140 -29 441
807 441 -543 -47 475 81 -342 140 -120 -307 437 272 -550 74 652 -194 -253 191 104 -414 47 -91 -387
828 -387 234 1 -470 40 -86 -318 109 543 -508 -232 358 -262 -441 341 274 -177 276 94 -617 319
848 319 231 38 -126 523 5 -393 333 16 -509 334 535 -249 -70 198 -153 -51 415 14 -164 523 -82
869 -82 -292 349 -7 -539 309 219 -305 -301 466 12 3 370 2 -168 118 -114 -202 337 540 13 -33 301 -231
892 -231 -6 328 -144 -219 436 58 -134 420 -9 -196 342 443 -326 127 421 -188 -3 450 -93 -212 131
913 131 20 -108 466 236 -128 162 218 -418 69 242 -337 33 304 64 -127 365 -114 -359 198 192 -348
934 -348 94 426 -327 -127 373 1 -537 77 -3 -472 80 69 -307 -83 491 -246 444 286 -201 -73 97
955 97 -148 -380 404 80 -431 119 33 -348 -195 292 -374 -19 445 -319 -213 176 -3 -296 84 -225 -312
976 -312 110 270 -258 40 73 -405 21 191 -163 -321 166 -137 -456 225 -176 -476 -187 230 -551 -114 57
997 57 -218 -249 187 -102 -304 190 -32 -302 -28 205 -295 17 74 -488 -55 198 -179 -360 214 -341 -340 300
1019 300 21 -363 47 186 -141 75 410 -246 -328 128 -24 -326 388 137 -483 -108 423 31 149 264
1039 264 -333 -172 299 -185 -220 141 -21 -107 203 -19 -668 284 405 -335 126 136 -219 -130 350 -77 -192
1060 -192 436 -94 -405 208 59 -204 89 279 -110 -119 375 -300 -104 190 5 -11 366 56 10 350 175
1081 175 -206 265 370 -172 34 44 -269 -66 677 342 -345 147 239 -252 265 101 -137 -159 443 6 68
1102 68 329 77 -98 277 1 -82 315 192 207 -63 258 -9 -24 298 167 137 314 246 -229 441 54 -59
1124 -59 303 650 -181 -42 480 -141 -116 280 -98 3 551 -16 -223 401 144 -236 220 276 -356 -47 46
1145 46 -299 -45 289 -128 -56 255 296 -228 352 143 -332 130 145 -103 181 97 -274 -461 274 208 -335 252
1167 252 245 -82 0 -27 -94 -103 254 -262 44 264 165 121 72 115 -247 125 90 -412 -296 169 1 -283 473 -261
1191 -261 -598 322 -149 -225 60 -63 -84 101 184 -153 -226 362 -196 -209 134 -52 -196 554 -178 -182 324 223
1213 223 -162 188 232 -232 -358 -106 -139 -336 302 -293 -305 71 -60 -61 -97 76 -197 -162 219 -79 0 18 -209
1236 -209 -238 131 -148 -456 290 468 -176 -150 223 -133 -102 509 -37 -260 223 -80 -297 134 -107 -402 181
1257 181 110 -293 -24 416 -258 -251 198 95 -409 305 -157 -103 22 255 -136 -129 186 -138 161 -86 -53 -24 167
1280 167 319 -12 160 116 -88 -45 220 -293 50 440 -308 -111 -83 -158 39 371 -38 -280 238 474 -340
1301 -340 242 218 22 148 180 -320 -122 327 86 -131 -26 102 171 253 -70 -81 158 260 -450 -125 186 63
1323 63 -4 130 -59 -144 -174 228 -128 74 72 92 132 264 -58 56 175 82 -29 63 220 -641 173 -7 -110
1346 -110 -128 580 -29 -43 53 151 -154 5 -108 0 85 70 -144 -216 -31 9 -51 190 -286 -498 333 27 -181
1369 -181 314 59 -117 274 158 -547 -20 329 -62 1 116 -323 -129 365 -39 -417 131 123 -392 -30 104
1390 104 -213 138 126 -244 -186 328 -185 -267 245 -192 2 341 37 -442 100 27 -36 -26 -145 -133 135 70 -74
1413 -74 -52 179 81 -355 -53 88 189 35 -12 19 -43 129 -32 150 -225 -114 -65 385 -140 -418 -158 42
1435 42 25 -211 328 -334 -182 181 -163 -242 -192 -1 -176 96 -46 -6 -3 -163 -147 166 -134 -250 60 -64 -108
1458 -108 -103 274 71 -219 47 166 -187 -93 -36 -59 -307 313 -125 -25 -125 47 -395 86 -119 -120 17 200
1480 200 -207 77 -5 76 -246 -10 -127 -146 346 180 1 175 136 -461 -153 343 -264 127 79 8 -93 54
1502 54 -133 146 95 -154 -464 184 53 -290 88 356 -214 159 -79 336 -205 124 163 50 139 129 -104 -66
1524 -66 -55 125 7 -112 43 -204 63 249 136 296 -300 -100 239 79 180 11 449 -124 44 -178 -3
1545 -3 -181 -181 229 -54 -62 -111 166 -27 5 -125 -226 227 -158 -133 -19 23 117 27 105 -277 -16 -37 39 -127 267
1570 267 102 -96 -103 -37 -147 277 -117 -61 132 261 -302 -166 -158 -74 -143 170 123 -170 287 -8 -393 31 177
1593 177 -192 59 425 -361 -119 -6 170 185 -63 -154 -14 -264 -58 207 138 -21 -334 338 306 -210 -444
1614 -444 47 -6 -71 28 -111 -206 145 -147 -213 43 100 -7 -290 27 -106 -188 15 133 -114 -176 -177 -221 235 226
1638 226 -116 129 -268 -331 210 158 -93 -115 -119 -122 -169 109 266 121 178 119 -69 -14 86 -406 41 -111 -87 -129
1662 -129 69 -107 -191 209 59 143 170 51 -151 -82 97 -168 -293 144 -21 -233 522 -84 -141 231 -31 -261
1684 -261 -82 407 -194 53 -23 -78 -152 316 -20 68 -12 -143 -259 -198 -62 -3 24 298 -156 1 34 232 -395
1707 -395 166 -61 197 215 200 -139 454 240 119 -138 311 -307 -24 -64 -45 -99 -30 -82 -236 95 258 -405
1729 -405 -176 -182 40 9 68 30 -136 218 38 -80 -12 41 126 14 13 -87 88 27 -26 -144 40 14 -91 147
1753 147 -151 -55 71 388 207 202 226 179 100 242 -42 -13 -129 206 -87 -126 208 320 55 291 -8 -197 238
1776 238 202 307 -79 -212 306 85 -15 -111 -210 4 -72 -56 1 -143 -302 -12 -141 -150 272 59 -155 222 208
1799 208 -13 -135 -47 -77 -121 42 164 -345 -37 43 -92 -41 199 -224 -13 221 -48 74 23 -253 -130 56
1821 56 -213 -72 140 -109 -126 167 170 -32 35 160 -220 -22 181 -208 54 -77 -124 -279 -126 270 -297 68
1843 68 73 108 160 206 -101 -146 130 24 -252 269 -162 32 -306 172 101 8 261 -79 -47 254 121 -132 138
1866 138 -108 -176 50 -20 -189 13 79 -185 -195 -12 -215 71 154 18 25 21 -6 -103 23 99 -260 -146 -23 -92
1890 -92 -217 218 -139 45 -196 139 -135 -66 142 -69 324 -42 3 25 130 -269 149 -25 75 -43 -78 -74
1912 -74 -193 107 185 154 64 -74 -80 -180 179 14 -91 -193 -118 -5 329 135 -161 139 223 80 55 223 -182
1935 -182 -98 21 54 -96 248 -47 -241 102 191 24 31 249 -43 -37 73 -300 -225 89 -83 45 128 -258 -54
1958 -54 171 -11 -365 209 8 -172 -20 539 302 88 -18 44 -141 -119 -135 -125 449 -270 -204 -232 15 -141
1980 -141 191 -379 103 -99 108 130 -59 12 80 -37 145 -204 -309 213 402 -82 35 326 14 -58 51
2001 51 -15 208 -49 -255 -97 108 -71 -67 -158 231 134 323 220 -55 260 8 -179 80 -52 -69 -161 -61 191
2024 191 -196 180 81 89 71 125 139 -207 126 7 -29 -138 -4 -29 53 -140 12 -192 105 58 -131 30 -193
2047 -193 111 65 -107 -163 44 249 226 -89 205 -49 105 56 243 158 -149 -109 -18 170 341 -195 -319 -14
2069 -14 -165 261 213 -235 -200 45 -7 202 -25 -39 -158 194 -188 77 -25 171 89 60 10 -32 217 235 137 -114
2093 -114 -2 187 34 -21 237 -119 -101 -162 3 -326 -182 38 -229 50 -180 246 222 219 -172 -38 -8 -118
2115 -118 -263 74 -4 -43 -173 -39 -70 198 160 -40 -33 -69 208 -2 -202 -223 -79 104 239 -151 209 -76 -89
2138 -89 -148 -22 -222 -98 -151 -75 -149 119 43 -15 123 -29 -390 -114 300 48 -12 -231 22 19 -404 -144 94
2161 94 85 58 107 149 -108 51 -54 -129 -249 88 98 -386 -57 -123 23 194 354 -28 -59 179 -101 -208 107
2184 107 250 -215 125 149 -383 122 -131 121 194 113 284 -24 -76 154 131 288 94 73 46 27 0 -222 64
2207 64 -295 153 251 -17 -13 -30 70 145 -248 -29 -77 132 161 25 -250 -60 -160 -94 175 -165 37 -99 288
2230 288 -25 256 32 -27 -89 9 -77 -5 -173 161 20 344 -254 57 193 88 -238 -71 2 -98 164 67
2252 67 -50 -51 183 -87 23 63 310 -64 -201 253 52 71 144 -49 -548 21 272 -35 -111 248 260 254 127
2275 127 -163 -75 318 22 -183 -141 -91 -122 108 -47 -94 116 -2 -119 -258 -21 -246 4 197 -54 -55 -48 163
2298 163 94 -70 90 35 -69 134 -79 -73 -39 -50 -122 -7 -121 0 382 108 -316 -78 81 65 14 62 -241
2321 -241 69 53 -97 169 22 92 -24 -92 68 218 -127 111 -85 -23 218 122 57 -27 85 -47 180 -101
2343 -101 125 -39 160 202 -37 8 132 -320 95 -265 -129 256 65 98 -72 -251 -133 25 -279 -58 117
2364 117 -56 113 -90 322 -302 121 267 230 42 -135 8 177 -86 -194 -168 51 -220 -204 -26 -111 133
2385 133 -20 135 61 327 55 -284 171 5 47 -84 -276 84 -60 -22 294 48 -166 17 -68 4 -66 -290
2407 -290 -220 -273 -65 51 62 -26 -163 -248 -86 220 -195 161 -84 -71 313 185 137 158 182 15 476 41 -87
2430 -87 -79 106 63 -43 -30 189 -84 -233 -77 -145 -242 181 84 110 -171 -90 199 -58 -123 -37 238 -119 117 64
2454 64 -52 -257 398 89 -20 -7 -39 -114 -156 -85 -135 -54 -126 131 -96 -183 277 148 -125 362 -364 -250 187
2477 187 177 -266 62 43 45 -240 72 127 -9 137 291 -243 -29 -21 -328 52 -159 -186 98 216 119 160 -136
2500 -136 68 121 164 34 -108 -109 6 -116 -245 247 -180 15 -39 -340 176 -166 37 -188 -220 5 -94 194
2522 194 -170 -110 232 266 31 -97 -117 119 72 88 35 -100 -23 -55 -261 -81 -30 338 149 -27 57 -66 217
2545 217 209 40 -238 -220 116 147 247 -174 74 52 -42 2 -257 284 114 159 -384 -213 110 10 -36 -96 91
2568 91 191 20 62 -29 42 257 -147 -168 30 -37 -27 12 56 -19 19 136 -132 11 -33 94 -84 238 327 -121
2592 -121 -127 70 -69 49 -100 248 72 -275 -174 -89 197 67 -66 394 64 -68 235 54 -134 -16 365
2613 365 -189 327 316 89 -275 242 43 -76 60 207 -83 76 125 -17 -71 230 -177 -119 -28 -73 261 -38
2635 -38 119 -183 123 -37 -145 -203 235 19 -77 398 111 -12 83 -12 -45 101 444 -52 -45 -138 4 -447 22
2658 22 -8 55 78 -65 197 263 166 31 -14 -159 62 163 214 55 -1 36 -8 -68 107 83 -103 195 106 -152 64
2683 64 97 33 145 131 20 -8 -276 -127 214 -143 6 98 119 144 -191 -150 35 92 113 -20 -123 107 -176 -16
2707 -16 -74 249 360 234 -29 -191 70 -194 -338 8 65 8 -61 -280 -28 -116 -146 -203 -59 80 128 191 371
2730 371 -51 -63 -185 210 -74 -37 10 -71 179 -112 -49 289 -92 193 -145 -195 -194 -181 100 122 164 -149 190 -86
2754 -86 -22 40 187 -151 27 -53 196 -26 245 142 -250 -71 265 159 24 -95 45 238 -22 203 -79
2775 -79 -165 -163 101 -64 129 -105 11 194 69 136 -273 -123 9 134 -112 -12 -5 -4 -179 -191 -17 211 441
2798 441 -78 147 253 7 -68 266 29 167 -23 33 142 124 -54 132 -12 46 50 -22 92 74 14 -29 171
2821 171 185 -41 -34 151 -270 218 48 123 -262 -171 -286 53 199 -13 48 103 -112 -199 112 56 -236 313 185
2844 185 66 54 -211 -142 204 97 65 -52 54 55 315 -72 -108 -263 -90 26 45 207 -71 -274 61 -96
2866 -96 -97 172 -61 192 -76 151 -9 136 -148 481 54 146 -145 -167 4 -192 131 279 -75 53 -71 -26
2888 -26 -186 -76 -34 106 52 147 124 -111 -69 -76 -89 -114 -71 233 -55 204 -36 -169 -180 51 152 178 7 57 -64
2913 -64 64 81 -119 -262 244 152 -57 65 42 70 220 11 -60 16 162 149 -36 -1 -25 -143 12 234 36
2936 36 -3 134 -7 43 -97 87 -63 21 46 62 -97 -168 -72 -263 61 -145 221 173 -454 -94 182 -117 188
2959 188 -36 10 -155 -106 136 12 73 98 77 64 236 56 -32 118 -7 25 263 100 -195 -258 -40 -217 241
2982 241 214 -195 33 278 349 144 9 -363 110 139 36 77 -45 116 79 68 206 236 60 274 -86 -21 5
3005 5 19 14 113 -30 104 -49 56 342 8 12 154 320 -15 33 -25 71 -62 -61 60 254 177 76 161 255 -25
3030 -25 -6 266 144 -50 24 -174 223 199 35 -266 -17 -127 -26 -8 -238 95 5 -23 -6 -107 -141 31 160
3053 160 -125 64 -171 -24 112 -103 -91 -64 -53 -215 140 -223 12 -3 83 5 193 -1 123 -98 -49 -101 -131
3076 -131 18 -180 -118 52 -213 -81 -54 -113 -48 101 -66 283 -3 99 -50 -86 -90 17 91 52 -141 -320 -223
3099 -223 92 46 -252 -73 229 21 -18 247 -45 28 -129 -7 67 -169 94 -73 -8 -70 -117 133 230 229 87
3122 87 -41 -191 8 -156 35 253 89 -393 68 -125 21 16 264 -108 44 -31 96 -10 71 238 -153 -42
3144 -42 286 -38 178 175 25 59 -165 89 79 44 -221 -129 -24 -202 96 -156 -138 276 -134 -137 426 -118 130
3167 130 69 -85 102 -129 153 141 45 130 235 -392 75 89 34 -56 51 -230 6 -184 290 -259 15 227
3189 227 -154 141 -158 385 -221 -165 -39 15 -89 129 179 102 246 -174 46 -192 96 273 135 109 -65 -15
3211 -15 -99 233 106 -87 135 -324 -78 -48 22 80 165 -22 -116 -140 115 -96 -38 -34 -110 201 -47 -131 -300 -232 -236
3236 -236 103 231 -239 -138 -200 -61 24 -172 -353 60 -115 59 175 72 60 99 99 -242 237 -98 257 170
3258 170 166 6 20 9 90 92 -84 202 -224 58 57 -74 -61 94 -223 132 -38 -7 -35 88 86 -178 -141 -114 96
3283 96 1 -23 -106 -181 -175 37 -406 -172 -25 45 -77 -22 44 -45 132 -34 -197 11 219 178 -129 299 56 69
3307 69 90 -144 -55 38 17 35 105 -101 -6 436 -83 36 186 -180 -79 9 -92 -300 -218 -34 -203 -16 137
3330 137 -80 -128 -41 180 -199 -1 -84 101 -43 -388 123 140 -128 160 228 -53 72 50 -12 226 -190 48
3352 48 -3 227 -46 185 -61 -130 -149 5 18 280 7 -166 211 -26 161 143 -176 58 131 -111 -2 -327
3374 -327 -83 140 6 272 68 20 -83 -67 72 -112 42 -132 260 -12 258 198 -120 4 -78 -74 -26 59 193
3397 193 116 21 40 79 173 -168 75 66 193 -72 126 169 135 -12 112 -47 17 291 17 81 -226 -199 -37 88
3421 88 -45 -306 56 104 29 -177 -80 -177 46 20 -24 -155 145 287 -207 -98 -148 -215 163 -58 61 14 166
3444 166 -87 11 60 -380 27 151 -19 -158 91 -206 -171 71 -246 -168 267 -179 107 -214 -421 71 -111
3465 -111 -263 -90 151 241 34 -53 -89 -72 67 110 -192 -169 5 116 35 254 23 -120 -248 -25 -97 -212 -9
3488 -9 -65 72 -261 7 114 104 -63 346 31 -123 172 -266 53 8 46 -366 -33 -111 -87 -58 45 62 28 -24
3512 -24 -18 -150 -115 62 -11 -31 -2 58 -110 -275 -103 158 -43 -121 -34 -61 -290 23 -263 -29 91 6 9 197 -99
3537 -99 -6 148 93 12 -89 -558 -128 -37 130 -207 -136 57 179 -112 -315 -115 14 -108 -90 153 -55 -172
3559 -172 -266 145 79 212 19 135 210 132 -117 -299 51 -80 -86 -117 45 -112 -74 -225 81 136 26 -118 -296
3582 -296 48 288 100 59 69 -285 -53 79 129 -289 -13 226 -210 -263 -222 -16 -62 73 -257 -45 -180 30
3604 30 -126 57 34 -116 -138 22 104 14 57 93 -110 -132 -39 131 45 -18 132 280 108 -21 312 -141 2 -10
3628 -10 -130 -44 44 329 214 21 59 -128 73 234 87 174 -190 -192 -145 -81 211 -246 -349 121 -171 -64 -83
3651 -83 141 -53 -138 51 -147 -163 -26 35 -6 11 -46 -18 117 247 -56 43 -27 -233 31 -11 -53 175 150 160 194
3676 194 -7 -130 42 85 122 -200 -30 83 68 -182 130 181 -74 114 -74 78 -127 185 35 -111 65
3697 65 -165 -489 -166 -1 -335 179 -29 49 -55 -43 23 -232 123 35 -82 -304 -34 -137 -25 27 96 -114
3719 -114 -49 -51 -108 58 57 -62 13 282 -329 350 -297 -9 -367 184 155 -97 30 33 413 32 -217 173 -157
3742 -157 -184 -278 -100 -126 -137 305 223 3 -56 -227 6 -66 -99 181 -77 -11 -199 -69 210 -222 -237 -92 -88 -55
3766 -55 182 -5 332 196 71 197 116 86 57 -67 -99 -183 -100 -49 46 156 113 -132 -28 -68 12 181 122 52 -144
3791 -144 75 211 -118 -120 -140 60 -71 47 -219 152 -53 -83 273 -197 -86 -17 160 -37 207 -399 46 -57
3813 -57 126 -157 141 -176 -205 -9 175 -213 -26 23 -100 -68 -182 45 170 -158 13 167 48 110 -155 -118
3835 -118 86 196 39 282 -105 75 38 69 -55 52 -199 16 -177 -129 -103 287 217 -96 -19 174 -34 86
3857 86 21 -171 -22 -141 -138 -149 327 -90 -261 -22 169 -88 -26 -3 -235 -444 86 -87 54 -55 -132 -139 183
3880 183 -80 119 -57 -150 276 -24 -28 -42 82 -5 169 -60 220 -69 39 -17 -115 32 126 -54 30 127 -19
3903 -19 180 88 -77 22 155 -33 -127 -4 192 -106 2 79 65 99 -103 154 -132 122 -1 164 152 -260 -65
3926 -65 -242 47 -83 281 33 -217 -52 93 -31 125 71 -113 -117 -74 291 -70 3 -29 -248 149 -224 150
3948 150 -15 210 -250 66 -93 53 297 35 89 -105 116 17 168 -114 14 -41 131 -132 81 2 -22 105
3970 105 84 245 5 -127 -103 65 159 -192 -153 -48 94 -128 -302 48 -4 160 -61 267 178 -32 -157 37
3992 37 91 -35 -161 133 42 8 43 -242 25 -233 287 208 49 106 200 -13 293 168 -195 -28 -20 -164 -11
4015 -11 234 -43 29 -82 189 9 135 -22 -105 10 -155 10 26 207 -31 175 -80 64 -181 -57 70
4036 70 -224 -30 -78 -325 -13 91 7 -137 19 -198 255 70 -196 159 -104 185 178 114 20 -59 -92 -77 126
4059 126 -123 -8 -129 24 136 -168 18 -72 217 -65 -294 -181 -94 36 -60 -32 33 13 -44 130 78 -7 -176
4082 -176 -4 12 -178 322 0 -287 168 -123 -39 -57 120 -8 -3 229 -59 25 414 -303 11 -53 197 -63
4104 -63 249 334 -82 124 118 -241 196 -242 -12 -103 -312 24 -115 -54 -208 61 -15 -113 13 -389 28 -229 -41
4127 -41 -105 -42 -63 47 123 -380 227 -243 1 119 -175 -104 333 80 -240 -33 135 -36 3 35 -40 39 95 42
4151 42 126 135 104 42 -128 -38 96 194 -92 -97 128 118 57 204 160 164 255 -48 94 -348 -122 -22 242 -159 192
4176 192 7 -61 -165 76 214 42 14 106 124 -344 -121 -85 22 93 112 186 124 133 195 -172 32 27 -14 -40 -400
4201 -400 84 -22 165 231 21 -72 -144 86 -239 -145 -95 136 20 -43 177 -88 128 36 -14 -98 -37 -35 200 -165
4225 -165 -113 -62 41 5 -159 31 99 231 213 195 -92 212 195 178 -246 -54 105 -1 -58 -75 -105 -45 78 -253
4249 -253 -254 204 74 -238 237 -66 154 -77 -78 -22 -14 12 -188 17 95 306 -314 -175 149 72 12 108 102 -4 98
4274 98 172 140 122 124 82 -61 -64 184 -4 -171 -9 -53 8 -108 -150 -290 -340 -148 -38 134 149 -14 79 -55 -75
4299 -75 -288 152 41 14 85 -280 126 -168 66 -80 207 166 -58 -75 -114 204 258 -356 1 6 -147 104 190
4322 190 81 -201 48 -15 244 106 -38 52 -177 -126 0 198 -209 -35 -243 27 -106 67 -20 207 -39
4343 -39 82 56 -203 -250 88 -14 -219 -227 74 18 73 30 42 -293 -54 -18 123 41 281 226 -311 72 -5 212
4367 212 -26 -61 204 -68 -86 22 -28 125 55 231 -64 203 93 21 -94 135 172 246 177 81 221 -242 59
4390 59 -51 -37 -74 171 -29 -93 78 -263 43 -19 109 98 92 183 31 -1 -6 70 -125 9 109 -188 46 69 -99
4415 -99 130 -30 -79 236 116 -291 134 115 -172 -170 -115 93 34 -31 -62 155 -56 -8 -331 -32 49 214 164 143
4439 143 -249 -164 32 -310 -78 -286 81 -41 136 159 -322 -125 119 -40 -207 208 -148 70 169 184 -226
4460 -226 -25 212 -53 -284 -113 -2 -245 -123 -68 -241 -73 5 215 -137 58 185 156 14 21 -120 -174 199
4482 199 300 61 185 156 -142 -113 -37 -116 142 215 -269 24 -40 -136 100 104 135 -91 320 41 -157 93 -26
4505 -26 182 15 -135 66 -80 110 -69 -29 20 -57 45 -29 -100 3 136 162 92 38 -128 141 -66 -90 72
4528 72 -192 -161 -13 -212 -257 -8 91 -67 33 -149 -70 121 64 72 -51 86 -127 97 -55 -195 -111 200 -28
4551 -28 71 -156 -49 -92 164 -24 239 44 189 65 183 41 168 272 1 -324 154 254 -61 -28 -53 22
4573 22 77 286 -306 -46 64 -2 -65 140 90 208 -7 -90 -292 291 -194 13 21 166 423 27 -135 -81 20
4596 20 -2 -89 -58 168 84 58 109 -31 -247 100 -137 492 0 23 -30 -199 180 -41 -55 206 -223 -147 -131 -335
4620 -335 -1 -89 262 110 -38 74 -56 -5 -156 131 14 345 -86 108 121 6 -288 -350 11 -236 -13
4641 -13 124 -41 -285 9 -233 265 5 236 118 151 161 -31 41 -46 135 166 101 -36 46 -211 88 85 -124
4664 -124 -67 126 239 -81 33 -156 404 27 181 234 -288 -251 -151 -29 -13 -52 -81 -153 45 -72 -332 -13
4686 -13 -4 -346 -63 180 -49 -168 30 76 55 -85 195 131 46 29 0 235 164 29 -126 44 130 -41 116 126
4710 126 271 -73 103 -9 -201 50 177 138 114 104 15 -76 43 -148 18 136 -145 -164 -32 -5 -60 -18 151
4733 151 75 -70 -88 99 -14 119 101 55 -143 51 -2 128 127 151 24 -3 53 -23 24 -60 125 221 -163 -10 124
4758 124 -298 182 -94 -277 48 53 182 -34 -266 149 -162 -193 105 22 -59 44 68 19 33 -31 29 34 -31 -229
4782 -229 -11 -104 24 300 -223 -110 -211 -76 -4 -50 -22 -342 126 -84 254 17 -3 53 -104 126 -22 32
4804 32 -6 -7 -124 -15 90 35 304 -214 -4 -116 68 -35 -18 -18 -452 -161 -82 265 -90 20 -63 15 152 -83
4828 -83 67 193 163 67 165 80 -87 7 -106 -51 150 -236 -85 3 -167 -208 -168 111 -83 -106 -59 -86 46 -92
4852 -92 -136 -174 39 217 305 -4 19 -148 147 72 -412 162 260 22 76 347 147 42 230 73 0 151 -192
4875 -192 47 89 85 198 110 94 -103 8 109 169 187 -135 61 -122 1 -204 -100 15 -206 177 -191 -55
4897 -55 -34 127 47 -12 -178 -42 -31 -348 -206 80 -18 205 -296 143 -75 -1 41 -318 -79 -8 127 52 149 -154
4921 -154 34 83 171 -81 -34 -144 82 74 -276 -133 48 13 261 -152 120 -68 -7 101 -2 166 -70 50
4943 50 6 468 66 -101 45 34 -203 267 -74 27 55 -26 280 36 -251 -189 169 279 -30 -19 -200 -59
4965 -59 -53 136 -36 -133 47 -14 96 -184 71 65 97 155 178 315 195 -157 120 -196 77 120 2 -56 150 -263
4989 -263 -66 425 97 -89 247 -35 176 -82 -75 21 -30 -143 101 326 116 -42 168 -148 -142 -281 -184 -251 123
5012 123 131 57 287 -337 43 280 159 -3 112 -109 -80 44 -290 24 -10 -67 -33 -221 108 145 33 185 23
5035 23 -99 214 1 187 -256 151 26 11 -70 -133 173 -182 10 -21 25 150 6 -35 166 109 -69 -273 10
5058 10 -40 162 185 -155 153 323 199 -44 -147 -276 -101 -29 127 75 -77 -90 172 204 -16 -200 -73 -17 -168
5081 -168 -292 -291 -28 126 120 191 99 -117 229 -323 12 -18 -49 128 168 35 57 -239 -212 123 85 -70 -140 74
5105 74 377 -173 119 102 -343 65 -212 100 172 -440 49 96 -54 -1 181 -111 -221 -80 -173 116 -340 13
5127 13 150 -147 -152 -165 -4 38 2 249 -393 -85 -58 -9 -170 -138 -183 163 122 92 1 142 191 159 87 74 141 -101
5153 -101 76 -201 -133 -14 -65 -241 79 326 60 -229 274 -48 104 63 -166 189 -275 99 114 254 291 -95
5175 -95 -123 -45 138 -169 29 311 111 -72 -219 276 98 59 -162 3 33 -17 23 -10 -22 66 313 223 144 -80
5199 -80 29 -97 -95 -60 83 -3 -23 -83 -176 -360 -169 151 -342 -235 -28 222 -1 -245 -221 -91 375 -4 68
5222 68 121 -108 -17 142 88 -136 65 137 -29 -127 69 -157 43 -35 64 -77 -99 -360 119 -53 222 125 -214
5245 -214 304 -478 -196 -107 -22 59 -300 -62 -218 -161 226 -76 -105 -181 40 -55 157 -182 -219 -48 41 -157 0
5268 0 -22 -69 136 -334 296 157 -207 -53 -90 -242 -15 -21 54 -50 43 192 114 107 173 181 -83 -91 164 -278 59 -76
5294 -76 146 158 -117 -130 -75 -168 -66 100 207 120 -3 106 28 12 -90 96 280 -195 13 67 -157 145 229
5317 229 -173 -229 74 -32 -366 0 -239 -1 -21 114 -196 165 289 -52 -79 232 240 264 309 166 78 52 240
5340 240 234 22 127 -143 167 -43 -334 3 -3 133 18 113 93 138 -96 104 68 -40 113 -73 142 -138 23
5363 23 -162 185 23 217 -275 200 358 86 76 137 117 -24 -31 -90 -33 -41 -119 139 142 -142 246 -110 -234 -153 103
5388 103 -92 -40 71 -204 -243 -222 -237 109 -40 36 -26 115 129 -113 -240 22 -143 181 186 -176 -229 108 -144
5411 -144 267 76 -79 81 -159 85 242 -8 -227 -114 -276 -20 97 136 -127 4 149 -139 -109 102 90
5432 90 -103 136 24 158 -146 -45 220 156 283 -89 134 31 42 60 -81 30 -45 122 -102 -72 6 -74 -79
5455 -79 22 162 -85 -106 -14 -107 282 225 -123 -215 109 37 21 -159 -154 -128 45 -110 -166 -48 57 -10 163 4
5479 4 174 150 -117 91 103 223 -107 -307 -127 -32 -99 261 -336 -289 -18 81 -30 -194 -25 -98 -124 -73 152 54
5503 54 -55 92 193 153 237 -223 -174 -23 -55 -83 -187 -45 13 -177 151 75 -202 -204 -69 223 78 136 -35 161
5527 161 -142 64 -164 -69 16 -103 -134 -159 -17 175 33 -20 50 128 -76 348 141 140 -246 -363 -77 71 -187
5550 -187 -168 -24 -133 7 75 11 49 -216 -24 26 18 48 5 -26 -82 61 271 36 193 -56 -112 50 118 -114
5574 -114 29 86 32 -135 -95 42 -89 -98 -83 14 75 110 234 60 15 24 391 -104 38 142 -70 61 211 -144
5598 -144 152 -119 -59 81 -155 73 -179 178 27 -245 121 -96 71 44 -156 148 -96 98 352 -94 126
5619 126 10 107 61 73 57 38 179 -128 178 -55 17 28 238 166 -68 50 236 -145 -184 43 -102 210 -128
5642 -128 127 155 215 125 -53 173 116 -130 -214 -40 95 58 51 93 99 -149 -142 -53 29 -298 3 113 49 28 -89 20
5668 20 6 210 -56 -90 -90 46 -282 47 -200 -105 -121 29 127 -160 50 127 202 123 -157 -336 -108 266 62 -148
5692 -148 -323 8 119 -167 -210 129 -42 63 -35 -29 -4 -107 184 6 150 -221 219 77 -243 -87 127 333
5714 333 -123 -6 74 73 219 -83 168 -32 21 -156 205 -203 -42 -383 99 18 4 -2 77 44 -317 84 124 254
5738 254 -205 255 -110 -198 128 -155 -72 -54 -33 -94 -192 29 118 25 -73 227 91 141 -10 185 62 129 -124 142
5762 142 64 311 11 15 61 216 117 56 -79 4 -251 178 49 84 159 40 -4 -133 105 68 76 -331 -329 -40 -305
5787 -305 40 215 -195 -31 165 -187 -1 114 -159 -199 -33 29 -168 27 96 31 104 -60 217 -16 144 -50
5809 -50 80 -62 45 -196 -88 -136 -50 -275 260 -31 -22 -118 129 -28 155 59 69 145 97 236 -134 26 100 186
5833 186 152 33 -71 -178 236 281 153 -122 59 -61 -252 -49 123 22 -263 -191 487 -20 -170 213 101
5854 101 167 -413 -69 36 -395 -75 -169 124 -45 80 44 7 1 -39 -67 60 -225 21 -49 198 38 69 389
5877 389 -24 43 92 308 250 48 2 179 -122 -2 -60 -1 -24 -114 -98 216 0 39 -7 -162 81 279 -64 -146
5901 -146 144 -61 179 -198 179 -63 -93 99 87 46 -335 -220 -16 -206 174 -128 228 -109 -103 266 131 -229
5923 -229 -165 163 160 212 -24 73 -22 -13 -31 -102 -122 -162 -49 104 -186 -66 -55 74 -153 83 -377 6 -43 -137 172
5948 172 -31 205 -144 -7 -13 -24 -169 186 114 45 125 -85 -85 -63 214 148 -34 47 55 -1 357 130 58 -129 111
5973 111 -150 -236 -184 84 109 9 -315 218 -220 137 -25 -25 -43 7 105 110 135 -230 207 235 81 139 -59 151
5997 151 -26 -346 -65 20 62 -98 198 101 80 -177 -31 117 -69 50 -60 -60 -30 45 36 23 5 -138 157 -199
6021 -199 -192 -168 28 21 71 360 216 -138 -47 212 109 123 66 -77 203 -152 30 -7 146 -39 -114 -103 -196 56
6045 56 -242 -232 -47 148 220 -25 -49 -47 -194 9 314 -111 55 124 15 -182 76 -251 60 -138 -344 166
6067 166 65 -195 122 109 291 88 525 -80 91 -310 259 -64 -308 -186 73 40 112 119 -289 191 -150 -96
6089 -96 89 32 96 146 -64 23 -186 -284 -101 40 118 48 46 174 140 -199 41 167 80 -258 228 -137 -223 117
6113 117 19 -17 -184 263 -17 120 -75 -228 225 243 -188 -25 -20 -32 63 -12 59 155 223 -129 142 -83 53 -92
6137 -92 -24 -95 109 75 54 -89 -76 -71 -148 -129 107 -164 -130 37 -98 -47 32 -91 265 -113 178 91 36 -117 85
6162 85 101 -47 80 138 160 -69 -110 -112 -74 -81 -3 -207 244 -27 52 13 -202 -93 33 -78 219 -113 115 50 -82
6187 -82 245 263 -110 81 -133 84 -179 17 133 61 118 -53 -109 39 19 252 -110 -308 -162 -51 -148 -217 -210
6210 -210 278 -79 -59 344 -73 110 -248 -37 -104 84 215 -13 246 -250 -235 71 215 38 -123 56 155
6231 155 119 -107 250 271 -18 -295 81 -40 140 40 -24 -171 -146 -23 2 -73 5 35 -8 -80 -263 2 -32 -204
6255 -204 -251 -9 68 -21 21 59 -350 -76 -193 57 -79 233 -32 -192 -10 -87 -186 48 -100 25 -248 -520
6277 -520 -264 105 225 59 210 47 -14 -34 -11 86 -109 -213 -143 -21 -45 187 -16 -170 -42 12 14 -186 304
6300 304 49 123 -314 134 169 187 130 -92 6 87 -65 289 -123 96 -109 20 356 -27 113 16 236 86
6322 86 -99 131 -167 92 -117 -244 -389 -80 118 -76 206 65 -48 55 3 96 -190 -17 -163 205 -56
6343 -56 -44 1 73 25 -119 71 -549 93 -64 -295 128 -49 -44 -43 -286 66 158 94 53 -66 288 -59 -81 122
6367 122 26 35 30 -32 178 119 -212 -26 -198 -72 131 -221 59 -349 247 -69 261 -3 105 212 -238 -88
6389 -88 -375 146 96 -228 -126 -60 -119 154 -191 -213 -87 90 -33 111 158 4 -48 253 194 -157 -170 32 35 -186
6413 -186 -132 -122 -146 -180 -92 162 138 -95 -127 -50 -186 152 120 3 -119 -193 34 -92 -87 43 -141 -18 -102 -15 -52
6438 -52 -106 -53 -194 -343 -7 -164 -40 -19 -222 30 -35 172 -156 5 62 -1 -354 -168 104 11 73 17 -21 162
6462 162 103 209 -216 0 -224 244 -116 -336 -89 19 73 -118 91 88 97 -142 60 16 -20 64 122 -90 257
6485 257 -192 76 -85 145 120 -79 73 -82 228 99 -113 25 -71 117 237 380 36 -93 -45 -13 44 -143
6507 -143 -26 -190 -159 231 -266 -122 60 -24 76 332 -78 52 186 7 239 226 1 156 2 -77 -64 226
6529 226 184 51 -112 211 71 -104 -34 172 -42 -80 8 -150 79 -72 182 214 101 -160 46 -153 3 117
6551 117 99 138 -282 6 171 69 6 97 12 202 76 -35 -51 -20 -29 -66 -71 -98 -150 144 107 84 -116 93 -6 32
6577 32 -240 37 -119 117 -178 -59 97 -46 20 111 275 -17 -22 96 294 -87 -77 -79 -73 -47 -68 -27 -98 127 207
6602 207 -97 13 -123 71 276 -18 -59 25 63 -95 50 -213 98 -28 191 157 51 -394 -83 -22 265 -80
6624 -80 -32 61 -79 -8 -5 101 129 -19 110 125 -16 -2 68 33 -157 54 -146 129 -131 -1 7 -104 -122 88 217
6649 217 -12 135 -229 -255 -20 304 143 216 -212 83 -82 110 -153 78 98 -349 158 -161 7 176 -133
6670 -133 160 -11 16 35 -112 -249 -345 244 -5 -39 253 -32 116 126 373 58 49 -56 195 -33 48 390 -157
6693 -157 265 -86 -329 135 11 199 77 112 102 5 -86 115 -128 -181 5 -66 71 -55 126 57 26 -114 -33
6716 -33 -234 -70 -62 151 141 -5 78 109 94 140 114 23 -319 121 67 10 -8 41 -60 -73 -104 -13 -88 -61 56 254
6742 254 -194 -132 -91 -94 -247 155 3 20 78 -104 96 52 172 -80 -27 -196 232 40 -13 45 96 1 -44 -23 -59
6767 -59 -131 204 55 -69 -182 -216 -64 -3 177 -107 -227 -15 -78 65 94 -160 -117 -38 55 -181 -20 -185 -115
6790 -115 -27 252 162 -94 -213 -8 -125 0 158 -16 39 -75 -98 139 -2 54 193 -73 -24 20 166 156 35
6813 35 -180 -312 81 -37 87 -120 -18 114 -91 265 -38 87 -80 -164 -181 -27 -187 79 194 -53 370
6834 370 -5 151 -62 -172 -262 84 -375 -76 137 -235 -145 -154 31 -54 52 320 -53 -458 -200 47 207 8
6856 8 56 -11 172 -153 -355 90 -145 -20 -147 196 35 190 -214 -229 85 -267 -4 -92 -43 117 -192 -287 180
6879 180 45 -133 361 81 -184 -82 -226 243 149 57 -2 80 -265 -154 160 -115 132 -117 587 211 -175
6900 -175 -101 -76 99 157 110 -218 -273 143 -71 -163 -184 -59 -236 123 71 100 146 -192 -36 -81 47 6 -98 33
6924 33 -279 -153 333 38 134 252 -146 18 47 267 149 -163 -57 -1 -193 -47 -161 117 327 -168 172
6945 172 -51 -12 243 91 95 -113 -16 152 87 -88 21 -117 398 92 91 -3 88 3 -25 65 154 349 -119 102
6969 102 3 -120 -91 67 41 -26 209 -163 183 139 -126 14 130 7 37 -38 -76 -202 -178 -38 -46 180 123 -193
6993 -193 123 251 37 183 -3 10 -87 -195 -93 -94 59 -49 114 -143 -120 -12 -47 226 -159 -81 -157 169 -22
7016 -22 28 223 -44 -178 84 7 -42 -158 -277 -131 -228 132 177 21 -80 -145 69 -115 115 -215 156 -61
7038 -61 93 88 67 340 114 -53 136 173 -230 221 156 78 146 46 -190 -9 -185 397 14 170 102 25 -140
7061 -140 -78 60 -153 194 171 -107 66 41 202 -278 111 -52 128 334 -211 146 17 1 -64 38 -36 304
7083 304 237 -138 77 230 -262 182 27 114 189 0 184 233 69 142 -27 -175 120 -216 -184 174 -150 -330
7105 -330 -118 185 -216 -137 -135 63 12 -118 37 158 -294 269 -30 109 -56 133 156 -57 317 12 242 -65
7127 -65 13 85 -97 -4 57 -55 77 -222 99 -201 -50 207 20 25 -42 -141 -173 -45 19 -387 -119 254 -280 -162
7151 -162 -121 87 -119 99 185 -42 -304 97 -175 -38 -39 0 -285 90 -235 42 137 79 227 -105 -42 153 151
7174 151 -92 91 73 -213 12 -103 -103 -62 127 -128 -193 -52 -72 -20 152 101 -231 122 91 -156 28 137 87
7197 87 161 43 121 -82 298 -231 166 121 -25 -56 57 -161 -42 6 -61 -174 3 34 168 65 -224 70 212
7220 212 -183 12 144 -245 8 17 51 -237 319 -27 -59 -15 -229 129 158 -74 27 261 -52 -74 -7 -159 55
7243 55 178 241 -50 -103 -11 -94 -37 -108 -49 -181 137 7 243 170 167 252 319 -58 85 224 41 301 141 -12
7267 -12 -129 -13 260 -134 -51 -108 189 -110 -31 49 -144 46 -217 -294 -299 31 34 -11 117 -36 117 12 76 -22
7291 -22 -282 -271 -263 196 4 -22 5 -40 -107 132 97 -33 -70 -159 -25 -104 115 -141 47 -61 316 248 -155 -265
7315 -265 -159 167 -41 13 -47 -295 -461 -45 -334 94 -34 -176 89 -165 -12 -90 78 239 -67 -241 2
7336 2 102 -161 -308 -5 42 -22 -27 52 227 51 -172 197 -119 374 142 17 -2 161 152 352 -102 46 28 -168
7360 -168 250 271 -3 277 -18 -64 -75 93 16 2 296 146 -176 -242 9 -96 287 32 -211 0 130 -72
7382 -72 -119 160 85 -171 60 -29 224 57 69 -175 -115 -312 155 188 -22 -151 -99 172 -176 17 -22 165 -76
7405 -76 83 221 120 77 -144 -293 -96 -95 -221 159 84 181 -277 -57 -169 -192 338 -57 103 251 -47 240
7427 240 -68 253 21 34 -107 -47 114 272 -72 -47 218 -32 161 -62 47 -127 -204 -36 85 108 -129 20
7449 20 -231 139 56 -15 339 193 56 -6 291 -227 -30 56 -82 -4 120 -204 306 196 -264 95 118 -338
7471 -338 -41 -26 59 -161 -318 -22 -138 49 190 -189 -229 -251 122 168 191 -11 212 -163 8 29 -72 -155 -68
7494 -68 403 -76 -66 153 -41 -339 289 -258 14 68 47 213 187 -398 29 -152 93 -3 -197 -19 307 -165
7516 -165 -206 123 -201 136 159 167 -110 129 -17 -92 143 98 -109 48 48 70 9 -1 -183 -76 -292 297 14 144
7540 144 -137 -1 -222 -22 63 132 75 284 199 -296 -244 21 -48 -164 -65 -28 95 -205 -40 -54 -52 23 167 86
7564 86 -110 285 64 21 32 65 -202 -170 18 113 127 -169 37 368 -246 104 -82 -65 -1 -35 -130 -154 32 -189
7588 -189 58 63 88 180 -10 78 173 102 -11 -55 36 31 88 -25 -233 -170 -223 243 -157 217 -86 3 126 -91 34
7613 34 84 212 -50 156 195 -128 -334 -103 -86 89 -30 -124 10 -91 -370 81 -53 428 92 -38 46 -42
7635 -42 48 122 -108 -203 -46 -11 -103 93 21 -52 -55 -145 -112 179 26 -224 222 168 39 128 -87 -132 128 150 -95
7660 -95 -66 81 20 -184 -18 77 33 49 -29 78 54 -100 -58 101 -66 -28 215 -79 70 -4 486 201 -34 -17
7684 -17 -154 358 223 3 48 -139 -81 262 154 -93 180 -90 -242 47 78 171 -247 45 -150 -142 163 124 -71
7707 -71 86 -183 -183 -99 146 -112 -78 25 189 92 108 70 153 -124 319 6 298 141 -31 -279 148 88 207
7730 207 364 -63 -49 31 -95 -178 -114 236 -1 -54 160 -38 -66 373 -170 -92 128 0 -104 56 -92 -138 50
7753 50 68 -46 34 -22 107 6 -140 -325 -115 40 -221 -167 -189 106 -92 76 178 51 -103 -150 -73 -64 35 175
7777 175 63 -181 58 -277 241 -142 -177 -1 -121 -219 9 -88 188 -73 -133 105 158 -53 -53 28 105 -111 108
7800 108 -85 -201 -26 -21 158 -296 91 44 -29 -9 92 -240 194 -98 74 141 151 121 -208 -17 -23 262 -201
7823 -201 80 -111 -9 -1 -26 -131 271 -53 95 -87 -101 25 253 192 43 592 61 85 -67 55 -68 -35
7845 -35 44 58 33 -25 -56 -133 -339 319 60 27 -30 276 330 206 117 80 -140 162 -131 -322 275 -21 -11 -27 189
7870 189 93 -2 6 -113 -172 265 11 14 1 -42 -36 -134 196 -202 215 190 86 7 449 -125 237 54 289 102 -79
7895 -79 93 -201 14 -56 35 -157 28 4 -265 -107 158 -70 26 -109 173 3 -213 39 62 74 111 -68 -153
7918 -153 -120 -41 251 -231 -280 -241 -60 154 78 -156 119 198 -111 -79 -48 -152 -102 -89 -342 -64 165 -79 200
7941 200 -66 -327 214 58 -42 20 145 -13 196 41 35 -125 135 -20 87 -178 48 27 -117 32 -130
7962 -130 -173 13 143 -182 81 -230 -6 63 64 33 -80 156 -159 -227 -111 -57 -123 -5 -262 -144 -48 11 -74 -220
7986 -220 366 -1 -160 139 250 -210 140 0 165 82 321 -214 89 -42 309 39 -289 -111 -31 4 81
8007 81 -12 -132 -183 -214 3 -119 87 222 371 -157 40 -71 -164 -333 160 25 -242 -20 56 29 200 -2
8029 -2 177 149 -51 150 150 16 38 129 210 -47 -107 124 124 172 -178 -205 160 131 53 -163 -112 30 -8 7 185 215
8055 215 79 197 -71 54 -94 25 -87 59 179 60 -316 199 41 -180 -85 -115 74 -18 126 62 46 -245
8077 -245 149 5 -247 129 128 119 -2 224 150 247 -247 -12 -97 -162 366 82 -10 -105 205 74 234 -107 -228
8100 -228 132 -152 -52 -108 -39 16 29 138 9 6 -228 -33 83 62 125 90 -55 193 22 282 286 -111 557 -144
8124 -144 -54 202 -286 25 46 15 -8 -103 -342 -84 131 61 230 7 7 46 186 218 162 -64 69 -69 -69 -15 -258
8149 -258 -35 118 141 100 -254 248 172 39 -100 299 9 -3 151 -327 41 -100 -70 73 123 167 48 -173
8171 -173 79 123 -353 64 102 11 -114 39 72 -109 -51 144 367 261 -139 148 -134 -191 -128 143
8191A43
##END NTUPLES=NMR FID
##END=
