##TITLE=1H_TG-2256-1
 CDCl3, 8 sc, 
 17.10.2019
##JCAMPDX= 6.0         $$ Bruker NMR JCAMP-DX V2.0
##DATA TYPE= NMR FID
##DATA CLASS= NTUPLES
##ORIGIN= UXNMR, Bruker Analytische Messtechnik GmbH
##OWNER= root
$$ XWIN-NMR		Version 3.5
$$ Thu Oct 17 14:51:14 2019 Russian Standard Time (UT+4h)  she@DPX200
##.OBSERVE FREQUENCY= 200.1315
##.OBSERVE NUCLEUS= ^1H
##.DELAY= (6, 6)
##.ACQUISITION MODE= SIMULTANEOUS
##.ACQUISITION SCHEME= undefined
##.AVERAGES= 8
##.DIGITISER RES= 18
##SPECTROMETER/DATA SYSTEM= spect
##.PULSE SEQUENCE= zg30
##.SOLVENT NAME= CDCl3
##.SHIFT REFERENCE= (INTERNAL, CDCl3, 0, 15.7039)
##AUDIT TRAIL= $$ (NUMBER, WHEN, WHO, WHERE, WHAT)
$$ ##TITLE= Audit trail, XWIN-NMR		Version 3.5
$$ ##JCAMPDX= 5.01
$$ ##ORIGIN= Bruker BioSpin GmbH
$$ ##OWNER= she
$$ F:/spectra/data/she/nmr/H-F/1/audita.txt
$$ ##AUDIT TRAIL=  $$ (NUMBER, WHEN, WHO, WHERE, WHAT)
(   1,<2019-10-17 14:49:37.15 +0400>,<she>,<DPX200>,
      <created by zg, POWCHK disabled, PULCHK disabled
       configuration hash MD5:
       00 E9 B6 7A A2 85 ED C7 34 08 36 98 17 FE 4E 26
       data hash MD5: 16K
       D2 65 31 10 17 C4 6B 54 94 DF AA 88 5A 92 12 B7>)
$$ ##END=
$$ 
$$ hash MD5
$$ 21 F4 13 8B B6 86 C5 78 F7 82 00 88 14 1D E8 61
##$RELAX= 
##$RELAX= 
##$RELAX= 
##$RELAX= 
##$RELAX= 
##$RELAX= 
$$ Bruker specific parameters
$$ --------------------------
##$DU= <F:/spectra>
##$EXPNO= 1
##$NAME= <H-F>
##$PROCNO= 1
##$TYPE= <nmr>
##$USER= <she>
##$AMP= (0..31)
100 100 100 100 100 100 100 100 100 100 100 100 100 100 100 100 100 100 
100 100 100 100 100 100 100 100 100 100 100 100 100 100 
##$AQSEQ= 0
##$AQ_mod= 1
##$AUNM= <au_zg>
##$AUTOPOS= <>
##$BF1= 200.13
##$BF2= 200.13
##$BF3= 200.13
##$BF4= 200.13
##$BF5= 200.13
##$BF6= 200.13
##$BF7= 200.13
##$BF8= 200.13
##$BYTORDA= 1
##$CFDGTYP= 0
##$CFRGTYP= 5
##$CHEMSTR= <none>
##$CNST= (0..31)
1 1 145 1 1 1 1 1 1 1 1 1 1 1 1 1 1 1 1 1 1 1 1 1 1 1 1 1 1 1 1 1 
##$CPDPRG= <>
##$CPDPRG1= <>
##$CPDPRG2= <>
##$CPDPRG3= <>
##$CPDPRG4= <mlev>
##$CPDPRG5= <mlev>
##$CPDPRG6= <mlev>
##$CPDPRG7= <mlev>
##$CPDPRG8= <mlev>
##$CPDPRGB= <>
##$CPDPRGT= <>
##$D= (0..31)
0 1.2 0 0 0 0 0 0 0 0.06 0 0.03 0 0 0 0 0.0002 0 0 0 0 0 0 0 0 0 0 0 0 
0 0 0 
##$DATE= 1571309376
##$DBL= (0..7)
120 120 120 120 120 120 120 120 
##$DBP= (0..7)
150 150 150 150 150 150 150 150 
##$DBP07= 0
##$DBPNAM0= <>
##$DBPNAM1= <>
##$DBPNAM2= <>
##$DBPNAM3= <>
##$DBPNAM4= <>
##$DBPNAM5= <>
##$DBPNAM6= <>
##$DBPNAM7= <>
##$DBPOAL= (0..7)
0.5 0.5 0.5 0.5 0.5 0.5 0.5 0.5 
##$DBPOFFS= (0..7)
0 0 0 0 0 0 0 0 
##$DE= 6
##$DECBNUC= <off>
##$DECIM= 24
##$DECNUC= <off>
##$DECSTAT= 4
##$DIGMOD= 1
##$DIGTYP= 9
##$DL= (0..7)
0 120 120 120 120 120 120 120 
##$DP= (0..7)
150 150 150 150 150 150 150 150 
##$DP07= 0
##$DPNAME0= <>
##$DPNAME1= <>
##$DPNAME2= <>
##$DPNAME3= <>
##$DPNAME4= <>
##$DPNAME5= <>
##$DPNAME6= <>
##$DPNAME7= <>
##$DPOAL= (0..7)
0.5 0.5 0.5 0.5 0.5 0.5 0.5 0.5 
##$DPOFFS= (0..7)
0 0 0 0 0 0 0 0 
##$DQDMODE= 0
##$DR= 18
##$DS= 0
##$DSLIST= <SSSSSSSSSSSSSSS>
$$ [...]
##$SUBNAM2= <"">
##$SUBNAM3= <"">
##$SUBNAM4= <"">
##$SUBNAM5= <"">
##$SUBNAM6= <"">
##$SUBNAM7= <"">
##$SUBNAM8= <"">
##$SUBNAM9= <"">
##$SW= 24.0689530833862
##$SWIBOX= (0..15)
0 0 2 0 0 0 0 0 0 0 0 0 0 0 0 0 
##$SW_h= 4816.95568400771
##$TD= 16384
##$TD0= 1
##$TE= 0
##$TE2= 300
##$TE3= 300
##$TEG= 300
##$TL= (0..7)
0 120 120 120 120 120 120 120 
##$TP= (0..7)
150 150 150 150 150 150 150 150 
##$TP07= 0
##$TPNAME0= <>
##$TPNAME1= <>
##$TPNAME2= <>
##$TPNAME3= <>
##$TPNAME4= <>
##$TPNAME5= <>
##$TPNAME6= <>
##$TPNAME7= <>
##$TPOAL= (0..7)
0.5 0.5 0.5 0.5 0.5 0.5 0.5 0.5 
##$TPOFFS= (0..7)
0 0 0 0 0 0 0 0 
##$TUNHIN= 0
##$TUNHOUT= 0
##$TUNXOUT= 0
##$USERA1= <user>
##$USERA2= <user>
##$USERA3= <user>
##$USERA4= <user>
##$USERA5= <user>
##$V9= 5
##$VALIST= <valist>
##$VCLIST= <CCCCCCCCCCCCCCC>
##$VD= 0
##$VDLIST= <DDDDDDDDDDDDDDD>
##$VPLIST= <PPPPPPPPPPPPPPP>
##$VTLIST= <TTTTTTTTTTTTTTT>
##$WBST= 1024
##$WBSW= 4
##$XGAIN= (0..3)
0 0 0 0 
##$XL= 0
##$YL= 0
##$YMAX_a= 61407
##$YMIN_a= -101881
##$ZGOPTNS= <>
##$ZL1= 120
##$ZL2= 120
##$ZL3= 120
##$ZL4= 120
##$ABSF1= 10
##$ABSF2= 0
##$ABSG= 5
##$ABSL= 3
##$ALPHA= 0
##$AQORDER= 0
##$ASSFAC= 0
##$ASSFACI= 0
##$ASSFACX= 0
##$ASSWID= 0
##$AUNMP= <proc_1d>
##$AZFE= 0.1
##$AZFW= 0.1
##$BCFW= 1
##$BC_mod= 2
##$BYTORDP= 1
##$COROFFS= 0
##$CY= 11.3945322036743
##$DATMOD= 1
##$DC= 2
##$DFILT= <>
##$DTYPP= 0
##$F1P= 20.1720416913024
##$F2P= 0.152960286110954
##$FCOR= 0.5
##$FTSIZE= 0
##$FT_mod= 4
##$GAMMA= 1
##$GB= 0.15
##$INTBC= 1
##$INTSCL= 1
##$ISEN= 128
##$LB= 0.24
##$LEV0= 0
##$LPBIN= 0
##$MAXI= 10000
##$MC2= 0
##$MEAN= 0
##$ME_mod= 0
##$MI= 1.114404
##$NCOEF= 0
##$NC_proc= 0
##$NLEV= 6
##$NOISF1= 3.799351
##$NOISF2= 2.8
##$NSP= 1
##$NTH_PI= 0
##$NZP= 0
##$OFFSET= 15.70392
##$PC= 1
##$PHC0= -9537.505
##$PHC1= -12.9991
##$PH_mod= 1
##$PKNL= yes
##$PPARMOD= 0
##$PSCAL= 0
##$PSIGN= 0
##$REVERSE= no
##$SF= 200.130013532006
##$SI= 16384
##$SIGF1= 3
##$SIGF2= 2
##$SINO= 400
##$SIOLD= 16384
##$SREGLST= <1H.CDCl3>
##$SSB= 0
##$STSI= 0
##$STSR= 0
##$SW_p= 3612.71676300578
##$SYMM= 0
##$S_DEV= 0
##$TDeff= 0
##$TDoff= 0
##$TI= <>
##$TILT= no
##$TM1= 0
##$TM2= 0
##$TOPLEV= 0
##$USERP1= <user>
##$USERP2= <user>
##$USERP3= <user>
##$USERP4= <user>
##$USERP5= <user>
##$WDW= 1
##$XDIM= 8192
##$YMAX_p= 0
##$YMIN_p= 0
$$ End of Bruker specific parameters
$$ ---------------------------------
##NTUPLES= NMR FID
##VAR_NAME=  TIME,          FID/REAL,        FID/IMAG
##SYMBOL=    X,             R,               I
##VAR_TYPE=  INDEPENDENT,   DEPENDENT,       DEPENDENT
##VAR_FORM=  AFFN,          ASDF,            ASDF
##VAR_DIM=   8192,          8192,            8192
##UNITS=     SECONDS,       ARBITRARY UNITS, ARBITRARY UNITS
##FACTOR=    0.0002076,     1,               1
##FIRST=     0,             0,               0
##LAST=      1.7004516,     0,               0
##MIN=       0,             -101881,         0
##MAX=       1.7004516,     61407,           0
$$ Real data points
##PAGE= N=1
##DATA TABLE= (X++(R..R)), XYDATA
0 0 0 0 0 0 0 0 0 0 8 -8 8 -8 8 -16 16 -20 24 -30 32 -40 48 -56 64 -72 83 -96 109 -124 140 -160 180 -202
32 -202 227 -253 284 -316 351 -389 432 -479 531 -588 651 -719 797 -885 983 -1094 1222 -1371
50 -1371 1546 -1756 2010 -2333 2750 -3318 4140 -5442 7828 -13678 61407 29496 -73598 7258
64 7258 50695 25934 -15990 -11787 5213 34518 11709 -23868 -6753 32222 10581 -10678 -444
77 -444 5038 3586 16056 -338 -17683 7041 24486 -4242 -13082 5955 7736 2311 5009 -7414
91 -7414 -6655 15820 9973 -14749 -4669 11721 2618 -2016 58 -7702 1713 15874 -3756 -18372
105 -18372 5365 15881 -4047 -9601 -1228 2694 7680 613 -15857 -2534 18100 12 -17990
118 -17990 78 10186 -1526 -3934 -1766 -5738 3956 7946 -8447 -9813 7121 4798 -5798
131 -5798 -2958 -2775 -1920 7969 49 -14654 -466 13249 -3010 -11803 1030 3541 -679 663
145 663 -5847 -6851 7944 5945 -11678 -6538 7529 1925 -3912 -1895 -4636 763 8810 -4058
159 -4058 -12596 4320 10370 -5295 -7571 1314 1689 2708 895 -8110 -2554 10562 1058 -10658
173 -10658 593 6755 -1141 -1278 197 -4489 3120 7941 -4857 -7476 5887 6096 -3204 -2044 -406
188 -406 454 6065 1052 -9392 632 11361 -1012 -8085 2368 4339 533 1726 -2507 -3973
202 -3973 7403 6468 -8267 -4205 7978 3601 -2688 -1074 -1860 2251 7867 -2396 -9233 5172
216 5172 9375 -4131 -5510 2989 2756 1972 1126 -5396 -1816 9317 1751 -8620 241 6548 -287
231 -287 -1146 -236 -3647 2548 6735 -5016 -7578 6018 5641 -4638 -3140 825 375 3487 -265 -7692
247 -7692 299 8881 -2051 -8320 1566 3392 -981 150 -2864 -4177 4707 4322 -7687 -5099 5927
262 5927 1699 -4698 -2238 -1803 296 4447 -3591 -8957 3087 6817 -5220 -6405 1728 833 -663
277 -663 -256 -5423 -3037 6166 884 -8949 -1807 4529 -867 -2821 -1649 -3725 1670 4576 -5598
292 -5598 -7514 4806 4859 -5813 -3773 748 -47 1871 -825 -6900 -250 7389 -2065 -7484 1208
307 1208 3666 -1189 -595 -1842 -3454 4061 4182 -6639 -4205 6311 2355 -4113 -1298 54 908
322 908 4045 -1947 -6076 3236 7161 -2904 -4499 2985 2044 421 1573 -3078 -2026 6459 2734
337 2734 -6489 -1189 6098 1280 -1457 -160 -1037 2966 5591 -3386 -5220 5293 5750 -3591 -2315
352 -2315 2898 1331 2405 1130 -4540 366 7382 50 -5883 1648 5060 518 -11 -555 -1687 4328
368 4328 4844 -5199 -3333 6688 3303 -3310 -779 1118 1064 3625 -559 -5170 2810 6739 -2248
383 -2248 -4335 2489 2304 101 1081 -1939 -2084 5482 2892 -6025 -1703 5853 1040 -2316 -687 -633
399 -633 1439 4123 -2958 -5423 3946 4939 -3707 -3017 1958 1087 978 322 -4261 -1111 5830 179 -6276
416 -6276 94 3848 -533 -1522 -928 -2104 2818 3508 -5105 -4463 4781 2734 -4161 -1737 716 387
432 387 1849 -769 -4930 730 5327 -1992 -5056 1627 1975 -293 -227 -2379 -2293 4155 2362 -5926 -2358
449 -2358 5116 857 -2928 -461 -182 915 2909 -2263 -4534 3031 4261 -3173 -2795 2340 965 325
465 325 597 -3031 -1007 5538 776 -5396 140 4332 -10 -1187 -129 -944 2512 3898 -3373 -3224
481 -3224 4892 3215 -3327 -888 2246 843 2172 403 -3421 1453 5802 -766 -3995 2041 2969
496 2969 64 77 -1009 -1001 4192 2830 -4253 -1255 5466 1550 -2615 -16 644 1382 2901 -1193 -3574
513 -3574 3280 4646 -2591 -2339 2515 1606 539 974 -2292 -814 5011 952 -4976 31 4350 -121
529 -121 -1824 -298 -530 2024 3083 -3090 -3493 3810 2397 -3258 -1588 1456 377 818 -251 -3662
545 -3662 278 4453 -1303 -4711 1057 2450 -752 -850 -1144 -1800 2572 1783 -4864 -1887 4174 415
561 415 -3621 -1117 271 91 1636 -1718 -4013 1655 3308 -2975 -3179 1302 676 -699 -723 -2713 -1417
578 -1417 3468 344 -5125 -825 3469 -948 -2729 -713 -741 1056 1403 -3349 -3184 3446 1974 -3774
594 -3774 -1980 1451 21 373 -688 -3620 -91 3716 -1210 -4566 987 2368 -760 -1277 -1175 -1113
610 -1113 2529 1491 -3964 -2030 3991 863 -2923 -637 983 247 1417 -1166 -3237 1582 3761
625 3761 -1964 -3270 1758 1652 -120 -233 -1702 -725 3440 1016 -4145 -267 3877 -9 -1886 92
641 92 531 1335 1879 -2007 -2403 3308 2725 -2400 -1436 1903 1097 495 252 -2282 279 3790 -264 -3563
659 -3563 1044 3165 -333 -1139 -189 -241 2131 1620 -2737 -1611 3488 1191 -2713 -522 1191 266 1135
676 1135 -528 -2800 1205 3575 -1686 -2985 1133 1866 -480 -404 -1191 -665 2504 715 -3825 -714
692 -714 3322 -7 -2046 -58 238 325 1418 -1683 -2784 2051 2362 -2676 -2086 1390 448 -225 -251 -2171
710 -2171 -269 2755 -469 -3929 209 2662 -865 -1627 -357 -514 1324 1330 -2881 -2281 3099 999 -2986
727 -2986 -1013 976 -285 460 -594 -2743 591 2997 -1738 -3147 1214 1643 -799 -431 -851 -599
743 -599 2174 738 -3475 -674 3187 -41 -1927 -123 375 616 879 -814 -2210 2192 2721 -2112
759 -2112 -1651 1798 1152 -143 -243 -1214 -2 2949 -101 -3074 758 2558 -442 -1034 605 258 1546
776 1546 1463 -1824 -1122 3171 1730 -1974 -525 1643 609 721 -91 -1548 1113 3357 -660 -2370
792 -2370 1520 2303 -95 -274 175 -141 2303 1385 -2541 -175 3322 548 -1560 338 1253 574 1156
809 1156 -539 -1539 1957 2684 -1711 -1696 2114 1386 -256 -67 -810 310 2631 -83 -2723 473 2796
826 2796 -316 -1246 564 204 840 1389 -1859 -1329 2619 1646 -2280 -621 1630 380 134 -304 -1761
843 -1761 627 2647 -842 -2436 1089 1927 -658 -751 -370 -272 1364 846 -2310 -923 2371 212 -2269
860 -2269 -342 745 213 571 -883 -1842 1294 2020 -1952 -2219 1422 1080 -846 -320 -541 -296 1639
877 1639 -226 -2789 -57 2164 -338 -1700 1 -7 329 962 -1556 -1739 1685 1143 -2284 -1258 1379
894 1379 558 -442 -244 -1081 109 2258 -623 -2391 1095 1892 -1214 -559 -31 146 853 1067 -2017
911 -2017 -640 2362 607 -2152 -14 833 -178 534 -651 -1488 1165 2096 -1659 -1509 1418 932 -734
928 -734 49 -66 -133 1679 312 -2261 108 2643 -191 -1206 474 341 365 955 -851 -1296 1971 1467
946 1467 -1803 -632 1597 511 -135 229 -981 392 2173 -841 -2090 1227 2165 -673 -707 323
962 323 69 1020 879 -1807 -796 1976 483 -2011 -410 1110 319 100 -389 -1334 708 1618 -1373
979 -1373 -1869 1137 872 -956 -778 -385 -221 1124 106 -2349 -215 2022 -503 -1576 345 247 201
996 201 247 -1116 -1604 1560 1224 -2127 -1267 1322 303 -786 -334 -968 124 1382 -896 -2534 633
1013 633 1415 -1112 -1032 -239 -31 312 447 -1793 -1088 1806 259 -2046 -434 956 -209 -101 -567 -1567
1031 -1567 386 1496 -1214 -1706 1256 1092 -837 -484 -95 -271 803 132 -2136 -82 2015 -350
1047 -350 -1697 351 595 140 353 -749 -1472 1380 1533 -1579 -943 1402 529 -903 -215 -404 -79 1563
1065 1563 125 -1546 678 2000 -754 -1044 346 443 607 518 -1357 -786 1837 742 -1273 -88 1392
1082 1392 146 -2 92 -908 862 1639 -1155 -1494 1379 1165 -637 -241 169 117 1019 330 -1579 40
1100 40 2047 191 -1336 344 1004 26 655 -382 -1067 1371 1203 -1324 -1077 1321 499 -681 53
1117 53 -256 119 1245 -138 -1308 755 1520 -509 -1059 301 174 396 374 -1096 -683 1575 430 -1472
1135 -1472 -482 1283 181 -355 230 -715 618 1591 -814 -1636 865 1368 -808 -667 136 -19 509 79
1153 79 -1469 -321 2011 -248 -1474 125 507 -276 -94 -235 -1063 805 1439 -1362 -1127 1134 408
1170 408 -562 -194 -269 -350 849 -376 -1673 332 1602 -529 -1228 126 353 69 410 -629 -708 1144
1188 1144 828 -1742 -500 1410 -53 -592 -192 -325 260 1288 -774 -1369 974 1222 -993 -519 508
1205 508 250 486 389 -1168 -248 1498 204 -1501 176 1130 81 -1 59 -637 764 973 -1046 -730
1223 -730 1233 618 -701 3 113 260 809 335 -1119 263 1550 -491 -833 267 733 464 348 -516
1241 -516 -626 1436 798 -1357 -161 1268 294 -254 -43 -321 291 1080 -205 -1347 673 1339 -926
1258 -926 -740 424 169 565 197 -901 -401 1603 341 -1562 170 989 -193 -118 -207 -445 625 724
1276 724 -1162 -1047 1155 680 -690 -328 -200 191 428 128 -1226 245 1312 -675 -1234 488 416 -407
1294 -407 -65 -361 -618 1095 775 -1321 -548 1049 285 -808 12 -292 325 847 -440 -1157 478 895
1312 895 -746 -961 183 -278 -142 31 -845 -550 1150 123 -1435 -453 584 -346 -242 -349 -456 280
1330 280 754 -945 -936 658 727 -839 -741 625 87 348 192 -867 -214 1343 -180 -1121 108 548 -49
1349 -49 -242 -303 -506 692 824 -1266 -520 1098 461 -729 -120 90 280 665 -404 -1061 505 1260 -529
1368 -529 -856 274 488 94 297 -545 -442 1050 511 -1246 -301 1202 1 -218 -232 -464 449 849 -584
1387 -584 -1049 1013 821 -707 -599 256 143 443 272 -793 192 1261 -212 -1099 75 625 -147 -128
1405 -128 191 -368 551 618 -909 -686 894 374 -771 -163 35 -168 391 -84 -1211 295 973 -662
1423 -662 -558 775 36 -33 400 -561 -272 920 182 -1241 -23 983 6 -334 50 -290 434 763 -250
1442 -250 -1144 472 537 -913 -336 263 297 352 376 -702 -196 1154 -106 -1165 58 242 36 9 -24 -434
1462 -434 357 467 -743 -779 713 314 -623 -160 218 80 327 -173 -855 350 647 -669 -873 463 578
1481 578 -62 287 -511 -425 824 296 -744 -312 926 71 -430 96 -190 149 530 -235 -661 699 763
1500 763 -838 -377 495 52 115 112 -786 -17 1060 32 -1017 176 884 -220 -73 -291 -380 521 723
1519 723 -459 -575 1012 314 -473 -124 440 158 428 252 -792 459 1119 -571 -784 360 374 74
1537 74 -35 -258 -151 545 425 -809 -170 936 254 -419 138 -48 256 499 -354 -539 718 879 -523
1556 -523 -418 588 -17 292 319 -334 60 849 212 -1197 187 719 -193 188 54 -340 129 528 -357
1575 -357 -748 786 714 -573 -191 227 129 248 44 -243 171 592 -256 -768 336 423 -678 49 -221 -598
1595 -598 613 526 -1007 -451 994 -78 -481 -22 77 -127 267 -110 -1026 -72 847 -429 -562 381 100
1614 100 -130 -164 -673 179 565 32 -913 -11 779 43 -472 -8 -128 -150 227 -638 -637 621 349 -508 -283
1635 -283 438 90 388 66 -690 44 697 -281 -984 563 618 -200 9 -6 64 616 687 -697 -228 743 83
1656 83 -645 8 219 189 452 -126 -1044 262 754 -431 -327 481 432 -124 -147 -314 -333 622 -43 -574 110
1677 110 658 -72 -311 95 -453 217 437 -415 -585 690 556 -332 -69 249 1 59 19 -735 69 781
1697 781 -236 -502 409 499 -300 -291 94 -242 261 377 -562 -211 458 178 -641 -239 307 43 428 76 -674
1718 -674 221 697 -661 -537 127 252 9 -152 -123 -242 745 255 -669 185 733 128 -263 -26 -134 190
1738 190 226 -336 -423 501 456 -641 -56 305 -127 -68 -41 -458 -172 472 -58 -529 -104 534 -191 -277 -241 -286
1760 -286 371 137 -702 -442 414 159 -474 -339 214 -5 209 -169 -806 147 309 -576 -495 152 236 -250 39
1781 39 261 -340 261 66 -672 60 536 -44 -677 102 -99 -134 639 -120 -856 698 202 -385 -272 263
1801 263 232 -161 61 -237 56 549 -274 -679 361 408 -92 -211 -76 128 255 154 -489 -351 597 300
1821 300 -497 139 254 228 82 -107 -301 313 622 -343 -164 458 155 -362 197 -178 -244 513 166 -321 31
1842 31 677 253 -365 -31 156 215 72 -267 -463 272 894 -372 -329 349 24 157 65 -282 10 505 -103
1863 -103 -568 44 553 -179 -291 -98 -96 222 352 -211 -85 215 307 -377 -62 634 166 -52 -146 -342 -136
1884 -136 543 -73 -486 439 440 -327 -159 73 -293 173 19 -355 -270 183 23 -504 86 176 205 246 -365 -429
1906 -429 378 222 -516 -280 79 562 -205 -100 -103 -194 229 93 -610 -193 716 -345 -373 -138 -32 142 460
1927 460 -436 -761 339 186 -410 -152 285 68 140 -55 -301 138 398 118 -398 -45 618 -154 -366 -14
1947 -14 -157 -36 220 -457 -188 532 37 -394 4 24 33 277 -46 -160 416 438 -124 -358 427 264 -207 -173
1969 -173 -92 47 298 161 -324 -61 789 -132 -673 74 -53 -258 186 -169 -84 255 384 -391 -168 694 18
1990 18 84 252 -46 75 377 -213 -403 140 490 -183 -114 20 125 107 -18 -385 -507 539 86 -293 -131
2011 -131 321 249 149 1 -95 296 212 -239 -519 401 56 -180 -214 -314 126 505 -76 -389 111 625 -21
2032 -21 -313 172 130 -192 259 -190 -471 422 270 -635 -496 380 87 133 -285 -437 -148 20 -304 -433 166
2053 166 240 -24 -199 77 -15 117 404 -330 -323 366 -251 -647 176 370 63 249 -91 -226 200 179 -213 -178
2075 -178 153 324 -103 -162 120 -133 305 87 -214 -94 335 -301 -500 57 -247 3 112 -1 -53 465 181
2096 181 -446 -445 298 183 94 151 -175 -224 309 59 -546 -14 333 -332 -149 212 -58 -135 96 -73 -256 532
2118 532 206 -621 -152 296 70 202 -60 -348 68 143 -171 -339 -43 198 -32 -37 201 -101 170 321 -418
2139 -418 -66 141 48 -297 37 193 -86 86 -129 -57 17 334 -399 -571 371 152 -136 66 199 123 360
2160 360 84 -116 100 312 -62 -216 80 -174 11 37 -305 -238 540 374 -424 -93 92 13 223 26 -99
2181 -99 77 409 -48 -503 298 193 -233 -285 40 154 241 -303 -294 -33 67 -166 -289 212 -8 155 -213 14
2203 14 -57 483 -26 -213 -194 416 30 -243 61 -95 -12 184 -125 -418 72 379 60 -154 -124 308 120 42
2225 42 -107 26 232 -242 -512 51 118 -199 -292 51 -169 118 238 -218 -369 235 315 -268 -234 91 -227 89
2247 89 247 -90 60 471 -70 -183 14 333 -16 57 10 -24 516 324 80 -379 309 41 -135 -32 0 190
2269 190 294 280 -152 3 292 -207 -7 241 268 14 180 -284 -360 337 357 -107 -174 184 116 43 -55 -252 268
2292 268 150 -188 -152 109 -61 -225 -202 104 118 241 314 -262 21 133 26 -265 73 118 78 19 -101 -79 -229
2315 -229 426 -168 -183 120 169 120 44 70 275 210 93 -284 28 407 -93 -94 -202 89 -162 -235 89 -129 174
2338 174 223 -305 17 -18 80 -199 -13 -252 160 251 59 -73 160 279 115 -233 -52 -38 62 132 -156 -143
2360 -143 236 -190 -179 -141 133 -121 -193 49 86 6 142 6 -249 14 125 -74 -49 -79 -156 72 -63 -191 -62
2383 -62 482 -73 -112 117 46 6 -32 -28 107 60 219 -601 -106 81 -345 -114 -162 34 -30 389 122 -418 250
2406 250 297 -320 -436 127 184 200 81 14 -22 560 331 -270 99 207 113 -182 -93 53 -110 -88 -26 -304 263
2429 263 -10 -201 88 -218 123 -88 -86 -120 -123 246 -192 -165 239 128 -78 -135 3 -95 -91 326 -223 -49 127
2452 127 -139 116 0 100 -94 -93 126 -283 249 394 0 -133 41 -178 -18 -107 -43 -207 108 274 -391
2473 -391 130 300 254 -328 151 -70 -37 -7 -239 -393 139 352 -144 -10 15 -92 -9 55 205 15 -22 -38 -577
2496 -577 -117 183 -54 -163 56 93 -35 35 -161 -130 354 -89 -293 -531 56 172 39 304 -237 234 50
2517 50 -185 -410 306 377 -356 167 139 -181 -123 297 43 -100 38 -62 -124 -273 -111 94 197 -222 -544 50
2539 50 289 -60 226 -5 159 -158 152 -62 -232 260 -354 -185 -93 199 -167 -25 177 -234 11 56 -303
2560 -303 -382 171 96 -299 -73 184 2 4 42 -365 -13 211 108 -365 47 164 -88 -116 -87 -220 168 181 -217
2583 -217 -171 108 -55 89 -213 -72 -154 68 -37 -504 175 463 -134 -67 52 96 15 42 -73 -41 209 -109
2605 -109 -243 29 150 -58 -207 190 -20 41 116 -280 -299 112 361 -169 192 343 204 -140 257 -186 -25
2626 -25 393 -346 -127 -75 209 102 121 32 -40 133 257 -504 -154 42 104 -334 180 -248 -69 -172 -84 -244
2648 -244 273 213 -229 -60 -83 72 -193 192 -95 57 299 215 -139 -98 60 248 88 205 -150 -18 304
2669 304 -69 -10 308 -16 -214 111 39 126 314 28 -188 -182 275 42 -430 156 25 -157 -287 -100 31 177
2691 177 74 -53 -260 360 65 -257 -18 128 -107 277 23 -57 -13 215 84 -227 158 215 9 41 148
2712 148 33 181 199 -336 389 355 1 -231 -128 -121 -21 116 -11 -155 44 647 -176 -188 8 173 -150 197
2734 197 34 -105 472 270 -46 -46 228 -112 -164 138 -369 120 343 25 -243 -8 139 80 -4 259 -100 223
2756 223 -22 -81 -7 -162 -216 -545 81 244 110 -9 -329 -46 204 -62 -234 -240 67 140 -283 -86 -3 -145
2778 -145 264 47 81 -183 385 2 -214 -197 13 108 25 120 -286 231 -152 -243 -150 -350 -94 108 -63 -181
2800 -181 145 345 -397 -133 307 141 -324 -42 -14 -8 -131 90 -15 22 11 -168 241 14 46 34 35 -95 90
2823 90 46 30 -152 -56 10 135 -204 215 -252 -27 -213 128 61 -7 164 -164 -217 45 50 -202 -90 -218 -94
2846 -94 -17 -138 -123 90 301 -85 -137 61 -25 -26 114 -183 -9 2 253 -233 -173 103 259 146 -39 -405 129
2869 129 257 -57 -122 51 37 -113 -22 -83 -139 94 -36 -30 -108 157 54 -55 -52 404 174 78 50 -97 -165 142
2893 142 223 -142 18 113 103 193 -86 40 195 -18 -234 46 111 -14 -161 -118 -320 179 80 140 -96 148 1
2916 1 -220 176 70 -293 -73 55 27 -278 162 -103 -116 41 -250 132 55 -19 -7 2 -2 -201 60 196 6 -201
2940 -201 60 -70 121 71 18 -112 -36 71 -365 -189 9 -7 253 -190 -11 -235 379 -71 -66 71 -190 -245
2962 -245 -47 89 -200 21 128 157 -217 141 -11 -257 -31 175 75 -10 9 -34 -69 -27 -75 -281 -295 140 -111
2985 -111 -169 -230 97 479 311 -143 284 280 -39 -25 -59 128 120 164 -60 -310 38 30 -68 -106 75 274 26 -69 -254
3010 -254 -98 137 280 -242 -92 280 53 -258 -84 159 252 140 -61 -65 137 247 -187 125 -218 0 14
3031 14 -125 -88 111 76 81 -174 37 301 -21 -73 102 -93 -9 51 193 -156 -24 209 58 218 -75 132 79
3054 79 118 -46 -139 322 -161 -292 -7 251 103 -59 -7 29 12 142 -184 -62 232 -30 -112 -38 -86 157 -34
3077 -34 -84 -135 41 91 -230 47 -186 -10 -99 394 -193 122 155 -50 -179 133 94 -15 -41 -293 -62 -152 128
3100 128 -155 -237 460 260 -221 201 95 224 241 73 -158 195 96 87 -565 18 103 -197 -109 88 -14 -95 26
3123 26 29 1 106 -273 -261 81 144 -388 169 -101 -250 100 245 -245 255 -13 93 288 13 -30 -161 -28
3145 -28 30 -276 74 72 25 87 165 287 -76 109 110 -68 25 -40 -22 -161 -73 -131 -26 229 60 33 56 -67 -31 -170
3171 -170 298 64 -79 -141 -11 137 -91 -416 96 463 179 -55 -9 -61 -140 310 -119 -211 431 181 4 -298
3193 -298 29 117 -52 -58 -91 -101 -51 -59 -351 19 407 -382 -212 -48 -214 21 296 -55 -195 3 -114 -136 -471
3216 -471 -62 61 -53 57 -22 -312 340 -44 -7 160 14 22 -130 214 -99 59 97 -60 -262 174 163 -216
3238 -216 -12 -108 -349 245 -90 57 81 97 -93 -18 -37 175 -206 -44 -151 -141 -98 91 -148 -68 134 88 -336
3261 -336 103 -71 -6 20 -274 -360 -165 182 -284 75 78 140 -83 -63 5 196 73 -2 -176 133 95 81 -27 38
3285 38 291 50 -106 -2 62 109 123 -236 -34 90 -56 -77 175 367 126 -130 -115 -45 102 -81 89 61 -2
3308 -2 -28 374 251 10 -204 79 -6 -110 298 74 -40 37 -207 -225 16 -10 -241 65 10 67 -209 286 18
3331 18 26 323 -105 176 4 -15 -184 -51 161 39 101 147 -243 105 50 -160 7 -285 168 -225 67 -212
3353 -212 -27 -168 356 -284 -288 -106 165 -7 96 201 -140 57 -65 -81 -60 187 163 -218 168 41 -65 86
3375 86 71 -103 -155 69 -189 -179 137 64 -153 90 -168 -34 209 255 277 -8 58 -3 -152 -269 -77 66 55
3398 55 -333 -130 82 280 -103 220 154 108 75 37 257 298 155 -22 -73 5 128 103 74 17 21 50 86 -114 -70
3423 -70 5 -77 88 48 38 -225 -11 51 68 130 -90 462 41 20 28 20 -27 132 32 172 -67 -7 130 67 -328
3448 -328 -123 -197 61 229 -17 -147 -167 -144 338 24 -349 456 116 -120 115 -154 -34 273 57 -212 67
3469 67 47 118 -114 -47 224 -78 17 -111 -128 110 140 -94 246 132 -64 166 35 -457 169 111 95 -246 -26
3492 -26 208 -168 -5 11 -151 77 183 -98 -67 5 148 -45 -106 117 -87 -190 -199 -91 6 136 -80 147 -6
3515 -6 -92 206 -8 -67 -172 151 102 -102 204 74 -193 -66 -281 179 -148 -5 -286 -92 48 8 -239 -248 245
3538 245 159 -64 276 3 191 446 -307 -205 300 -26 -180 34 -64 57 206 227 -424 -289 44 -78 -135
3559 -135 193 114 -13 -23 93 -26 179 -183 -214 25 204 178 -214 45 223 -253 340 -143 5 -21 275 31
3581 31 -295 58 76 64 -199 -129 -312 222 260 21 -56 123 132 21 -45 -237 94 -130 -328 -264 -19 -10 -321 169
3605 169 148 86 -224 373 -31 -191 208 -44 -39 -29 179 -248 -3 -135 119 -102 143 -122 -233 51 227 178
3627 178 76 -12 40 6 -54 -418 75 192 2 -153 112 -146 -97 -93 -391 -341 -64 157 -169 -193 -146 106 -7
3650 -7 145 -199 -100 -30 -74 73 46 -209 11 5 -52 -311 167 296 145 49 86 345 117 -89 268 -55 75 -3
3674 -3 -275 208 23 -233 -269 262 -32 -143 316 135 278 116 163 -151 -179 62 -140 -134 -142 -114 114 -2 -298
3697 -298 -494 177 -58 36 -137 106 -73 -381 -73 18 -8 2 -278 -20 496 -15 125 25 195 -88 -188
3718 -188 -92 -245 -13 179 77 -138 -84 -20 46 8 233 -174 -328 180 -98 -159 221 -77 -149 -129 55 91 -14
3741 -14 117 -27 4 48 138 -212 -109 -45 134 46 -110 251 16 -109 -198 -50 -54 76 -72 79 -169 153 157 -359
3765 -359 164 138 -13 101 -206 83 90 60 -39 -246 -94 109 8 -64 26 -154 212 62 16 174 -87 160 4
3788 4 -48 174 -144 -57 -309 -54 94 -54 -211 -66 221 -202 -46 -68 -5 -4 -192 -156 -71 28 316 -29 -132 -140
3812 -140 136 103 -89 177 12 9 29 82 -173 -68 -44 -43 -82 69 1 -16 -7 -277 -56 102 132 -202 -145 113 -23
3837 -23 -13 83 124 33 117 -184 19 6 307 4 -222 28 137 51 162 -270 129 286 -220 -67 -69 4 -147 294
3861 294 133 -48 232 90 51 -314 145 281 -215 -67 -123 96 195 -280 59 -18 157 140 -276 -40 -104 4
3883 4 -34 -205 57 402 -164 -141 -174 88 74 81 270 163 123 -160 -378 95 66 100 -167 -208 363 53 -166 -38
3907 -38 72 99 -101 280 -320 45 113 25 -254 54 -109 -165 -56 3 -108 -128 135 -209 273 -234 110 82 230
3930 230 42 263 187 39 -140 30 -67 82 225 -241 -184 229 105 -38 -197 63 -82 193 -16 136 -124
3951 -124 -170 3 -240 -102 73 9 139 105 -10 157 18 43 -17 91 131 -68 46 223 -8 6 178 -339
3973 -339 89 230 6 -63 111 -5 -283 -171 -11 208 20 -196 -235 -54 88 398 -123 -42 177 -214 -340
3994 -340 -7 73 -248 182 58 6 8 -53 -37 243 135 -112 -204 -46 34 -241 323 -20 -51 180 -60 190 -138
4017 -138 -175 62 -11 167 231 249 129 -13 119 -189 -471 -1 141 -136 20 107 101 -40 -10 66 -67 153 230
4040 230 -194 45 -141 -145 -509 -59 55 -218 -45 8 -72 118 -38 208 -29 31 -197 -263 -41 -27 305 177
4062 177 146 -282 35 394 72 -145 260 -240 -318 -234 45 -159 14 146 127 -59 -108 -271 -200 144 -242 -63
4084 -63 17 -46 115 -131 117 -124 234 -135 -79 -39 -114 -58 56 -2 16 300 29 229 184 141 12 86 80 175 -97
4109 -97 68 168 -114 -153 135 168 160 326 461 -52 -37 -48 -135 120 -105 125 187 216 11 32 356 157 8 92
4133 92 -142 -202 262 49 -63 100 168 -41 110 202 82 92 -167 263 225 40 -278 37 37 231 139 -252 145
4156 145 140 -55 -299 183 115 78 50 73 242 -2 -60 256 -177 -12 -155 136 22 238 19 128 -282 45
4178 45 112 -150 -150 -216 -96 68 407 -329 -338 -293 -148 46 17 304 -46 -152 -74 -103 -104 228 133 -73 -185 127 -44
4203 -44 7 -33 272 90 -88 -51 184 13 -63 166 231 -240 34 -97 233 18 -24 3 -260 -164 125 70 -98
4226 -98 65 -82 -315 -246 -34 -82 -327 187 207 179 -146 -93 94 46 113 -88 331 -128 123 -186 -73 90 98
4249 98 74 -69 -68 -26 192 98 -29 -42 -14 14 84 -397 -239 -206 85 -236 114 6 184 69 83 165 20 13 207
4274 207 -95 52 241 -147 6 -170 -46 53 26 41 -133 -53 -254 0 226 -45 -26 -131 65 154 -81 36
4296 36 -121 112 77 10 44 -60 100 -53 164 -46 -2 52 -373 -165 -147 62 181 -1 73 203 -172 -77 228
4319 228 -108 28 19 -260 -107 257 -258 116 144 82 -269 72 -139 -42 131 47 -45 -31 -284 -79 -232 -99 92
4342 92 -71 104 137 -248 -43 -16 183 52 -130 -93 -152 -115 -76 64 137 482 -266 -241 -248 -275 91 77 89 -231 213
4367 213 418 220 103 -184 -67 25 -28 -32 110 -212 249 -126 -22 -222 -20 262 -27 58 -237 95 27 -5
4389 -5 -69 24 -247 198 -72 -149 107 -48 69 15 53 -51 11 133 -78 313 294 -278 -47 30 410 -13 -157
4412 -157 -234 170 -34 -28 -233 10 -76 56 -6 256 0 106 170 85 37 159 -192 -129 -136 88 6 -21 37 75 224
4437 224 23 20 125 77 95 -167 -114 -123 -223 -174 -33 71 203 -64 42 -152 -243 124 -185 -165 108 76 -17 -62
4461 -62 -58 -64 99 58 -85 -73 132 -115 45 214 -119 -118 315 -92 44 17 -241 37 -140 -38 146 244 123 167
4485 167 -145 79 -42 158 132 229 112 108 211 14 -178 470 135 59 -50 5 26 143 -214 -187 -59 53 -153
4508 -153 -5 192 -233 -83 9 -77 264 16 -161 -242 -97 -130 -148 323 -146 209 31 -93 -86 113 121 63 -70
4531 -70 62 -54 -42 -149 54 8 -159 -149 -105 -147 182 212 -47 -213 39 -164 211 38 -63 7 12 -138 33
4554 33 -36 142 137 56 40 70 309 -6 -164 193 -119 -64 -440 -201 479 -12 108 -61 -155 -138 -113 -44 29 223
4578 223 -168 15 -92 -106 164 251 -171 -141 -146 140 72 38 16 -154 141 242 -52 59 206 -392 -405 -202 99
4601 99 20 187 139 -92 11 -348 -128 -299 313 74 116 -24 -43 -180 21 92 -62 -59 120 -141 -78 151 -121
4624 -121 -304 80 -88 -39 103 39 -239 14 -34 -3 13 20 97 -91 -143 30 -124 132 -16 -263 -133 -76 -23 -188
4648 -188 469 54 -50 215 259 -34 -122 -246 -182 96 -60 108 98 250 -109 -183 173 -222 -49 -6 -29 -50 -65
4671 -65 127 -118 49 -89 -46 62 107 -14 149 256 -163 -124 203 34 -10 57 -102 -156 162 -66 92 9 -87
4694 -87 -248 -13 38 104 -311 -102 141 -71 65 -11 157 -201 244 249 94 -185 -18 -5 -44 -182 -165 69 -27
4717 -27 -219 39 85 136 -11 -288 -59 -28 -13 264 -191 45 -40 -114 -149 -253 -78 -169 50 -104 -13 16 79 -166
4741 -166 -310 -171 -51 -51 82 193 36 210 -1 -25 8 481 -85 45 -137 -258 -75 223 -100 -93 150 211
4763 211 -86 -207 88 -12 85 -141 -215 249 309 -372 39 317 -65 -132 -77 57 -138 480 -3 -140 40 187
4785 187 116 -279 406 -189 17 -299 27 112 253 28 -33 185 201 142 -168 99 13 19 -149 196 -131 64 54
4808 54 -136 -14 278 -18 132 -61 -145 -108 35 78 -228 67 127 -168 -124 -90 -8 149 316 -337 -76 -140 271
4831 271 -63 -38 -22 -8 423 214 -76 110 48 -94 -262 -154 -137 92 -144 -71 60 117 136 193 102 131 -59 -35
4855 -35 146 37 -43 -1 108 144 300 -28 -37 -210 -157 4 -50 34 -127 17 204 245 -160 58 17 -260 -68 63
4879 63 86 -10 7 -126 -4 150 192 -287 109 -25 -200 -54 8 -218 -68 252 -7 -111 79 -5 122 -70
4901 -70 -76 68 53 -134 77 53 1 55 200 326 -137 -70 222 148 62 148 -119 124 -144 -9 98 -184 185 -81
4925 -81 86 300 -34 21 139 -228 122 -64 379 53 24 1 120 -146 181 153 -167 17 67 100 36 -79 -178
4948 -178 -128 -23 32 -10 76 11 209 -340 210 -126 129 67 -172 130 163 350 -86 -78 -35 -16 -29 -193 -448 221
4972 221 -208 -129 -112 60 -89 -25 88 -319 -218 62 71 -54 -144 -245 380 102 -134 -95 293 194 -142 -378 87
4995 87 13 -264 -207 -168 -46 157 -317 17 -9 -67 165 50 156 132 -1 -179 6 57 48 -76 -296 -252 32 -13
5019 -13 87 -85 65 126 310 -17 -89 61 317 -67 -210 -71 -232 234 146 311 31 -4 183 22 39 159
5041 159 91 -242 185 -16 -95 13 -52 -230 -88 102 126 -298 82 50 126 -88 88 89 -42 -43 -252 81 244
5064 244 121 -67 149 -5 159 141 44 -438 -22 -178 104 62 -198 76 -132 159 -27 112 50 -33 205 -10
5086 -10 119 2 73 168 -5 233 256 -44 -101 -97 90 -175 -109 -43 67 163 -96 -280 -135 -37 26 -114 91 74
5110 74 12 -21 158 -2 194 90 -143 52 95 -48 -142 157 87 28 166 -82 -132 -132 110 -19 -210 57 176
5133 176 30 -158 39 -1 -71 157 54 -114 -242 -19 -162 -26 -99 -82 61 -26 -95 -406 35 124 274 163
5155 163 -21 52 10 -350 -43 21 8 -166 33 -132 -96 -50 -184 -222 154 -92 -285 -182 -67 -126 27 -69 259
5178 259 52 171 48 56 19 130 -96 -71 -45 -73 -2 -65 112 -197 308 -151 2 53 -20 1 -81 136 -133 -151
5202 -151 -133 -240 -65 93 61 127 333 126 -255 -266 -50 46 -32 -49 -122 -291 -16 -43 9 73 110 84 81 -318 -262
5227 -262 82 173 13 -47 -119 -26 38 -45 -36 -14 424 19 -158 111 6 -231 166 -220 66 47 29 -241 -121 154
5251 154 -111 -132 -127 -159 16 121 263 5 28 145 111 -105 -188 201 40 -194 43 -184 -104 -175 -150 -250 -99
5274 -99 19 102 -44 -150 -12 66 -195 12 107 -42 23 -81 -37 -178 37 176 -32 -78 -65 215 -53 76 -221
5297 -221 259 222 -177 -122 -117 282 -108 -5 -303 159 23 33 -270 -75 247 86 -238 19 -72 -74 63 -39 213
5320 213 96 -62 25 284 -4 113 68 -316 -258 -242 126 293 216 166 147 99 11 10 189 157 146 284 280 28 14
5345 14 -96 -392 -241 72 246 177 49 -188 45 -365 -25 -8 42 55 -137 24 122 -246 -41 -114 -313 134
5367 134 -73 -78 -223 -88 40 -182 -41 181 -79 62 86 -10 -15 -144 -88 -123 -17 -32 89 296 187 -141 -73
5390 -73 114 -309 -201 89 95 150 43 321 20 204 -64 76 -42 10 110 -274 195 207 -42 -290 5 -259
5412 -259 -150 268 72 -159 -255 -134 -228 60 50 -197 -39 -40 -22 251 -25 -245 -282 -152 -229 -113 2 205 -72
5435 -72 214 -41 -146 180 76 -206 -33 190 -31 292 197 -151 -22 43 117 37 188 151 -135 106 -25 -5
5457 -5 -218 -105 118 -157 162 185 -202 -146 96 -146 -98 -264 23 117 284 -36 -85 -66 -117 57 96 0 -66 200
5481 200 59 113 -236 153 180 31 -257 121 -191 -255 87 303 -104 357 -33 -154 118 -244 134 -78 -40
5502 -40 86 -172 -33 43 -221 41 -123 185 15 207 -128 -174 48 116 215 83 -62 -3 -86 60 -311 -167
5524 -167 90 -71 106 -256 -307 25 -99 -145 -65 -325 290 247 88 108 -363 155 -42 113 370 -227 96 -100
5546 -100 -307 111 25 -19 157 -420 -92 203 -297 -149 -254 53 -171 -197 6 111 142 -129 219 37 289
5567 289 -141 -64 15 -42 369 -85 55 -113 -14 -171 -17 -70 123 -234 227 79 117 -105 -28 121 186 -139 -409
5590 -409 21 86 -51 -138 153 173 45 68 30 143 46 95 29 67 141 95 -7 109 -194 33 169 -3 -99 -54
5614 -54 -227 -6 70 178 -84 -166 -253 133 95 65 -265 -64 24 14 19 -350 161 -20 -22 -150 -15 -499 151 67
5638 67 -25 -149 34 32 112 -16 -89 70 146 75 -25 157 -80 -129 -97 -296 -206 286 288 -205 -57 335 239 47 -40
5663 -40 101 139 31 212 -170 74 113 -67 74 169 102 21 -2 -141 309 172 -205 -135 91 201 -38 11 9 -71
5687 -71 -44 22 -117 -108 -73 -273 -83 22 194 -102 126 -44 89 -65 -18 13 -63 53 -95 116 43 62 -139 -310
5711 -310 -17 87 -89 52 76 -208 -54 188 98 327 105 -21 195 -130 -30 -45 172 164 164 178 7 225 293
5734 293 166 -35 -68 13 98 23 -187 -135 94 154 -168 13 -159 -306 173 -97 209 -12 -77 -25 10 -150 -191
5757 -191 -42 -251 -95 -110 -19 8 -180 170 91 -31 142 -125 46 32 -104 -36 138 -99 -364 -70 -204 78
5779 78 153 -64 66 13 186 -56 8 -14 211 -8 -67 7 272 -146 -307 -168 391 118 339 190 -325 148
5801 148 -129 164 163 -65 212 -116 336 21 37 -139 -8 232 -62 -227 247 -132 205 -155 53 247 27
5822 27 -85 -222 -163 -31 0 -180 45 -21 -13 232 -82 118 207 44 171 204 -19 55 11 117 -82 -34 -173 -113
5846 -113 86 3 42 -168 240 -73 16 236 -157 -186 -41 38 34 66 247 209 -75 -164 -131 258 271 156 20 13 72
5871 72 -155 -144 90 -290 165 -172 41 -153 129 64 275 100 -76 30 173 -62 0 -24 51 13 145 13
5893 13 -59 -287 -6 -68 287 -22 -73 23 216 4 27 82 63 -56 -93 135 69 -120 -160 -85 -44 158 171 14 69
5918 69 217 -381 -160 293 -24 -176 129 -115 184 -222 150 45 -20 74 -207 -476 260 441 -265 -82 105
5939 105 -189 6 -149 -60 -52 273 -111 139 117 58 -199 -26 -15 -27 -176 -37 -230 -199 -226 -296 16 109 87 -181
5963 -181 104 -112 2 61 213 91 -127 -14 -148 -70 70 253 -45 22 261 -88 8 -284 -145 -221 142 -321
5985 -321 213 9 -56 -20 67 -83 130 5 186 139 -60 56 237 218 7 -141 110 27 112 118 111 127 143 -78
6009 -78 233 -221 1 76 -51 -242 -1 227 -107 98 179 -125 138 202 184 -243 207 -156 170 281 -109 -11
6031 -11 23 -28 -111 195 64 59 -383 -135 71 451 130 60 -300 -144 252 0 -180 -24 97 248 -26 71 -71
6054 -71 -185 -29 16 -135 276 47 -72 104 -87 -47 -11 -78 -37 -36 100 -145 -16 -90 -50 -237 212 95 -71
6077 -71 253 93 -4 16 -100 53 217 56 179 -64 -20 13 -352 -186 207 57 12 96 -4 104 -141 329
6099 329 101 229 9 117 231 -25 -92 -37 13 323 -125 160 10 5 148 -117 -43 -218 28 -119 -205 83
6121 83 93 -111 -17 201 29 58 114 -263 -153 250 31 -98 -41 -73 -21 91 -69 28 -81 -58 136 77 111 122
6145 122 164 228 144 -136 -199 -47 -26 -160 95 16 -304 -39 -301 341 104 -46 76 132 -106 68 -118 201
6167 201 72 20 136 3 -274 187 109 96 -478 -224 165 244 114 -4 108 -435 19 196 4 45 -112 146
6189 146 -170 -48 -186 71 119 -50 -9 179 207 -65 180 -5 98 128 -138 -117 501 93 -8 346 -11 31
6211 31 -131 -2 159 -120 13 56 117 250 255 -68 197 -29 225 -164 -61 -98 381 59 -126 -5 -253 -41
6233 -41 -207 -66 -101 -164 93 -163 -47 -150 -5 -10 -57 -7 199 162 -218 189 -111 -58 87 -212 -158 9 179
6256 179 -118 22 52 204 8 83 214 -134 -10 -120 131 403 54 -87 43 117 -84 -276 23 -79 140
6277 140 -102 37 -27 228 -52 -13 29 -106 174 -250 54 92 29 -13 81 -33 37 301 -245 -14 277 153 -61
6300 -61 9 250 17 99 -31 -114 337 323 17 -98 -142 58 -139 -3 71 -36 17 161 -177 -121 145 -67 1
6323 1 177 5 -322 210 -93 69 -12 -177 -341 -106 -293 46 142 216 66 -236 -227 44 245 -45 -121 -175 72
6346 72 -73 32 342 -211 -10 111 -206 -251 133 -128 130 12 1 39 271 -73 -169 32 215 -24 102 -166
6368 -166 105 207 -115 60 -21 -140 -154 -197 17 347 16 -62 -9 57 -101 56 162 173 -225 79 -155 186
6390 186 -170 -177 -46 18 -17 -282 25 42 282 17 -134 -13 -26 -66 -5 -1 -35 31 -275 -123 -87 -26 -85 -110 227
6415 227 -65 130 -69 103 32 -222 168 34 5 44 -15 128 -237 -150 13 -167 330 -213 30 -57 -19 103
6437 103 122 398 264 134 -13 42 96 60 251 3 300 196 -216 34 78 105 -39 -54 85 -144 -284 -72
6459 -72 -5 -373 -267 -20 121 164 430 -156 22 -30 -87 147 154 -45 49 184 51 -125 214 -258 96 -1 400
6482 400 -248 65 80 46 80 39 125 -196 141 -4 -91 -87 -280 -58 17 41 100 -21 183 -35 112 -80 206 -209
6506 -209 37 167 105 232 421 -13 -105 57 1 -226 -41 132 -24 -223 247 -110 92 107 144 56 53 -108 -59
6529 -59 121 28 183 170 144 269 37 123 244 -170 213 247 -172 -307 -99 243 -80 36 32 22 -70 57 -206
6552 -206 55 -83 -8 127 41 17 9 -198 -11 -69 31 257 -59 -46 -131 -24 -83 1 10 -159 157 61 -234 -137 117
6577 117 171 107 72 -86 23 196 -30 105 134 -302 -55 -273 214 -24 -39 176 235 -148 -39 -158 -224 3
6599 3 -183 65 9 20 80 -21 320 -53 -96 180 -53 -171 -143 -193 87 362 -222 -108 317 116 96 -154 -112
6622 -112 -85 -138 86 171 286 -197 199 -189 -109 -104 214 -71 -2 5 67 79 -103 -176 -173 -15 -189 22 189 60 30
6647 30 304 -58 80 200 -8 348 -10 -113 107 29 261 -99 -52 176 -161 75 151 40 -257 177 18
6668 18 -256 211 142 231 44 -74 8 -17 -2 172 -135 -53 157 493 -62 -10 -207 -110 13 -232 -65 -128 118
6691 118 -144 219 -26 134 -57 18 60 -25 -80 151 -361 39 218 -63 -103 5 39 -82 -5 -27 -169 -123 247
6714 247 -6 71 80 -16 60 89 7 -197 39 -292 -118 -118 19 133 -126 12 -79 180 5 25 -271 -38 50 -250
6738 -250 1 140 -43 161 -134 -134 92 -203 182 -93 123 46 -157 -100 105 -24 18 -159 -129 -156 -141 -258 57
6761 57 54 -20 295 30 -154 -214 108 29 -108 45 112 82 203 90 21 -42 161 85 14 -81 98 79 -10 20 -118
6786 -118 100 58 -25 -249 -166 8 -99 -45 64 94 -75 -111 210 127 -93 9 -379 76 64 30 -161 76 -84
6809 -84 112 22 -245 180 157 -149 -103 146 -161 -59 -91 165 -80 -93 -80 -127 239 -34 -70 122 -130 -271 62
6832 62 -269 -170 50 -21 144 -28 150 -67 -57 428 229 -286 -117 98 -98 -167 -40 269 247 -232 161 170 -320
6855 -320 197 34 118 -63 -19 -196 -237 -210 4 205 427 -80 -93 -91 -51 -6 -72 -145 57 81 -86 144 14 -224
6879 -224 -54 -32 286 25 105 96 -16 134 -27 -100 8 91 -36 -183 66 -26 28 -214 82 159 217 -166 -113 41
6903 41 54 -65 9 244 -4 -83 -34 -200 232 14 225 3 -46 358 -96 -36 -222 169 -110 -71 98 -79 -255
6926 -255 56 243 -48 156 3 12 303 74 128 -51 -250 -27 -178 -52 146 21 -151 -141 128 10 24 185
6948 185 -88 -118 -243 -10 163 11 154 -58 138 54 144 27 67 -77 -179 70 159 227 -296 60 29 100 -256
6971 -256 -184 -63 125 -280 23 -75 -153 65 -57 -71 132 12 154 7 -169 -38 241 195 -14 107 -128 -38
6993 -38 49 -137 -280 -127 -28 -222 207 102 -99 185 98 35 -101 -16 198 -253 34 -38 117 -106 -94 147 -48
7016 -48 -25 -108 -210 -49 -147 7 82 219 -171 24 17 -107 -5 -199 182 116 -114 285 -180 507 -7 -71 307
7039 307 -53 235 -34 50 -82 -81 78 24 62 134 -306 -194 -32 -10 -114 -34 -53 -249 -204 -209 189 83 -205 -15
7063 -15 156 -33 -73 35 -262 44 -153 -136 94 -292 266 38 126 147 -186 -32 274 -3 36 -151 146 121
7085 121 30 -126 11 152 95 54 42 52 76 244 -42 -35 -13 289 -98 -91 129 67 -90 206 143 248 -110 -93 -88
7110 -88 -29 177 -41 -358 -138 66 -29 60 127 3 89 -304 -154 -95 40 -11 27 -52 -33 245 -163 97 -7 110
7134 110 184 -38 43 -143 -79 -10 -72 -181 91 -253 -50 -134 -55 -80 98 -254 -1 232 -264 -25 -63 164 -6
7157 -6 -178 141 -188 164 86 184 13 -207 89 -35 108 -28 -100 2 -141 -201 111 -10 108 72 -18 32 196
7180 196 184 -30 -15 16 90 88 -239 -187 -70 -202 -79 -102 278 -65 142 -41 149 131 257 15 323 -69 -36
7203 -36 107 79 2 5 -169 157 -71 -70 -186 -261 -284 203 -230 -205 168 130 -83 -47 -229 -75 184 -62 -84 -133 223
7228 223 -109 23 -76 111 -100 78 -54 64 -23 -30 280 253 49 199 -110 -46 85 -88 -13 32 16 283 -319
7251 -319 145 177 -89 -67 133 45 37 -265 -49 -125 -211 -191 -88 29 -139 186 101 -52 266 -86 327 -206 182
7274 182 90 84 153 376 405 125 51 -512 76 229 204 70 -76 53 238 65 -136 62 -51 -19 24 -199 -43
7297 -43 -123 32 -94 -183 -105 -187 359 151 -111 -76 -454 -138 39 43 95 34 -171 -48 -281 52 148 15 163 21
7321 21 -31 147 27 29 296 163 -214 -82 139 -65 23 200 307 135 139 -5 -189 -14 -243 -50 -86 -89 82
7344 82 -209 -176 -165 162 -127 -427 275 -80 -202 120 -43 -168 -144 -57 -102 -114 155 -65 89 119 126 -84 -167 105
7368 105 138 102 130 37 -90 -453 -189 262 -157 13 23 289 -272 -142 269 -209 -199 75 21 125 56 326 -233
7391 -233 -23 -34 -81 -64 354 190 101 132 -265 126 8 -105 70 107 173 -44 235 191 14 52 174 36 125
7414 125 -97 295 434 61 265 44 11 -13 203 -107 153 58 -112 128 -75 -184 148 -22 -129 74 323
7435 323 -114 110 -200 -241 134 134 -12 82 -10 -247 10 7 113 90 -36 -299 130 -335 -227 63 -52 -142 96
7458 96 -24 52 -19 -63 -15 -184 114 109 128 294 -158 -50 -31 -142 -148 176 67 -74 -129 -148 -236 -164 -87 -381 160
7483 160 -57 -55 -288 273 -59 -69 -37 -234 158 -54 -28 72 -20 -193 -228 -160 -115 98 48 7 -44 232 -172 -55
7507 -55 -146 92 -96 166 78 18 135 -152 56 151 -223 157 -198 311 161 75 51 -101 24 -114 -50 -186 35
7530 35 163 -34 -103 -7 323 -6 134 -237 -29 -71 59 -221 116 239 -129 -16 -490 84 25 16 -38 110 -13
7553 -13 48 84 28 321 217 -155 -236 -76 64 -53 111 144 -72 112 -86 91 189 -333 91 -149 171 -77
7575 -77 -101 67 -68 2 338 -86 339 -260 -3 -115 253 -23 -118 35 216 2 148 124 120 92 509 13 93
7598 93 34 -79 163 52 86 119 326 346 -278 104 186 -37 -54 27 326 -129 -19 -116 46 30 55 93 358 54
7622 54 -86 115 -167 201 167 19 -277 32 228 55 24 -78 -73 203 163 100 -326 48 33 -66 95 21 153
7645 153 93 148 -74 -47 131 -24 -51 90 -43 136 -203 44 -77 -56 160 -170 85 -80 -71 70 4 -59 31
7668 31 92 -168 161 -4 -317 117 48 -52 -138 -63 -387 -150 9 193 -161 97 36 129 46 -86 360 -57 -68
7691 -68 191 -52 -9 -204 87 -71 -10 -5 18 285 -199 -405 -160 -4 236 -275 110 137 219 92 -84 75 67
7714 67 26 -268 -54 -366 143 -200 265 -114 27 247 -149 -262 10 -185 147 -130 -62 -6 28 -141 122 110
7736 110 192 -3 -216 182 58 39 111 -217 49 -24 -64 61 -16 -27 24 85 -44 51 -137 136 210 -49 117 -157
7760 -157 -52 106 -1 -502 -23 104 -88 10 -57 127 -100 34 256 -380 -129 -177 96 -3 145 -164 -35
7781 -35 -269 -148 14 134 -138 100 -66 183 -79 269 -106 -351 5 74 206 21 28 -119 176 -61 -79 137
7803 137 121 116 15 109 287 124 346 65 26 -9 -178 -61 235 44 110 -249 -191 -66 92 -108 25 103 75
7826 75 -138 110 109 -309 -33 -112 -236 364 -142 -59 -179 -67 41 187 317 -13 210 231 -81 -228 -21 103
7848 103 120 66 56 -77 -47 87 -15 -68 148 -175 -28 13 -1 -7 81 46 -74 -151 15 -144 70 -22 0 -219 163
7873 163 -16 91 -33 6 -200 182 288 -59 -76 -7 174 117 -10 122 32 -199 -74 -212 82 242 -162 102
7895 102 126 155 363 228 -22 -71 -96 58 -10 -108 61 -143 117 91 175 270 30 166 -127 187 -1 -85 34
7918 34 201 270 144 -2 -2 -3 -155 36 159 -185 -158 -25 -30 77 -58 423 29 -95 -187 91 -106 62 137 21
7942 21 278 -28 -28 208 -312 154 175 108 106 -275 -266 -47 45 -104 86 -30 -89 109 -30 -76 7 60 334 -186 -82
7967 -82 -62 159 -27 182 231 136 -39 -102 -40 17 149 397 58 -109 -17 -104 50 -138 52 212 -123 86 -13
7990 -13 123 -190 81 -130 -153 -155 -23 -69 -46 -44 115 85 84 23 -331 -99 -53 207 189 -95 164 206 -365 -125 169
8015 169 278 83 201 -20 145 296 -248 260 15 120 -42 -299 -25 19 -21 166 300 -301 -258 -47 53
8036 53 -104 -390 -210 90 -151 -210 -39 -40 412 213 -119 272 -103 277 281 -267 174 143 55 -119 204 9 -87
8059 -87 -258 184 75 -101 25 -259 -22 -332 -93 20 -367 -2 23 -266 -49 -65 53 -271 -63 206 203 119
8081 119 96 -8 138 -178 107 54 -293 73 -14 -167 -29 -94 -34 -20 -171 180 -165 181 -16 -47 2 197 50
8104 50 -128 -122 146 -73 327 42 389 8 -59 207 208 -194 4 -133 43 42 -145 -143 50 149 6 200 -255 -107
8128 -107 -44 36 -116 95 -59 -167 -34 -306 -6 83 26 254 161 -93 -80 74 -37 186 -183 -54 96 29
8150 29 155 93 -46 -159 -155 152 96 121 -24 -43 -216 88 -78 39 138 217 29 -283 -67 151 -293 126 102
8173 102 121 135 42 114 -30 -7 -8 -68 -285 33 60 55 -162 -17 -226 -115 -59 -50
8191e0
$$ Imaginary data points
##PAGE= N=2
##DATA TABLE= (X++(I..I)), XYDATA
0 0 0 0 0 0 0 0 0 0 0 0 0 0 0 7 -8 8 -8 8 -8 13 -16 16 -18 23 -25 29 -33 37 -42 47 -53 59 -66 74 -83 92
36 92 -103 113 -127 138 -153 170 -190 210 -232 257 -287 319 -361 404 -458 523 -609 715 -858 1060
56 1060 -1366 1888 -2938 5848 -28226 -101881 -6267 58751 12360 -33119 -16760 9231 24171
69 24171 3249 -29402 -10754 28450 7343 -23013 -7144 6711 -153 4715 -3379 -19264 1748
82 1748 20571 -8298 -21267 3560 8506 -3747 -2818 -7010 -8114 10101 6764 -18156 -9684 11875
96 11875 1158 -9121 -2876 -5083 -1334 10207 -4625 -19666 2844 15471 -7008 -14988 -357
109 -357 4416 2683 -2311 -13853 -3621 16077 -194 -20489 -1303 13118 -2603 -8563 -981
122 -981 -2580 1706 6110 -7629 -10378 7615 6763 -7818 -4557 978 -397 4768 426 -12216 -945
137 -945 14135 -1758 -13342 1681 7814 -1388 -1554 -2629 -4477 6888 7012 -9963 -6018 10523
151 10523 4331 -5802 -1210 -100 1345 7240 -2061 -10843 4594 12220 -4259 -8895 4102 5364
165 5364 970 487 -4931 -1487 10563 2509 -10383 203 9799 -133 -3379 1601 -1156 1709 6847
180 6847 -3212 -7637 6127 7644 -4425 -3723 2425 1436 4103 617 -7949 60 10978 -867
194 -867 -9939 1934 6770 -827 -1387 -1567 -3380 4840 5517 -7972 -5600 8397 3626 -5680 -2467
209 -2467 302 1112 4700 -2657 -9101 3431 9225 -5173 -8419 3204 3690 -1481 -1180 -4161 -2492
224 -2492 6868 1426 -9749 -1472 7015 -1276 -4934 -636 -2073 840 4526 -4734 -8387 5070 5921
239 5921 -6576 -5167 1968 859 591 -999 -6462 -658 7981 -1720 -9624 1218 5178 -2297 -2159
254 -2159 -1731 -3167 3025 4088 -7451 -5421 6805 2781 -6015 -2379 902 860 2905 -2511 -7181
269 -7181 3031 7611 -4246 -7067 3387 3513 -1297 -600 -2452 -1548 5956 2113 -7865 -1081 7191
284 7191 786 -3597 366 -100 1947 5242 -3255 -5824 6111 6916 -5090 -3800 4072 2731 1047
299 1047 443 -3685 1149 8218 -72 -6715 2498 6869 -436 -1196 549 -754 4389 5112 -4771 -3429
315 -3429 7637 4318 -4140 -886 3099 1812 3239 -153 -4761 3456 7727 -2482 -5252 4434 4239
330 4239 -409 816 -974 -678 5446 3124 -6118 -1097 7226 1608 -3054 257 925 2056 4077 -2489
346 -2489 -5243 5094 6046 -4377 -3713 3580 2672 147 -65 -2951 -174 6536 -128 -6818 979 5443
362 5443 -832 -2369 -125 -1121 2521 3384 -4888 -4262 5718 3151 -5514 -2452 2558 756 1122 -1238
378 -1238 -5005 1397 5758 -3176 -6152 2280 3115 -1739 -1153 -1387 -2081 3449 2192 -6504 -2500 5447
394 5447 756 -4267 -952 193 480 2155 -2567 -5229 3037 5030 -4783 -4290 2836 1431 -764 -384
410 -384 -2913 -1055 4879 60 -6535 89 4976 -714 -2780 -768 -678 1856 2828 -3800 -3965 4980
426 4980 3535 -4806 -2128 2816 944 654 -400 -3525 926 5602 -1598 -5063 2070 3667 -1066
441 -1066 -949 -393 -1288 3476 2650 -4642 -1909 5767 1628 -3829 -257 2096 1281 2204 -1200 -3577 3355
458 3355 5242 -2909 -3367 3088 2216 -754 530 -1047 -550 4766 1351 -5135 -2 5292 -43 -2434
474 -2434 123 552 1972 2949 -2627 -3377 4772 3457 -3896 -2047 2882 971 233 61 -2796 701
490 701 5104 -743 -4995 1590 3537 -1101 -1477 -504 -747 2343 1972 -4347 -2311 4902 1426 -4396
506 -4396 -917 1663 413 585 -1334 -3496 1999 3737 -3365 -4155 2250 1848 -1579 -888 -1936 -1125
522 -1125 2899 260 -5752 -984 4230 -842 -3563 -831 -332 572 1433 -2947 -3861 3168 2507 -4376
538 -4376 -2828 2074 103 -784 -564 -3106 -444 3839 -1496 -5241 812 2938 -1244 -2044 -549 -1241
554 -1241 1563 957 -4109 -2362 4143 1034 -4253 -1027 1405 92 298 -1144 -3195 1657 3759 -2770
570 -2770 -4092 2451 1838 -1344 -819 -983 -313 3167 637 -4555 -308 4645 -375 -3027 -60 689
586 689 988 1589 -1921 -2498 3442 3048 -3471 -2305 2838 1310 126 -31 -1674 412 4080 -553 -3928
603 -3928 1215 3836 -871 -1437 280 57 1719 1939 -3044 -1406 4385 1664 -3394 -164 2308 826
619 826 876 112 -2102 1621 3950 -1778 -2928 2524 2728 -685 -177 -233 -107 2831 1222 -3637 -68
636 -68 4503 218 -3065 539 1431 522 1090 -1161 -2207 2885 3136 -2695 -1802 2634 1368 -730 -404
653 -404 -1474 -109 3299 -403 -3901 629 3407 -657 -2205 46 47 893 1306 -2735 -2012 3287 1577
670 1577 -3238 -1039 1907 219 -209 -502 -2288 662 2853 -1641 -3806 1918 2488 -1047 -1193 -536
686 -536 -488 1710 728 -3490 -935 3589 228 -3048 -139 1041 152 168 -1287 -2223 1874 2263 -2689
703 -2689 -2378 2037 1493 -824 -524 -1028 -44 2652 -147 -3529 498 3386 -599 -1897 664 332 717
720 717 1388 -1909 -1614 3023 1732 -2991 -732 2146 538 -86 -220 -1686 916 3066 -679 -3009
736 -3009 1804 2955 -701 -703 338 213 1841 876 -2421 -415 3598 614 -2362 402 2036 772
752 772 709 -287 -1471 2065 3079 -1798 -1849 2429 1821 -884 -469 -121 203 2296 554 -3046 781 3627
770 3627 -427 -1807 762 916 626 1220 -1107 -1381 2855 1733 -2491 -646 1872 996 -109 -153 -1099
787 -1099 841 2992 -625 -2661 1511 2234 -1125 -1563 336 154 1209 981 -2220 -876 3112 430
803 430 -2677 -448 1485 108 -108 -772 -1644 1301 2152 -1815 -2365 1930 1485 -1265 -550 -11 -598 1651
821 1651 -166 -2901 -69 2730 -1163 -2417 -25 380 121 178 -1384 -1961 1673 1328 -2626 -1646 1706
838 1706 290 -854 -526 -1120 -125 1659 -861 -3030 1010 1984 -1298 -1607 14 -262 308 296 -2119
855 -2119 -857 2184 658 -2737 -543 917 130 -218 -614 -1452 971 1985 -1811 -2306 1547 1453 -1418
872 -1418 -839 -38 -226 1290 153 -2381 14 2709 -196 -2256 297 783 447 426 -640 -1531 1940
889 1940 1598 -2198 -1024 1865 509 -721 -178 -817 495 1889 -575 -2595 1327 2036 -904 -1109
905 -1109 670 297 507 654 -1474 -613 2227 624 -2179 -263 1442 169 25 -448 -729 1040 1925
922 1925 -1295 -1830 1667 1445 -1306 -560 336 201 1220 352 -1921 220 2675 -267 -2160 271 973
939 973 -38 14 -530 -1031 1572 1413 -2136 -1379 1920 538 -1280 -316 -657 36 1268 -733 -2258 365
957 365 1749 -1100 -1204 416 39 214 304 -1596 -1085 1976 444 -2457 -716 1263 7 -933 -501
974 -501 -905 287 1610 -1078 -2003 1355 1139 -1417 -878 28 -242 366 -116 -2032 20 2098 -416
991 -416 -2025 19 969 -404 -174 -559 -1322 1066 1019 -1912 -1323 1488 782 -1219 -368 -248 -104 1204
1009 1204 -735 -2313 694 2134 -859 -1408 591 528 137 370 -941 -681 1845 973 -1898 -258 1983
1026 1983 263 -644 256 -772 654 1106 -876 -1670 1568 1516 -1103 -277 555 297 619 254 -1219 209
1044 209 2514 189 -1931 459 1136 151 -123 -41 -611 1254 1574 -1070 -823 1817 1015 -468 -286 180
1062 180 114 1121 19 -1545 848 2105 -487 -1165 511 769 -5 349 -525 -493 1690 884 -1374 -416
1080 -416 1967 345 -497 39 -103 550 1125 -501 -1675 1274 1531 -889 -424 691 172 523 587 -964
1098 -964 -544 1704 132 -1729 -149 1134 -35 -540 -181 -856 873 825 -1132 -1149 1290 754 -1151
1115 -1151 -285 282 317 728 -309 -1465 584 1658 -729 -1429 637 183 -207 -164 -1038 -929 1208 640
1133 640 -1734 -790 1463 -87 -779 -68 -140 -63 984 -587 -1560 977 1298 -1139 -773 659 292 184
1151 184 348 -1349 -326 1673 182 -1865 -66 1209 -203 -377 -157 -353 877 983 -1369 -1079 1330
1168 1330 847 -946 -399 342 277 560 53 -1239 51 1776 -147 -1103 400 949 -231 2 -515 -708
1186 -708 1413 948 -1571 -632 1546 85 -914 64 230 559 796 -634 -1264 970 1506 -639 -750 549
1204 549 375 344 234 -1024 -379 1865 212 -1742 -18 1188 -230 -456 -165 -673 666 958 -657
1221 -657 -843 1174 968 -1226 -309 506 -227 250 -6 -1075 225 1746 -127 -1403 382 935 -397
1238 -397 -91 -256 -455 1019 338 -1524 -668 1525 360 -974 79 -80 28 684 -660 -1302 497
1255 497 1073 -907 -1390 573 297 -137 -124 -751 -534 1310 87 -1690 -102 1066 -480 -552 -197 -432
1273 -432 245 727 -1027 -1169 1242 790 -1482 -486 169 9 15 -66 -929 82 1158 -427 -1316 58 977
1292 977 -46 -313 -332 -844 372 460 -1458 -776 1227 410 -982 -423 262 -52 265 -185 -889 542 904
1311 904 -901 -880 318 575 -458 -170 -738 -411 1125 232 -1160 -246 1456 -61 -733 258 -121 336
1329 336 687 -718 -1092 800 643 -987 -582 427 -17 357 108 -817 -171 1292 -311 -1201 422 1062
1347 1062 -106 -309 -92 -284 671 815 -729 -580 1267 674 -713 -267 393 -191 476 -7 -1110 239
1365 239 909 -637 -843 435 667 -43 -35 -205 -385 853 294 -1043 -16 1039 68 -524 -118 -84 198
1384 198 599 -499 -916 839 727 -741 -500 498 28 279 335 -563 -127 951 -106 -1099 -12 757
1402 757 -320 -456 -210 -73 586 648 -950 -683 1033 223 -867 84 217 -97 292 78 -1166 258
1420 258 783 -392 -1004 500 709 -514 141 -92 -406 771 362 -1208 -48 1016 -72 -684 -109
1437 -109 -62 -56 347 -592 -756 734 737 -789 -1026 617 296 -127 -145 -335 -108 886 -183 -918 188 925
1457 925 -145 -226 264 -421 406 1017 -869 -745 902 455 -954 -128 728 315 259 471 -239 394 997
1476 997 -398 -721 499 692 -491 -145 -92 -297 337 343 -613 -18 1233 137 -548 329 61 -76 483
1495 483 -327 -774 601 889 -557 -652 821 328 9 82 -151 178 881 100 -1088 187 1047 -213 -533
1514 -533 -120 71 225 397 -477 -667 704 691 -826 -115 498 167 171 76 -437 215 950 -231 -768 536
1534 536 587 -322 -15 -143 -48 742 780 -962 -248 1082 124 -847 -47 398 -156 86 -145 -793 391 478
1554 478 -629 -730 542 373 -408 -275 -271 -119 463 37 -1020 -49 814 -79 -611 88 -186 -39 380 -384
1574 -384 -985 381 608 -629 -379 341 85 -84 150 -388 4 869 -221 -666 325 320 -339 -325 87 -195
1594 -195 666 372 -800 -291 710 340 -744 30 372 -256 183 -145 -500 234 616 -578 -845 500
1612 500 149 -429 -51 -52 -176 362 196 -932 44 830 -160 -765 54 -135 8 665 -248 -621 682 590
1632 590 -738 -264 599 285 -281 -37 -205 -61 865 -190 -805 479 721 -245 -269 -37 23 353 321 -937
1652 -937 -589 1039 84 -792 18 364 -125 -162 -365 -423 440 1080 -342 -732 182 97 -241 89 117 -118 584
1673 584 115 -766 -22 439 -19 -549 -5 58 51 347 -688 -215 353 640 -813 -508 598 149 -148 -137
1693 -137 -242 -1 459 -242 -831 58 745 -41 -333 77 -140 26 33 -479 -325 761 371 -635 -325 268
1713 268 -4 55 33 -345 39 440 -254 -680 176 139 -517 -23 -165 -205 373 73 -650 16 601 23 -739
1734 -739 275 23 -25 358 -133 -387 552 788 -527 -34 439 32 50 73 -311 59 421 65 -581 89
1754 89 334 -143 -636 33 -353 131 241 -526 -628 770 -6 -724 48 145 151 125 29 -417 266 434 -206 -488
1776 -488 170 553 -211 -105 306 25 451 275 -506 0 700 212 -283 8 508 25 -71 -116 -418 568 674
1797 674 -446 -421 632 542 -123 74 7 117 444 298 -731 299 726 -19 -366 159 268 406 267 14
1817 14 -69 412 333 -748 -49 460 -180 -151 30 -420 138 607 -25 -852 211 588 -78 -109 -9 -108 188
1838 188 74 -441 -227 731 -25 -578 -48 204 -215 -12 57 -189 197 553 -253 -243 493 109 -228 -33 28
1859 28 32 404 142 -642 -154 557 -27 -570 262 39 74 387 -492 -110 142 305 -177 -137 421 366 -366 -207
1881 -207 -285 124 495 -166 -673 281 318 37 -395 -155 -265 77 207 -166 -253 461 420 -680 -95 329 -252
1902 -252 -116 -236 -180 277 411 -287 -517 253 136 -104 -81 74 -552 248 226 -526 63 734 191 -662 -30
1923 -30 383 97 287 115 107 326 441 -296 -373 594 226 2 38 -186 8 641 -232 -249 495 618 -14 -245
1945 -245 36 447 366 -195 -334 -186 623 312 -404 -110 491 134 177 164 -297 425 352 -453 -415 291 61 -197
1967 -197 -179 32 78 222 6 -514 -269 524 127 -330 -117 438 -251 112 -156 -407 154 522 -366 1 396
1988 396 151 -341 -111 -26 -50 329 305 -307 -26 268 -251 -300 224 294 151 -72 -371 -240 342 140 -245 68
2010 68 294 -6 -21 118 -141 -41 492 -318 -375 166 78 -368 -319 92 -44 72 -46 -516 -189 541 -104 -464
2032 -464 -139 -180 -341 -156 2 -382 255 207 -649 -175 270 416 -308 -76 -185 160 159 -29 -599 443 327
2053 327 -13 -245 152 108 107 144 -107 -405 242 311 -501 0 421 -35 -312 -258 42 -50 565 -161 -368 60
2075 60 167 -97 -84 -15 62 159 13 -148 151 598 -261 -440 279 232 -136 132 -25 -261 234 584 -538 -39
2097 -39 182 340 -265 9 22 262 296 56 -340 138 267 10 -223 89 176 83 132 -22 145 403 374 -262
2119 -262 21 415 182 -449 163 27 -307 387 -19 -43 311 151 -209 -295 306 124 -1 -329 -712 142 196
2140 196 308 -625 15 296 182 41 -55 -393 205 40 -220 -269 334 -203 -70 -189 -83 57 -143 59 -372
2161 -372 173 410 -147 -635 364 309 -172 135 45 93 143 95 -505 -352 159 -284 -174 2 -337 -129 434 54
2183 54 -234 128 129 -226 -358 280 -25 73 -140 -150 -150 199 -96 -388 75 253 167 143 -186 -234 282 194 -312 -90
2207 -90 266 -146 -256 286 -41 -23 1 68 -219 165 324 -29 -208 303 -98 109 -215 60 -121 279 136
2228 136 -225 -46 192 236 -109 136 -15 -67 298 -305 -100 252 256 -288 -367 167 -133 162 381 -166 -173 387
2250 387 175 -509 32 407 43 -50 101 -143 -116 231 -331 44 130 -128 -204 -193 92 -90 46 57 -182 138
2272 138 513 -324 -276 128 50 -169 -163 108 33 275 78 -48 -99 386 -78 -192 -83 -112 -26 604 -142 -539 48
2295 48 388 -135 40 224 -41 59 72 -126 -143 425 45 -248 -4 209 -224 -444 -22 -62 70 188 -74
2316 -74 1 168 195 -318 -328 253 82 174 -199 -3 -307 328 14 -351 39 224 45 -56 -406 -302 395 549
2338 549 -116 -156 272 -223 -152 -105 -115 -133 183 11 -116 -257 326 -29 -94 109 214 38 89 -17 -41 87 30
2361 30 -247 -64 244 -125 -194 33 68 -106 360 -120 -252 -72 228 -83 -145 128 20 -106 196 -215 -97
2382 -97 498 111 -395 157 48 32 -20 -172 -244 272 223 -210 -215 434 -138 -390 -44 320 165 73 107 -338 6
2405 6 24 -184 -386 -79 288 -152 114 108 -252 205 210 -383 -174 18 -154 -234 -95 -215 122 198 -168 -226 261
2428 261 298 -121 -327 111 160 -89 -32 -142 -48 141 54 -140 -177 364 10 -84 202 -146 57 -34 -304 -648 138
2451 138 169 -391 -104 106 -60 -186 1 -302 -16 377 185 -314 -48 314 -207 -35 -68 -323 92 -32 -204
2472 -204 69 292 -125 -211 249 48 -75 291 -10 -349 225 329 -203 -188 -88 2 156 95 -63 -98 -17 -12 10
2495 10 237 11 -14 -154 -42 -154 247 23 -379 -516 91 350 -22 -94 119 242 13 193 -299 -65 194
2516 194 185 -142 -102 539 -6 59 -2 -358 118 306 -47 -174 262 248 37 169 -136 89 122 6 -130 82
2538 82 304 -185 -165 136 290 90 -47 -193 -144 141 102 -326 -125 624 190 -120 -18 -14 21 375 185 -193
2560 -193 -14 169 -28 -9 95 -103 -74 -284 -133 -231 655 3 -42 12 106 -62 20 -316 -147 -75 394 -461 -109
2583 -109 513 6 119 -87 -51 118 382 -143 -527 97 69 -212 -108 -92 53 227 12 -194 102 56 191
2604 191 -186 19 448 -73 -115 -108 -204 320 409 18 -199 -39 325 -204 -232 362 232 -234 78 202 -7 390
2626 390 305 -139 230 97 136 -8 -161 -131 94 214 -197 -374 110 216 39 -79 -54 -81 36 200 -258 -87
2648 -87 239 -168 6 147 143 -163 49 -33 -231 90 132 -95 -337 -96 93 -376 178 -78 -270 22 71 -190
2670 -190 289 -96 -296 53 -74 101 66 -182 -167 -31 70 253 -32 -317 315 -6 -495 192 207 126 27 -93
2692 -93 -570 286 46 -573 -190 60 -115 158 33 -297 -2 339 14 -449 -34 424 -95 -218 -126 -124 110
2713 110 197 -183 147 -25 -1 -214 -244 12 215 -163 31 -237 268 272 211 -209 33 -145 73 -51 -115 0
2735 0 116 79 -62 73 303 -194 -311 -11 -207 -217 129 -64 -48 297 137 -383 -111 217 379 -18 190 -437
2757 -437 -149 85 -67 27 -208 -32 -41 -215 154 58 148 125 -88 -165 -138 16 -276 71 -64 -33 196 -113 -130
2780 -130 -135 -190 -110 -160 -209 -149 -181 47 -154 202 9 256 -350 -141 83 -147 70 175 13 -100 94 -138 59
2803 59 127 7 18 -169 163 25 -164 -213 -282 43 362 53 -81 257 105 -9 -28 -45 28 101 95 -215 -99 253
2827 253 238 137 57 115 15 24 -113 -524 303 256 249 -74 251 67 28 -111 20 -71 104 167 12 -48 228 0
2851 0 -36 36 -46 21 116 -151 -44 138 13 98 -51 56 26 177 67 -150 114 578 -83 -150 90 52 93 231
2875 231 -193 168 19 65 -335 -162 241 184 -151 -119 -39 -62 82 40 15 199 454 -172 -171 -171 58 -147 16 207
2899 207 -148 78 -76 12 181 54 -176 -189 24 41 -261 74 92 247 -72 149 -97 -227 -12 -8 -31 58 -261
2922 -261 -30 171 -34 -124 -145 194 -80 -152 -95 -162 139 -18 -148 -348 482 127 -256 143 19 30 -15 -107 -156
2945 -156 -213 391 -114 -117 240 -256 66 -123 309 -84 225 -28 -227 -410 112 69 -448 -187 231 -253 298
2966 298 59 -51 -355 267 -113 -147 404 97 221 -17 21 -1 131 63 -316 223 202 -99 -143 -64 84 100 86
2989 86 -102 -134 326 24 -398 106 13 -44 -31 -147 -152 97 197 22 -134 271 -82 161 156 -58 50 -44 -180
3012 -180 -182 -96 138 143 -72 -48 212 -199 417 205 -125 193 251 -347 -250 163 -133 -171 -65 29 -75 119 242
3035 242 12 -140 7 46 225 246 190 -200 146 233 -302 -82 309 -40 34 217 42 -62 320 97 -384 -166
3057 -166 -160 -112 18 259 -47 113 113 76 58 60 -443 -305 362 -131 -367 24 56 156 -226 96 -298 269 410
3080 410 -10 -145 153 127 -438 -16 338 89 -259 -101 -275 -83 47 -52 -99 43 -27 33 -206 99 30 367
3102 367 288 -47 -46 -47 246 -94 80 271 -260 135 33 -245 39 219 -49 -14 -32 -169 18 -24 -67 7 305
3125 305 -124 5 223 86 -244 205 17 -275 -111 138 -125 -238 40 140 -334 122 -209 -209 100 -244 -144
3146 -144 -237 43 95 -144 145 110 -246 68 -6 -97 63 175 -245 -176 277 363 -3 -43 34 -122 492 -112 150
3169 150 -84 -293 137 -6 100 -90 -220 86 185 -80 8 -53 9 177 13 -151 76 -33 -239 93 263
3190 263 -55 -75 285 -78 -238 -273 -51 -138 177 -96 -252 -60 151 60 -13 148 67 -108 -72 -224 -294 -5 128
3213 128 44 35 147 369 -357 -288 -134 -198 271 -53 194 104 223 -254 19 302 132 -55 -22 131 190 14 184
3236 184 -178 82 36 -295 -75 -38 -103 -16 3 86 -105 175 103 -168 -156 -22 200 -169 -165 82 -87 374 180
3259 180 -117 31 -147 236 45 48 -164 172 171 -36 -216 170 -64 20 -185 150 89 287 -103 -342 -205 322
3281 322 7 218 166 -231 11 -130 -194 -47 72 254 -137 -172 30 285 -43 198 -34 44 -94 -330 -116
3302 -116 140 272 -132 -321 49 135 -145 -21 -98 5 -10 202 -56 -192 280 -24 -122 -164 -246 -155 116 -100
3324 -100 73 161 250 -101 -150 -81 -42 31 16 -97 37 283 250 -59 99 34 211 7 -234 -45 83 -254 -214
3347 -214 40 150 68 238 -225 -108 142 100 -352 -244 -199 92 46 -65 203 -44 334 172 -21 -60 190 82
3369 82 -288 -251 111 -52 -201 -193 -81 12 339 -259 -224 50 119 -120 102 52 -83 -7 280 -187 -86 106 -62
3392 -62 -261 -176 129 101 -151 -92 16 181 197 -331 130 69 -114 -95 -178 91 85 17 -72 74 -194 80 -208 216
3416 216 167 161 -41 94 -157 -23 316 308 -215 83 142 6 -52 190 -102 -134 382 -202 -35 -57 289 -99 -23
3439 -23 -235 -123 115 -157 -316 -82 258 272 -300 -158 117 -144 -114 -204 -174 184 235 32 -277 181 304 111
3461 111 74 186 178 120 -130 -170 81 333 -87 -255 37 -64 63 -11 -120 -160 202 -57 -58 -114 90 -287 -126
3484 -126 266 -35 34 317 -42 -44 117 91 -85 -95 -57 -35 298 116 -245 20 438 406 -148 -3 25 -44 126
3507 126 -119 -17 19 198 -113 21 166 20 40 -413 -168 27 -186 15 -8 -10 -158 8 -159 8 191 72
3529 72 -82 -53 9 79 50 -484 27 217 -60 -102 -120 118 203 143 284 -111 4 90 77 104 127 -251 206 53
3553 53 -613 -230 147 -20 -140 307 225 -329 -88 -49 -73 19 30 108 150 150 284 221 -372 -36 36 204 -57 -134
3577 -134 28 170 -87 -157 -46 45 -153 -197 -24 -80 177 254 -404 2 -102 -165 248 165 106 -1 -28 10 -55 199
3601 199 -172 -15 -226 10 51 234 186 0 -37 -93 318 77 131 -98 16 -171 21 85 -90 -51 -148 -193 252
3624 252 -104 -226 92 -240 2 69 -62 283 -44 -29 -37 -252 163 73 40 -266 -185 -43 -132 107 -21 212 102
3647 102 304 -144 -164 -245 -6 117 -58 -23 79 217 294 -68 -99 169 49 -93 -210 -71 302 54 -206 -24
3669 -24 -10 -10 33 -122 0 50 -99 29 325 297 -83 -135 129 131 73 286 6 -157 -259 132 193 89 -165 186
3693 186 -54 83 -83 162 -78 1 -42 -520 111 -216 -118 151 58 185 -251 56 -196 -39 71 -234 -19
3714 -19 320 152 32 -309 -275 -26 197 -118 36 -142 232 -171 -47 75 72 -249 114 -9 -148 -141 431 36
3736 36 162 95 19 140 -24 81 -204 -221 -117 -170 67 137 242 101 -73 -169 -23 215 -95 -262 149 -1
3758 -1 103 -89 47 120 32 150 86 216 -217 146 -211 -63 31 232 -142 -344 -184 42 158 -263 -217 115
3780 115 -41 103 -51 -49 -59 104 -89 77 213 143 -79 -172 -204 -327 -56 -164 -15 -18 45 -94 -126 42 -37 -55
3804 -55 -76 32 -35 245 -253 -161 -245 234 132 9 207 77 -126 154 -144 39 246 317 82 33 5 141 -185
3827 -185 135 -66 -14 -43 140 159 -128 189 -151 199 -27 -8 126 9 -59 37 -9 65 -236 -163 -109 132 0
3850 0 -70 -25 152 282 -254 -480 9 -7 50 2 -7 26 299 47 39 -306 462 173 -98 -107 233 -23 -56 -46 -67 -43
3876 -43 -51 -60 -43 -82 -40 31 163 41 -112 -112 71 -142 65 -176 -253 -123 -27 -33 -236 136 258 -282 134 -156 18
3901 18 -100 123 78 39 152 -243 123 -263 13 308 -27 -141 101 -189 265 84 5 66 -346 -65 -29 -123
3923 -123 -76 -42 179 -107 -126 -264 -210 -148 280 35 -71 46 -35 -291 151 -104 -53 -280 -149 -232 104 -81 -53
3946 -53 -263 156 -64 -118 50 -84 -30 216 316 -27 -308 177 6 239 -51 -34 -38 73 -205 -113 -43 292 4
3969 4 -170 -19 -18 -159 274 -208 -307 342 53 -207 -39 -66 74 117 -26 -125 162 10 33 -71 -100 256 -216
3992 -216 -133 -215 -121 -25 48 92 110 35 -42 -21 53 43 6 241 -30 94 463 -22 452 -214 -2 -20 -49 -187 -88
4017 -88 375 346 -184 136 113 226 105 -24 -24 -173 101 -153 10 123 -228 79 164 -94 -116 -129 -67 -132 265
4040 265 78 42 -313 -16 -10 107 -93 -68 165 -72 -117 94 -224 -65 45 -63 260 -39 -250 47 -65 130
4062 130 101 -129 224 -53 -202 -368 212 -140 68 30 -251 212 -96 -474 -155 331 320 118 -112 273 93
4083 93 -67 -7 -148 237 120 52 62 140 -132 333 31 152 108 199 -6 -190 -313 -76 -294 -119 5 36 53
4106 53 184 -251 46 96 214 81 -163 -88 78 146 -103 -51 191 381 -33 -167 -144 24 -15 129 -300 -75
4128 -75 -64 69 -9 73 169 228 -13 -34 -71 -131 -158 -196 -277 157 -4 39 -126 -21 44 -248 -37 -35 120 42 -200 -117
4154 -117 -173 -204 -161 65 80 151 -128 48 -120 1 -119 135 147 143 206 -147 -36 -1 -275 92 283 -104 -138 91
4178 91 47 -207 -107 -289 -140 26 -200 -280 107 -45 143 -333 -21 90 63 260 -62 8 198 292 -37 -105
4200 -105 210 -82 -42 -159 -14 -274 21 -86 -74 16 84 -136 59 -26 -96 140 157 171 -436 -29 263 -154 -7
4223 -7 -18 32 -159 -77 342 190 237 -174 -242 37 -30 -298 102 309 -121 15 81 40 98 149 112 -137 133 229 203
4248 203 47 -75 203 -50 128 -11 16 93 -115 90 -330 -165 -61 28 13 -208 154 153 -77 195 42 -25
4270 -25 35 -142 -52 -363 -17 -17 -102 16 -216 -100 15 34 358 330 -140 40 -57 132 76 -163 29 237 -161
4293 -161 -91 -9 81 -31 25 250 205 63 235 189 199 92 -25 37 204 -95 -6 133 -162 116 -7 -105 66
4316 66 -107 -85 -11 179 -82 255 -73 -101 149 1 -32 -182 -179 26 -226 283 -85 383 123 -194 -82 -36 -105
4339 -105 -154 179 -89 -21 346 104 -80 21 56 164 -145 -288 -38 28 55 -171 -207 22 74 144 133 -151 -20
4362 -20 92 19 -247 45 99 -358 -1 15 -25 306 46 -236 5 -50 -181 -80 90 -63 66 -70 -313 91
4384 91 108 -76 167 22 42 11 -43 72 94 95 -3 -177 -226 210 275 -171 -231 63 -396 -54 94 -170 -25 -104
4408 -104 11 -264 -213 167 214 -367 379 15 -304 -151 86 26 124 -98 -192 -133 126 -375 43 177 -71 -165
4430 -165 302 132 -89 323 -240 -117 134 -288 -38 54 152 -74 25 483 76 -112 177 60 164 18 102
4451 102 -147 -369 69 50 20 -20 -31 -189 352 30 -1 137 301 -60 13 204 247 -188 246 -76 -195 126
4473 126 45 -105 -63 137 56 -251 82 -78 -4 -63 135 -117 164 -133 63 -145 86 238 217 -151 95 113
4495 113 292 -70 -18 124 -181 113 -143 90 -146 314 15 -349 110 225 -93 -257 -406 -109 84 45 -210
4516 -210 128 174 67 -263 -120 204 -123 -214 33 179 -34 32 24 -260 52 32 -91 248 -80 -35 104 214
4538 214 -160 -163 201 209 -349 42 156 -308 19 128 -132 -63 441 3 -112 57 4 215 -41 62 -134 -62
4560 -62 -98 -38 72 -212 -100 167 -250 -183 -215 3 70 -47 273 257 -170 -172 -5 -237 -247 19 -61 -75 9 20 -167
4585 -167 -73 91 153 102 -165 -70 139 -37 -245 80 247 -79 -565 -40 106 -113 16 -2 -176 51 107 -77
4607 -77 -218 82 -118 -58 -325 20 -39 -55 104 -204 -225 74 -238 174 -59 97 107 -121 41 190 -150 144
4629 144 167 -234 97 -242 -283 -76 -9 -159 -140 -209 -266 -30 185 -384 -127 -50 -130 -139 -139 -140 -156 218 -106 -25 265
4654 265 174 87 -460 -143 -153 86 161 109 -149 142 168 -100 16 -98 -30 228 -102 -117 -117 212 109 -119 29
4677 29 49 138 -90 259 -46 -92 223 -51 -123 -8 84 53 258 -105 -6 131 -177 -219 -48 -76 -342 -361 -87 -246
4701 -246 -166 -13 -37 73 -42 144 -173 111 -98 -58 135 41 -7 4 199 -190 -35 36 60 -1 297 -62 69
4724 69 113 -121 36 -148 128 -156 -305 -194 139 189 -220 -81 214 -3 271 -502 -283 -1 -63 -200 -276 -174
4746 -174 -209 -312 135 60 142 80 -179 1 -29 110 -262 48 -280 -237 -2 322 -314 -10 181 29 211 159
4768 159 88 203 91 138 -96 166 143 -87 326 133 -66 61 3 -99 -155 46 -19 183 195 294 261 -42 -137
4791 -137 -58 220 70 38 100 -46 339 -84 99 149 -45 -86 -400 -229 339 325 176 -79 -213 -244 12 -147
4813 -147 23 -355 7 22 -6 143 82 25 -83 -12 -34 52 157 -95 -72 -62 23 -202 54 140 -205 47 93 -249
4837 -249 -87 280 -88 -150 141 54 -493 -252 -222 121 166 -149 -233 20 110 239 -215 22 -103 -228 -143 -160 -164
4860 -164 -168 28 -192 -112 -84 170 161 -90 -114 348 84 -14 -75 -217 124 118 -162 -298 110 129 157 -66 -214 11
4884 11 129 -135 52 -162 19 38 -221 87 -68 22 117 -329 224 -218 52 126 -97 272 36 83 -17 -56
4906 -56 248 157 -399 54 19 167 253 168 -120 -250 -142 160 -13 294 165 60 22 211 41 -166 -116 212
4928 212 -130 198 77 147 123 16 -147 9 123 17 158 -277 -23 -63 172 71 15 207 36 78 -283 51
4950 51 -398 -12 136 33 -103 -66 239 -17 -10 157 -201 -4 -34 58 128 207 100 98 -205 -304 145 81 189 -235
4974 -235 33 -111 109 -159 -203 59 238 358 -166 -84 133 -116 -128 296 -207 97 -91 101 -46 -126 -233
4995 -233 37 141 -135 143 183 188 -55 1 195 -226 -106 -32 346 135 -65 -239 -20 201 -288 238 83 188
5017 188 32 102 197 126 10 -196 285 -103 44 102 -7 137 -294 -133 101 -84 -28 87 -4 321 -136 -20
5039 -20 208 -258 74 -152 -50 102 178 -173 -104 239 141 -1 -1 1 -188 -149 157 92 32 142 113 -96 146 143 18
5064 18 -189 251 -173 -326 -280 -327 115 47 45 52 -153 -192 95 -237 159 -150 289 538 -297 114 152 198 -33 -43
5088 -43 151 90 153 31 -103 -26 209 43 34 -54 -83 -17 213 -83 -157 100 22 -237 -94 -55 -197 -176 0 35 -124
5113 -124 6 -171 -258 222 123 -58 -61 -86 -69 -212 -8 71 178 94 218 165 211 -51 136 -261 -93 98 -43
5136 -43 114 -32 -134 82 70 3 96 122 -207 228 -156 -402 -131 265 -162 -145 -86 15 75 -307 104 -116 5
5159 5 176 174 -142 -95 -88 11 46 -63 56 -201 25 21 -89 204 -50 85 -77 -43 -16 -33 -346 -169 75 160 -118
5184 -118 -146 162 -288 53 -13 -88 -70 324 -119 -360 -2 -120 414 -103 39 444 132 87 -280 45 -186 -234
5206 -234 231 -207 -108 -203 4 37 16 49 -153 139 -201 125 483 -121 190 302 -86 -144 -15 71 45 -16 -56
5229 -56 -77 -110 19 -91 223 -422 170 -82 200 -29 -138 -73 76 -281 28 72 -123 -55 -9 -111 -74 -8 -30
5252 -30 76 -114 -207 -148 -76 -158 -68 144 83 138 -13 -243 109 187 -47 -65 -69 17 153 68 99 -126 -116 -9 -109
5277 -109 -20 324 387 -287 -219 155 -127 -57 30 113 31 -104 132 -252 229 194 -102 -110 -157 -21 92 154 -34 -27 -60
5302 -60 -149 -148 -73 106 -38 -311 -162 61 -17 401 -100 119 217 -25 190 -127 264 -34 190 249 -96 -85 -124
5325 -124 90 -176 41 342 -126 53 66 52 -43 97 16 138 168 8 -134 -26 69 165 -105 141 7 -107
5347 -107 15 -188 -14 -143 -11 -51 -257 -34 -20 -36 44 133 282 94 -348 136 58 -73 138 273 -66 196
5369 196 179 94 44 -272 71 46 -37 -197 -44 13 110 254 31 -122 -69 -93 125 331 -117 23 -226 -231 -231 7
5393 7 109 -131 -182 11 103 51 -193 -261 -267 -243 37 -53 -112 54 4 -202 -272 91 198 -156 -56 7 -29 118 -226
5418 -226 153 265 -54 195 6 189 -101 20 16 -191 -16 56 116 135 -179 134 125 83 -263 119 62 -126 164
5441 164 153 25 -155 -67 -5 -153 116 83 -104 -75 -116 187 -140 287 78 -29 44 -77 43 -5 -38 -124 90
5464 90 100 0 -14 -167 -6 173 244 -360 180 -54 -40 -98 13 -23 139 -22 -105 -36 25 -284 88 -179 -241 270
5488 270 132 153 207 113 -59 -59 -16 -21 -194 233 2 -25 -73 57 -4 178 240 65 323 -194 85 33 -4 22 33
5513 33 35 -172 103 100 143 11 78 -51 53 140 -117 -6 29 -97 392 177 135 -23 -14 -74 258 192 -5 21 226
5538 226 -135 9 198 -195 7 -150 25 -52 -21 -74 134 -3 -126 -145 -153 -232 -16 -50 105 164 101 10 110 -74
5562 -74 282 -52 297 51 -223 -124 83 -364 253 100 18 -200 -112 -290 -2 -29 -207 -148 48 -71 -266 184
5584 184 216 -166 -238 -332 -204 163 72 -207 -172 140 21 -132 23 275 -313 -13 136 -80 -97 -100 -97 62 338
5607 338 -206 10 96 14 61 -44 62 28 103 -56 -70 -98 -193 314 29 -56 -263 219 15 -45 88 -69 0 268
5631 268 -118 104 -130 198 253 410 183 0 -100 8 7 46 -244 94 91 49 -35 -216 216 -39 -49 75 193
5654 193 143 -254 -188 -3 217 -56 147 -71 74 -12 -15 16 128 172 -128 -184 -112 158 32 90 211 18 -98
5677 -98 -39 50 -95 70 109 -145 -217 -3 -171 98 -101 -118 -52 -101 -73 -221 254 -261 -165 -87 10 129 14 -167
5701 -167 95 -240 198 -26 27 4 90 -188 -138 -130 -147 -160 -133 240 -31 -98 -366 4 94 -94 1 177 -89 137
5725 137 -183 191 -229 122 144 23 -151 -147 -197 11 -177 85 11 -53 44 -91 -23 -107 -107 -67 -41 -156 -177 213 31
5750 31 -127 -77 196 96 251 124 75 128 -99 56 258 333 -203 158 50 -105 -139 81 -182 38 209 50
5772 50 -372 -134 -69 -172 80 125 43 235 -226 35 15 100 54 183 -126 89 334 -64 -36 80 -302 -85 82
5795 82 -183 -213 163 -92 -48 -111 -18 -309 295 133 191 246 -234 -90 -30 94 -122 -82 74 -151 174 22 87
5818 87 74 -42 166 200 157 453 169 -342 -117 123 -126 134 -127 233 212 70 -148 -4 134 -139 62 -23
5840 -23 117 -81 271 -34 -68 153 -63 -81 38 -189 140 -40 96 6 -27 72 -14 17 -28 33 166 246 -202 21
5864 21 -14 165 -111 177 -41 216 78 -251 318 20 -172 64 252 -192 238 -15 -43 223 -54 -111 179
5885 179 -243 68 -113 88 123 6 182 -157 -17 238 -35 160 -105 7 -188 -68 -46 -187 -195 223 -61
5906 -61 -168 76 -317 103 -121 294 -175 -147 -180 97 87 -366 171 84 -459 194 185 -74 155 -37 -195 12
5928 12 -171 -145 165 -141 -73 141 9 -40 28 317 5 -52 -48 -466 1 31 -346 -104 -92 -88 29 280 223 56
5952 56 109 -132 -132 -59 -159 -335 89 141 106 -49 52 -83 -266 -181 132 -37 -170 173 229 -462 -133 -48 -91 25
5976 25 64 -41 -63 102 275 82 239 193 -1 110 -34 -18 -15 -50 -97 -114 139 -310 -35 -199 243 -84 65
5999 65 -219 -134 -93 98 -133 -113 239 -33 -110 -73 79 -26 222 -158 -266 -181 -82 45 -43 -259 -38 128 157
6022 157 -79 -77 368 113 82 45 -248 116 -19 129 -243 148 -123 0 -292 78 -111 -450 66 -23 -284 13
6044 13 -198 208 147 157 -41 -70 -184 -53 165 48 -113 -18 182 114 44 -41 59 -81 255 -303 18 111 -28
6067 -28 148 -4 23 -11 -39 -42 173 13 68 4 16 -112 -81 -37 -104 121 -45 108 -76 40 -49 -29 84 -18 110
6092 110 -161 51 -35 107 -79 257 -161 -73 -111 -219 -6 -29 -82 205 10 -97 -10 -145 32 79 -108 128
6114 128 -89 47 106 -218 53 -56 -50 -86 -62 -16 239 22 -105 64 121 298 152 -496 -246 -18 94 433
6136 433 25 20 -110 43 40 355 128 -75 71 -170 -373 -43 -5 -33 -122 122 -59 -317 259 -192 -42 -39 -223
6159 -223 -15 -1 -36 -426 286 -92 179 -121 -17 134 19 202 -86 150 -159 -2 36 194 212 -97 50
6180 50 -131 -122 -183 -109 94 76 190 230 -21 -159 67 243 106 229 -592 -128 13 -178 -3 22 -36 -170 162
6203 162 -118 82 -277 266 -34 -61 143 6 -58 100 29 33 172 -13 -110 90 169 82 -99 -285 3 -136 118
6226 118 -97 131 -46 134 264 -157 -290 -145 -37 -27 -5 -149 -150 -44 -12 -122 10 23 -139 -185 136 -116
6248 -116 -34 74 115 -31 -152 -186 95 51 64 205 222 24 -49 4 -161 56 93 388 -20 -16 -5 -112 182 148
6272 148 -6 344 45 215 105 125 -40 8 4 -173 -271 45 -194 -316 173 -100 -201 -85 65 -161 -53 -38
6294 -38 -110 25 20 125 -79 77 19 -185 12 59 -79 -174 36 -148 131 158 112 46 120 -212 -109 -103 183 -39
6318 -39 -127 164 -46 86 -151 263 39 12 268 162 -96 23 -6 -140 -92 -76 210 66 16 85 197 81 -221
6341 -221 101 79 -139 -130 9 9 112 160 83 -97 84 -171 -179 122 99 -192 -102 45 -199 -187 -192 209 -181 101 11
6366 11 81 -45 31 42 155 -34 275 26 -11 -34 203 -32 -122 212 -20 49 43 -99 -14 -314 205 268 88 26
6390 26 -18 282 45 -52 -173 147 17 82 -241 -109 154 30 152 91 -213 -47 152 142 229 39 -91 -43 75
6413 75 -6 -77 217 -175 -109 -224 -7 199 181 42 106 -211 -57 -130 -150 -205 -323 -229 -59 46 101 -116 -119 -40 -20
6438 -20 32 -30 211 44 6 -201 126 -9 8 -63 -345 45 -39 -59 60 -60 270 145 388 97 284 -56 14
6461 14 -19 -27 0 18 -72 -126 122 168 -354 -154 85 117 -206 12 199 138 76 -86 184 88 48 138 -6 83 150 -268
6487 -268 -28 66 -47 -101 -143 86 53 166 77 -316 190 52 -32 116 -113 247 -43 -135 29 110 43 -62 40
6510 40 -147 -180 239 126 -142 -173 -191 -69 63 -151 69 -71 -93 2 114 -54 -96 1 -343 139 73 -169 112
6533 112 -337 314 121 -166 -327 -136 206 -51 -240 157 -91 -259 129 -210 74 -193 -117 -40 -59 -50 -152 141
6555 141 -31 211 99 45 -90 -116 -232 -26 49 127 -355 122 318 158 -22 -251 -187 40 90 336 64 99
6577 99 45 -260 106 362 300 -6 61 74 171 -217 -257 209 203 45 -68 98 8 -112 -35 -204 -261 -16 20 157
6601 157 209 -101 43 23 176 221 -113 -149 -17 45 32 9 -90 -324 127 86 77 10 327 -235 -277 49 -75 1 -110
6626 -110 273 5 453 0 -42 -162 36 -96 -104 -41 4 26 81 -62 208 207 195 -35 142 214 -48 -108 247 84
6650 84 -2 -119 20 -220 -42 313 -94 180 68 29 109 69 64 -16 119 258 -90 -29 341 54 -178 -76 98
6673 98 -115 -96 -89 -88 -514 -218 -17 -94 -124 148 -312 -51 372 -46 102 273 -55 -103 -22 -229 154 -136 78
6696 78 -81 -180 88 56 -185 -236 -45 152 -131 -22 -57 -314 181 145 -284 138 85 266 2 89 126 23 124
6719 124 -159 68 33 104 -288 101 97 -92 -30 -61 -41 -165 135 -173 10 108 -213 -210 -149 -58 -24 -48 125 -121 154
6744 154 80 -285 -56 210 315 288 55 -169 -37 51 -228 -115 -230 23 -85 87 172 108 202 263 -37 -84 169
6767 169 225 -114 5 169 127 -103 -111 19 -168 64 -155 85 -145 23 1 81 50 -68 319 -273 84 82 -51
6790 -51 8 -63 40 121 -100 124 -108 225 -37 -170 -10 20 -105 1 59 -213 -3 -94 82 71 17 -56 218
6813 218 206 -82 34 27 -78 159 63 195 -57 166 212 68 64 19 164 -339 -50 159 90 116 -173 -194 -10 130
6837 130 -107 -60 -221 176 -15 -110 219 -49 -249 69 218 -102 74 -201 -165 156 -99 -50 114 79 57 -93
6859 -93 -118 -96 219 116 10 -54 -33 73 -274 -357 -82 -125 -235 291 301 -159 -322 100 -25 -63 -54 -92 -69 44
6883 44 5 169 -44 18 -287 -288 -24 -99 58 -73 -35 171 119 253 -27 -32 -113 -94 -154 173 67 155 -63 -297 -17
6908 -17 109 85 17 287 69 -3 156 -144 -201 172 5 -131 89 -112 76 7 59 -17 10 15 -92 98 202 113
6932 113 -32 -57 46 91 15 -231 -23 -269 40 -112 -225 123 -2 89 -57 273 -86 -250 -46 42 -176 113
6954 113 30 156 90 88 115 102 155 -139 -99 76 161 148 162 188 59 33 -55 -44 -251 -96 188 240 -27 68 49 316
6980 316 9 76 -304 42 50 -85 48 -17 -21 134 81 -64 -61 -33 -212 -62 23 -249 -158 -63 -254 -101 123 17
7004 17 -23 -263 34 133 -212 60 -30 -18 34 88 69 225 57 -189 -261 307 282 35 -16 46 -27 -363 -159 -24
7028 -24 361 109 -94 -61 37 -8 174 133 -140 -208 31 -46 172 -118 134 -23 9 -59 -23 -142 52 7 112 -126
7052 -126 -84 81 -311 -155 -372 -9 -405 1 -25 11 86 -39 -96 237 -136 66 -154 -20 126 46 -20 290
7074 290 -28 -111 136 -293 -235 -104 8 139 106 -223 131 239 -7 -65 310 -54 225 -123 479 20 -146
7095 -146 -217 5 82 171 -34 221 31 -73 173 116 -137 -254 138 -11 180 -258 -97 156 61 215 111 -40
7117 -40 -90 -192 -109 -164 -267 -112 117 -113 77 42 -364 -41 147 37 -81 21 163 -226 -10 -88 -417 -23
7139 -23 141 -64 2 -3 226 -34 -99 27 249 59 -158 -102 -27 -180 -27 148 155 56 154 333 -221 155 252 75
7163 75 128 16 143 -30 -18 94 -318 73 148 -72 198 -216 249 117 62 -165 -100 -99 189 128 91 271 -384
7186 -384 88 82 124 -173 -194 -188 82 170 -156 17 145 91 -70 25 -79 -111 268 -152 99 -305 66 96 -170 94
7210 94 213 82 -141 238 -97 373 -59 -202 198 70 38 -74 100 -56 -291 -108 -150 -183 -21 103 239
7231 239 -196 27 44 -28 -53 22 125 22 155 336 -48 -129 -181 79 -41 -118 262 -27 81 -241 -252 175 -89
7254 -89 66 -10 101 -158 -309 156 12 255 97 -58 36 400 387 32 -163 51 -20 116 245 80 156 -107
7276 -107 -117 2 18 -203 -52 95 -52 -207 125 -48 221 -226 -124 -71 -287 148 119 -10 47 13 -167 207
7298 207 68 230 -195 -202 57 90 -69 -189 -69 74 -158 37 -18 -51 264 -148 292 -24 -150 -132 -296 246
7320 246 -44 -7 515 -174 297 -178 -1 -57 -271 -114 -4 84 -61 159 -94 216 77 -87 -14 -93 -158 176
7342 176 27 126 -47 -183 158 -122 10 25 204 -145 11 -107 -48 -90 151 150 36 -186 180 -74 -141 53
7364 53 -73 118 152 -71 51 -168 113 16 53 -115 357 140 4 100 -46 64 -80 92 -2 -47 -96 201 70
7387 70 206 156 -308 -140 99 -1 172 -285 75 47 -231 -90 -130 167 104 -76 -57 47 93 -134 -177 -106 -107 -22
7411 -22 335 52 -42 157 41 35 122 -101 89 -24 165 -19 66 338 15 -41 182 -364 189 -10 -273 123
7433 123 53 132 -209 134 289 -95 186 411 73 13 -37 -252 -14 174 -71 -283 -49 205 -155 56 105 -165
7455 -165 -1 163 88 102 116 -22 55 -56 -122 -334 64 72 -175 108 106 79 -302 -100 91 -21 230 -160 241
7478 241 -28 35 -100 -197 11 -335 31 -222 -130 -74 254 39 -134 5 -23 142 -130 18 27 95 91 177 147 216
7502 216 294 -222 78 148 -201 79 -238 75 -220 244 294 -232 70 1 44 -23 91 -66 -149 202 -142 -184 -53
7525 -53 -77 116 -147 -35 9 -31 121 87 -164 -202 -218 38 -43 135 133 126 -41 -36 -83 -317 -8 -46 76 -109 -463
7550 -463 127 185 -82 -126 187 133 14 -12 -53 13 10 -155 -325 167 -141 18 -119 168 -65 232 283 43 -152
7573 -152 15 -124 171 -140 -10 113 40 151 -305 -359 122 -127 42 -167 -112 137 -310 -155 -77 295 -129
7594 -129 -321 -56 205 -155 85 -55 -191 135 195 -83 -128 119 -235 20 -89 -8 138 -126 77 -190 127
7615 127 59 40 20 98 -21 -247 23 272 62 54 -29 61 -53 202 -7 21 -257 -144 -132 -171 -294 -5 95 -333
7639 -333 163 -13 -43 202 -209 -228 -300 -179 102 26 -150 -129 0 -96 -97 -142 182 52 115 -253 20 92 255 109
7663 109 55 31 31 189 6 -165 273 11 -23 8 -121 -48 -143 107 119 162 11 243 396 -254 -23 72 88 86 226
7688 226 -61 -77 124 -180 194 230 102 -1 -124 -170 71 100 -138 141 -341 -121 -10 -139 -109 170 59 79
7710 79 -78 -130 156 47 -177 -87 -55 -30 -215 -164 -139 158 -51 282 -153 4 -93 -8 510 244 65 15 61 -340
7734 -340 -127 262 124 69 0 79 256 -145 137 38 -34 -49 -2 -235 103 2 -111 -23 202 8 286 -103 81
7757 81 90 14 316 5 55 292 -81 92 -31 -41 54 305 75 24 253 -101 7 68 -43 -212 69 6 71 -78
7781 -78 -20 120 263 128 -102 -64 -22 13 -197 -206 -163 -306 -27 7 173 87 -196 137 44 225 -64 -189 95 -5
7805 -5 -94 -103 438 -506 -162 -85 -34 -118 67 9 -120 181 177 48 249 62 149 -253 -311 196 -45 49 35 -164 112
7830 112 81 -112 -140 211 73 149 175 -106 -96 54 91 -241 7 -48 -241 -69 -222 -154 168 -3 -172 61 153
7853 153 195 -9 -147 147 -218 -120 -147 -103 31 303 -208 -48 122 11 -68 -41 -282 114 217 259 189 -40 -80
7876 -80 -206 124 3 32 -94 -57 -129 15 83 73 224 182 286 -163 239 250 2 -79 -39 -211 170 35 -68
7899 -68 148 -66 -156 68 132 -230 -41 98 116 107 268 0 -181 -68 -73 -56 34 -36 67 282 -17 -215 -157 -156 -106
7924 -106 -46 124 -41 136 -14 36 -41 -159 212 -40 143 140 -150 33 -69 -195 -203 -125 -227 -211 62 -186 -278
7947 -278 180 27 21 248 -144 419 -310 232 44 -161 164 -193 184 -57 349 -65 -44 -83 -281 -215 -4 91
7969 91 75 -64 -274 336 88 60 -50 -173 66 137 82 165 21 284 -121 163 -130 -15 -51 -231 -149 -291 0
7992 0 -160 -31 -114 -98 246 47 87 195 -215 282 134 57 65 -68 118 -164 124 30 -286 -221 62 -209 -54
8015 -54 -307 -40 -138 253 9 -70 5 -166 62 59 1 103 65 -314 -154 -345 58 265 242 1 149 66 121 -57
8039 -57 63 -111 -285 254 -159 75 118 -68 -151 78 170 -104 104 277 42 -77 -95 -54 -155 104 332 -169
8061 -169 -158 172 -43 57 169 -15 153 180 11 -46 -38 -182 96 -2 -63 -4 -135 76 -161 91 179 190 -97
8084 -97 -90 161 392 -128 -198 26 116 -340 -137 -3 -147 -152 96 115 -130 -94 152 187 -42 -2 -109 -233 -211 63
8108 63 17 -321 226 22 -28 285 -130 -232 34 -40 -205 -15 331 0 25 -178 440 173 34 130 -166 -42
8130 -42 -119 -54 -188 60 214 89 33 129 127 -77 -158 213 177 -65 -210 13 289 110 448 -356 55 -12 -83 228
8154 228 -35 370 278 52 -322 52 232 29 390 122 27 220 -225 -393 -200 81 3 -115 226 -124 -79
8175 -79 -66 -344 -189 -80 -59 -235 94 17 -145 -51 -68 31 -66 -30 -172 210
8191B10
##END NTUPLES=NMR FID
##END=
