##TITLE=1H_TG-2256-0
 DMSO, 8 sc, 
 17.10.2019
##JCAMPDX= 6.0         $$ Bruker NMR JCAMP-DX V2.0
##DATA TYPE= NMR FID
##DATA CLASS= NTUPLES
##ORIGIN= UXNMR, Bruker Analytische Messtechnik GmbH
##OWNER= root
$$ XWIN-NMR		Version 3.5
$$ Thu Oct 17 14:13:32 2019 Russian Standard Time (UT+4h)  she@DPX200
##.OBSERVE FREQUENCY= 200.1315
##.OBSERVE NUCLEUS= ^1H
##.DELAY= (6, 6)
##.ACQUISITION MODE= SIMULTANEOUS
##.ACQUISITION SCHEME= undefined
##.AVERAGES= 8
##.DIGITISER RES= 18
##SPECTROMETER/DATA SYSTEM= spect
##.PULSE SEQUENCE= zg30
##.SOLVENT NAME= DMSO
##.SHIFT REFERENCE= (INTERNAL, DMSO, 0, 15.7039)
##AUDIT TRAIL= $$ (NUMBER, WHEN, WHO, WHERE, WHAT)
$$ ##TITLE= Audit trail, XWIN-NMR		Version 3.5
$$ ##JCAMPDX= 5.01
$$ ##ORIGIN= Bruker BioSpin GmbH
$$ ##OWNER= she
$$ F:/spectra/data/she/nmr/H-F/1/audita.txt
$$ ##AUDIT TRAIL=  $$ (NUMBER, WHEN, WHO, WHERE, WHAT)
(   1,<2019-10-17 14:12:34.81 +0400>,<she>,<DPX200>,
      <created by zg, POWCHK disabled, PULCHK disabled
       configuration hash MD5:
       00 E9 B6 7A A2 85 ED C7 34 08 36 98 17 FE 4E 26
       data hash MD5: 16K
       2F 60 21 D7 A1 32 5F AC C1 74 72 A6 A8 13 D8 BE>)
$$ ##END=
$$ 
$$ hash MD5
$$ 9F 6C 79 20 CD 2B E7 8C 93 41 10 7D 7B 57 75 42
##$RELAX= 
##$RELAX= 
##$RELAX= 
##$RELAX= 
##$RELAX= 
##$RELAX= 
$$ Bruker specific parameters
$$ --------------------------
##$DU= <F:/spectra>
##$EXPNO= 1
##$NAME= <H-F>
##$PROCNO= 1
##$TYPE= <nmr>
##$USER= <she>
##$AMP= (0..31)
100 100 100 100 100 100 100 100 100 100 100 100 100 100 100 100 100 100 
100 100 100 100 100 100 100 100 100 100 100 100 100 100 
##$AQSEQ= 0
##$AQ_mod= 1
##$AUNM= <au_zg>
##$AUTOPOS= <>
##$BF1= 200.13
##$BF2= 200.13
##$BF3= 200.13
##$BF4= 200.13
##$BF5= 200.13
##$BF6= 200.13
##$BF7= 200.13
##$BF8= 200.13
##$BYTORDA= 1
##$CFDGTYP= 0
##$CFRGTYP= 5
##$CHEMSTR= <none>
##$CNST= (0..31)
1 1 145 1 1 1 1 1 1 1 1 1 1 1 1 1 1 1 1 1 1 1 1 1 1 1 1 1 1 1 1 1 
##$CPDPRG= <>
##$CPDPRG1= <>
##$CPDPRG2= <>
##$CPDPRG3= <>
##$CPDPRG4= <mlev>
##$CPDPRG5= <mlev>
##$CPDPRG6= <mlev>
##$CPDPRG7= <mlev>
##$CPDPRG8= <mlev>
##$CPDPRGB= <>
##$CPDPRGT= <>
##$D= (0..31)
0 1.2 0 0 0 0 0 0 0 0.06 0 0.03 0 0 0 0 0.0002 0 0 0 0 0 0 0 0 0 0 0 0 
0 0 0 
##$DATE= 1571307154
##$DBL= (0..7)
120 120 120 120 120 120 120 120 
##$DBP= (0..7)
150 150 150 150 150 150 150 150 
##$DBP07= 0
##$DBPNAM0= <>
##$DBPNAM1= <>
##$DBPNAM2= <>
##$DBPNAM3= <>
##$DBPNAM4= <>
##$DBPNAM5= <>
##$DBPNAM6= <>
##$DBPNAM7= <>
##$DBPOAL= (0..7)
0.5 0.5 0.5 0.5 0.5 0.5 0.5 0.5 
##$DBPOFFS= (0..7)
0 0 0 0 0 0 0 0 
##$DE= 6
##$DECBNUC= <off>
##$DECIM= 24
##$DECNUC= <off>
##$DECSTAT= 4
##$DIGMOD= 1
##$DIGTYP= 9
##$DL= (0..7)
0 120 120 120 120 120 120 120 
##$DP= (0..7)
150 150 150 150 150 150 150 150 
##$DP07= 0
##$DPNAME0= <>
##$DPNAME1= <>
##$DPNAME2= <>
##$DPNAME3= <>
##$DPNAME4= <>
##$DPNAME5= <>
##$DPNAME6= <>
##$DPNAME7= <>
##$DPOAL= (0..7)
0.5 0.5 0.5 0.5 0.5 0.5 0.5 0.5 
##$DPOFFS= (0..7)
0 0 0 0 0 0 0 0 
##$DQDMODE= 0
##$DR= 18
##$DS= 0
##$DSLIST= <SSSSSSSSSSSSSSS>
$$ [...]
##$SUBNAM2= <"">
##$SUBNAM3= <"">
##$SUBNAM4= <"">
##$SUBNAM5= <"">
##$SUBNAM6= <"">
##$SUBNAM7= <"">
##$SUBNAM8= <"">
##$SUBNAM9= <"">
##$SW= 24.0689530833862
##$SWIBOX= (0..15)
0 0 2 0 0 0 0 0 0 0 0 0 0 0 0 0 
##$SW_h= 4816.95568400771
##$TD= 16384
##$TD0= 1
##$TE= 0
##$TE2= 300
##$TE3= 300
##$TEG= 300
##$TL= (0..7)
0 120 120 120 120 120 120 120 
##$TP= (0..7)
150 150 150 150 150 150 150 150 
##$TP07= 0
##$TPNAME0= <>
##$TPNAME1= <>
##$TPNAME2= <>
##$TPNAME3= <>
##$TPNAME4= <>
##$TPNAME5= <>
##$TPNAME6= <>
##$TPNAME7= <>
##$TPOAL= (0..7)
0.5 0.5 0.5 0.5 0.5 0.5 0.5 0.5 
##$TPOFFS= (0..7)
0 0 0 0 0 0 0 0 
##$TUNHIN= 0
##$TUNHOUT= 0
##$TUNXOUT= 0
##$USERA1= <user>
##$USERA2= <user>
##$USERA3= <user>
##$USERA4= <user>
##$USERA5= <user>
##$V9= 5
##$VALIST= <valist>
##$VCLIST= <CCCCCCCCCCCCCCC>
##$VD= 0
##$VDLIST= <DDDDDDDDDDDDDDD>
##$VPLIST= <PPPPPPPPPPPPPPP>
##$VTLIST= <TTTTTTTTTTTTTTT>
##$WBST= 1024
##$WBSW= 4
##$XGAIN= (0..3)
0 0 0 0 
##$XL= 0
##$YL= 0
##$YMAX_a= 42505
##$YMIN_a= -79493
##$ZGOPTNS= <>
##$ZL1= 120
##$ZL2= 120
##$ZL3= 120
##$ZL4= 120
##$ABSF1= 10
##$ABSF2= 0
##$ABSG= 5
##$ABSL= 3
##$ALPHA= 0
##$AQORDER= 0
##$ASSFAC= 0
##$ASSFACI= 0
##$ASSFACX= 0
##$ASSWID= 0
##$AUNMP= <proc_1d>
##$AZFE= 0.1
##$AZFW= 0.1
##$BCFW= 1
##$BC_mod= 2
##$BYTORDP= 1
##$COROFFS= 0
##$CY= 11.3945322036743
##$DATMOD= 1
##$DC= 2
##$DFILT= <>
##$DTYPP= 0
##$F1P= 20.1720416913024
##$F2P= 0.152960286110954
##$FCOR= 0.5
##$FTSIZE= 0
##$FT_mod= 4
##$GAMMA= 1
##$GB= 0.15
##$INTBC= 1
##$INTSCL= 1
##$ISEN= 128
##$LB= 0.24
##$LEV0= 0
##$LPBIN= 0
##$MAXI= 10000
##$MC2= 0
##$MEAN= 0
##$ME_mod= 0
##$MI= 1.114404
##$NCOEF= 0
##$NC_proc= 0
##$NLEV= 6
##$NOISF1= 3.799351
##$NOISF2= 2.8
##$NSP= 1
##$NTH_PI= 0
##$NZP= 0
##$OFFSET= 15.70392
##$PC= 1
##$PHC0= -9576.708
##$PHC1= 19.60091
##$PH_mod= 1
##$PKNL= yes
##$PPARMOD= 0
##$PSCAL= 0
##$PSIGN= 0
##$REVERSE= no
##$SF= 200.130013532006
##$SI= 16384
##$SIGF1= 3
##$SIGF2= 2
##$SINO= 400
##$SIOLD= 16384
##$SREGLST= <1H.CDCl3>
##$SSB= 0
##$STSI= 0
##$STSR= 0
##$SW_p= 3612.71676300578
##$SYMM= 0
##$S_DEV= 0
##$TDeff= 0
##$TDoff= 0
##$TI= <>
##$TILT= no
##$TM1= 0
##$TM2= 0
##$TOPLEV= 0
##$USERP1= <user>
##$USERP2= <user>
##$USERP3= <user>
##$USERP4= <user>
##$USERP5= <user>
##$WDW= 1
##$XDIM= 8192
##$YMAX_p= 0
##$YMIN_p= 0
$$ End of Bruker specific parameters
$$ ---------------------------------
##NTUPLES= NMR FID
##VAR_NAME=  TIME,          FID/REAL,        FID/IMAG
##SYMBOL=    X,             R,               I
##VAR_TYPE=  INDEPENDENT,   DEPENDENT,       DEPENDENT
##VAR_FORM=  AFFN,          ASDF,            ASDF
##VAR_DIM=   8192,          8192,            8192
##UNITS=     SECONDS,       ARBITRARY UNITS, ARBITRARY UNITS
##FACTOR=    0.0002076,     1,               1
##FIRST=     0,             0,               0
##LAST=      1.7004516,     0,               0
##MIN=       0,             -79493,          0
##MAX=       1.7004516,     42505,           0
$$ Real data points
##PAGE= N=1
##DATA TABLE= (X++(R..R)), XYDATA
$$ plain form
0 0 0 0 0 0 0 0 0 0 0 0 8 -8 8 -8 8 -16 16 -17 24 -25 32 -37 41 -49 57 -65 73 -85 95 -109 120 -135 152
33 152 -172 190 -213 237 -264 293 -324 361 -400 440 -489 541 -600 668 -742 829 -931 1048
51 1048 -1190 1361 -1579 1861 -2243 2796 -3670 5270 -9186 42006 14779 -63373 -18903 28190
65 28190 35808 -5027 -26132 -11139 25404 20890 -10986 -25073 -163 21732 18995 -13110 -29954
78 -29954 -1106 34298 12182 -26614 -22001 11735 24140 6937 -22039 -22442 12083 29405 -378
91 -378 -27229 -13732 16053 23862 -287 -28670 -14964 25208 24940 -14844 -27620 -463 21940
104 21940 15007 -11558 -25147 -2412 25833 14235 -18321 -22024 2969 24270 13481 -20445
116 -20445 -27019 11651 32482 182 -28660 -11814 16956 20070 -1088 -22651 -13765 17967 22452
$$ packed form
0@%%%%%%%%%%Qj6J6j6J6k4L2l3M1m9N7o9P8r0J06j22J38j58J80k04K29k55K87
33A52l24L62m03M50n01N57o17O85p61Q40r29J030j141J268j410J571j760J979
51A048k238K551k940L440m104N039o466Q940j4456N1192k7227p8152M4470M7093
65B8190P618m0835k1105J4993L6543m514l1876j4087K4910K1895k737l2105j6844
78b9954K8848L5404k2116l8796M613L3736J2405j7203k8976m03L4525J7322k9783
91c78k6851J3497K9785P809k4149k8383J3706M0172k68l9784j2776K7157K2403
104B1940o933k6565j3589K2735K8245j1598l2556l703K4993K1301j0789l3926
116b0445o574L8670K0831l2300k8842J6846K8770L114k1158k1563Q886L1732M485
$$ plain form
129 22452 -7441 -23983 -6836 18667 20730 -8098 -28585 -3676 28309 14178 -19948 -20138 5759
142 5759 20640 9399 -15906 -21439 6563 25582 4184 -21622 -14575 10094 21406 3491 -23418
155 -23418 -16030 18076 22158 -8660 -22474 -4329 15444 15542 -5312 -21851 -6057 20794 14912
168 14912 -12289 -19835 -930 19064 13766 -14427 -23698 5578 25752 3568 -20773 -12396 9300
181 9300 17261 3745 -17599 -14819 12016 20305 -2691 -19487 -9071 12886 18868 -3103 -24026
194 -24026 -6908 21705 14296 -13095 -17584 635 16108 11717 -10061 -20126 1955 21450 7180
207 7180 -15381 -14674 5196 18671 6813 -17629 -16217 12742 19996 -3272 -17078 -6772 10261
220 10261 15223 -392 -18426 -7936 16015 14600 -7625 -16321 -3487 14290 14274 -9137 -20356
$$ packed form
129B2452k9893j6542J7147K5503K063k8828k0487K4909L1985j4131l4126j90K5897
142E759J4881j1241k5305n533K8002J9019k1398k5806P047K4669J1312j7915k6909
155b3418P388L4106M082l0818j3814J8145J9773R8k0854j6539J5794K6851n882
168A4912k7201p546J8905J9994n298k8193r271K9276K0174k2184k4341Q377K1696
181I300P961j3516k1344K780K6835Q289k2996j6796J0416K1957N982k1971k0923
194b4026J7118K8613p409k7391m489J8219J5473m391k1778j0065K2081J9495j4270
207G180k2561P07J9870J3475j1858k4442J412K8959P254k3268j3806J0306J7033
220A0261M962j5615j8034J0490K3951j415k2225q696J2834J7777j6k3411j1219
$$ plain form
233 -20356 2039 20781 5951 -14029 -11274 3800 14122 6481 -12774 -14614 7205 17609 1105
246 1105 -14846 -9893 7739 16582 528 -18925 -8523 15922 12896 -7845 -13973 -2484 11009
259 11009 11920 -5465 -17038 -1520 16578 8192 -10513 -13183 1257 15249 8326 -13513 -14713
272 -14713 7650 16550 -268 -12901 -7362 6152 13013 2354 -14750 -9168 11218 13299 -3997
285 -3997 -13757 -5327 10599 13168 -5153 -17099 -665 15638 6357 -9465 -9843 411 10912
298 10912 8225 -8890 -13564 3673 14646 3032 -11004 -9604 4486 14008 2839 -14765 -8190
311 -8190 10907 10849 -4313 -10094 -4331 7002 11102 -1734 -14112 -3720 12807 8342 -6451 -11338
325 -11338 -1380 11692 8741 -9309 -12821 4305 12738 1570 -8450 -7395 2074 11170 4663 -11207
$$ packed form
233b0356K2395J8742j4830j9980K755J5074J0322p641j9255j840K1819J0404j6504
246A105j5951M953J7632Q843j6054j9453J0402K4445l026k0741o128J1489J3493
259A1009R11j7385j1573J5518J8098q386j8705k670J4440J3992o923k1839j200
272a4713K2363Q900j6818j2633N539J3514O861j0659j7104N582K0386K081j7296
285c997r760Q430J5926K569j8321j1946J6434J6303r281j5822l78J0254J0501
298A0912k687j7115m674J7237J0973j1614j4036J400J4090R522j1169j7604O575
311h190J9097n8j5162n781N763J1333M100j2836j2378J0392J6527m465j4793m887
325a1338R958J3072k951j8050l512J7126Q433j1168j0020J055R469R096o507j5870
$$ plain form
339 -11207 -9727 7474 11757 -1221 -10616 -5866 7031 11786 -2223 -13707 -2686 11194 6521
352 6521 -5115 -8462 -2245 8190 8815 -5739 -11919 1312 11649 3991 -7697 -8637 1914 11285
366 11285 3964 -10652 -7559 7021 8641 -1246 -7073 -5166 3770 10240 225 -11372 -4347 8946
380 8946 7430 -3501 -8490 -2657 8424 8145 -5858 -10195 2163 9498 2652 -5504 -6368 -691 8734
395 8734 5618 -8143 -8547 5046 9344 189 -7295 -5611 4227 9461 -238 -10362 -3186 7685
409 7685 5208 -2562 -6099 -3620 5542 8242 -3191 -10139 285 8719 3817 -4811 -7041 -358 8419
424 8419 4458 -7311 -6596 4391 6611 519 -4786 -5216 1271 8483 1718 -8540 -4232 6454 5974
439 5974 -1449 -6286 -3325 5259 7221 -3156 -8228 430 6381 2868 -2748 -5255 -2027 6509 5650
$$ packed form
339a1207J480J7201M283j2978r395M750J2897M755j4009j1484J1021J3880m673
352F521j1636l347O217J0435O25j4554o180J3231J0337p658j1688r40J0551R371
366A1285p321j4616L093J4580J620r887n827J907Q936O470j0015j1597P025J3293
380H946j516j0931m989N833J1081k79j4003m337J2358P335o846q156q64N677R425
395H734l116j3761m04J3593M298r155p484J684R838N234r699j0124P176J0871
409G685k477p770l537K479R162K700j1433o948J0424Q434m902q628k230O683Q777
424H419l961j1769P15J0987K220o092n305m30O487P212o765j0258M308J0686m80
439E974p423m837K961Q584J962j0377n072Q658N951l513n616k507L228Q536q59
$$ plain form
454 5650 -5318 -7152 2732 6730 1118 -4638 -4963 1788 7894 1080 -7470 -3500 4831 4144 -569
469 -569 -4049 -3925 3155 6875 -1561 -7883 -857 5858 2915 -2811 -5213 -1554 5984 4495 -5094 -5594
485 -5594 2473 4951 1245 -2642 -4424 -87 6696 2510 -6528 -3674 3768 4810 -273 -4427 -3421
500 -3421 3215 5835 -1506 -6023 -29 4359 2203 -762 -3664 -2341 4339 5081 -3252 -5606 1179
515 1179 4989 1543 -2719 -4429 232 5648 1590 -5140 -2475 2811 2817 692 -2400 -3759 1767 5714
531 5714 -452 -5894 -1168 3794 2592 -867 -3522 -2013 3575 3696 -3082 -4055 1292 2712 1282 -950
547 -950 -3648 -1083 4923 2543 -4660 -3203 2666 3275 389 -2395 -3126 1521 4564 -817 -4797 -616
563 -616 2122 1817 784 -2545 -2784 2533 4488 -2168 -4124 856 2950 1289 -1173 -3218 -531 3858
$$ packed form
454E650j0968j834R884L998n612n756l25O751O106o814q550L970Q331o87m713
469e69l480J24P080L720q436o322P026O715k943n726k402L659P538j489r589n00
485e594Q067K478l706l887j782M337O783m186r038K854P442J042n083m154J006
500c421O636K620p341m517N994M388k156k965k902J323O680P42q333k354O785
515A179L810l446m262j710M661N416m058o730K665N286Ok125l092j359N526L947
531E714o166n442M726M962j202l459k655J509N588J21o778r73N347J420j430k232
547i50k698K565O006k380p203J457N869O09k886k784p31M647L043n381l980M181
563f16K738l05j033l329k39N317J955o656j956M980K094j661k462k045K687M389
$$ plain form
579 3858 1594 -3271 -1914 1795 1777 1093 -1290 -3412 370 4519 76 -4226 -743 2368 1685 287
595 287 -2547 -1948 2400 2933 -1792 -2820 473 1357 1453 112 -3060 -1764 3555 2047 -3072 -2443 1280
612 1280 1937 680 -1389 -2275 620 2784 -44 -2928 -422 1137 818 861 -1643 -2930 1571 3436
628 3436 -1465 -3008 670 1393 820 65 -2093 -918 2648 1296 -2063 -1257 666 821 1160 -54 -2820
645 -2820 -37 3179 300 -3016 -542 1208 733 449 -1261 -1702 1293 2318 -1154 -1820 369 633
661 633 734 816 -2073 -1590 2680 1646 -2160 -1530 864 822 724 -214 -1916 -163 2532 -52 -1620 -155
679 -155 381 492 1212 -934 -2443 692 2854 -945 -2055 575 753 463 586 -1239 -984 1866 1187
696 1187 -1374 -548 416 -32 836 192 -2283 -268 2549 217 -2090 -19 459 171 649 -392 -1735
$$ packed form
579C858k264m865J357L709j8o84k383k122L782M149m443m302L483L111o83j398
595B87k834N99M348N33m725j028L293Q84R6j341l172J296N319j508n119O29L723
612A280O57j257k069q86K895K164k828k884K506J559l19M3k504j287M501J865
628C436m901j543L678P23n73p55k158J175L566j352l359Q06J923J55L39j214k766
645b820K783L216k879l316K474J750m75k84j710m41K995J025l472o66K189K64
661F33J01Q2k889M83M270j034l806O30K394m2r8r38j702J753K695k584j568J465
679a55N36J11P20k146j509L135K162l799j110K630J78k90J23j825K55K850o79
696A187k561Q26R64m48Q68o44k475K015K817k332k307K071M78k88M78j041j343
$$ plain form
713 -1735 670 1340 -1076 -952 379 -237 303 1147 -1183 -1291 1961 1252 -1901 -547 609 150 612
730 612 458 -1261 -297 1551 -26 -939 96 -212 -222 1079 -238 -1830 580 1738 -946 -1003 661
747 661 187 -95 713 -628 -671 1238 686 -1085 -396 494 -232 483 554 -1562 -418 1624 -229 -1128 428
766 428 411 -73 446 348 -982 442 1154 -689 -458 662 -348 256 1158 -844 -1048 1330 785 -1046
784 -1046 -50 604 -558 362 516 -793 -200 904 14 -601 367 -100 -397 1104 -329 -1381 557 1475
802 1475 -707 -629 568 -331 -119 723 -144 -590 962 180 -620 309 130 -718 758 485 -1043 -352 1342
821 1342 -91 -1198 456 484 -701 771 581 -939 445 668 -524 -86 414 -449 -6 996 -606
838 -606 -975 1251 287 -879 395 664 -704 -155 717 -587 -234 785 -274 -364 469 -75 -636 1016
$$ packed form
713a735K405O70k416J24J331o16N40Q44k330j08L252p09l153J354J156m59M62
730F12j54j719R64J848j577r13J035l08j0J301j317j592K410J158k684n7J664
747F61m74k82Q08j341m3J909n52j771O89Q90p26P15P1k116J144K042j853q99J556
766D28j7m84N19r8j330J424P12j843K31J120j010O04R02k002k04K378n45j831
784a046R96O54j162R20J54j309N93J104q90o15R68m67k97J501j433j052J938R18
802A475k182P8J197q99K12Q42q67m46J552p82q00R29j79q48J476k73j528O91J694
821A342j433j107J654K8j185J472j90j520J384K23j192M38N00q63M43J002j602
838f06l69K226r64j166J274K69j368N49Q72j304L53J019j059r0Q33n44n61J652
$$ plain form
856 1016 4 -979 229 827 -614 -605 822 -462 -579 708 -209 -393 716 -56 -565 154 88 -932
874 -932 425 745 -1144 -426 1162 -445 -683 738 -249 -838 439 496 -698 130 320 -671 -152 447
892 447 -594 -62 939 -312 -610 854 121 -1060 428 306 -910 172 610 -526 -178 438 -246
909 -246 -433 818 -62 -646 552 186 -812 623 810 -899 -12 640 -255 -267 521 -260 -678 404 -18
928 -18 -667 368 138 -748 406 906 -675 -218 1083 -570 -574 941 -142 -643 732 329 -648 324 353
947 353 -502 230 641 -419 40 594 -373 -279 458 -210 -768 734 452 -610 141 955 -449 -365 434 -194
967 -194 -159 632 -353 -648 557 155 -616 597 852 -774 219 744 -525 -403 881 -298 -442 573
985 573 3 -633 335 145 -717 343 349 -548 -458 621 -240 -557 654 98 -613 672 192 -621 36 425
$$ packed form
856A016j012r83J208N98j441RJ427j284j17J287r17j84J109p72n09P19o6j020
874i32J357L20j889P18J588j607k38J421r87n89J277N7j194Q28J90r91N19N99
892D47j041N32J001j251k98J464p33j181J488j22j216J082M38j136L48O16o84
909b46j87J251q80n84J198l66r98J435J87j709Q87O52q95j2P88p81m18J082m22
928a8o49J035k30q86J154N00j581M57J301j653mJ515j083n01J375m03r77R72K9
947C53q55P32M11j060M59N54r67R4P37o68n58J502k82j062P51Q14j404Q4P99o28
967a94L5P91r85k95J205m02p71J213K55j626R93N25j269J22J284j179j44J015
985E73n70o36R68j90q62J060Oq97R0J079q61l17J211n56p11J285m80q13O57L89
$$ plain form
1005 425 -390 240 498 -208 -546 536 -652 -569 689 119 -719 670 530 -879 254 769 -538 -175
1023 -175 800 -358 -404 499 -270 -341 497 272 -871 294 599 -646 23 532 -593 -368 524 -196 -718
1042 -718 530 -20 -563 507 57 -720 311 422 -761 -114 897 -458 -407 355 -305 -575 564 100
1060 100 -603 475 327 -223 54 499 -570 40 407 -209 -505 491 -129 -839 460 149 -997 358
1078 358 560 -642 12 608 23 -62 499 132 -311 575 -21 -506 329 281 -650 228 634 -857 -112 914
1098 914 -570 -733 607 200 -454 259 160 -710 294 317 -469 -145 645 -508 -360 662 -192 -671 733
1117 733 382 -642 494 240 -496 482 624 -424 70 557 -354 -382 630 253 -513 302 223 -670 324
1136 324 434 -523 -23 721 -420 -228 564 -270 -278 444 119 -761 407 418 -228 306 529 -490 -231 704
$$ packed form
1005D25q15O30K58p06l38J082j188Q3J258n70q38J389j40j409J133N15j307L63
1023a75R75j158m6R03p69p1Q38k25j143J165L05j245O69N09j125K25Q92p20n22
1042g18J248n50n43J070m50p77J031J11j183O47J011j355N1P62o60k70J139m64
1060A00p03J078j48n50K77M45j069O10L67o16k96R96o20p10J299l11j146J355
1078C58K02j202O54N96n85q5N61l67m43Q86n96m85Q35m8r31Q78M06j491P45J026
1098I14j484j63J340m07o54P13r9q70J004K3p86L24P90j153J48J022q54m79J404
1117G33l51j024J136k54p36R78J42j048M94M87r11k8J012l77p66Q15p9q93R94
1136C24J10r57N00P44j141J92P92q34qP22l25q80J168J1o46N34K23j019K59R35
$$ plain form
1156 704 -332 -459 489 299 -577 311 112 -387 412 444 -1015 -148 444 -357 -158 648 -263 -321 576 73
1176 73 -555 128 701 -329 235 452 -439 47 396 -262 -441 475 194 -550 315 -33 -676 45 659 -623
1196 -623 -4 276 -276 -58 364 -548 -101 832 -1 -542 156 68 -597 164 383 -635 -111 775 -368 -511
1216 -511 199 94 -338 264 184 -517 434 378 -348 -169 369 -449 -7 809 -185 -264 566 116 -298 121 184
1237 184 -842 177 360 -640 -163 571 -347 -143 422 -9 -312 406 42 -378 590 441 -637 -198 173
1256 173 -245 82 376 -298 -548 614 -265 -411 183 95 -507 291 294 -631 -179 472 -295 -639 137 -18 -235
1277 -235 441 0 -794 359 552 -525 30 324 -324 -140 545 -549 -402 699 321 -637 -179 180 -239
1296 -239 277 504 -366 63 407 -255 -385 706 -178 -291 381 87 -376 346 524 -502 -118 -39 -391 102
$$ packed form
1156G04j036j27R48j90q76Q88j99m99P99L2j459Q67N92q01J99Q06r11n8Q97n03
1176G3o28O83N73j030N64K17q91M86L49o58j79R16k81p44Q65l48o43P21O14j282
1196f23O19K80n52K18M22r12M47R33q33n41O98q8o65P61K19j018N24Q86j143j43
1216e11P10j05m32O02q0p01R51n6p26J79N38q18M42Q16r94p9Q30m50m14M19O3
1237A84j026J019J83j000M77P34r18K04N65m31l03P18l64m20R68j49j078M39L71
1256A73m18L27K94o74k50J162q79j46N94q8o02P98Lr25M52O51p67l44P76j55k17
1277b35O76m41p94J153J93j077N55K94o48J84O85j094J47J101l78r58M58L59m19
1296b39N16K27q70M29L44o62j30J091q84j13O72k94m63P22J78j026L84P9l52M93
$$ plain form
1316 102 267 -293 -205 622 109 -548 388 193 -371 358 77 -727 -25 506 -281 -273 486 -39 -212 166 -57
1337 -57 -561 299 390 -442 22 428 -276 -74 537 -447 -357 567 -131 -296 437 180 -266 142 301 -379 -5
1358 -5 855 -17 -147 517 -96 -366 478 139 -726 129 441 -409 -93 424 -221 72 524 -457 -123 718 77
1379 77 -380 303 -84 -435 525 113 -568 52 735 -430 -131 409 -22 -17 284 19 -456 541 387 -245 -27
1400 -27 341 -345 27 269 -835 -141 371 428 -648 359 70 -423 183 -29 -381 295 715 -297 -567
1419 -567 244 -277 -50 301 -436 -404 279 503 -502 -152 195 -385 200 581 -789 -413 621 -101 -611
1438 -611 155 251 -560 241 30 -573 53 475 -427 -157 203 67 -63 303 -43 -531 366 -112 -435 -15
1458 -15 35 -412 360 287 -530 -281 298 60 -638 186 -77 -242 280 -70 -205 389 776 -336 -133 162 -268
$$ packed form
1316A02J65n60Q8Q27n13o57R36j95n64P29k81q04P02N31p87QP59n25j73L78k23
1337e7n04Q60R1q32M64M06p04K02O11r84R0R24o98j65P33k57m46M08J59o80L74
1358eQ60q72j30O64o13k70Q44l39q65Q55L12q50L16N17o45K93M52r81L34Q41o41
1379G7m57O83l87l51R60m12o81O20O83j165K99N40m31NL01k65m75R97j54o32K18
1400b7L68o86L72K42j104O94N12N7j076J007k89m93O06k12l52O76M20j012k70
1419e67Q11n21K27L51p37L2O83K24j005L50L47n80N85L81j370L76J034p22n10
1438f11P66R6q11Q01k11o03O26M22r02K70L60j36j30L66l46m88Q97m78l23M20
1458a5N0m47P72p3q17K49N79k38o98Q24k63j65N22l50j35N94L87j112K03K95m30
$$ plain form
1479 -268 -113 677 -13 -644 454 342 -308 -49 259 -367 110 412 -518 -47 293 42 -336 556 -37 -610
1499 -610 414 246 -578 96 553 -53 -310 370 -192 -351 650 56 -508 270 44 -316 142 115 -188 67
1519 67 549 -379 -118 552 -66 -211 223 -36 -113 252 366 -241 238 310 -246 37 202 45 -97 262 -183
1540 -183 -338 129 19 -303 167 307 -136 243 600 79 -618 191 35 -199 84 -65 -341 268 228 -828
1560 -828 179 332 -397 -225 206 -50 4 312 -105 -385 356 219 -306 319 435 -260 326 328 -368 -179 428
1581 428 163 -421 351 20 -429 365 206 -211 73 317 -387 6 568 -275 -322 351 -213 -134 278 -120 -330
1602 -330 41 167 -120 80 141 -330 -377 363 -361 -283 453 -35 -405 381 101 -217 -176 283 -162 -93 343 -189
1624 -189 -123 408 47 -25 361 167 -314 1 201 -527 -4 384 -39 -109 461 -146 -193 29 6 -312 212 165
$$ packed form
1479b68J55P90o90o31J098j12o50K59L08o26M77L02r30M71L40k51l78Q92n93n73
1499f10J024j68q24O74M57o06k57O80n62j59J001n94n64P78k26l60M58k7l03K55
1519F7M82r28K61O70o18j45M34k59p7L65J14o07M79P2n56K83J65j57j42L59m45
1540a83j55M67j10l22M70J40m43L79L57n21o97Q09j56k34K83j49k76O09m0j056
1560h28J007J53p29J72M31k56N4L08m17k80P41j37n25O25J16o95N86Ko96J89O07
1581D28k65n84P72l31m49P94j59m17K84K44p04L93N62q43m7O73n64P9M12l98k10
1602c30L71J26k87K00O1m71m7P40p24P8P36m88l70P86k80l18M1M59m45O9M36n32
1624a89O6N31l61p2L86j94m81L15K00p28N23L88m23p0N70o07m7K22k3l18N24m7
$$ plain form
1646 165 -381 -22 225 -366 -249 500 -199 81 456 39 -496 255 248 -150 278 376 -297 -195 201 -437 -132
1667 -132 172 -54 -234 398 -198 -487 -148 74 -163 -115 188 -237 -134 332 -221 34 619 -33 -360 275
1687 275 200 -203 362 40 -269 -45 522 -111 181 731 117 -205 475 -97 -275 416 298 -296 319 256 -6
1708 -6 -64 408 -473 -52 531 -226 -405 252 -189 -327 258 100 -62 -133 257 -217 39 517 -148 -132 161 -318
1730 -318 -246 85 3 -455 224 108 -363 -45 28 -265 -398 419 -142 -556 73 303 -374 276 150 -341 -193
1751 -193 158 -107 0 266 -380 -159 156 -36 -414 346 -16 -128 -80 130 17 -95 37 -148 -70 441 -258
1772 -258 -525 483 288 -325 329 104 -246 252 363 -32 78 195 -210 -154 229 30 -289 321 201 -164
1792 -164 241 278 -185 120 203 -9 -132 624 -96 -40 391 3 -200 101 32 -462 80 106 -192 163 271 -99
$$ packed form
1646A65n46L59K47n91J17P49o99K80L75m17n35P51pl98M28R8o73J02L96o38L05
1667a32L04k26j80O32n96k89L39K22k37M8L03m25J03M66n53K55N85o52l27O35
1687B75p5m03N65l22l09K24N67o33K92N50o14l22O80n72j78O91j18n94O15o3k62
1708fn8M72q81M21N83p57j79O57m41j38N85j58j62p1L90m74K56M78o65J6K93m79
1730c18P2L31q2m58O79j16m71L18P3k93j33Q17n61m14O29K30o77O50j26m91J48
1751a93L51k65J07K66o46K21L15j92l78P60l62j12M8K10j13j12J32j85P8N11o99
1772b58k67J008j95o13O54k25l50M98J11l95J10J17m05N6L83j99l19O10j20l65
1792a64M05L7m63L05Q3k12j23P56p20N6M31l88k03L01o9m94N42K6k98L55J08l70
$$ plain form
1814 -99 -16 145 -5 -326 202 9 -168 216 10 -463 -46 188 -238 165 261 -254 51 245 -53 -332 114
1835 114 3 -272 87 327 -134 129 170 -408 57 99 131 -219 412 140 -440 122 295 -329 325 206 -250
1856 -250 -168 330 14 -48 284 -31 -73 445 447 -379 222 156 -22 -94 111 -36 -186 456 -91 -439 330 -33
1878 -33 -278 -69 179 -10 92 105 -207 296 295 -71 -122 220 37 33 -2 150 -422 234 164 -329 -23 140 -110
1901 -110 -77 289 -117 -306 378 72 -328 -181 -62 -354 -199 406 -391 -84 273 12 -253 53 5 -274 243
1922 243 34 -355 224 396 18 225 81 -87 -128 419 -371 -362 -72 168 -283 70 153 -437 -109 146 -167
1943 -167 -57 -19 -80 -60 277 -55 139 44 76 -197 -154 170 -316 -143 326 -92 225 106 -219 34 -179 217
1965 217 -281 226 -180 -218 105 126 -125 -153 128 -118 -467 -22 428 215 367 -70 -422 -31 147 -77 -47
$$ packed form
1814i9Q3J61j50l21N28j93j77L84k06m73M17K34m26M03R6n15L05J94k98k79M46
1835A14j11k75L59K40m61K63M1n78M65M2L2l50O31k72n80N62J73o24O54j19m56
1856b50Q2M98l16o2L32l15m2N18Kq26O01o6j78p2K05j47j50O42n47l48P69l63
1878c3k45K09K48j89J02J3l12N03jl66n1L42j83ml5J52n72O56p0m93L06J63k50
1901a10L3L66m06j89O84l06m00J47J19k92J55O05p97L07L57k61k65L06m8k79N17
1922B43k09l89N79J72l78K07j44j68m1N47p90RK90K40m51L53Q3n90L28K55l13
1943a67J10L8o1K0L37l32J94r5L2k73M3L24m86J73M69m18L17j19l25K53k13L96
1965B17m98N07m06l8L23K1k51k8K81k46l49M45M50k13J52m37l52L91J78k24L0
$$ plain form
1986 -47 357 154 327 348 -166 -280 66 80 -327 -47 43 -140 168 217 -393 -94 281 -275 -26 328 202 -67
2008 -67 366 94 -378 99 158 -386 -55 -155 138 232 163 -403 -32 242 62 -125 -260 157 -147 118 396
2029 396 -234 105 181 -19 -210 -207 -37 -23 241 -57 -366 14 191 -147 -208 25 -94 397 297 -296 -257 363
2051 363 291 -53 -152 -41 -23 -16 305 -366 429 324 140 -182 -229 13 -104 543 -51 -238 103 196 -203 -86
2073 -86 185 71 -226 212 -309 -206 146 270 -149 -209 -169 -299 270 237 -379 -224 341 -11 -152 -73 -30 108
2095 108 224 -94 -380 47 475 -222 361 -31 -386 188 201 -70 -242 313 269 -58 64 -167 -355 42 177
2116 177 -275 -193 192 236 -113 -293 1 -20 217 -48 -252 254 81 -214 120 288 -67 151 659 -265 -189
2137 -189 373 302 -168 240 50 -138 483 114 -558 -302 317 200 43 -34 84 -15 437 -16 -501 203 157
$$ packed form
1986d7M04k03J73K1n14j14L46J4m07K80R0j83L08M9o10K99L75n56K49L54j26k69
2008f7M33k72m72M77N9n44L31j00K93R4o9n66L71K74j80j87j35M17l04K65K78
2029C96o30L39P6k00j91LJ70J4K64k98l09L80J77l38o1K33j19M91j00n93L9O20
2051C63p2l44r9J11J8PL21o71P95j05j84l22m7K42j17O47n94j87L41R3l99J17
2073h6K71j14k97M38n21J03L52J24m19o0M0j30N69l3o16J55N65l52j41P9M3J38
2095A08J16l18k86M27M28o97N83l92l55N74J3k71j72N55m4l27J22k31j88L97J35
2116A77m52Q2L85M4l49j80K94k1K37k65k04N06j73k95L34J68l55K18N08r24P6
2137a89N62p1m70M08j90j88O21l69o72K56O19j17j57p7J18r9M52m53m85P04m6
$$ plain form
2158 157 33 -214 -30 -178 -71 384 21 -309 408 329 -220 122 75 -222 24 239 -379 -70 356 -122 217
2179 217 -192 -158 185 239 -148 -431 -31 -146 -28 228 83 -519 125 669 6 -335 254 116 -32 -277 -148
2200 -148 -390 373 -78 -435 32 -43 82 227 -87 -136 -66 257 -110 -276 -110 80 269 -93 9 -267 449
2221 449 330 -186 -302 -86 184 101 -35 -275 -97 557 269 -539 -79 181 35 -173 -54 -66 -207 437 248
2242 248 -389 -122 390 -232 151 -274 -400 83 323 -93 -285 234 361 -84 -166 -52 -134 405 147 -587 -211
2263 -211 99 197 512 -121 -423 -59 640 -346 -79 -226 -154 -37 -59 -197 -302 56 343 151 -189 -11 71
2284 71 142 -157 -248 -83 266 386 -10 -235 52 220 -47 -50 -469 -80 279 161 -182 152 151 161 80 -165 -235
2307 -235 86 39 -275 -224 113 316 -220 113 -46 -268 -23 262 -236 -174 269 6 -373 23 -254 166 413
$$ packed form
2158A57j24k47J84j48J07M55l63l30P17p9n49L42m7k97K46K15o18L09M26m78L39
2179B17m09L4L43N4l87k83M00j15J18K56j45o02O44N44o63l41N89j38j48k45J29
2200a48k42P63m51l57M67p5J25J45l14m9P0L23l67j66J66J90J89l62J02k76P16
2221D49j19n16j16K16K70q3j36k40J78O54k88q08M60K60j46k08J19j2j41O44j89
2242B48o37K67N12o22L83m25j26M83K40m16j92N19J27m45q2J14q2N39k58p34L76
2263b11L10R8L15o33l02L64O99r86K67j47P2J17k2j38j05L58K87j92l40J78Q2
2284G1P1k99r1J65L49J20l96k25K87J68k67lm19L89L59j18l43L34jJ0q1k45p0
2307b35L21m7l14N1L37K03n36L33j59k22K45K85m98O2M43k63l79L96k77M20K47
$$ plain form
2328 413 117 -289 -149 70 187 26 -95 -221 164 246 -52 -315 71 2 398 252 -255 -348 49 302 -339
2349 -339 -235 60 63 246 -207 -474 20 498 3 -642 -192 131 -84 -22 -148 -186 247 239 -249 -288 -75 -59 361
2372 361 129 -326 -434 757 244 -174 -415 153 125 -61 216 -445 -93 219 -5 -557 122 -132 -33 -183
2392 -183 -87 -216 -121 227 4 -545 65 107 307 42 -302 -200 282 478 -206 -307 188 233 257 202 -303 34
2414 34 307 132 -160 -157 182 134 196 -171 -529 211 490 -35 -290 -111 185 557 279 52 -288 489 509 -466
2436 -466 -137 -149 291 117 62 -92 -137 470 -118 -360 53 247 113 63 -210 -424 -95 558 -168 -236 -362 -146
2458 -146 27 -22 -63 124 192 80 -49 -221 40 144 133 52 -151 70 378 157 -617 -75 212 306 724 45
2480 45 -216 -107 352 36 -452 -249 172 -21 -117 -206 -157 163 140 -278 -381 -171 131 258 411 -545 -174 775
$$ packed form
2328D13k96m06J40K19J17j61j21j26L85Q2k98k63L86o9L96j46n07r3L97K53o41
2349c39J04K95LJ83m53k67M94M78m95o45M50L23k15O2j26l8M33qm88l9K13J6M20
2372C61k32m55j08J191n13m18k41N68k8j86K77o61L52L12k24n52O79k54R9j50
2392a83R6j29R5L48k23n49O10M2K00k65l44J02M82J96o84j01M95M5K4n5n05L37
2414C4K73j75k92LL39m8O2l67l58P40K79n25k55J79K96L72k78k27l40P77K0r75
2436d66L29j2M40j74n5j54m5O07n88k42M13J94j34n0k73k14L29O53p26o8j26K16
2458a46J73m9m1J87O8j12j29j72K61J04j1q1k03K21L08k21p74N42K87R4M18o79
2480D5k61J09M59l16m88K03M21j93r6q9M9L20k3m18j03K10L02J27J53r56L71R49
$$ plain form
2502 775 383 -306 52 12 -128 370 53 -530 300 390 29 -403 -336 263 105 218 -245 -504 130 456 -348
2523 -348 -12 -220 -157 75 57 -391 -166 347 308 206 -104 -130 138 603 -170 -527 185 397 137 -111 4
2544 4 75 390 140 -374 -233 188 385 -206 -403 -182 165 267 -60 -340 -274 248 198 36 -181 52 -41 262
2566 262 -137 -304 -52 228 -47 -277 26 32 273 -53 -89 -223 38 -67 -362 -260 -74 1 260 62 -240
2587 -240 -509 564 422 -112 -146 -169 172 175 -296 -487 -29 346 133 -498 -257 -17 389 166 -290 -452 -44
2608 -44 193 99 -94 76 -166 115 40 -434 120 214 218 -368 -436 -18 270 417 -458 -227 257 311 -163 -257 -340
2631 -340 -41 78 169 -155 -454 212 428 207 -146 -135 97 444 156 -278 -288 142 259 -17 -37 -16 -107 385
2653 385 -155 -522 158 650 -135 -94 -233 -271 164 269 -145 -294 -105 456 69 -45 -208 -134 -6 143 -181
$$ packed form
2502G75l92o89L58m0j40M98l17n83Q30R0l61m32O7N99j58J13m63k59O34L26q04
2523c48L36k08O3K32j8m48K25N13l9j02l10k6K68M65p73l57P12K12k60k48J15
2544DP1L15k50n14J41M21J97n91j97K21L47J02l27k80O6N22n0j62k17K33r3L03
2566B62l99j67K52K80k75k30L03OK41l26l6j34K61j05k95J02J86P5K59j98l02
2587b40k69J073j42n34l4k3L41Lm71j91M58L75k13o31K41K40M06k23m56j62M08
2608d4K37r4j93J70k42K81p5m74N54R4Mn86o8M18K88J47q75K31M84N4m74r4q3
2631c40K99J19R1l24k99O66K16k21l53J1K32L47k88m34j0M30J17k76k0K1r1M92
2653C85n40l67O80M92p85M1j39l8M35J05m14j49J89N61l87j14j63P4J28J49l24
$$ plain form
2674 -181 -351 492 233 -24 151 -325 170 122 204 -223 86 314 -117 30 119 -41 124 265 -1 -333 104
2695 104 378 -149 -70 -200 25 222 343 -247 -192 99 116 -111 19 -290 207 94 -350 -512 -339 104 240
2716 240 -52 -110 -66 256 168 -57 -346 -91 119 59 -137 111 -105 308 365 -414 -264 585 343 -91 -269 -75
2738 -75 -110 267 7 -444 -41 165 -145 -115 69 -130 306 264 -532 -270 15 -7 -86 99 38 -22 -143 117 -263
2761 -263 -575 145 313 -26 -158 -10 175 287 90 -286 73 189 296 159 -20 69 -56 274 -491 -452 -119
2782 -119 80 -135 -364 95 -40 157 469 -208 -443 -60 -72 31 -45 13 -177 191 -37 -112 118 27 35 50 -274
2805 -274 -147 -92 443 -80 -93 81 172 179 -275 -229 -234 248 276 -453 -123 10 -84 -152 141 -138 -26 306 -224 -136
2829 -136 -32 150 -84 335 28 82 54 153 -44 115 164 9 -159 -19 -264 -158 75 167 167 105 147 4 -48
$$ packed form
2674a81j70Q43k59k57J75m76M95m8Q2m27L09K28m31J47Q9j60J65J41k66l32M37
2695A04K74n27P9j30K25J97J21n90N5K91J7k27J30l09M97j13m44j62J73M43J36
2716B40k92n8M4L22q8k25k89K55K10o0j96K48k16M13N7p79J50Q49k42m34j78J94
2738g5l5L77k60m51M03K06l10L0J84j99M36m2p96K62K85k2p9J85o1o0j21K60l80
2761b63l12P20J68l39j32J48J85J12j97l76L59J16J07j37j79Q9j25L30p65L9L33
2782a19J99k15k29M59j35J97L12o77k35L83j2J03p6N8j90L68k28p5K30r1QJ5l24
2805b74J27N5N35n23j3J74R1Pm54M6nM82K8p29L30J33r4o8K93k79J12L32n30Q8
2829a36J04J82k34M19l07N4k8R9j97J59M9j55j68J40k45J06K33R2%o2M2j43n2
$$ plain form
2852 -48 -20 59 10 184 25 176 155 106 188 35 23 -332 5 272 13 -389 -46 382 82 45 -13 -26 24 374
2876 374 -88 -77 105 95 191 27 -249 251 49 22 258 -289 -36 131 -188 -116 -262 -109 41 174 -179 217
2898 217 -115 375 -15 -267 -169 180 190 -147 -45 -119 128 -126 80 -192 -262 185 -224 -339 -50 269 -41
2919 -41 -49 6 -175 193 474 258 -50 -164 3 188 -42 168 -294 79 518 -105 46 301 48 -2 276 -211
2941 -211 -311 194 -210 -113 165 25 -115 143 -36 -138 -100 337 124 -510 -148 162 25 149 -179 26 188
2962 188 13 -234 -248 52 311 148 123 -315 32 226 -188 -363 75 37 147 20 -256 -192 43 121 -2 -291
2984 -291 -116 147 -2 -220 -112 -37 107 423 -263 -150 -101 432 -420 331 -57 -242 214 -37 -285 -228 91
3005 91 -153 38 34 -52 122 200 -9 -222 86 100 -9 189 -23 2 281 186 -66 183 -123 -67 132 172 234 69
$$ packed form
2852d8K8P9m9J74j59J51k1m9Q2j53j2l55L37K67k59m02L43M28l00l7n8j3N0L50
2876C74m62J1J82j0R6j64k76N00k02k7K36n47K53J67l19P2j46J53J50J33l53L96
2898B17l32M90l90k52R8L49J0l37J02p4K47k54K06k72p0M47m09j15K89L19l10
2919d1qN5j81L68K81k16l08j14J67J85k30K10m62L73M39o23J51K55k53n0K78m87
2941b11j00N05m04R7K78j40j40K58j79j02L8M37k13o34L62L10j37J24l28K05J62
2962A88j75k47j4L00K59j63k5m38L47J94m14j75M38l8J10j27k76O4K35P8j23k89
2984b91J75K63j49k18J08P5J44L16o86J13M9N33q52P51l88j85M56k51k48N7L19
3005I1k44J91mq6J74P8k09k13L08J4j09J98k12K5K79r5k52K49l06N6J99M0O2j65
$$ plain form
3029 69 12 266 327 -20 240 128 144 135 -131 -252 285 -59 190 316 129 -150 204 -121 44 130 161 -171 -95
3052 -95 -173 12 132 82 -322 -313 130 47 77 -123 -40 -67 -266 91 -20 -56 420 128 -485 198 259 113 126 -185
3076 -185 -20 103 -120 -31 -66 228 2 177 -29 -189 -104 320 83 -258 -37 -197 -120 215 -203 242 -107
3097 -107 -92 -254 261 -6 26 -56 149 6 -150 338 46 -165 45 68 69 6 -20 -87 -89 -88 109 -234 26 21 -98
3122 -98 25 45 -247 -127 95 -53 -332 166 52 -382 284 -109 -401 -7 195 -252 -36 5 63 259 309 -65
3144 -65 -99 349 -47 -329 18 -160 -298 -13 36 -154 -10 52 181 133 -204 60 -10 140 128 -219 -21 70 -196
3167 -196 128 276 -86 -59 251 5 -140 -46 -28 36 -61 -38 85 31 87 -135 171 104 21 25 -66 127 -99 21
3191 21 -10 59 4 211 -103 -167 -38 -88 -178 271 35 -259 331 -33 -197 71 13 50 -25 131 -72 -69 -125 -94 12
$$ packed form
3029F9n7K54O1l47K60j12J6rk66j21N37l44K49J26j87k79L54l25J65Q6L1l32P6
3052i5p8J85J20n0m04RM43q3L0k00Q3k7j99L57j11l6M76k92o13O83O1j46J3l11
3076a85J65J23k23Q9l5K94k26J75k06j60Q5M24k37l41K21j60P7L35m18M45l49
3097a07J5j62N15k67L2q2K05j43j56M88k92k11K10K3Jo3k6o7kJJ97l43K60nj19
3122i8J23K0k92J20K22j48k79M98j14m34O66l93k92L94K02m47K16M1N8J96N0l74
3144f5l4M48l96k82L47j78j38K85M9j90J44O2J29m8l37K64p0J50j2l47J98R1k66
3167a96L24J48l62K7L10k46j45R4J8O4r7K3J23n4N6k22L06o7q3Mr1J93k26J20
3191B1l1O9n5K07l14o4J29n0r0M49k36k94N90l64j64K68n8L7p5J56k03Ln6L1J06
$$ plain form
3216 12 161 66 -201 320 130 -8 169 3 29 454 -89 -104 -38 277 -23 -154 115 -87 -123 -54 -278 117
3238 117 69 8 -177 70 72 0 -277 184 -61 -206 157 -62 -237 7 188 -113 228 -10 154 -7 -122 -292
3260 -292 -32 240 -6 -188 -5 -176 -249 48 -184 -151 88 369 -153 43 -5 19 -210 105 103 -101 73 194
3282 194 77 114 -134 134 45 15 -230 -414 103 145 -125 -28 -81 135 37 -134 -67 -272 46 -159 -22 -70 -142
3305 -142 -33 433 -71 3 274 -80 88 66 241 63 6 70 -32 109 38 249 73 -14 4 33 -150 160 -58
3328 -58 307 92 -130 -326 63 48 -35 182 -10 -156 389 125 -112 43 234 -36 -175 197 106 -177 -199 15
3350 15 19 49 34 203 -152 49 -376 226 163 112 294 36 -65 -237 339 -236 -200 132 44 -61 22 41 192 -118
3374 -118 95 67 -143 155 -116 -360 36 -164 -78 210 7 -32 480 -22 -122 215 29 -196 -62 -24 -249
$$ packed form
3216A2J49r5k67N21j90j38J77j66K6M25n43j5O6L15l00j31K69k02l6O9k24L95
3238A17m8o1j85K47Kp2k77M61k45j45L63k19j75K44J81l01L41k38J64j61j15j70
3260b92K60K72k46j82J83j71p3K97k32L3K39K81n22J96m8K4k29L15kk04J74J21
3282A94j17L7k48K68q9l0k45j84N17M2k70R7n3K16r8j71O7k05L18k05J37m8p2
3305a42J09M66n04P4K71l54J68k2J75j78n7O4j02J41p1K11j76q7J8K9j83L10k18
3328e8L65k15k22j96L89j5q3K17j92j46N45k64k37J55J91k70j39L72r1k83k2K14
3350A5ML0j5J69l55K01m25O02o3n1J82k58j01j72N76n75L6L32q8j05Q3J9J51l10
3374a18K13k8k10K98k71k44L96k00Q6K88k03l9N12n02j00L37j86k25J34L8k25
$$ plain form
3395 -249 -49 53 35 9 -242 -37 -103 -56 395 -297 30 -176 -5 66 114 7 -210 180 83 -107 -161 -190 80
3418 80 276 -409 161 -30 75 57 -31 69 119 -235 209 114 -78 -277 132 61 234 162 -81 -63 -290 295 24
3441 24 -45 -112 -374 -35 5 -107 86 178 -62 -292 35 -119 -71 47 53 -295 139 118 -153 -83 44 -80 -20 20
3465 20 7 -6 -82 -28 50 77 203 -50 106 3 -242 56 21 -21 -209 -30 -380 -46 295 -87 3 117 -65
3488 -65 -173 106 213 12 78 -9 -91 18 55 -51 61 121 208 145 -45 168 -96 9 91 137 117 -71 -119 -134
3512 -134 17 242 85 -79 -83 156 -18 58 26 110 -70 -221 -19 91 11 -86 314 70 -112 -54 131 68 -2
3535 -2 -102 -102 -140 218 -67 245 167 81 360 227 97 -380 -58 113 190 40 -51 199 26 -65 -77 -56 -53 -131 146
3560 146 -30 322 81 -202 193 151 -112 -6 -233 -562 -68 -46 -298 331 333 -530 -9 118 -92 193 204 -241
$$ packed form
3395b49K00J02j8k6k51K05o6M7M51o92L27k06J71P1M8j07k17L90r7j90n4k9K70
3418H0J96o85N70j91J05j8q8J00N0l54M44r5j92j99M09p1J73p2k43J8k27N85k71
3441B4o9o7k62L39M0j12J93R2k40k30L27j54M8J18Ol48M34k1k71P0J27j24O0M0
3465B0j3j3p6N4P8K7J26k53J56j03k45K98l5m2j88J79l50L34L41l82R0J14j82
3488f5j08K79J07k01O6q7q2J09L7j06J12O0Q7o3j90K13k64J05Q2M6k0j88m8j5
3512a34J51K25j57j64mK39j74P6l2Q4j80j51K02J10q0r7M00k44j82N8J85o3p0
3535bj00%l8L58k85L12p8q6K79j33j30m77L22J71P7j50r1K50j73r1j2K1Lp8K77
3560A46j76L52k41k83L95m2k63J06k27l29M94K2k52O29Kq63N21J27k10K85J1m45
$$ plain form
3582 -241 -92 -176 151 -159 -26 -236 -302 93 150 -248 203 -97 -99 -40 82 66 -265 183 262 -93 6 262 -84
3605 -84 -111 36 51 -283 -80 220 -120 73 -299 -255 -31 -143 -154 80 -254 -121 -12 76 -26 46 -239 -62
3627 -62 -156 -61 65 245 53 -156 117 9 -119 -128 115 217 19 7 79 249 -211 75 -52 -99 65 166 373
3650 373 108 279 -344 98 86 -151 -227 157 -19 -96 -57 123 -82 -71 -78 127 -115 44 -64 -14 -28 148 58
3673 58 -177 134 -353 285 -80 126 -109 103 129 -121 163 13 476 -25 -87 0 111 217 264 237 108 96
3695 96 -192 -52 -112 -213 128 -110 -84 243 -18 23 8 -125 83 293 189 -119 -31 233 -105 -180 200 -294
3717 -294 156 23 -55 -26 -180 -43 -158 247 10 141 308 148 -74 -234 237 65 67 -6 -179 44 343 73
3739 73 20 -171 133 -128 62 -70 39 59 -54 61 173 21 -102 -16 -184 199 202 19 115 -85 -80 -83 -112 70
$$ packed form
3582b41J49q4L27l10J33k10o6L95N7l98M51l00kN9J22j6l31M48P9l55R9K56l46
3605h4k7J47J5l34K03L00l40J93l72M4K24j12j1K34l34J33J09Q8j02P2k85J77
3627f2r4R5J26J80j92k09K73j08j28rK43J02j98j2P2J70m60K86j27m7J64J01K07
3650C73k65J71o23M42j2k37p6L84j76p7L9J80k05J1pK05k42J59j08N0j4J76r0
3673E8k35L11m87O38l65K06k35K12K6k50K84j50M63n01o2Q7J11J06M7k7j29j2
3695I6k88J40o0j01L41k38K6L27k61M1j5j33K08K10j04l08Q8K64l38p5L80m94
3717b94M50j33p8K9j54J37j15M05k37J31J67j60k22j60M71j72Kp3j73K23K99k70
3739G3n3j91L04k61J90j32J09K0j13J15J12j52j23Q6j68L83Lj83R6k00Nlk9J82
$$ plain form
3763 70 28 -30 -5 61 176 60 -172 -282 133 154 217 225 -154 -204 -32 -98 -122 100 -170 5 148 235 12 178
3787 178 198 130 -55 30 -218 -110 39 -102 -151 -418 -219 101 -127 109 -45 11 -89 -99 33 -89 -226 3
3809 3 19 -66 -98 71 112 -96 142 -32 -18 88 247 -241 -71 68 -42 -48 -41 -17 259 -42 -64 12 -17 -365 -158
3834 -158 245 178 -102 93 -4 4 -160 -120 -56 -214 38 2 61 322 61 31 213 17 -192 30 74 -39 -183
3857 -183 304 6 41 57 90 235 307 -137 -17 124 246 3 54 -136 -196 95 80 39 223 -123 12 -109 89
3880 89 -28 -103 128 72 -219 92 61 -13 -103 -204 155 -152 -21 7 87 166 -231 -197 -66 -157 63 -70 232 86
3904 86 35 123 101 38 20 -18 62 240 94 36 -235 356 -240 191 -97 167 227 -245 -65 71 197 31 58 43
3928 43 119 63 127 389 -207 -434 -21 -337 -105 -128 -211 -100 -82 -212 -372 103 125 -16 -100 218 174 -147 -50 -194
$$ packed form
3763G0m2n8K5O6J15j16k32j10M15K1O3Ql79n0J72o6k4K22k70J75J43Q7k23J66
3787A78K0o8j85Q5k48J08J49j41m9k67J99L20k28K36j54N6j00j0J32j22j37K29
3809CJ6q5l2J69M1k08K38j74J4J06J59m88J70J39j10oPK4K76l01k2P6k9l48K07
3834a58M03o7k80J95r7Qj64M0O4j58K52l6N9K61k61l0J82j96k09K22M4j13j44
3857a83M87k98L5J6L3J45P2m44J20J41J22k43N1j90o0K91j5m1J84l46J35j21J98
3880H9j17p5K31n6k91L11l1p4r0j01L59l07J31K8Q0P9l97L4J31r1K20j33L02j46
3904H6n1Q8k2o3j8l8Q0J78j46n8k71N91n96M31k88K64O0m72J80J36J26j66K7j5
3928D3P6n6O4K62n96k27M13l16K32k3q3J11J8j30j60M75K2j41q4L18m4l21R7j44
$$ plain form
3952 -194 -201 -70 -113 124 43 300 120 -71 -148 130 -29 89 45 -142 10 116 95 14 -22 87 36 301 -42
3975 -42 -24 -48 -239 109 -148 3 71 -78 -110 298 53 -250 153 46 260 89 5 -43 -292 -320 -45 -29 -99
3998 -99 89 74 125 -217 -330 76 8 111 154 205 133 -203 -133 -200 -86 148 233 -229 -66 323 51 -215 50
4021 50 -98 276 147 -138 7 -85 -36 2 -83 166 114 -61 242 78 359 -81 157 -135 -179 5 -17 30 -13
4044 -13 -240 -83 40 -114 -65 -88 14 143 -102 68 -117 -167 -149 48 -18 -105 63 -19 84 -160 142 -18 405
4067 405 -165 82 274 -67 -25 -78 82 61 -123 -283 8 127 42 66 52 70 -10 -220 -153 -50 -383 -32 -208
4090 -208 -79 -21 37 -15 -158 9 -86 16 269 -146 7 -15 380 78 -40 74 229 -202 -183 40 423 -95
4112 -95 58 -147 99 28 -146 -123 -287 59 -9 93 59 -185 -64 -4 -81 256 -92 -57 132 68 -347 56 7
$$ packed form
3952a94pJ31m3K37q1K57j80j91p7K78j59J18m4j87J52J06k1q1l6J09n1K65l43
3975d2J8k4j91L48k57J51O8j49l2M08k45l03M03j07K14j71q4m8k49k8K75J6p0
3998i9J88j5N1l42j13M06o8J03M3N1p2l36P0o7J14K34Q5m62J63L89k72k66K65
4021E0j48L74j29k85J45r2M9L8q5K49n2j75L03j64K81m40K38k92m4J84k2M7m3
4044a3k27J57J23j54M9k3J02J29k45J70j85n0J8J97o6q7J68q2J03k44L02j60M23
4067D05n70K47J92l41M2n3J60k1j84j60K91J19q5K4j4J8q0k10O7J03l33L51j76
4090b08J29N8N8n2j43J67r5J02K53m15J53k2L95l02j18J14J55m31J9K23L83n18
4112i5J53k05K46p1j74K3j64L46o8J02l4k44J21O0p7L37l48L5J89o4m15M03m9
$$ plain form
4135 7 58 178 232 -265 27 61 186 377 110 -220 56 2 -33 -246 -241 -264 -105 -280 131 269 20 404 144
4158 144 12 311 141 58 96 111 152 25 161 -40 160 53 80 160 -79 -21 -126 49 118 -193 113 63 539
4181 539 -195 57 -228 -72 34 151 -72 136 -230 39 51 -92 262 190 2 0 -93 75 -42 20 -131 -182
4203 -182 135 -6 -29 -180 120 -83 -127 81 13 -142 -22 95 -88 -119 -55 -406 59 221 -49 62 216 211
4225 211 -3 62 12 39 -285 -152 40 126 -26 27 125 79 22 75 171 162 121 -389 90 -176 -164 66 -49 -180 -418
4250 -418 93 202 214 -16 -36 106 -230 -41 147 -90 579 -165 -265 -3 -77 174 -207 -123 190 119 -141 338
4272 338 129 -89 -18 48 -58 -55 25 269 152 -156 4 104 90 -48 -47 8 17 35 98 -390 -223 -11 -28 -129 101
4297 101 93 95 -70 131 10 -69 -225 268 4 222 15 128 -16 -85 23 20 -173 137 -135 11 -155 -97 137
$$ packed form
4135GN1J20N4m97K92L4J25J91k67l30K76n4l5k13Nk3J59j75M11J38k49L84k60
4158A44j32K99j70q3L8J5M1j27J36k01K00j07K7Q0k39N8j05J75O9l11L06n0M76
4181E39p34K52k85J56J06J17k23K08l66K69J2j43L54p2j88kr3J68j17O2j51n1
4203a82L17j41k3j51L00k03m4K08o8j55J20J17j83l1O4l51M65J62k70J11J54n
4225B11k14O5n0K7l24J33J92Q6j52N3R8m6n7N3R6rm1n10M79k66J2K30j15j31k38
4250d18N11J09J2k30k0J42l36J89J88k37O69p44j00K62p4K51l81Q4L13p1k60M79
4272C38k09k18P1O6j06LQ0K44j17l08J60J00j4j38JN5RJ8O3m88J67K12j7j01K30
4297A01qKj65K01j21p9j56M93k64K18k07J13j44o9J08lj93L10k72J46j66N8K34
$$ plain form
4320 137 -158 -143 43 146 117 167 -261 -39 -116 34 -141 147 -158 108 284 -90 43 90 252 171 -50 -98
4342 -98 55 117 175 -130 283 -263 -55 -37 -262 -282 -171 -159 34 -236 187 -56 -161 -228 -153 -64 -6 178 -11
4365 -11 -37 174 -115 -148 -31 79 -67 38 204 116 -21 53 73 166 99 -1 44 -70 176 -357 71 178 -206
4388 -206 -126 65 63 169 132 -131 -27 339 -92 25 96 72 39 -48 43 57 -97 63 31 109 135 161 112 -29 -132
4413 -132 -60 33 -18 -236 2 84 0 -58 87 -131 -54 21 50 -136 265 -256 -308 49 -170 123 144 123 -61 -227
4437 -227 217 -246 94 -62 -21 190 116 -25 -89 -17 -105 401 -134 99 -177 -69 -225 299 -53 -114 192 144
4459 144 161 -341 208 116 134 -144 -209 -175 390 43 -58 -148 22 42 22 23 -149 197 -79 21 220 -21 283
4482 283 117 130 152 -23 -310 118 313 15 61 1 -122 -189 213 87 -157 -74 -52 -250 -209 -58 7 29 139
$$ packed form
4320A37k95J5J86J03k9N0m28K22p7J50j75K88l05K66J76l74J33M7J62q1k21m8
4342i8J53O2N8l05M13n46K08J8k25k0J11J2J93k70M23k43j05o7P5Q9N8J84j89
4365a1k6K11k89l3J17J10j46J05J66q8j37P4K0R3o7j00M5j14K46n33M28J07l84
4388b06Q0J91kJ06l7k63J04L66m31J17P1k4l3q7R1J4j54J60l2P8K6K6m9j41j03
4413a32P2R3n1k18K38Q2q4n8J45k18P7P5K9j86M01n21n2L57k19K93K1k1j84j66
4437b27M44m63L40j56M1K11p4j41o4P2q8N06n35K33k76J08j56N24l52o1L06m8
4459A44J7n02N49r2J8k78o5L4N65l47j01r0J70K0k0Jj72L46k76J00J99k41L04
4482B83j66J3K2j75k87M28J95k98M6o0j23o7M02j26k44Q3K2j98M1J51O5K2J10
$$ plain form
4505 139 -236 -274 -14 -331 -35 -123 7 -19 56 16 20 -20 -218 283 -132 21 177 -212 -310 -372 27 -53 -128 -52
4529 -52 88 -20 225 10 145 -23 74 -82 -104 149 -199 107 -6 -44 157 242 28 -130 51 -32 -101 -48 -167
4552 -167 37 -112 -239 -109 81 -122 -77 -28 -23 45 -3 343 144 42 -202 -115 -265 301 26 -269 111 237
4574 237 96 -135 -107 173 -73 -127 -112 -127 4 -86 165 -86 -22 -77 303 88 4 98 181 -63 -138 259 -279 -70
4598 -70 113 197 16 -210 -161 157 -66 75 165 46 11 -2 -27 -85 -100 65 -101 -250 -94 -112 -131 47 -147 247
4622 247 -14 -2 242 -197 -19 180 125 116 -113 -119 25 128 137 -20 -144 -242 75 105 -8 -78 145 113 107 18 -141
4647 -141 91 -58 -182 167 -78 -12 -66 70 -151 -282 -190 -240 15 -134 91 122 47 95 -134 -22 37 30 -101
4670 -101 13 135 -27 75 298 -182 -136 421 -447 -33 -8 128 147 -140 -155 275 -22 101 43 157 10 -9
$$ packed form
4505A39l75l8K60l17K96q8J30k6P5m0Mm0j98N01m15J53J56l89r8o2L99q0p5P6
4529e2J40j08K45k15J35j68R7j56k2K53l48L06j13l8K01Q5k14j58J81q3o9N3j19
4552a67K04j49j27J30J90k03M5M9NO8m8L46j99j02k44Q7j50N66k75k95L80J26
4574B37j41k31K8K80k46n4J5j5J31r0K51k51O4n5L80k15q4R4Q3k44p5L97n38K09
4598g0J83Q4j81k26M9L18k23J41R0j19l5j3k5n8j5J65j66j49J56j8j9J78j94L94
4622B47k61J2K44m39J78J99n5rk29oJ44J03Rj57j24r8L17L0j13p0K23l2oq9j59
4647a41K32j49j24L49k45O6n4J36k21j31R2n0K55j49K25L1p5M8k29J12N9pj31
4670a01J14J22j62J02K23m80M6N57q68M14K5J36J9k87j5M30k97J23n8J14j47j9
$$ plain form
4692 -9 -343 -305 48 123 -181 -492 117 -338 -86 83 24 -102 -8 165 188 -117 -56 159 -20 27 116 37 146 42
4716 42 39 52 121 -207 209 -45 17 -3 -24 147 36 245 -76 -200 249 268 173 -71 -231 11 -54 -88 77 195
4740 195 450 -339 -11 -16 -84 4 84 21 111 76 -65 41 168 56 230 113 -237 168 233 192 -44 249 -107
4763 -107 -123 -110 134 68 -45 -1 -14 57 31 102 101 84 -74 -201 146 134 -19 -6 39 -229 -11 88 22 -150 -138 126
4789 126 75 28 158 -130 -2 19 -40 -196 145 335 -48 67 41 -6 -202 -48 2 60 -109 163 -136 168 -73
4812 -73 -62 -259 105 10 56 111 -152 -236 -12 -372 -132 -90 190 185 -96 -190 -121 46 -62 31 45 -109 -27 164 -103
4837 -103 -25 -51 92 -99 -77 180 2 -53 -189 292 65 -49 -9 -134 -62 -264 -115 -111 391 55 -12 12 -38 -71
4861 -71 245 29 -123 -69 -37 -47 -192 403 2 -205 21 155 -47 -36 151 49 17 266 31 272 260 -323
$$ packed form
4692il34L8L53P5l04l11O09m55K52J69n9j26R4J73K3l05O1K15j79M7Q9p9J09j04
4716D2lJ3O9l28M16k54O2k0k1J71j11K09l21j24M49J9r5k44j60K42o5l4J65J18
4740A95K55p89L28no8Q8Q0o3R0l5j41J06J27j12J74j17l50M05O5m1k36K93l56
4763a07j6J3K44o6j13M4j3P1k6P1jj7j58j27L47j2j53J3M5k68K18R9o6j72J2K64
4789A26n1m7J30k88J28K1n9j56L41J90l83J15k6m7j96J54N0N8j69K72k99L04k41
4812g3J1j97L64r5M6N5k63q4K24l60K40M2K80nk81r4O9J67j08R3J4j54Q2J91k67
4837a03P8k6J43j91K2K57j78n5j36M81k27j14M0j25P2k02J49MN02l36o7K4n0l3
4861g1L16k16j52N4L2j0j45N95m01k07K26J34k02J1J87j02l2K49k35K41j2n83
$$ plain form
4883 -323 -59 29 71 -3 -156 -151 69 -231 -49 -219 -233 468 -42 187 -74 -84 9 141 159 -53 149 169 196 -116
4907 -116 146 -55 -322 -121 -40 165 -139 -315 93 2 -74 96 67 100 -61 -239 193 82 101 52 170 101 121
4930 121 -65 56 -319 16 204 12 -89 -139 376 20 62 -122 -98 -116 161 -1 71 203 -47 -75 -332 15
4952 15 -123 -195 -46 179 90 18 158 -230 -468 45 -292 -89 77 93 158 -203 162 432 222 -22 129 -33
4974 -33 219 -72 -15 170 -16 -158 1 157 -129 -353 -169 -188 311 269 412 -157 13 -65 -254 -87 -326 173
4996 173 164 24 -90 246 57 -161 5 -235 32 -74 -220 50 -117 -174 -182 113 54 -82 304 82 12 -197
5018 -197 -103 -170 20 -32 -194 -38 17 -16 91 64 68 -185 -91 -159 -141 -55 -99 -159 163 3 -244 -40 -22 -78 -23 127
5044 127 284 -18 -269 -207 -49 -23 -103 231 -4 -41 -55 22 -158 293 90 218 232 159 -184 -78 178 55 -10
$$ packed form
4883c23K64Q8M2p4j53NK20l00J82j70j4P01n10K29k61j0R3J32J8k12K02K0K7l12
4907a16K62k01k67K01Q1K05l04j76M08r1p6J70k9L3j61j78M32j11J9m9J18o9K0
4930A21j86J21l75L35J88j92j01n0N15l56M2j84K4j8K77j62P2J32k50k8k57L47
4952A5j38p2J49K25q9p2J40l88k38N13l37K03J66J6O5l61L65K70k10k44J51j62
4974c3K52k91N7J85j86j42J59J56k86k24J84j9M99m2J43n69J70p8j89J67k39M99
4996A73rj40j14L36j89k18J66k40K67j06j46K70j67n7qK95n9j36L86k22p0k09
5018a97R4o7J90n2j62J56N5l3J07k7Mk53R4o8J8Q6m4o0L22j60k47K04J8n6N5J50
5044A27J57l02k51O2J58K6q0L34k35l7j4P7j80M51k03J28J4p3l43J06K56j23o5
$$ plain form
5067 -10 -391 103 58 -148 128 -43 82 271 204 117 -53 267 -260 -73 -159 192 162 69 -155 259 -46 184
5089 184 -371 19 27 -50 146 -86 -104 -146 71 123 -348 -38 -52 78 -22 -70 -223 11 226 410 -119 218 108
5112 108 4 103 79 -58 -86 234 -147 -122 14 -195 -1 -131 -171 -41 -240 -195 20 -72 -39 233 -200 -7 -425
5135 -425 73 -307 -378 -2 -5 -59 71 -80 -345 100 135 150 20 72 151 -166 -173 -67 -208 56 154 -83 -238 12
5159 12 60 44 74 1 314 -375 5 112 146 -164 163 134 -186 -39 -162 119 -11 -295 312 -151 -62 9 -132
5182 -132 130 1 230 273 134 78 90 60 -230 140 -8 -34 -57 -103 111 -52 30 -22 275 8 98 6 258 -199
5206 -199 248 32 -124 22 75 -14 209 -47 -32 -273 56 134 -10 66 27 7 42 -86 -14 -375 -183 -165 -60
5229 -60 199 99 48 -20 -185 237 11 -32 302 411 -129 122 22 -30 -53 15 -361 133 57 -51 73 -251 202
$$ packed form
5067a0l81M94m5k06K76j71J25J89o7q7j70L20n27J87q6L51l0r3k24M14l05K30
5089A84n55L90Qp7J96k32j8m2K17N2m71L10j4J30j00m8j53K34K15J84n29L37j10
5112A08j04R9k4j37k8L20l81K5J36k09J94j30m0J30j99M5K15r2L3K72m33J93m18
5135d25M98l80p1L76ln4J30j51k65M45L5J5j30N2P9l17pJ06j41K64R8k37j55K50
5159A2M8j6L0p3L13o89L80J07L4l10L27k9l20J47j23K81j30k84O07m63Q9P1j41
5182a32K62j29K29M3j39n6J2l0k90L70j48k6k3m6K14j63Q2n2K97k67R0r2K52m57
5206a99M47k16j56J46N3q9K23k56J5k41L29P8j44P6l9k0L5j28P2l61J92J8J05
5229f0K59j00n1o8j65M22k26m3L34J09n40K51j00n2k3O8l76M94p6j08J24l24M53
$$ plain form
5252 202 122 -376 46 22 -156 -22 151 43 -201 125 151 -89 -10 196 -235 76 -119 267 78 275 -174
5273 -174 94 -54 -45 -179 51 -31 258 265 -40 30 72 -21 10 115 -16 -62 -18 -161 -104 -29 9 5 -290 -122 -77 -33
5299 -33 -8 45 137 -48 -21 -145 -55 421 170 -48 -147 75 69 -125 -59 -283 -108 48 -240 115 111 -45 -18 -113 -219
5324 -219 24 -204 41 -17 115 -177 190 291 -47 -86 -148 -12 -125 -63 30 238 -46 -84 -2 -53 31 216 -30
5347 -30 -185 0 -16 170 115 3 144 74 130 26 -104 -268 300 -182 -7 -313 -158 -175 38 -46 56 -282
5369 -282 12 -61 238 295 -7 -147 127 -181 183 183 -248 15 -121 -110 -39 343 -15 -246 11 -150 -96 89
5391 89 120 334 -135 218 14 6 -184 -25 85 -24 -62 -101 154 -36 -60 -224 73 -200 -121 -151 -19 -48 -18 229
5415 229 39 18 -75 -206 -112 -263 -24 56 273 77 146 -64 47 30 -65 1 85 130 24 -91 31 -62 -80 177
$$ packed form
5252B02q0m98M22k4j78J34J73j08k44L26K6k40P9K06m31L11j95L86j89J97m49
5273a74K68j48Rj34K30q2K89Pl05P0M2r3L1J05j31m6M4j43N7P5L8mk95J68M5M4
5299c3K5N3R2j85K7j24R0M76k51k18r9K22oj94O6k24J75J56k88L55mj56K7r5j06
5324b19K43k28K45n8J32k92L67J01l38l9o2J36j13O2R3K08k84l8Q2n1Q4J85k46
5347c0j55J85j6J86n5j12J41p0N6j04j30j64N68m82J75l06J55j7K13q4J02l38
5369b82K94p3K99N7l02j40K74l08L64%m31K63j36J1P1L82l58k31K57j61N4J85
5391H9L1K14m69L53k04qj90J59J10j09l8l9K55j90k4j64K97k73P9l0J32k9L0K47
5415B29j90k1r3j31R4j51K39Q0K17j96O9k10J11j7r5O6Q4M5j06j15J22r3j8K57
$$ plain form
5439 177 105 125 -72 26 24 -18 -5 -64 17 -128 1 198 171 -120 -114 -162 -16 -301 27 194 137 166 -69 215 104
5464 104 -91 -209 -266 -46 101 126 -51 65 91 302 15 101 -38 -162 -173 131 -55 200 3 -14 -217 198
5486 198 347 315 -14 -453 41 -54 88 137 149 281 -86 -159 179 -156 148 144 -141 -176 -67 -80 -18 -126 -122 243
5510 243 -178 271 -65 37 -72 44 184 22 -61 35 -50 58 17 111 -87 79 171 -96 107 174 65 -190
5532 -190 -103 -77 -20 -105 103 53 -10 -216 -251 -89 -304 -150 -105 -89 -245 19 234 -129 208 54 135 -114 110
5555 110 228 218 -90 25 -209 -23 106 172 55 28 -9 -121 55 -70 -13 90 62 -83 95 211 82 -283
5577 -283 183 -178 67 -146 199 -58 22 122 17 -127 12 -167 -49 171 -84 342 26 83 6 -40 -198
5598 -198 -297 139 105 -11 4 -11 264 -59 -74 30 -223 -37 -216 -31 156 58 -216 55 56 -171 -21 -217 50
$$ packed form
5439A77p2K0j97R8km2J3n9Q1j45J29J97k7k91Om8J46k85L28J67n7K9k35K84j11
5464A04j95j18n7K20J47K5j77J16K6K11k87Q6j39j24j1L04j86K55j97j7k03M15
5486A98J49l2l29m39M94r5J42M9J2J32l67p3L38l35L04mk85l5J09j3O2j08ML65
5510B43m21M49l36J02j09J16J40j62q3R6q5J08m1R4j98J66R2k67K03O7j09k55
5532a90Q7K6N7q5K08n0o3k06l5J62k15J54M5J6j56K64K15l63L37j54Q1k49K24
5555A10J18j0l08J15k34J86J29O6j17k7l7j12J76j25N7J03k8j45J78J16j29l65
5577b83M66l61K45k13L45k57Q0J00j05j44J39j79J18K20k55M26l16N7p7m6j58
5598a98r9M36l4j16J5j5K75l23j5J04k53J86j79J85J87r8k74K71Jk27J50j96K67
$$ plain form
5621 50 41 29 -115 -49 -39 -208 -375 162 -50 -158 -41 165 341 149 165 -97 -173 -96 95 -162 -77 -8 -57 -83
5645 -83 189 66 164 -70 51 230 90 13 -196 -87 -45 37 6 -37 38 2 -271 -193 9 76 289 -96 30 27
5669 27 139 -185 37 21 144 65 -120 41 -174 -190 -116 344 24 -158 -99 72 298 -187 -100 -11 107 20 -284
5692 -284 96 -218 284 130 -115 -31 20 90 223 -18 -118 -12 -161 2 -84 272 -201 363 -42 43 -129 216
5714 216 -100 -133 -37 111 -77 -86 -370 87 13 -38 24 83 -24 33 49 -29 219 -331 -199 153 -122 -46 5 131
5738 131 -86 -291 7 -108 -54 148 152 117 -78 -61 -9 92 -2 124 0 -56 111 -115 100 134 -45 24 -61 -108
5762 -108 90 -102 -300 -270 -97 -42 -148 409 151 64 6 152 133 -157 -54 -4 66 53 -48 -211 -280 -36 -159
5785 -159 -156 -5 89 32 10 -62 -186 -82 -2 42 122 137 19 309 242 150 0 57 71 -107 -355 61 118 -42 225
$$ packed form
5621E0rj2j44O6J0j69j67N37k12j08J17K06J76j92J6k62p6P7J91k57Q5O9m9k6
5645h3K72j23R8k34J21J79j40p7k09J09M2Q2l1m3P5l6k73P8K02O7K13l85J26l
5669B7J12l24K22j6J23p9j85J61k15j6P4M60l20j82N9J71K26m85Q7Q9J18q7l04
5692b84L80l14N02j54k45Q4N1P0J33k41j00J06j49J63q6L56m73N64m05Q5j72L45
5714B16l16l3R6J48j88rk84M57p4n1O2N9j07N7J6p8K48n50J32L52k75P6N1J26
5738A31k17k05K98j15N4K02Ml5j95J7N2J01r4J26j24n6J67k26K15L4j79O9q5m7
5762a08J98j92j98L0J73N5j06N57k58q7n8J46j9k90J03N0P0j3j01j63o9K44j23
5785a59LJ51R4n7k2p2j24J04Q0M4Q0J5j18K90o7r2j50N7J4j78k48M16N7j60K67
$$ plain form
5810 225 -243 -294 143 -37 -61 164 61 -23 213 182 122 7 -128 252 -24 193 -188 10 -346 -32 95 -169
5832 -169 96 163 -232 -72 211 224 96 -345 -219 12 33 -72 -6 -104 77 4 482 111 -88 45 5 47 -20
5855 -20 -195 27 -309 343 -155 110 215 -36 -28 -172 -19 -186 -99 121 -94 141 264 -48 -80 -214 -171 -242
5877 -242 -79 49 128 143 -95 -115 -42 -148 -2 -19 122 62 -176 124 70 -139 -227 142 -112 65 -57 246 -208
5900 -208 -200 -37 9 -53 -40 189 -175 -89 153 -177 -130 -41 144 -41 -22 -218 198 117 -157 119 -171 269 173 69
5924 69 63 -135 -83 40 -169 54 273 -68 89 -3 11 75 -151 29 159 -39 -90 -4 -68 -225 -235 32 4 160
5948 160 -140 -51 21 20 -9 26 -207 -7 364 116 -50 194 -305 63 128 -94 38 -161 -97 147 -72 -148 56
5971 56 267 87 -124 281 17 -25 -51 121 -60 -108 85 111 -216 135 -222 -42 73 -28 16 -86 -112 -90 -319
$$ packed form
5810B25m68n1M37j80k4K25j03q4K36l1o0j15j35L80k76K17l81J98l56L14J27k64
5832a69K65O7l95J60K83J3j28m41J26K31K1j05O6r8J81p3M78l71j99J33m0M2o7
5855b0j75K22l36O52m98K65J05k51Qj44J53j67Q7K20k15K35J23l12l2j34M3p1
5877b42J63J28P9J5k38k0P3j06J46j7J41o0k38L00n4k09q8L69k54J77j22L03m54
5900b08QJ63M6o2J3K29l64Q6K42l30M7Q9J85j85J9j96M16q1k74K76k90M40r6j04
5924F9oj98N2J23k09K23K19l41J57r2J4O4k26J80J30j98n1Q6o4j57j0K67k8J56
5948A60l00Q9P2jk9L5k33K00L71k48j66K44m99L68O5k22J32j99O4K44k19p6K04
5971E6K11j80k11M05k64m2k6J72j81m8J93K6l27L51l57J80J15j01M4j02k6K2k29
$$ plain form
5994 -319 87 -286 -122 41 -88 -58 177 -319 -113 -18 101 253 149 -92 130 -181 -197 90 -5 -107 -15 80
6016 80 -49 -75 -47 127 257 308 100 24 -67 -186 130 -88 -3 231 -34 -141 -49 96 145 -229 -168 -183 89 -4
6040 -4 -55 116 158 -4 117 -112 50 -159 46 -12 156 -60 124 115 -42 -123 -236 337 -68 -224 17 57 -134
6063 -134 -71 -127 247 -73 116 -169 -27 -142 49 95 -88 -22 -285 107 -23 64 33 49 83 -62 -115 210 111
6086 111 31 -172 -123 -90 103 -121 1 -112 56 -28 -102 -135 149 424 -78 172 200 -16 -112 -23 70 264 -319
6109 -319 -144 184 94 16 -100 43 -152 -84 -71 39 -157 269 22 -254 -74 270 109 -35 95 -86 -26 181
6131 181 -70 61 -33 -127 -8 61 183 -156 -184 -60 7 -97 86 -197 134 -31 32 67 127 -261 -68 162 126
6154 126 -152 232 -108 -300 -86 -115 -54 43 315 58 82 -124 31 71 -64 102 -128 -127 -183 -175 -210 281 211 117
$$ packed form
5994c19M06l73J64J63j29L0K35m96K06R5J19J52j04k41K22l11j6K87r5j02R2R5
6016H0j29k6K8J74J30N1k08p6r1j19L16k18Q5K34k65j07R2J45M9l74O1j5K72r3
6040dn1J71M2j62J21k29J62k09K05n8J68k16J84rj57q1j13N73m05j56K41M0j91
6063a34O3n6L74l20J89k85J42j15J91M6j83O6k63L92j30Q7l1J6L4j45n3L25r9
6086A11q0k03M9L3J93k24J22j13J68q4p4l3K84K75n02K50K8k16r6Q9R3J94n83
6109c19J75L28r0p8j16J43j95O8J3J10j96M26k47k76J80L44j61j44J30j81O0K07
6131A81k51J31r4r4J19O9J22l39k8J24O7j04J83k83L31j65O3L5O0l88J93K30l6
6154A26k78L84l40j92K14k9O1R7K72k57K4k06J55M0j35J66k30Jn6Ql5M91p0r4
$$ plain form
6178 117 -30 132 27 69 245 204 127 141 -72 66 228 58 107 -217 29 -199 -147 241 93 -115 -56 -88 -166
6201 -166 26 126 -27 64 165 45 61 -270 -279 80 48 87 -144 -152 -26 -22 -55 -84 52 14 63 57 -97 -158 -305 -95
6227 -95 -213 58 -33 -222 71 -130 78 -43 -50 -129 -145 10 6 -13 52 9 139 -37 178 52 232 -177 -18 63
6251 63 79 19 -140 322 -345 94 -146 245 -194 -2 -104 58 -140 138 -289 -127 -3 40 9 175 -14 71
6273 71 59 87 157 -241 9 -107 -71 20 -1 0 -53 -141 -130 112 204 145 20 -325 95 -41 244 12 -338 117 -40
6298 -40 -158 96 74 348 -82 15 58 -74 -42 -22 -272 -2 -126 -132 -190 -231 63 -64 49 80 -226 108 79 4
6322 4 -79 -110 102 -36 107 -307 133 -107 31 -172 -131 -225 25 54 -133 -228 -224 172 -207 -220 -86 -33 141 -139
6346 -139 -148 164 -209 -235 -37 -109 -86 -277 30 -187 -121 146 9 -199 -65 -109 193 -214 -46 159 -230 45
$$ packed form
6178A17j47J62j05M2J76m1p7J4k13J38J62j70M9l24K46k28N2L88j48k08N9l2p8
6201a66J92J00j53R1J01j20J6l31rL59l2L9k31qJ26Ml3k9J36l8M9oj54o1j47K10
6227i5j18K71r1j89K93k01K08j21pp9j6J55mj9O5m3J30j76K15j26J80m09J59Q1
6251F3J6o0j59M62o67M39k40L91m39J92j02J62j98K78m27J62J24M3l1J66j89Q5
6273G1j2K8P0l98K50j16L6R1k1Jn3q8J1K42R2n9j25l45M20j36K85k32l50M55j57
6298d0j18K54k2K74m30R7M3j32L2K0k50K70j24on8m1K94j27J13L1l06L34k9p5
6322Dq3l1K12j38J43m14M40k40J38k03M1r4K50K9j87r5ML96l79j3J34N3J74k80
6346a39rL12l73k6J98p2K3j91L07k17O6K67j37k08J34m4L02m07J68K05l89K75
$$ plain form
6368 45 -22 30 9 -117 -108 -139 -262 77 -202 13 91 -170 -137 172 18 -110 242 23 -214 -77 -140 134 -266
6391 -266 -9 -177 18 123 5 -2 -61 89 31 120 177 -80 -165 -77 353 -309 -49 84 147 140 -90 -74 -163 -36
6415 -36 71 327 -112 125 -29 -227 -149 79 -246 -85 -108 148 -166 34 86 393 260 -142 39 107 106 76 -10
6438 -10 -35 132 23 -40 140 270 -242 -81 -132 138 -74 192 22 54 9 58 -122 88 304 155 49 51 -53
6461 -53 -129 101 -28 319 20 112 -83 -5 90 167 47 158 -27 -106 -2 139 38 88 -48 -168 -147 127 -144
6484 -144 79 108 -232 -31 124 -65 -62 -81 -117 171 -73 237 -49 -7 38 72 53 -49 293 257 -34 57 -77 32
6508 32 109 72 21 115 14 -12 117 -5 -20 -158 -210 -286 -111 -120 -9 38 -32 319 -30 -53 -105 -50 20 32 -58 -123 13
6535 13 -94 -151 72 211 4 98 -16 -20 385 103 248 113 -126 -78 264 -116 47 -31 206 56 24 -97 193
$$ packed form
6368D5o7N2k1j26Rl1j23L39k79K15P8k61L3L09j54j28L52k19k37J37o3K74m00
6391b66K57j68J95J05j18pn9J50n8Q9N7k57q5Q8M30o62K60J33O3pk30J6q9J27
6415c6J07K56m39K37j54j98P8K28l25J61k3K56l14K00N2L07j33m02J81O8jl0q6
6438a0k5J67j09o3J80J30n12J61n1K70k12K66j70L2m5M9j80K10K16j49j06Kj04
6461e3p6K30j29L47k99R2j95P8R5P7j20J11j85p9J04J41j01N0j36j20K1K74k71
6484a44K23K9l40K01J55j89Lj9l6K88k44L10k86M2M5L4j9j02L42l6k91R1j34J09
6508C2P7l7n1R4j01k6J29j22j5j38n2p6J75rJ11M7p0L51l49k3n2N5P0J2r0o5J36
6535A3j07n7K23J39k07R4j14mM05k82J45j35k39M8L42l80J63p8K37j50l2j21K90
$$ plain form
6558 193 246 58 -4 77 85 -187 71 -176 -233 -29 -167 46 -81 176 46 -111 -24 -159 -26 -306 -110 -36 15
6581 15 -161 49 -195 0 -171 112 87 -68 29 -147 -41 -129 -77 257 -276 -169 184 -112 210 -73 -117 205
6603 205 258 36 -64 79 -172 118 -89 -178 11 -115 202 411 -9 139 -262 59 -12 16 -268 -122 -33 -83
6625 -83 -50 -271 109 2 63 91 142 31 54 74 -64 85 -67 -81 241 149 28 223 -168 214 -163 -163 -26 -47
6649 -47 -120 120 81 61 -119 27 -70 25 -115 161 -226 -17 -71 -45 -124 182 -77 12 71 131 317 -69 407 186
6673 186 -87 -212 98 -160 -72 -19 157 -100 31 377 66 -83 319 -291 160 -32 4 -178 -245 -125 -197 156
6695 156 -229 -18 193 7 22 19 86 48 17 -9 22 -80 113 17 120 -141 -67 -109 -26 -7 -33 169 138 9 53
6720 53 63 -32 200 -35 95 -31 -6 -274 -325 -225 -5 264 -232 -73 27 -22 -177 56 -22 161 -19 -233
$$ packed form
6558A93N3j88o2Q1Qk72K58k47n7K04j38K13j27K57j30j57Q7j35J33k80J96P4N1
6581A5j76K10k44J95j71K83k5j55R7j76J06q8N2L34n33J07L53k96L22k83m4L22
6603B05N3k22j00J43k51K90k07q9J89j26L17K09m20J48m01L21p1K8k84J46Q9n0
6625h3L3k21L80j07O1K8N1j11K3K0j38J49j52j4L22r2j21J95l91L82l77%J37k1
6649d7p3K40l9k0j80J46r7R5j40K76l87K09n4K6p9L06k59Q9N9O0J86l86M76k21
6673A86k73j25L10k58Q8N3J76k57J31L46l11j49M02o10M51j92L6j82o7J20p2L53
6695A56l85K11K11j86J5lO7l8l1k6L1j02J93r6J03k61P4m2Q3J9k6K02l1j29M4
6720E3J0r5K32k35J30j26K5k68n1J00K20K69m96J59J00m9j55K33p8J83j80k14
$$ plain form
6742 -233 142 -288 20 106 -48 -81 -202 -204 16 16 -32 -177 289 -35 67 -213 -52 262 -186 -23 -356 110
6764 110 8 183 211 -121 -96 -322 20 -254 61 13 -109 -172 132 -61 15 -136 -149 282 -210 27 -30 44 168
6787 168 -20 -1 523 -174 12 -137 -216 -59 -144 349 55 -220 8 115 -73 69 13 38 -157 100 68 -43
6809 -43 49 117 1 -295 -110 11 25 -86 -33 -208 -156 32 -167 5 77 115 210 99 -169 50 219 80 67
6832 67 -21 39 57 12 143 -135 -70 215 4 21 -226 27 -51 -27 148 6 105 14 143 36 -89 -323 83 -348
6856 -348 -110 -5 -128 -93 125 -5 124 42 190 75 -42 -145 57 -114 -42 23 131 153 -84 -408 -17 39
6878 39 -159 -184 215 -42 55 -121 102 52 -319 171 215 -27 162 128 194 180 -287 -217 79 81 170 -178 -117 119
6902 119 -163 -120 287 269 -237 226 -2 -130 134 106 100 62 66 130 262 -61 48 106 -343 -28 -50 26 197 -93
$$ packed form
6742b33L75m30L08Q6j54l3j21kK20%m8j45M66l24J02k80J61L14m48J63l33M66
6764A10j02J75K8l32K5k26L42k74L15m8j22o3L04j93P6j51j3M31m92K37n7P4J24
6787A68j88J9N24o97J86j49p9J57q5M93k94k75K28J07j88J42n6K5j95K57l2j11
6809d3R2O8j16k96J85J21J4j11N3j75N2J88j99J72P2L8R5j11k68K19J69j39j3
6832F7q8O0J8m5J31k78O5K85k11J7k47K53p8K4J75j42R9r1J29j07j25k34M06m31
6856c48K38J05j23L5K18j30J29q2J48j15j17j03K02j71P2O5J08K2k37l24L91N6
6878C9j98k5L99k57R7j76K23n0l71M90M4k42J89l4O6j4m67P0K96KQ9l48O1K36
6902A19k82M3M07j8n06M63k28j28K64k8ol8MO4J32l23J09N8m49L15k2P6J71k90
$$ plain form
6926 -93 -189 20 -62 53 -161 13 -296 4 -349 161 -61 -72 77 148 -1 0 49 180 -40 27 151 -50 100
6949 100 357 -32 -95 -15 -36 -150 120 -31 -27 55 150 111 -120 33 -85 27 -7 -60 -74 115 -90 -89 -46 47 123
6974 123 65 -166 -148 298 -55 -1 232 -123 -25 -18 75 -63 -159 102 58 371 202 93 22 -95 -29 -11 -71 144
6998 144 -111 -279 -146 -84 -74 199 19 -81 61 -13 -21 -157 73 -307 -148 -87 -273 4 -97 -41 140 -251
7020 -251 116 -33 245 37 148 2 293 -65 -58 -55 -10 -119 144 222 178 -105 99 -147 -18 -69 -7 -114 -5
7043 -5 132 343 -47 55 119 -218 -36 -73 58 55 207 -313 -169 13 -237 -20 96 207 242 241 -222 -10 72
7066 72 -170 167 -127 137 -11 6 -95 188 -45 -300 -21 9 96 258 -138 -183 164 -123 241 -1 -101 8
7088 8 -71 147 304 -112 -330 184 -77 -146 -256 -185 -22 -78 292 159 -4 135 73 -95 -159 124 34 32 -6 -359
$$ packed form
6926i3r6K09q2J15k14J74l09L00l53N10k22j1J49P1j49JM9J31k20O7J24k01J50
6949A00K57l89o3Q0k1j14K70j51MQ2R5l9k31J53j18J12l4n3j4J89k05JM3R3P6
6974A23n8k31J8M46l53N4K33l55R8PR3j38r6K61m4L13j69j09p1j17O6J8o0K15
6998A44k55j68J33O2J0K73j80j00J42p4qj36K30l80J59O1j86K77j01N6J81l91
7020b51L67j49K78k08J11j46K91l58PLM5j09K63P8m4k83K04k46J29n1O2j07J09
7043eJ37K11l90J02O4l37J82l7J31lJ52n20J44J82k50K17J16J11L5jm63K12Q2
7066G2k42L37k94K64j48J7j01K83k33k55K79L0Q7J62l96m5L47k87L64k42j00J09
7088Hp9K18J57m16k18N14k61o9j10P1J63n6L70j33j63J39o2j68o4K83r0kl8l53
$$ plain form
7112 -359 51 28 184 -110 179 11 53 -211 37 -119 -386 112 58 93 -214 123 92 -16 126 -178 178 -29
7134 -29 60 208 307 233 -203 361 -53 191 213 -99 23 -142 -68 103 85 -93 -183 -96 36 103 31 -186 102 86
7158 86 150 17 -20 51 -107 -152 -101 26 126 -69 -293 -161 -246 53 -121 -104 27 -159 -142 203 -28 3 17 -277
7182 -277 -188 -27 -95 -157 191 -244 -121 -162 233 129 184 -207 189 -4 -67 8 21 46 -228 154 -204 -79 -284
7205 -284 2 -230 150 -215 237 44 -80 -34 100 -26 -346 -86 -367 -278 -66 -49 83 -39 129 124 81 -125
7227 -125 90 64 -33 64 -133 79 20 266 39 185 144 -361 -45 60 -48 56 211 120 16 -21 -15 98 -65
7250 -65 -144 -202 46 -170 43 2 -103 -169 -315 -116 -353 99 12 -29 13 -129 285 -91 -74 17 -265 8 -57 -51
7274 -51 -154 146 25 154 -408 -131 159 -255 116 -204 207 2 160 108 -538 51 90 -104 -180 -38 54 -342
$$ packed form
7112c59M10k3J56k94K89j68M2k64K48j56k67M98n4L5l07L37l1j08J42l04L56k07
7134b9Q9J48R9p4m36N64m14K44K2l12J22j65P4J71j8j78r0Q7J32O7p2k17K88j6
7158H6O4j33l7P1j58m5N1J27J00j95k24J32q5K99j74J7J31j86J7L45k31L1J4k94
7182b77Q9J61o8o2L48m35J23m1L95j04N5l91L96j93o3P5J3K5k74L82l58J25k05
7205b84K86k32L80l65M52j93j24M6J34j26l20K60k81Q9K12J7J32j22J68nm3k06
7227a25K15k6r7R7j97K12n9K46k27J46m1n05L16J05j08J04J55r1j04l7OJ13j63
7250f5p9n8K48k16K13m1j05o6j46J99k37M52q7m1M2j42M14l76J7R1k82K73o5O
7274e1j03L00j21J29n62K77K90m14L71l20M11k05J58n2o46N89L9j94p6J42R2l96
$$ plain form
7296 -342 73 -125 121 -277 -4 -139 -84 119 64 71 -30 -28 96 115 -154 -109 -106 87 -41 -107 -146 30 128 -160
7320 -160 223 67 -110 -2 177 94 -186 -146 -211 91 42 -286 -99 120 78 138 -57 -88 184 -151 -305 -123
7342 -123 -77 137 34 76 137 198 104 200 -226 -175 -6 -226 213 123 66 -69 82 136 -106 140 -89 105 -162
7365 -162 -373 -11 73 -176 -195 -286 -229 92 -18 110 58 38 9 -132 42 118 122 86 -232 -153 -64 -162 -148 332 75
7390 75 -97 77 -103 -121 13 -15 121 -233 30 -48 34 -175 107 -58 300 -295 -184 -24 -95 17 -96 48
7412 48 407 -22 183 -326 -227 82 158 -79 -135 -76 94 47 -18 -262 193 235 90 151 139 -52 94 -134 122
7435 122 81 7 -178 -21 39 132 78 303 -99 450 -26 72 2 -38 15 -120 -279 236 117 -124 -56 10 -206 243
7459 243 -357 -15 113 32 -95 -175 65 73 381 249 214 -12 101 61 -4 216 -8 253 -61 -14 -145 -84 63
$$ packed form
7296c42M15j98K46l98K73j35N5K03n5Pj01KJ24J9k69M5LJ93j28o6l9J76R8k88
7320a60L83j56j77J08J79q3k80M0o5L02m9l28J87K19m2O0j95l1K72l35j54J82
7342a23M6K14j03M2O1O1r4R6m26N1J69k20M39r0n7j35J51N4k42K46k29J94k67
7365a62k11L62Q4k49j9r1N7L21j10J28n2k0k9j41J74P6Ml6l18P9Q9r8J4M80k57
7390G5j72J74j80j8J34k8J36l54K63p8Q2k09K82j65L58n95J11J60p1J12j13J44
7412D8L59m29K05n09R9L09P6k37n6N9J70m7o5k44M55M2j45O1j2j91J46k28K56
7435A22m1p4j85J57O0R3n4K25m02N49m76R8p0m0N3j35j59N15j19k41O8O6k16M49
7459B43o00L42J28q1j27q0K40QL08j32l5k26J13m0o5K20k24K61l14M7j31O1J47
$$ plain form
7482 63 -54 -194 366 -130 -140 -80 26 415 -284 237 -352 283 19 28 -279 63 101 16 -96 83 -6 -153 20
7505 20 60 235 -40 -105 75 -132 7 71 -214 52 -110 -147 75 180 17 33 -14 13 210 -147 -20 321 -16
7528 -16 -5 107 -198 -127 183 52 61 -12 -169 57 -149 -68 -99 -55 -23 70 -41 118 139 174 172 -130 90 -232 121
7553 121 7 131 -358 10 266 40 87 15 -152 14 -63 -47 -115 -81 -57 -15 -242 -16 52 -156 -7 223 -155
7576 -155 -90 -262 39 -149 -198 -211 47 70 -176 28 -53 -202 -1 39 5 39 -100 -11 -232 46 -406 -222 -88
7599 -88 -153 71 -26 22 -89 172 -187 -139 262 -69 -135 167 208 -179 4 -54 -102 -37 -51 -57 -147 180 122 255 -81
7624 -81 2 38 31 104 271 218 -13 -45 100 16 188 214 43 77 -29 102 -40 -23 130 286 119 -85 -169 -41
7648 -41 -65 -132 -104 194 159 19 243 0 289 5 278 -213 -15 144 -283 -200 180 -170 -177 34 31 -175 155
$$ packed form
7482F3j17j40N60m96j0O0J06L89o99N21n89O35k64Rl07L42L8q5j12J79q9j47J73
7505B0M0J75k75o5J80k07J39O4k85K66j62l7K22J05j63J6m7K7J97l57J27L41l37
7528a6J1J12l05P1L10j31Rp3j57K26k06Q1l1M4L2R3j11J59K1L5kl02K20l22L53
7553A21j14J24m89L68K56k26M7p2j67J66p7J6o8L4K4M2k27K26O8k08J49K30l78
7576a55O5j72L01j88m9j3K58K3k46K04q1j49K01M0l4L4j39Q9k21K78m52J84J34
7599h8o5K24r7M8j11K61l59M8M01l31o6L02M1l87J83n8m8O5j4or0L27n8J33l36
7624h1Q3L6pP3J67n3k31l2J45q4J72K6j71L4j06J31j42J7J53J56j67k04q4J28
7648d1k4o7K8K98l5j40K24k43K89k84K73m91J98J59m27Q3L80l50pK11lk06L30
$$ plain form
7671 155 -114 -116 171 -220 12 -84 0 -59 140 -10 -193 -100 -100 161 290 296 -101 -22 -97 14 -165 -151 75 -72
7695 -72 142 43 257 -447 -243 166 -64 -32 132 74 117 -13 156 135 120 277 -44 154 -64 82 -64 11 -228
7718 -228 49 158 8 53 122 -142 -46 70 13 -94 217 145 168 39 -141 -174 -92 596 158 266 25 -23 -43
7741 -43 -193 -20 220 42 314 68 256 93 234 61 -161 -100 9 -371 -19 218 22 -89 118 18 -145
7762 -145 -7 -3 -25 -246 28 252 -88 -404 78 -58 -20 -107 316 -89 132 171 -151 6 -191 59 67 150 -18
7785 -18 13 48 -78 90 202 107 53 -5 -147 -135 -40 -125 72 -82 -48 -72 -42 70 -159 -60 -24 -317 219 -31 -51
7810 -51 160 -110 -50 310 -67 -69 -80 -101 -128 71 -61 169 17 -94 -90 145 255 -287 -108 -57 -235 40 -17 -16
7834 -16 -42 120 268 33 130 119 -39 -84 28 175 -5 -41 121 -166 29 151 -242 -243 101 -109 179 -118 -125
$$ packed form
7671A55k69kK87l91K32r6Q4n9J99j50j83R3%K61J29Ol97P9p5J11j79J4K26j47
7695g2K14r9K14p04K04M09k30L2J64n8M3j30J69k1j5J57l21J98k18J46j46P5k39
7718b28K77J09j50M5O9k64R6J16n7j07L11p2K3j29j80l3Q2O88m38J08k41m8k0
7741d3j50J73K40j78K72k46J88j63J41j73k22O1J09l80L52K37j96j11K07j00j63
7762a45J38Mk2k21K74K24l40l16M82j36L8q7M23m05K21L9l22J57j97K50QQ3j68
7785a8L1L5j26J68J12r5n4n8j42J2R5q5J97j54L4k4L0J12k29R9L6k93N36k50k0
7810e1K11k70O0L60l77kj1k1k7J99j32K30j52j11MK35J10n42J79N1j78K75n7J
7834a6k6J62J48k35R7j1j58m5J12J47j80l6J62k87J95J22l93jL44k10K88k97p
$$ plain form
7857 -125 -76 -102 -175 -165 65 171 162 -30 225 -162 32 -32 -41 52 -22 -177 -129 -27 -127 32 -106 -201 185 199 102
7882 102 -152 96 -15 30 -101 -100 -63 99 -267 -78 45 61 -105 90 127 -196 -147 476 345 18 65 43 -181
7905 -181 -91 -170 350 61 93 -209 -8 165 15 -180 -117 56 85 117 150 239 450 8 123 375 1 3 103
7928 103 211 -159 -51 -294 383 -161 -83 170 -57 15 -148 -176 13 111 46 101 -102 -198 43 49 -153 158 27
7951 27 -15 -24 -43 18 -146 -153 127 87 -57 62 43 -130 99 -148 66 229 -74 198 -207 139 167 124 24 -3
7975 -3 243 -54 126 190 -75 -12 -18 15 -80 -221 104 125 -160 58 -36 -18 62 -302 267 -1 68 -58 -114 288 -18
8000 -18 139 -134 8 129 198 357 -173 -81 58 265 270 69 121 60 16 245 -162 -3 151 127 -19 216 -92
8023 -92 326 -259 -195 347 -117 -28 132 149 -107 -17 -6 10 47 -10 -115 102 387 33 8 -91 -126 94 -38 -302
$$ packed form
7857a25M9k6p3J0K30J06rj92K55l87J94o4rR3p4j55M8J02j00J59j38r5L86J4r7
7882A02k54K48j11M5j31JL7J62l66J89J23J6j66J95L7l23M9O23j31l27M7k2k24
7905a81R0p9N20k89L2l02K01J73j50j95O3J73K9L2L3Q9K11m42J15K52l74KJ00
7928A03J08l70J08k43O77n44P8K53k27P2j63k8J89R8o5N5k03r6K41Ok02L11j31
7951B7m2rj9O1j64pK80m0j44J19j9j73K29k47K14J63l03K72m05L46K8m3j00k7
7975cK46k97J80O4k65O3oL3r5j41L25K1k85K18r4J8Q0l64N69k68O9j26n6M02l06
8000a8J57k73J42J21O9J59n30R2J39K07Nk01N2o1m4K29m07J59J54k4j46K35l08
8023i2M18n85O4N42m64Q9J60J7k56R0J1J6L7n7j05K17K85l54k5r9l5K20j32k64
$$ plain form
8047 -302 106 117 82 104 57 -19 -96 -2 -16 44 -43 -94 -113 112 -37 90 199 138 -35 267 29 -80 54 -254
8071 -254 -194 196 36 199 145 118 -87 343 -84 -139 -108 91 -34 -188 -79 -19 89 97 -124 -155 165 66 -25 -348
8095 -348 -94 -117 149 29 -285 16 95 -53 -155 -107 89 190 -123 143 -25 -188 150 -164 -260 189 -292
8116 -292 -72 7 -164 -169 252 -113 -3 103 5 -15 -371 178 149 272 -101 11 -78 -121 -31 20 -5 169 138 64
8140 64 -52 -113 -13 42 24 87 -23 220 130 -23 -157 -24 279 -92 -139 -18 207 60 -35 192 72 -38 123
8163 123 -125 5 -68 24 222 -83 68 44 28 258 -141 -99 5 -45 -77 62 493 -68 154 -206 157 61 83
8186 83 -92 235 -26 -87 228
$$ packed form
8047c02M08J1l5K2m7p6p7R4j4O0q7n1j9K25j49J27J09o1j73L02k38j09J34l08
8071b54O0L90j60J63n4k7k05M30m27n5L1J99j25j54J09O0J08Qk21l1L20r9r1l23
8095c48K54k3K66j20l14L01P9j48j02M8J96J01l13K66j68j63L38l14r6M49m81
8116b92K20P9j71nM21l65J10J06r8k0l56N49k9J23l73J12q9m3R0N1k5J74l1p4
8140F4j16o1J00N5j8O3j10K43r0j53j34J33L03l71m7J21K25j47r5K27j20j10J61
8163A23k48J30p3R2J98l05J51k4j6K30l99M2J04n0l2J39M31n61K22l60L63r6K2
8186H3j75L27k61o1L15
8191B28
$$ Imaginary data points
##PAGE= N=2
##DATA TABLE= (X++(I..I)), XYDATA
$$ plain form
0 0 0 0 0 0 0 0 0 0 0 0 0 0 0 2 -8 8 -8 8 -8 8 -15 16 -16 18 -24 24 -28 32 -36 41 -47 52 -59 67 -74 82 -91
37 -91 100 -111 123 -137 152 -167 187 -206 229 -254 284 -318 357 -404 462 -533 625 -746 917 -1174
57 -1174 1604 -2455 4772 -21687 -79493 -15688 42505 30783 -16917 -30794 -5129 26712 16505
70 16505 -18707 -23859 6059 23705 9948 -18270 -25502 5502 33436 6261 -31593 -18612 19807
83 19807 23426 -2790 -24517 -15486 17293 26907 -6492 -29922 -7223 22605 19394 -8501 -27467
96 -27467 -7473 27926 20896 -20799 -27403 7451 25854 8047 -17203 -20546 4690 26898 8682
109 8682 -23307 -18765 11243 24366 5555 -23137 -20983 16567 30958 -5805 -31924 -6147 23586
122 23586 16582 -9029 -22362 -6759 21227 19032 -13296 -24403 232 22154 14420 -14101 -25555
$$ packed form
0@%%%%%%%%%%%%%Kj0J6j6J6j6J6k3L1l2L4m2M8n2O0o8P7q8R9j11J26j41J56j73
37i1J91k11K34k60K89l19L54l93M35m83N38o02O75p61Q66r95J158j371J663k091
57a174K778m059P227k6459n7806O3805N8193j1722m7700j3877K5665L1841j0207
70A6505l5212n152K9918J7646j3757k8218p232L1004K7934k7175l7854J2981L8419
83A9807L619k6216k1727R031L2779R614l3399k3430K2699K9828l211k7895j8966
96b7467J9994L5399p030m1695o604L4854J8403j7807k5250l343K5236K2208j8216
109H682l1989M542L0008J3123j8811k8692K154L7550J4391l6763k6119K5777K9733
122B3586p004k5611j3333J5603K7986k195l2328j1107K4635K1922p734k8521j1454
$$ plain form
135 -25555 2157 29796 9378 -25684 -17815 13033 21124 1921 -18966 -16601 11415 24683 -1348
148 -1348 -24426 -10212 16278 18764 -3502 -23228 -10467 21004 19915 -13618 -23359 1835 19690
161 19690 10427 -10767 -19833 -509 22120 10667 -17494 -17711 6336 19844 7736 -17168 -19544
174 -19544 10239 25545 -923 -24127 -8473 15287 15706 -2771 -18255 -9640 15665 18786 -7535
187 -7535 -20748 -3315 16745 14597 -7998 -22092 -2333 23704 11171 -17994 -16429 7108 17529
200 17529 5646 -13587 -16374 6363 21497 2681 -19541 -11215 10786 16863 958 -18625 -11933
213 -11933 15734 18558 -7841 -19383 -1698 14326 11571 -5602 -17533 -3952 18127 11881 -12510
226 -12510 -15981 2332 15732 9292 -12274 -17916 5500 20969 2261 -17812 -8991 9493 13445
$$ packed form
135b5555K7712K7639k0418l5062P869L0848Q091j9203k0887K365K8016J3268k6031
148a348k3078J4214K6490K486k2266j9726J2761L1471j089l3533r741K5194J7855
161A9690r263k1194r066J9324K2629j1453k8161k17K4047J3508j2108k4904k376
174a9544K9783J5306k6468k3204J5654K3760M19j8477j5484Q615K5305L121k6321
187g535j3213J7433K0060k148k2595j4094J9759K6037j2533k9165J565K3537J0421
200A7529j1883j9233k787K2737J5134j8816k2222Q326K2001O077j5905j9583O692
213a1933K7667K824k6399j1542J7685J6024k755j7173j1931J3581K2079o246k4391
226a2510l471J8313J3400o440k1566n642K3416J5469j8708k0073Q821J8484L952
$$ plain form
239 13445 1283 -13882 -11252 10255 16882 -3304 -16948 -5505 11607 13655 -3611 -18651 -4832
252 -4832 18110 11120 -12548 -14348 3185 13068 7403 -8641 -15165 1970 17607 5012 -14223
265 -14223 -11245 6031 14586 3621 -14587 -12070 10865 16166 -4318 -15226 -3981 9747 10734
278 10734 -1727 -14779 -5983 13859 11621 -8185 -13887 -629 12423 9814 -7958 -16078 2287
291 2287 16900 3596 -13040 -8495 4842 11081 3940 -10481 -11334 6692 14721 -316 -13330
304 -13330 -6616 7710 12200 -663 -15038 -5941 13527 10070 -7940 -10954 -384 8955 7957 -4758
318 -4758 -13179 -835 13955 5802 -9817 -10220 2693 11566 5022 -10681 -11421 7376 13401 -1494
332 -1494 -11245 -4468 5700 9632 1221 -11532 -7509 9678 10973 -4681 -11525 -2554 8989 9514
$$ packed form
239A3445j2162j5165K630K1507O627k0186j3644J1443J7112K048j7266j5040J3819
252d832K2942o990k3668j800J7533R883n665j6044o524J7135J5637j2595j9235
265a4223K978J7276Q555j0965j8208K517K2935N301k0484j0908J1245J3728R87
278A0734j2461j3052Q796J9842k238j9806n702J3258J3052k609j7772q120J8365
291B287J4613j3304j6636M545J3337O239p141j4421q53J8026Q029j5037j3014
304a3330O714J4326M490j2863j4375R097J9468l457j8010l014J0570R339r98j2715
318d758q421J2344J4790q153j5619m03J2913Q873o544j5703p40J8797O025j4895
332a494r751O777J0168L932q411j2753M023J7187J295j5654o844Q971J1543N25
$$ plain form
346 9514 -4810 -13300 -137 13201 4319 -8605 -7330 1876 8265 5752 -6999 -10733 3468 12317
360 12317 1343 -9774 -6788 4514 10416 1144 -11352 -6236 9175 8709 -4659 -8141 -1977 5667
374 5667 8053 -1637 -11117 -2624 10803 6142 -6393 -8135 512 8618 5550 -7143 -9834 4209
388 4209 10406 77 -7688 -4538 2568 7981 2903 -8960 -7158 6936 9418 -2809 -8494 -3135
402 -3135 5761 7712 -2319 -10382 -1354 9349 4378 -5624 -6057 -474 6167 6136 -4570 -9704 1781
417 1781 10024 2141 -6980 -5436 2515 7704 2361 -8459 -5931 6014 6761 -2125 -5913 -2779 3081
432 3081 6946 359 -8780 -3391 7810 5513 -4246 -6195 -1015 5649 5624 -4439 -7946 1529 7481
447 7481 1190 -5039 -4180 166 6102 3706 -6205 -6792 4346 6773 -1018 -5679 -3312 3069 6644
$$ packed form
346I514j4324q490J3163J3338q882j2924J275R206O389k513j2751l734J4201Q849
360A2317j0974j1117K986J1302N902r272j2496N116J5411m66j3368l482O164P644
374E667K386r690r480Q493J3427m661j2535j742Q647Q106l068j2693k691J4043
388D209O197j0329p765L150P106N413n078j1863J802J4094K482j2227n685N359
402c135Q896J951j0031q063R028J0703m971j0002m33N583O641l1j0706n134J1485
417A781Q243p883r121J544P951N189n343j0820K528J1945P47q886l788L134N860
432C081L865o587r139N389J1201k297r759j949N180O664k5j0063l507R475N952
447G481o291o229Q59M346N936k396r911n87J1138K427p791m661K367O381L575
$$ plain form
462 6644 -418 -7633 -2089 6272 3821 -2724 -4423 -1828 3961 6004 -2443 -7821 1 7184 2087
477 2087 -4305 -4361 443 6078 3233 -5753 -5205 3975 5317 -811 -3955 -2603 1345 5664 1035 -6637
493 -6637 -3107 5395 4534 -2202 -4568 -1748 3773 5125 -2236 -6031 931 5366 1465 -2615 -3170 -777
509 -777 4081 4080 -4225 -5448 2406 5137 -271 -3748 -2934 1196 4891 806 -5526 -2359 4361 2957
525 2957 -1228 -2644 -2570 2017 4981 -1192 -5987 -198 5178 1805 -2477 -3324 -479 4151 3080 -3856
541 -3856 -4241 2347 3499 18 -1799 -2840 120 4382 1950 -4787 -3372 3743 3127 -1086 -2866 -1973
557 -1973 1965 4120 -974 -4523 70 3307 968 -903 -2500 -1578 2812 3848 -2439 -4418 1595
572 1595 3818 415 -1882 -2313 95 3742 1132 -3721 -2126 2771 2162 -43 -1301 -2076 634 4174
$$ packed form
462F644p062p215N544Q361k451o545j699K595N789K043q447n378P822P183n097
477B087o392n6M804N635k845q986N48R180J342o128l144J352L948M319m629p672
493f637L530Q502q61o736k366K820N521J352p361l795O962M435l901m080n55K393
509g77M858jq305j223P854K731n408l477Q14M130L695m085o332L167O720j404
525B957m185j416P4M587K964o173m795N789N376l373m282q47K845M630j071o936
541c856l85O588J152l481j817j041K960M262k432o737J415P115o16m213j780Q93
557a973L938K155n094l549M593L237k339j871j597R22M390J036o287j979O013
572A595K223l403k297m31K408L647k610m853J595M897o09k205j258p75K710L540
$$ plain form
588 4174 -73 -4246 -559 3364 1375 -1094 -1981 -1035 2713 2464 -1861 -3006 1540 2250 366 -873
604 -873 -1831 -1119 3214 1963 -3550 -2274 2336 2130 -526 -1700 -1756 1325 3265 -348 -3351 -336 1935
621 1935 772 -235 -1344 -1936 1676 3157 -2065 -3239 1261 2458 397 -1080 -1787 -720 2538 1437
637 1437 -2671 -1444 1344 880 316 -630 -2083 -101 3133 466 -3242 -501 2224 676 -230 -831
653 -831 -1044 1547 2410 -1198 -1929 505 1044 -34 54 -1508 -1286 2294 1893 -2430 -1518 1906 970 -275
671 -275 -702 -1394 151 2226 -197 -2465 -242 1410 -21 375 -511 -2065 698 2460 -1167 -2324
687 -2324 629 1237 159 -75 -891 -707 1729 1242 -1521 -882 829 328 358 130 -1681 -419 2552 433
705 433 -2187 -90 1368 -20 12 52 -943 800 1556 -717 -1377 500 435 -37 619 -757 -1226 1715
$$ packed form
588D174m247m173L687L923j989k469q87R46L748k49m325j145M546P10j884j239
604h73r58P12M333j251n513J276M610k06k656j174n6L081J940l613l003L015K271
621A935j163j007j109n92L612J481n222j174M500J197k061j477p07J067L258j101
637A437m108J227K788m64n64r46j453J982L234k667l708K741K725j548r06o01
653h31k13K591Q63l608p31K434N39j078Q8j562K22L580m01m323R12L424r36j245
671b75m27o92J545K075k423k268K223J652j431L96q86j554K763J762l627j157
687b324K953O08j078k34q16J84K436m87k763O39J711n01L0k28j811J262K971k119
705D33k620K097J458j388L2M0r95J743P56k273o60J877o5m72O56j376m69K941
$$ plain form
723 1715 1452 -2069 -867 1268 27 -106 350 -975 -146 1512 292 -1450 -11 566 -440 676
739 676 165 -1333 408 1781 -843 -1343 485 641 -393 304 -299 -1228 963 917 -963 -468 559 -202
757 -202 397 474 -1365 -676 1828 205 -1167 293 759 -178 140 413 -1068 135 1076 -531 -686 464
775 464 145 83 741 -676 -910 876 1028 -1291 -247 807 -308 -49 667 -595 -571 1038 40 -1001
793 -1001 241 435 -674 534 406 -1319 56 1530 -573 -1018 845 16 -648 730 -275 -813 304
810 304 644 -1036 201 663 -572 397 940 -929 -624 1385 127 -1300 478 772 -613 408 335
827 335 -899 -57 950 -633 -708 590 8 -361 907 -380 -1171 663 798 -919 -136 994 -657
844 -657 -420 790 -584 -428 616 -290 -695 287 134 -598 564 119 -1301 -47 1107 -710 -327 560
$$ packed form
723A715k63l521J202K135j241j33M56j325Q29J658j220j742J439N77j006J116
739F76n11j498J741J373k624n00J828J56j034O97o03r29K191m6j880M95J027p61
757b02N99P7j839O89K504j623j372J460M66r37L18K73j481J203R41j607j55J150
775D64l19o2O58j417k34J786J52k319J044J054j115K59P16j262K4J609r98j041
793a001J242J94j109J208j28j725J375J474k103m45J863q29o64J378j005n38J117
810C04L40j680J237M62j235R69N43j869L05K009j258j427J778K94j385J021p3
827C35j234Q42J007j583p5J298n82l69J268j287p91J834J35j717P83J130j651
844f57K37J210j374J56J044r06m05R82j53p32J162m45j420J254J154j817L83Q87
$$ plain form
862 560 -244 -615 521 224 -698 497 443 -597 222 318 -622 -66 753 -763 -324 1549 122 -885 507
881 507 470 -505 452 499 -764 46 593 -615 -479 637 62 -355 911 -297 -824 666 319 -945 90
900 90 825 -515 -179 692 -548 -664 685 -234 -240 632 207 -501 647 284 -716 223 742 -726 -475
919 -475 1060 -135 -459 930 95 -779 418 320 -529 347 235 -890 118 341 -629 -592 961 -220
937 -220 -1139 768 430 -747 326 616 -988 4 613 -171 -331 483 -110 -419 843 -212 -853 684
955 684 185 -967 551 919 -680 -252 831 -259 -260 455 -58 -488 695 -31 -867 560 270 -773
973 -773 243 820 -538 -500 784 -113 -741 529 -44 -649 161 479 -627 242 79 -510 113 750 -343
992 -343 -538 877 -509 -718 607 235 -687 519 471 -421 -74 479 -495 -96 545 -113 -350 578 -149
$$ packed form
862E60q04l71J136k97r22J195n4j040Q19R6r40N56Q19j516M39J873j427j007J392
881E07l7r75R57M7j263Q10N47j208J36J116n75m17J266j208n27J490l47j264J035
900I0P35j340L36Q71j240j16J349r19oQ72m25p08J148l63j000R39N19j468K51
919d75J535j195l24J389q35q74J197r8q49Q76j12j125J008K23r70L7J553j181
937b20r19J907l38j177J073K90j604R92O09p84j60Q14n93l09J262j055o41J537
955F84m99j152J518L68j599M28J083j090jP15n13m30J183p26q36J427k90j043
973g73J016N77j358L8J284q97o28J270n73o05Q10L18j106Q69j63n89O23O37j093
992c43j95J415j386k09J325l72r22J206m8q92L47N53r74L99O41o58k37R28p27
$$ plain form
1011 -149 -983 771 124 -738 228 819 -420 -195 921 -772 -524 623 -318 -730 521 55 -987 279
1029 279 525 -611 381 587 -466 -552 665 -331 -588 731 -41 -540 626 539 -563 177 283 -635 114
1048 114 702 -373 -119 660 -295 -657 745 99 -386 97 547 -598 -105 543 -484 96 550 -395 -130
1067 -130 426 -213 -716 839 97 -808 189 445 -575 -59 672 -450 -269 546 -248 -291 278 176 -480
1086 -480 317 579 -630 254 497 -429 -92 503 -296 -505 463 10 -580 228 136 -454 393 338 -422 -3
1106 -3 332 -542 -146 515 -256 -380 777 -2 -637 300 353 -737 -196 725 -242 -118 680 -414 -240 502
1126 502 -262 -364 815 420 -455 126 315 -549 227 588 -464 -246 769 120 -150 258 47 -173 44
1145 44 -45 -836 295 233 -299 -195 585 -442 -85 873 -185 -643 392 -4 -260 62 227 -453 162 641
$$ packed form
1011a49q34J754o47q62R66N91j239K25J116j693K48J147r41m12J251m66j042J266
1029B79K46j136R92K06j053q6J217r96k57J319p72m99J166q7j102P40J06r18P49
1048A14N88j075K54P79r55l62J402o46m85M83M50j145M93O48j027N80M54r45K65
1067a30N56o39n03J555p42r05R97K56j020N16P31j122J81Q15p94m3N69j02o56
1086d80P97K62j209Q84K43r26L37N95p99k09R68m53n90Q08r2n90Q47n5p60M19
1106cL35q74L96O61p71j24J157p79o35R37N3j090N41R21r67J24P98j094J74P42
1126E02p64j02J179l95q75N81J89q64P76L61j052K18J015o49k70M08k11k20K17
1145D4q9p91J131o2n32J04P80j027L57R58j058m58J035l96k56L22J65o80O15M79
$$ plain form
1165 641 -719 -512 564 -269 -228 465 -59 -560 522 78 -611 161 618 -115 140 656 -406 -155 490
1184 490 -437 -561 331 344 -361 322 161 -619 -234 450 -414 -424 632 -246 -339 369 -178 -562 725 123
1204 123 -745 -91 173 -725 134 453 -748 -266 474 140 -808 323 234 -527 404 239 -349 374 507 -567
1224 -567 47 545 -339 -604 606 -300 -361 416 118 -451 122 491 -165 -79 131 -373 -136 629 -179 -527
1244 -527 815 228 -227 533 151 -425 203 600 -406 -215 551 -137 -185 315 -150 -841 510 376 -827
1263 -827 305 731 -541 59 283 -558 -251 756 -14 -765 307 68 -229 339 9 -605 332 587 -406
1282 -406 -94 83 60 -153 551 -141 -600 546 418 -598 -10 106 -318 103 171 -278 -215 543 36 -447
1302 -447 37 135 -291 333 328 -636 100 420 -533 -277 190 -23 -252 272 -177 -383 746 285 -410 246 293
$$ packed form
1165F41j360K07J076q33M1O93n24n01J082m44o89P72M57p33K55N16j062K51O45
1184D90r27j24Q92J3p05O83j61p80L85O84q64j0J056q78r3P08n47l84J287o02
1204A23q68O54K64q98Q59L19j201M82P40l34r48J131q9p61R31j65n88P23J33j074
1224e67O14M98q84k65J210r06o1P77k98n69N73L69o56Q6K10n04K37P65q08l48
1244e27J342n87m55P60l82n76O28L97j006J91P66o88m8N00m65o91J351j34j203
1263h27J132M26j272O00K24q41L07J007p70p51J072k39k97N68l30o14R37K55r93
1282d06L12J77k3k13P04o92m59J146j28j016N88J16m24M21O8m49O3P58n07m83
1302d47M84R8m26O24nr64P36L20r53K56M67k13k29N24m49k06J129m61o95O56M7
$$ plain form
1323 293 -295 -42 261 -503 -154 795 -202 -773 306 57 -267 257 175 -638 158 325 -750 -136 465 -382
1343 -382 -420 354 -3 -429 461 9 -513 223 104 -396 126 379 -253 24 817 -290 -192 140 -74 -568
1363 -568 66 -2 -509 416 561 -464 -248 289 -258 -259 228 -294 -519 301 220 -565 130 490 -304 49 262
1384 262 -537 -91 533 -98 -583 249 48 -512 519 28 -528 416 185 -65 -424 59 -241 -242 443 -70
1404 -70 -592 235 286 -494 -5 183 -401 117 473 -648 -103 562 -215 -643 567 -302 -117 765 -152 -337
1424 -337 6 303 -636 -436 352 -122 6 472 -466 -349 694 184 -380 386 362 -485 275 459 -529 139
1444 139 634 -119 -391 -117 -120 -175 277 291 -558 112 404 -612 -99 71 -145 172 443 -195 -324 543 13
1465 13 -678 440 26 -453 131 129 -568 58 958 -277 -358 381 38 -87 433 -336 -802 43 349 -584 -126
$$ packed form
1323B93n88K53L03p64L49R49r97n71J079k49l24N24q2q13P96J67j075O14O01q47
1343c82l8P74l57m26Q90m52n22P36j19n00N22K53o32K77P93j107R8L32k14m94
1363e68O34o8n07R25J45j025K16N37n47jM87n22k25Q20q1p85O95L60p94L53K13
1384B62p99M46O24o31m85Q32k01n60J031m91n56R44k31k50l59M83l00jO85n13
1404g0n22Q27N1p80M89J88n84N18L56j121N45O65p77m28J210q69J85Q82r17j85
1424c37L43K97r39K00P88m74J28M66r38J17J043n10n64P66k4q47P60J84r88O68
1444A39M95p53k72K74ln5M52J4q49O70K92j016N13J70k16L17K71o38j29Q67n30
1465A3o91J118m14m79N84ko97O26R00j235q1P39l43j25N20p69m66Q45L06r33M58
$$ plain form
1486 -126 525 -74 50 365 -279 -146 516 239 -565 303 116 -162 -10 297 -510 -96 570 -301 -239 322
1506 322 -125 -282 379 42 -417 157 242 -281 -124 350 -343 -220 381 -474 -588 514 53 -318 50 199
1526 199 -482 -39 144 -138 -275 529 -138 -283 584 -12 -147 172 65 -120 239 327 -161 -193 483 -62 -347
1547 -347 245 -394 -267 384 212 -269 287 -121 -487 333 134 -416 341 344 -148 -460 65 -52 -138 474 -25
1568 -25 -537 190 58 -621 211 623 -467 -88 467 -64 -261 531 131 -288 340 216 -581 135 289 -427
1588 -427 277 331 -411 -292 69 50 -510 475 314 -323 278 310 -463 -246 330 -521 121 518 128 66 233
1609 233 1 -357 536 86 -251 56 140 -383 -43 188 -28 -128 190 -20 -281 355 235 -465 -32 108
1629 108 -377 -59 145 -150 -84 664 -105 -366 327 213 -197 213 68 -235 226 340 -148 -43 375 -217
$$ packed form
1486a26O51n99J24L15o44J33O62k77q04Q68j87k78J52L07q07M14O66q71O2N61
1506C22m47j57O61l37m59N74Q5n23J57M74o93J23O01q55j14J102m61l71L68J49
1526A99o81M43J83k82j37Q04o67j45Q67n96j35L19j07j85L59Q8m88l2O76n45k85
1547c47N92o39J27O51j72m81N56m08l66Q20j99n50P57Lm92l12N25j17q6O12m99
1568b5n12P27j32o79Q32M12j090L79N55n31j97P92m00m19O28j24p97P16J54p16
1588d27P04N4p42J19L61j9n60R85j61o37O01L2p73K17N76q51O42L97l90o2J67
1609B33k32l58Q93m50l37L07Q4n23L40K31k16j00L18k10k61O36j20p00M33J40
1629A08m85L18K04k95O6P48p69k61O93j14m10M10j45l03M61J14m88J05M18n92
$$ plain form
1649 -217 -316 202 194 -209 206 19 -452 222 334 -503 140 369 -126 -77 389 -18 -354 418 -38 -124 275 248
1671 248 -405 341 311 -201 -146 317 -176 -226 287 243 -254 377 180 -389 268 118 -244 179 192 -378 213 118
1693 118 -393 -430 110 -23 -532 215 94 -333 26 -38 -175 -290 431 -80 -42 176 -353 -214 273 9 -400
1714 -400 546 73 -415 318 124 -72 -73 418 -25 -409 -31 167 -341 -33 -154 -184 132 119 -268 -5 417
1735 417 -404 -88 483 -104 -224 111 20 -148 282 430 -333 154 195 -501 -61 320 -273 -385 542 74 -217
1756 -217 213 215 -343 145 -55 -62 22 -56 -81 4 416 -211 -33 21 -48 -178 442 168 -141 155 352 22 4 321
1780 321 -109 -165 213 -292 -454 295 111 -360 183 63 -502 -142 524 -266 199 301 -269 -261 216 -157 -88
1801 -88 204 -88 -380 216 273 -428 312 184 -307 -287 259 -67 -320 287 47 -593 41 411 -500 178 102
$$ packed form
1649b17r9N18qm03M15j87m71O74J12q37O43K29m95M9M66m07l36P72m56q6L99k7
1671B48o53P46l0n12N5M63m93n0N13m4m97O31j97n69O57j50l62M23J3n70N91r5
1693A18n11l7N40j33n09P47j21m27L59o4j37j15P21n11L8K18n29J39M87k64m09
1714d00R46m73m88P33j94j96jM91m43l84L78J98n08L08j21l0L16j3l87K63M22
1735D17q21L16N71n87j20L35r1j68M30J48p63M87M1o96M40L81n93j12R27m68k91
1756b17M30Kn58M88k00pQ4p8k5Q5M12o27J78N4o9j30O20k74l09K96J97l30j8L17
1780C21m30n6L78n05j62P49j84m71N43j20n65L60O66p90M65J02n70QM77l73O9
1801h8K92k92k92N96N7p01P40j28m91K0N46l26k53O07k40o40O34L70r11O78p6
$$ plain form
1822 102 -374 57 229 -70 18 183 -307 -116 438 -207 -189 63 283 -510 63 223 -102 -242 184 -118 -76
1843 -76 316 144 -551 -39 211 -486 52 71 36 -39 188 -145 -177 334 21 -107 223 36 -128 0 -44 -353
1865 -353 -172 297 -311 -504 195 -160 -196 218 341 -254 356 83 -695 112 -32 -71 -96 404 34 138 205
1886 205 -138 -280 332 61 -243 57 15 -336 -124 70 -88 -144 184 40 -437 -146 29 -141 228 78 -87
1907 -87 97 165 -109 0 368 -329 -230 244 -107 -324 -82 -39 -176 -176 99 -331 433 273 -244 167 271 -276
1929 -276 18 122 108 -179 -72 121 -71 -11 338 12 117 -11 119 0 263 83 125 404 214 153 88 152
1951 152 -624 178 407 -113 -75 269 -70 -160 354 -277 -246 190 140 -153 62 269 123 270 128 -184 -314
1972 -314 232 -179 -157 231 305 -350 -28 -247 -204 163 554 -435 -388 -97 -225 -77 42 -10 -276 143 239 61
$$ packed form
1822A02m76M31J72k99Q8J65m90J91N54o45J8K52K20p93N73J60l25j40M26l02M2
1843g6L92j72o95N12K50o97N38J9l5p5K27l33l2N11l13j28L30j87j64J28m4l09
1865c53J81M69o08j93O99l55l6M14J23n95O10k73p78Q07j44l9k5N00l70J04O7
1886B05l43j42O12k71l04L00m2l51K12J94j58n6L28j44m77K91J75j70L69j50j65
1907h7J84O8k74J09L68o97R9M74l51k17K42M3j37%K75m30P64j60n17M11J04n47
1929b76K94J04j4k87J07J93j92O0L49l26J05j28J30j19K63j80M2K79j90o1o5O4
1951A52p76Q02K29n20L8L44l39r0N14o31L1M36n0k93K15K07j46J47j42l12j30
1972c14N46m11K2L88P4o55L22k19M3L67L91r89M7K91j28J48J19n2k66M19R6j78
$$ plain form
1994 61 -128 -4 -219 170 325 193 -113 683 -47 -367 81 -144 -461 177 144 -159 93 376 -76 -138 -3
2015 -3 78 -223 346 -372 -247 187 -56 -45 80 239 17 -26 2 -230 74 166 32 -386 202 155 -301 41 -114
2038 -114 -137 184 250 -107 -153 151 -87 -63 144 -85 -50 368 150 -313 -218 77 -95 34 -117 -144 -326 647
2060 647 106 -318 329 237 185 432 169 -310 87 155 282 -343 198 -174 66 261 -97 -433 69 176 -375
2081 -375 -101 136 -18 439 318 -259 -7 307 58 -250 23 -55 -194 -247 71 -139 132 71 -270 -393 -110
2102 -110 116 66 187 -102 -56 456 443 -308 -12 194 16 -38 31 -284 -323 310 225 -185 97 -41 -73 21 36
2125 36 -20 79 301 -67 -183 262 91 -44 36 -118 -405 110 379 -371 -19 47 123 204 198 -545 -331 247 52
2148 52 -76 -122 91 45 294 -115 -274 52 269 -123 -2 135 42 -97 417 -221 -416 64 344 -258 56
$$ packed form
1994F1j89J24k15L89J55j32l06P96p30l20M48k25l17O38l3l03K52K83m52o2J35
2015cQ1l01N69p18J25M34k43J1J25J59k22m3K8k32L04R2j34m18N88m7m56L42j55
2038a14k3L21O6l57m6L04k38K4K07k29L5M18k18m63R5K95j72J29j51k7j82R73
2060F47n41m24O47r2n2K47k63m79L97O8J27o25N41l72K40J95l58l36N02J07n51
2081c75K74K37j54M57j21n77K52L14k49l08K73p8j39n3L18k10K71o1l41j23K83
2102a10K26n0J21k89M6N12j3p51K96K06j78n4O9l15l9O33q5m10K82j38l2R4J5
2125C6n6R9K22l68j16M45j71j35Q0j54k87N15K69p50L52O6P6Q1op43K14N78j95
2148E2j28m6K13m6K49m09j59L26K17l92J21J37r3j39N14o38j95M80K80o02L14
$$ plain form
2169 56 -134 -68 105 280 -332 -10 628 163 -407 -314 57 -129 425 -369 -255 128 323 -174 -302 -57 -43
2190 -43 175 190 -148 -292 16 289 -165 -77 179 -69 152 200 -219 -261 508 373 -70 -47 -250 -89 279 138
2212 138 -440 -117 328 76 -279 136 -126 327 197 -205 -311 321 387 -52 -273 -144 -114 232 247 -363 -100
2233 -100 297 91 -103 -76 -45 64 435 173 -569 400 349 142 4 -131 -320 -43 145 -128 -576 409 507
2254 507 -230 -228 -24 3 240 200 -602 -216 398 177 16 -8 -53 -213 348 -150 -309 94 349 -123 171 -87
2276 -87 -392 16 432 -116 -376 95 286 150 -86 -67 -96 179 280 -415 -399 127 187 147 -224 -260 -41 324
2298 324 64 -619 -25 439 53 -220 -216 2 239 394 -336 -269 143 464 -82 88 -20 -18 133 78 -194 -224
2320 -224 142 429 -258 223 -167 19 531 -69 -619 38 201 64 -78 -133 -211 110 445 -205 -353 62 231
$$ packed form
2169E6j90O6J73J75o12L22O38m65n70R3L71j86N54p94J14L83J95m97j28K45J4
2190d3K18J5l38j44L08K73m54Q8K56k48K21M8m19m2P69j35m43K3k03J61L68j41
2212A38n78L23M45k52l55M15k62M53j30m02j06O32O6m39k21J29L0L46J5o10K63
2233a00L97k06j94K7L1J09L71k62p42R69n1k07j38j35j89K77J88k73m48R85R8
2254E07p37KK04K7K37m0q02L86O14k21j61k4m5j60N61m98j59M03K55m72K94k58
2276h7l05M08M16n48k60M71J91j36k36J9k9K75J01o95J6N26O0m0l71l6K19L65
2298C24k60o83N94M64l86k73MK18K37J55p30O7M12L21n46J70j08KJ51n5k72l0
2320b24L66K87o87M81l90J86N12o00n50O57J63j37j42n5p8L21L35o50j48M15J69
$$ plain form
2341 231 -309 -40 -428 35 195 -56 -448 -357 38 214 -88 -389 -383 260 220 105 -348 -67 384 94 -91
2362 -91 -248 -57 346 516 49 -476 115 378 38 158 -305 -281 446 390 -151 -185 210 100 55 34 -168 -261
2384 -261 184 -81 -338 -183 137 92 -89 -305 -527 150 341 -418 -297 258 382 -126 -132 -321 -61 38 54 -230
2406 -230 -185 370 375 -12 249 -243 -110 264 35 -316 -274 319 234 -10 -217 -189 110 219 -63 -383 168 325
2428 325 19 -34 -230 -179 418 399 -308 -309 123 35 -5 -39 -221 -179 323 -232 -220 -184 -37 -78 -131 25 -168 217
2452 217 397 157 -193 177 248 180 125 -337 -227 357 207 -148 -479 77 101 418 -14 -180 -167 527 -134 -422
2474 -422 -343 218 195 69 -380 -238 60 716 14 -425 71 231 299 123 -184 -130 381 449 -369 -254 216 12
2496 12 68 -47 -190 -63 417 236 -424 -397 -217 142 90 32 -209 277 431 -52 -463 -138 150 49 -25 -224
$$ packed form
2341B31n40K69l88M63J60k51l92R1L95J76l02l01OO43m0j15m53K81M51k90j85
2362i1j57J91M03J70m67n25N91K63l40J20m63K4P27n6n41l4L95j10m5k1k02r3
2384b61M45k65k57J55L20m5j81k16k22O77J91p59J21N55J24n08oj89K60R9J6k84
2406b30M5N55Nl87K61m92J33L74k29l51M2N93q5k44k07K8K99J09k82l20N51J57
2428C25l06n3j96N1N97j9p07jM32q8m0l4j82M2N02n55J2L6J47m1n3J56j93L85
2452B17J80k40l50L70P1o8n5m62J10N84j50l55l31N56K4L17m32j66J3O94o61k88
2474d22P9N61k3j26m49J42K98O56p02m39M96J60O8j76l07N4N11O8q18J15M70k04
2496A2N6j15j43J27M80j81o60K7J80L59n2n8k41M86J54m83m11L25K88j01p4j99
$$ plain form
2518 -224 -179 314 423 -132 -202 55 435 158 -261 -189 -174 278 438 -518 -354 28 372 344 -148 -371 302 191
2540 191 -248 -504 -197 185 96 103 -333 -101 245 290 113 -151 -56 184 250 -40 -304 -34 505 136 -407 -218
2562 -218 31 -22 206 -317 -358 59 207 28 -56 -221 -171 375 60 -90 -598 108 387 -336 -249 -259 55 300
2584 300 -14 -144 -157 446 269 -293 -233 -356 239 6 28 -44 340 336 -162 -166 -350 -57 -94 250 -390 -679 72
2607 72 223 22 -180 21 135 672 170 -201 33 487 343 -175 -292 -99 193 666 -191 -41 -244 440
2627 440 230 -182 -208 -204 93 176 -394 -558 241 434 -60 -127 -136 -77 247 -220 -551 -113 398 413 -365 30 126
2650 126 142 219 -401 -162 34 542 -63 -192 62 -149 209 90 -122 -243 101 214 -315 -300 -108 100 264
2671 264 266 -318 -80 332 156 -382 -308 -32 -83 -6 256 -402 -179 239 294 -325 -118 110 -93 93 -341 96
$$ packed form
2518b24M5M93J09n55p0K57L80k77m19P2J5M52J60r56J64L82L44k8m92k23O73j11
2540A91m39k56L07L82q9Pm36K32L46M5j77k64R5K40O6k90k64K70N39l69n43J89
2562b18K49n3K28n23m1M17J48j79q4j65N0N46l15j50n08P06K79p23Q7j0L14K45
2584C00l14j30j3O03j77n62O0j23N95k33K2p2L84mm98mj84K93l7L44o40k89P51
2607G2J51k01k02K01J14N37n02l71K34M54j44n18j17J93K92M73q57J50k03O84
2627D40k10m12k6MK97Q3n70j64P99J93m94o7rN9L24m67l31M38N11J5p78L95R6
2650A26J6P7o20K39J96N08o05j29K54k11L58j19k12j21L44J13n29J5J92K08J64
2671B64Kn84K38M12j76n38P4K76n1P7K62o58K23M18N5o19K07K28k03J86m34M37
$$ plain form
2693 96 -19 435 105 -213 30 197 409 110 -296 -509 373 151 -59 -129 -221 156 149 -177 -303 147 567 -17
2715 -17 -65 89 -205 54 294 -224 -314 159 188 3 -99 -204 18 521 284 -30 -179 453 355 66 -167 261
2737 261 -39 208 -17 -296 -93 320 96 -54 -216 -13 338 234 -242 -371 298 -54 -76 -59 -60 -23 -149 -106
2759 -106 -288 -248 26 74 -575 -61 -2 107 487 14 -325 -64 234 295 -170 -212 20 76 378 3 -179 196
2781 196 290 77 -165 15 -130 212 270 -463 -58 190 221 44 149 -31 170 173 115 -43 -355 480 27 -114
2803 -114 -199 -148 -49 185 -98 -232 247 92 103 -279 25 -15 204 170 -239 -461 71 72 -96 -533 -38 -28 83
2826 83 -13 -304 -10 112 -125 91 -284 -162 251 209 18 -426 -31 304 9 -36 40 -324 85 97 -302 -88
2848 -88 303 7 49 -149 -93 115 290 29 -544 68 48 144 -81 -71 -131 233 258 -32 -354 -255 -63 -278 -107
$$ packed form
2693I6j15M54l30l18K43J67K12k99m06k13Q82k22k10p0r2L77pl26j26M50M20n84
2715a7m8J54k94K59K40n18r0M73K9j85j02j05K22N03k37l14j49O32r8k89k33M28
2737B61l00K47k25k79K03M13k24j50j62K03L51j04m76j29O69l52k2J7jL7j26M3
2759a06j82M0K74M8o49N14N9J09L80m73l39K61K98O1m65m2K32N6L02l75j82L75
2781A96R4k13k42J80j45L42N8p33M05K48L1j77J05j80K01Ln8j58l12Q35m53j41
2803a14q5N1R9K34k83j34M79j55J1l82L04m0K19l4m09k22N32Jj68m37M95J0J11
2826H3r6k91K94J22k37K16l75J22M13m2j91m44L95L35k95m5P6l64M09J2l99K14
2848h8L91k96M2j98N6K08J75k61n73O12k0R6k25J0o0L64K5k90l22R9J92k15J71
$$ plain form
2871 -107 -53 -53 -29 -81 -138 -45 49 -5 -193 -434 -12 152 245 193 -278 -44 395 165 -90 58 -261 84 327 -197
2895 -197 -58 41 20 -42 68 6 -97 135 345 -114 -261 -278 281 -95 -97 -127 97 290 225 141 123 168 85 -96
2919 -96 -16 -36 -127 225 -203 -424 81 276 -344 -136 143 -131 227 209 -98 -347 -9 -186 -16 242 -379 -111
2941 -111 158 136 22 -15 52 92 1 -48 -266 12 455 -198 -123 208 123 100 23 195 -107 -68 270 -129 -147 48
2965 48 138 131 181 -74 -121 263 295 -17 -220 9 375 79 -149 -347 -146 77 42 -528 -395 -34 150 183 -133
2988 -133 -248 283 250 -154 186 146 -13 -106 -51 -236 -168 97 192 -56 93 4 -5 67 90 -240 301 -39 119 -409
3012 -409 54 292 -26 -44 -139 200 108 220 118 -454 46 135 42 54 -446 -107 172 63 -562 96 63 160 -179
3035 -179 169 -51 34 -59 -56 -263 -240 13 -51 -46 -274 -368 15 359 -170 145 98 -160 137 -93 -280 113 -21
$$ packed form
2871a07N4%K4n2n7R3R4n4j88k41M22J64R3n2m71K34M39k30k55J48l19L45K43n24
2895a97J39R9k1o2J10o2j03K32K10m59j47j7N59l76kl0K24J93o5q4j8M5q3j81
2919i6Q0k0r1L52m28k21N05J95o20K08K79k74L58j8l07k49L38j77J70K58o21K68
2941a11K69k2j14l7O7M0r1m9k18K78M43o53P5L31q5k3p7J72l02L9L38l99j8J95
2965D8R0pN0k55m7L84L2l12k03K29L66k96k28j98K01K23l5n70J33L61J84L3l16
2988a33j15N31l3m04L40m0j59r3N5j85O8K65R5k48J49q9rP2K3l30N41l40J58n28
3012d09M63K38l18j8r5L39r2J12j02n72N00Q9r3J2n00L39K79j09o25O58l3R7l39
3035a79L48k20Q5r3Lk07K3K53o4Nk28r4L83L44n29L15m7k58K97k30j87L93j34
$$ plain form
3058 -21 52 24 63 63 292 79 -29 13 99 260 249 -42 4 225 -160 56 -3 33 69 343 15 -12 154 239 15
3083 15 145 216 -300 315 151 -165 -79 369 -5 -94 -43 -69 -161 71 -213 -50 -184 -133 -48 9 61 -32 -104 -106 -131
3108 -131 -54 127 -330 201 6 41 -19 129 -236 -154 -236 -195 -171 200 277 -211 -27 148 -176 -262 85 -141 89
3131 89 -41 104 -293 86 -180 -19 -61 -14 -93 92 -90 -49 -86 125 509 -166 9 48 -84 -199 114 -321
3153 -321 -225 -4 59 -42 129 -60 32 40 66 -138 -290 -34 3 -318 -24 265 -5 79 -4 -518 -88 98 -24
3176 -24 51 -56 -204 238 -227 -165 -6 190 109 5 -26 87 -231 186 -39 -45 142 -93 -45 -215 -166 -204 33
3199 33 186 -73 -55 -55 -84 38 75 -84 -78 16 -20 -26 -31 134 46 -142 97 215 156 -121 31 -1 -8 -40 -19 -68 278
3226 278 -11 -371 160 -123 -311 103 402 -85 -147 -188 81 217 29 -193 105 75 204 21 -100 -147 -182 -19
$$ packed form
3058b1P3k8L9%K29k13j08M2Q6J61j1k91M6K21l85K16n9L6L6K74l28k7J66Q5k24
3083A5J30P1n16O15j64l16Q6M48l74q9N1k6r2K32k84J63j34N1Q5N7N2r3p2kk5
3108a31P7J81m57N31j95L5o0J48l65Q2q2M1K4L71P7m88J84J75l24q6L47k26K30
3131H9j30J45l97L79k66J61m2M7p9J85j82M1l7K11L84o75J75L9j32j15L13m35
3153c21R6K21O3j01J71j89R2QK6k04j52K56L7l21K94K89k70Q4q3n14M30J86j22
3176b4P5j07j48M42m65O2J59J96q1j04l1J13l18M17k25oJ87k35M8j70M9l8K37
3199C3J53k59J8%k9J22L7j59OR4l6onJ65q8j88K39J18n9k77J52l2pl2K1m9L46
3226B78k89l60N31k83j88M14K99m87o2m1K69J36j88k22K98l0J29j83j21m7l5J63
$$ plain form
3248 -19 182 -107 97 -72 64 -18 6 53 -257 475 -317 -68 272 68 -96 -14 -1 -165 204 -208 -9 211
3270 211 -67 166 -228 -148 6 -131 -62 7 -240 74 -45 -164 -74 -11 -100 -375 59 -79 5 -19 -114 49 202
3293 202 328 -127 115 -114 -140 22 15 290 10 4 51 -37 38 178 -47 128 -31 -36 156 121 139 -32 -6 48 -82
3318 -82 196 43 -17 36 84 90 165 65 -1 55 76 -139 -122 43 -124 110 -39 104 -152 264 221 -149 -15 -222
3342 -222 -47 -35 -72 260 -55 -89 164 69 -10 213 81 -260 -8 -136 117 260 168 159 124 -75 -86 -7 5 -77
3366 -77 -64 -87 117 161 303 -280 3 15 -146 -109 -43 264 -96 -32 378 -76 112 42 -254 -31 -179 22 133
3389 133 132 287 61 125 372 -110 -43 96 -67 -115 -77 133 -31 180 178 -188 -86 221 -341 11 -6 123 134
3412 134 -52 -199 -363 3 71 -107 -14 -230 -16 226 -72 -224 115 110 255 2 -134 -93 -281 26 -237 -93
$$ packed form
3248a9K01k89K04j69J36q2K4M7l10P32p92K49L40k04j64Q2J3j64L69m12J99K20
3270B11k78K33l94Q0J54j37O9O9k47L14j19j19R0O3q9k75M34j38Q4k4r5J63J53
3293B02J26m55K42k29k6J62pK75k80oM7q8P5J40k25J75j59nJ92l5J8j71K6N4j30
3318h2K78j53o0N3M8OP5j00o6N6K1k15J7J65j67K34j49J43k56M16m3l70J34k07
3342b22J75J2l7L32l15l4K53r5p9K23j32l41K52j28K53J43r2rl5j99j1P9J2q2
3366g7J3k3K04M4J42n83K83J2j61L7O6L07l60O4M10m54J88p0k96K23j48K01J11
3389A33jJ55k26O4K47m82O7J39j63m8L8K10j64K11kl66J02L07n62L52j7J29J1
3412A34j86j47j64L66O8j78R3k16K14K42k98j52L39nJ45k53j36M1j88L07k63J44
$$ plain form
3434 -93 -141 -4 -195 -249 -169 25 42 -144 -87 15 6 170 -152 236 -56 125 81 173 122 216 207 -183 -102 -265 35
3459 35 -66 206 187 -56 86 -23 80 162 -168 -56 -2 -23 115 -9 191 -179 -114 -18 189 -128 -101 -133 -130 -37
3483 -37 72 231 -69 80 -31 1 147 -70 -289 258 57 149 263 188 193 27 39 110 -64 16 -245 9 167
3506 167 177 68 134 138 -68 -45 119 -66 90 -8 -388 -24 145 84 -160 265 116 -106 13 231 -59 -29 105
3529 105 -324 -174 0 -57 -22 86 -87 -165 -59 104 -92 196 14 -40 -98 12 -254 -103 -7 9 175 -350
3551 -350 232 -271 8 -14 -324 196 -10 -163 50 76 -101 165 44 23 -160 132 -198 22 -159 241 -59
3572 -59 -295 -77 -84 -165 36 -212 -16 26 72 -119 -141 58 -244 66 257 80 -153 185 -45 -109 -261 108 96
$$ packed form
3434i3m8J37j91n4Q0J94J7j86N7J02rJ64l22L88k92J81m4R2n1R4rl90Q1j63L00
3459C5j01K72j9k43J42j09J03Q2l30J12N4k1J38j24K00l70O5R6K07l17K7l2LR3
3483c7J09J59l00J49j11L2J46k17k19N47k01R2J14p5Nj66J2P1j74Q0k61K54J58
3506A67J0j09O6Mk06K3J64j85J56r8l80L64J69o1k44M25j49k22J19K18k90L0J34
3529A05m29J50J74n7L5J08j73p8J06J63j96K88j82n4n8J10k66J51R6J6J66n25
3551c50N82n03K79k2l10N20k06j53K13K6j77K66j21k1j83K92l30K20j81M00l00
3572e9k36K18pq1K01k48J96M2M6j91k2J99l02L10J91j77k33L38k30o4j52L69j2
$$ [...]
8191D9
##END NTUPLES=NMR FID
##END=
