##TITLE=1H_TG-2255
 DMSO, 8 sc, 
 15.10.2019
##JCAMPDX= 6.0         $$ Bruker NMR JCAMP-DX V2.0
##DATA TYPE= NMR FID
##DATA CLASS= NTUPLES
##ORIGIN= UXNMR, Bruker Analytische Messtechnik GmbH
##OWNER= root
$$ XWIN-NMR		Version 3.5
$$ Tue Oct 15 13:47:53 2019 Russian Standard Time (UT+4h)  she@DPX200
##.OBSERVE FREQUENCY= 200.1315
##.OBSERVE NUCLEUS= ^1H
##.DELAY= (6, 6)
##.ACQUISITION MODE= SIMULTANEOUS
##.ACQUISITION SCHEME= undefined
##.AVERAGES= 8
##.DIGITISER RES= 18
##SPECTROMETER/DATA SYSTEM= spect
##.PULSE SEQUENCE= zg30
##.SOLVENT NAME= Acetone
##.SHIFT REFERENCE= (INTERNAL, Acetone, 0, 15.7039)
##AUDIT TRAIL= $$ (NUMBER, WHEN, WHO, WHERE, WHAT)
$$ ##TITLE= Audit trail, XWIN-NMR		Version 3.5
$$ ##JCAMPDX= 5.01
$$ ##ORIGIN= Bruker BioSpin GmbH
$$ ##OWNER= she
$$ F:/spectra/data/she/nmr/H-F/1/audita.txt
$$ ##AUDIT TRAIL=  $$ (NUMBER, WHEN, WHO, WHERE, WHAT)
(   1,<2019-10-15 13:46:46.17 +0400>,<she>,<DPX200>,
      <created by zg, POWCHK disabled, PULCHK disabled
       configuration hash MD5:
       00 E9 B6 7A A2 85 ED C7 34 08 36 98 17 FE 4E 26
       data hash MD5: 16K
       9B 95 00 27 98 79 BA FC 64 A9 E1 E1 10 C3 5A 4F>)
$$ ##END=
$$ 
$$ hash MD5
$$ 8B 1D 47 F8 BC A7 2B 8A 8E B1 7A 54 D9 14 E4 AB
##$RELAX= 
##$RELAX= 
##$RELAX= 
##$RELAX= 
##$RELAX= 
##$RELAX= 
$$ Bruker specific parameters
$$ --------------------------
##$DU= <F:/spectra>
##$EXPNO= 1
##$NAME= <H-F>
##$PROCNO= 1
##$TYPE= <nmr>
##$USER= <she>
##$AMP= (0..31)
100 100 100 100 100 100 100 100 100 100 100 100 100 100 100 100 100 100 
100 100 100 100 100 100 100 100 100 100 100 100 100 100 
##$AQSEQ= 0
##$AQ_mod= 1
##$AUNM= <au_zg>
##$AUTOPOS= <>
##$BF1= 200.13
##$BF2= 200.13
##$BF3= 200.13
##$BF4= 200.13
##$BF5= 200.13
##$BF6= 200.13
##$BF7= 200.13
##$BF8= 200.13
##$BYTORDA= 1
##$CFDGTYP= 0
##$CFRGTYP= 5
##$CHEMSTR= <none>
##$CNST= (0..31)
1 1 145 1 1 1 1 1 1 1 1 1 1 1 1 1 1 1 1 1 1 1 1 1 1 1 1 1 1 1 1 1 
##$CPDPRG= <>
##$CPDPRG1= <>
##$CPDPRG2= <>
##$CPDPRG3= <>
##$CPDPRG4= <mlev>
##$CPDPRG5= <mlev>
##$CPDPRG6= <mlev>
##$CPDPRG7= <mlev>
##$CPDPRG8= <mlev>
##$CPDPRGB= <>
##$CPDPRGT= <>
##$D= (0..31)
0 1.2 0 0 0 0 0 0 0 0.06 0 0.03 0 0 0 0 0.0002 0 0 0 0 0 0 0 0 0 0 0 0 
0 0 0 
##$DATE= 1571132805
##$DBL= (0..7)
120 120 120 120 120 120 120 120 
##$DBP= (0..7)
150 150 150 150 150 150 150 150 
##$DBP07= 0
##$DBPNAM0= <>
##$DBPNAM1= <>
##$DBPNAM2= <>
##$DBPNAM3= <>
##$DBPNAM4= <>
##$DBPNAM5= <>
##$DBPNAM6= <>
##$DBPNAM7= <>
##$DBPOAL= (0..7)
0.5 0.5 0.5 0.5 0.5 0.5 0.5 0.5 
##$DBPOFFS= (0..7)
0 0 0 0 0 0 0 0 
##$DE= 6
##$DECBNUC= <off>
##$DECIM= 24
##$DECNUC= <off>
##$DECSTAT= 4
##$DIGMOD= 1
##$DIGTYP= 9
##$DL= (0..7)
0 120 120 120 120 120 120 120 
##$DP= (0..7)
150 150 150 150 150 150 150 150 
##$DP07= 0
##$DPNAME0= <>
##$DPNAME1= <>
##$DPNAME2= <>
##$DPNAME3= <>
##$DPNAME4= <>
##$DPNAME5= <>
##$DPNAME6= <>
##$DPNAME7= <>
##$DPOAL= (0..7)
0.5 0.5 0.5 0.5 0.5 0.5 0.5 0.5 
##$DPOFFS= (0..7)
0 0 0 0 0 0 0 0 
##$DQDMODE= 0
##$DR= 18
##$DS= 0
##$DSLIST= <SSSSSSSSSSSSSSS>
$$ [...]
##$SUBNAM2= <"">
##$SUBNAM3= <"">
##$SUBNAM4= <"">
##$SUBNAM5= <"">
##$SUBNAM6= <"">
##$SUBNAM7= <"">
##$SUBNAM8= <"">
##$SUBNAM9= <"">
##$SW= 24.0689530833862
##$SWIBOX= (0..15)
0 0 2 0 0 0 0 0 0 0 0 0 0 0 0 0 
##$SW_h= 4816.95568400771
##$TD= 16384
##$TD0= 1
##$TE= 0
##$TE2= 300
##$TE3= 300
##$TEG= 300
##$TL= (0..7)
0 120 120 120 120 120 120 120 
##$TP= (0..7)
150 150 150 150 150 150 150 150 
##$TP07= 0
##$TPNAME0= <>
##$TPNAME1= <>
##$TPNAME2= <>
##$TPNAME3= <>
##$TPNAME4= <>
##$TPNAME5= <>
##$TPNAME6= <>
##$TPNAME7= <>
##$TPOAL= (0..7)
0.5 0.5 0.5 0.5 0.5 0.5 0.5 0.5 
##$TPOFFS= (0..7)
0 0 0 0 0 0 0 0 
##$TUNHIN= 0
##$TUNHOUT= 0
##$TUNXOUT= 0
##$USERA1= <user>
##$USERA2= <user>
##$USERA3= <user>
##$USERA4= <user>
##$USERA5= <user>
##$V9= 5
##$VALIST= <valist>
##$VCLIST= <CCCCCCCCCCCCCCC>
##$VD= 0
##$VDLIST= <DDDDDDDDDDDDDDD>
##$VPLIST= <PPPPPPPPPPPPPPP>
##$VTLIST= <TTTTTTTTTTTTTTT>
##$WBST= 1024
##$WBSW= 4
##$XGAIN= (0..3)
0 0 0 0 
##$XL= 0
##$YL= 0
##$YMAX_a= 65849
##$YMIN_a= -105171
##$ZGOPTNS= <>
##$ZL1= 120
##$ZL2= 120
##$ZL3= 120
##$ZL4= 120
##$ABSF1= 10
##$ABSF2= 0
##$ABSG= 5
##$ABSL= 3
##$ALPHA= 0
##$AQORDER= 0
##$ASSFAC= 0
##$ASSFACI= 0
##$ASSFACX= 0
##$ASSWID= 0
##$AUNMP= <proc_1d>
##$AZFE= 0.1
##$AZFW= 0.1
##$BCFW= 1
##$BC_mod= 2
##$BYTORDP= 1
##$COROFFS= 0
##$CY= 11.3945322036743
##$DATMOD= 1
##$DC= 2
##$DFILT= <>
##$DTYPP= 0
##$F1P= 20.1720416913024
##$F2P= 0.152960286110954
##$FCOR= 0.5
##$FTSIZE= 0
##$FT_mod= 4
##$GAMMA= 1
##$GB= 0.15
##$INTBC= 1
##$INTSCL= 1
##$ISEN= 128
##$LB= 0.24
##$LEV0= 0
##$LPBIN= 0
##$MAXI= 10000
##$MC2= 0
##$MEAN= 0
##$ME_mod= 0
##$MI= 1.114404
##$NCOEF= 0
##$NC_proc= 0
##$NLEV= 6
##$NOISF1= 3.799351
##$NOISF2= 2.8
##$NSP= 1
##$NTH_PI= 0
##$NZP= 0
##$OFFSET= 15.70392
##$PC= 1
##$PHC0= -9582.422
##$PHC1= 30.40093
##$PH_mod= 1
##$PKNL= yes
##$PPARMOD= 0
##$PSCAL= 0
##$PSIGN= 0
##$REVERSE= no
##$SF= 200.130013532006
##$SI= 16384
##$SIGF1= 3
##$SIGF2= 2
##$SINO= 400
##$SIOLD= 16384
##$SREGLST= <1H.CDCl3>
##$SSB= 0
##$STSI= 0
##$STSR= 0
##$SW_p= 3612.71676300578
##$SYMM= 0
##$S_DEV= 0
##$TDeff= 0
##$TDoff= 0
##$TI= <>
##$TILT= no
##$TM1= 0
##$TM2= 0
##$TOPLEV= 0
##$USERP1= <user>
##$USERP2= <user>
##$USERP3= <user>
##$USERP4= <user>
##$USERP5= <user>
##$WDW= 1
##$XDIM= 8192
##$YMAX_p= 0
##$YMIN_p= 0
$$ End of Bruker specific parameters
$$ ---------------------------------
##NTUPLES= NMR FID
##VAR_NAME=  TIME,          FID/REAL,        FID/IMAG
##SYMBOL=    X,             R,               I
##VAR_TYPE=  INDEPENDENT,   DEPENDENT,       DEPENDENT
##VAR_FORM=  AFFN,          ASDF,            ASDF
##VAR_DIM=   8192,          8192,            8192
##UNITS=     SECONDS,       ARBITRARY UNITS, ARBITRARY UNITS
##FACTOR=    0.0002076,     1,               1
##FIRST=     0,             0,               0
##LAST=      1.7004516,     0,               0
##MIN=       0,             -105171,         0
##MAX=       1.7004516,     65849,           0
$$ Real data points
##PAGE= N=1
##DATA TABLE= (X++(R..R)), XYDATA
$$ [...]
1853D4L65l60J26O3l48K38J41l86j95O49l55K7j09K68k92l8K92L4pl25K61p2p0
1876d9O4r3M1q8K9Q2L8r2j8J05j44r0L95l95P6K89j80RO0K6K0j71PR2k8L15l93
1903i3o2L5L14j76NJ13k85L14M0p2P3j81J33j42J28J03k50K87l60NK7o6K70k37
1927g7J8j59PJ15k83N81m90j2J85K91p6k44L44k19J72j67j36M07p99Q02k39K53
1949B74j74R9l45J08K15j01qj6j48J02J54r0k36J3n9L55q3l12M32r7J37l27j23
1972b30K32j40o7K60M1kj5m74J71K12L8J8q1q7O9L09j34k53K63r5K2K1k42J31
1996c3q6K1j18K66K8j29L22k48j38l1j4K93k96K02o7k28J99j60K39N8r7o8l7j92
2020c14J57K21j88J28K25k58K22k37k47L79j98J07J56j59J19K41m47j02J44n8
$$ y = [44, 409, 49, 175, 238, -110, 128, 269, -117, -312, 337, -18, 9, -100, 168, -124, -162, 130, 164, 157, -168, 93, 21, -49, 15, -78, -37, -125, -96, -14, 24, -68, -86, 19, -125, -215, 180, -215, -139, 150, -30, -21, 39, 65, 85, -86, -79, 13, -15, 300, -93, -155, -120, 194, 18, 23, 136, -149, 165, 205, 133, 206, 25, 158, 16, 144, 247, -3, 284, -76, -71, -44, -110, 160, -77, -59, -218, -211, -96, -379, 202, -288, -300, -115, 176, 100, -144, 200, -19, 153, -14, -150, 257, -542, 260, 21, 274, 100, 199, -146, -38, 177, 76, 68, 52, -96, 6, 160, 70, -166, -153, -212, 143, 60, -252, 180, 83, 220, -107, -230, 2, -138, -205, 55, 96, 94, 79, -395, -224, -12, 26, 44, -37, -124, -55, 254, 120, -133, 130, 35, 57, 78, -164, -33, -119, -98, -216, 50, 78, -51, 271, 23, -115, -146, -160, 133, -163, 39, -28, -256, -57, -217, 22, 80, -17, -85, -122, -314, -157, 64, -124, 4, 229, -29, 193, -44, -291, 88, -110, -3, 153, -6, 113, 354, -93, -195, -51, -109]
2040a09J70p8K38k96Q8n0j11J67p6K01j25p7K51l30J47K15m31J05q4J93L5N3n3
2063D3o0k40L52j18k63K62M42o32J65K43k59K52l01M19l40j45M11j62N9%j97K6
2085d3M78n17J54k18j29N36l03k79K92j26M0L11L6n33L53J02K2l92K15j72K41
2106F8jm7L0k50L66J62l87k10L44R2j62J47m77L27j52K0k8K43m4k36J58K24n55
2129c68J02N68k68k62L18P0J0k22o2K25j64r6L4J38Q6L1m86O73m12J3J57N8r3
2152E0j4K68j14k61K80n86L73J61j33J50K3l94Q9L6K97j30o2j69l1Q6j27L39K84
2175D15l92J25P9m36K16k18L95k36nj4j2l5J6K69k1k01M9n5Pl2K68k39j12J36
2199c3q0K29j30Q3J56r3k53L93l57j57O7K97k1j67K7k17J30K38k84K26j69L85
$$ y = [-109, 61, -17, 221, -75, 13, -37, -148, 19, -57, 144, 19, -58, 193, -137, 10, 225, -206, -101, -185, 8, 43, 96, 43, -17, -257, 95, -23, -286, -24, 418, -214, -49, 194, -65, 187, -114, 305, -35, -180, 231, 69, 128, 128, -69, -43, 435, -82, 72, -146, -275, 261, -42, -321, -29, -155, -115, 196, 232, -301, 52, 154, 176, -216, -1, -173, 68, 67, 20, 50, -200, 166, 328, -59, -269, 75, 167, 5, 152, -325, 2, -150, -130, -158, 85, 41, -195, -37, 187, -368, -266, 302, 34, -228, 90, 160, 170, -52, -114, 111, -53, -149, -115, 23, 109, 140, -346, 327, -85, -72, 85, 143, 50, 36, 304, 190, -71, 209, -377, -4, 157, 24, 174, 197, -197, -108, -72, 225, 95, 33, -136, -167, -81, -208, 131, 415, 23, 148, 227, -209, 7, -211, 184, -52, -57, -71, -83, -118, -102, 167, 146, -55, -6, -61, -54, -86, 182, -57, -169, -33, -113, 116, -14, 69, 225, 132, -121, 272, -85, -242, -175, 122, 101, -66, -39, -256, -126, 112, -172, 54, -115, 270]
2221B70l23r4L63K51m40R3l03%j6J04j66P1J10J49j84j28K88k8PM5j84K29n6j28
2245g0K21K4j60j77M14k83K39k81J45j84M2M5n4j12J86J22k38N4o2r4M22k57N
2268e3J08l3l03L09l1oK64k08OJ30K74o19L71l10K96m1o9j72l2K53j95K27l16
2291a50J79p0J20l0j82k0J45j23L2J58o5rk9Q2k2L7j83M66n67N8pR5J07k3l52
2316c53N99j10k44j83N06k60J5L12r4l02p5J53O4R4q8j51r6L42l84K09J63r8K1
2339D0Q8m02K44J24O2J06l38M2M0o5J74j47K22j60j10nK60J60o2l31Qj15J13K5
2363b7J5KL46k59j73M3j6J61J37k23J12l10P2L14m54L96k5k82J19K49l39K17j16
2386d1J48N8j93Q4O8j57j44km9K01J45J32l13N0P3j93j97P2K79j42J86L8k29M05
$$ y = [270, -53, -147, 216, 467, 27, 120, -183, -183, -199, -95, -261, -190, -80, 69, -115, -243, 45, 17, 24, 69, -115, 114, 58, -70, 151, 175, 15, -162, 252, -31, 208, -73, 72, -112, -70, -25, -79, -191, -5, 117, -121, -67, -129, -223, 199, -58, -53, 55, 22, -281, 28, -3, -9, 255, 47, 53, 183, 457, -162, 209, -101, 195, 154, 85, -87, -119, 134, -61, 166, -150, 29, -41, 79, 49, -133, -153, -8, -131, -99, 59, -6, -15, -44, 38, 16, 53, -130, 336, -231, -173, -180, -85, 22, -1, -353, 246, 136, -108, -291, 215, -45, -30, 282, 188, -114, -189, -36, 28, 122, 34, -117, -213, 129, -255, -46, 117, 19, 40, 128, -274, -30, 94, 156, 262, -76, -34, 6, -59, 115, -32, 190, 30, -80, -85, 175, 335, 273, -58, -50, -165, -52, -27, -12, -10, 336, 77, -96, -53, -69, 92, 229, 6, 118, -192, -120, 194, -260, 136, 111, -171, -52, 197, -142, 75, -41, 107, 165, -28, 56, 124, -33, -177, -179, -228, -27, 118, 250, -63, -13, 60, -133, -330, -258, 21, -121, 65, 103, -126, 279]
2410B79j66J18k09R7J26m42J17K11k5o0o0k09K92%O5l79R0L3M20m54j18N54m71
2433a91L47k80M31k59l23L86J23k10J17j55N2K2l0m9L38k59k02J48l4j53L26l64
2455b19K27K02l81Q7K67p0lj0r8J01K2j61K7Q1K5Q7j02O2n58K73O3J59K77k30
2479A28j13k97L72Np9O5J43J72l70p4l2O6J99Lk61K66k75K27p2o6k43M0L47l13
2503a62J63O8l2r2O7P0r4k5k24J23J00J21j36J16J43l66L77k85J20o8j86K59j69
2526a12K06J26j53Q1J5j39j22J61K50J49l77l72L33j7m9J73j94J3rJ60j96j85
2548b58K47j3K66k30o8p5J34J18m75M49k15OR7j82Q9O1J61oK7J48m90K88P0j64
2572a5J09j62O5n9j4P6P2k26J77j98J6J08P2k81K21Q4j95K73k34K06j97J50P0
$$ y = [279, 113, 231, 22, 119, 245, -197, -80, 131, 106, 46, -14, -223, 69, 69, 134, -245, -155, -122, 298, -156, -274, 280, -191, 156, -124, 307, 48, -275, 111, 234, 24, 141, -14, 38, 60, 30, -19, 319, 60, -142, 6, -28, -181, 145, -219, 8, 210, -171, -84, 183, 113, 110, 100, 2, 103, 125, -36, -9, 72, 97, 184, 82, 144, -414, -141, -78, 81, 358, 128, 15, -282, 90, 95, 16, 81, 224, 396, 26, -48, -80, -14, 185, 188, -73, 193, -82, 145, 73, 7, -236, -196, 151, -162, 1, 69, 37, -55, 12, 82, -12, -37, -261, -138, -38, 83, -53, 63, 206, -160, 217, -68, 52, -16, -202, 57, -112, 94, 220, 67, 148, 163, 24, -98, 63, 313, 462, 85, -287, 46, 29, -20, 153, -41, -28, -37, 123, -73, -258, -11, -24, 242, 12, -56, -131, 3, 121, -354, 95, -120, -114, -17, -199, -110, -49, 112, 106, 133, 281, -209, 79, 149, -15, 94, -68, -3, -62, -76, 0, 72, -154, 23, -175, -159, -51, 21, -260, -39, 45, -150, 123, -111, 95, -102, 48, 118]
2595A18j5m77M95p2k3J28r1l17L68M3j44L54n13j79L61l25J24M43k26K8j53l4
2617a07J92K5q2R0j39q5K52l01K78k69OK96Q2k44n5j0r5K58Pm00K03J69L6r6K03
2642B14j30r1j20QJ55r7K27j66M7m5J02r5j55k05M96%j89l33L52J12J08l74L33
2665A54m6N3P4k89o9J94j14J92K0l67J48K24P9l93J49j02K60N3o1j76J81k06%
2688d2l7J77J15k65Q4J17j58J12Pm5N5k02R3k2k83M86l44J17J66q0l96L66k22
2711b01k7J04J38n8J56Jj50Q7O6j8J60l39Qj60K34j52O4J7K37j07N2j63k34L74
2735H9k12Q9J34p7nj58L61n0j67Mj74M13n64L51k32mK30J23k0k52K49p5o9j64
2759a80J11l4q9M95j62j22l47L31QL25j68k00k85L83k33J18L60l55j35P7K15j30
$$ y = [118, 103, -374, 121, 49, 26, 154, 63, -254, 114, 157, 13, 367, -146, -325, 36, -289, -165, 278, 52, 80, -73, -107, 85, 110, 28, 118, -21, -106, 146, -155, 123, -146, -140, 156, 238, -6, -61, -71, -166, 92, 99, -301, -98, 71, 107, 11, 214, 84, -7, -127, -119, 36, -61, 166, 0, 47, 2, 104, 9, -146, -351, 145, 145, -44, -377, -25, 87, 195, -179, 154, 108, 161, 235, -54, -123, 71, -43, 149, 169, -198, -50, 174, 253, -140, 9, -93, 167, 220, 159, -17, 164, -42, -42, -79, 98, 213, -52, 32, 149, -9, 103, 110, 65, 120, -82, 11, -11, -294, 192, -152, -35, 131, 51, -345, 21, -201, -228, -124, 14, -44, 112, 113, -37, 50, 116, 98, 258, -81, -73, -233, 1, -151, -87, -70, 167, 60, 112, -51, -285, 89, -123, -34, 100, 23, 18, -140, 221, 171, 4, 8, -166, 247, -317, 34, -198, -202, 28, 151, 131, -121, 128, 53, -16, -180, -69, -103, -192, 303, 141, 19, -328, 3, 11, 336, 168, -32, -317, 66, -167, -49, 311, -44, -179, -102, 113, -17]
2781a7M5m8j92M2J49k43L73l00J67K04j08K8j44L0N7k3k4j57j08K47J05m2k85
2804b44L88j9K27k81j23J45j03K14k07R6J5j3J25l64j62J75M2Q9J53k36j39L67
2826A45m1%o3j58K34N6j72J06j41K9r1p7j1K61l97L36Rr9q7J89l6J16q8l08J81
2851a07L32j84N1j66k0P8j47N11j39m34L53k99J04k8j05K41J84l91oJ82l60M38
2873H8k15J67j9O0j8l24l2K28R5j42J42k2j74O5P5j04k2J33J55l79O56n99J11
2896g5L35m8j48l07M08L0m63K6J77K2K57j55k92J22N1l7K46j14N6l12L76l44J56
2919c3j61J12l9M2J00k99J99J66K26k41k05M91l60J93l73L41k65j9q0K39J44j10
2941F8k55L29k31P2j75J68K3J37l75K48jj98o0J23J68j81M62l97n2L87l21K65
$$ y = [-17, 28, -20, -212, -170, -21, -264, 109, -191, -24, 180, 72, 100, -44, -14, 43, 20, -4, -161, -269, -22, 83, 41, -244, 144, 125, 352, 71, -52, 93, -10, 204, -3, 93, 108, 95, 220, -144, -306, -131, -89, 0, 153, -83, -222, 145, 104, 104, 41, -117, 117, 173, 1, 107, -34, -5, -96, -173, -184, 77, -320, 16, 25, -74, -161, 28, -8, 108, 20, -288, -107, 225, 41, 92, -74, -94, -16, -163, 348, 209, -225, 128, -171, -67, -95, -200, 41, 225, -166, -172, 10, -350, 88, -127, 40, 21, 81, 63, -261, -293, -65, 30, -112, 30, 8, -166, -101, -26, -130, -152, -19, 136, -243, 413, -186, -75, 260, 212, 64, -243, 165, 195, -268, -242, -65, -43, 214, 59, -233, -111, -60, -97, 149, 35, 91, -221, 155, -189, -33, -194, -82, -121, -79, 21, -278, -79, 87, 313, 72, -133, 358, -2, 191, -182, 159, -106, -125, -205, 34, 178, 68, -187, 142, -89, -17, -192, -24, -1, 136, -239, 9, 8, -190, -250, -127, 41, -140, 322, -75, -127, 260, -61, 204]
2963B04j18j09J38l06L80m23L81k79q3K21j27p8M83m05J00Q6k78J96O8L6K0m0
2985F7k76J80N5j3m4L7q2k0K61j07j0j4j62L6J39k84JL55O7m31K39j16p8M17m20
3010b03K73j24j82m8K44m2J41L8J30q6p8P2k65L2q2O7J76J1J14k17R5J05p5l59
3034b63J0J75j56l8K79J10k41o0N29l00k91L09j35K86p4j63L5k2J7J02J58k58
3056Ip5K19m4k60J61j06Rj17l2J89N1K48p4k24J0K1k6p2N5K48j56j57K85p7k11
3081a26L62j38l94M87l98k5K60j91K86k56L10J58j85j50j11J19j00J51M36o55
3101a60J45j58R4N0j84J50Jj52J38j52N15l68Q0Q1p4J9pN2j58J50k61J65p5J05
3125dkJ95l1l7m1j9j49J98l26M77k33J56r5j42l40J74K81k72J97m4j16K16J72
$$ y = [204, 86, -23, 115, -191, 189, -234, 147, -132, -215, 6, -121, -199, 284, -121, -21, 65, -213, -17, 51, 87, 107, 67, -209, -29, 26, 13, -31, 6, -76, -96, 165, 58, 48, 34, -128, -92, 47, -237, -236, 119, 186, -245, -6, -122, -200, 217, -203, 70, -54, -236, -284, -40, -82, 59, 97, 227, 141, 63, 135, -130, -98, -180, -113, 63, 74, 188, -29, 66, 171, 96, -263, -253, -78, -234, -272, 7, 117, -124, -184, 345, 45, -246, 63, -72, 214, 140, -23, 12, -10, 7, 109, 267, 9, -66, 153, 109, -151, 10, -96, -87, -204, -236, -47, 4, 252, 178, -46, -36, -15, -41, -113, -58, 190, 34, -123, 162, 85, -126, 236, 98, -296, 191, -207, -232, 28, -163, 123, -133, 177, 335, 150, 0, -111, 8, -92, 59, 495, -160, -15, -173, -79, -29, -213, -63, -62, -214, -76, -228, 287, -81, -1, 80, 6, 25, 18, 70, -88, 62, -199, -34, -109, -4, -6, 189, 158, 121, 80, 61, -88, 110, -216, 261, 28, 184, 89, -53, -393, -219, 62, -210, -13, -57, -173, 43, 215]
3148B15k88J44m1L5k11n9L19l91K68K45l47J25J97l36L53l79k6L33k7l11K32p3
3170b3j73Q9L74n3N3k86Q0nj57M6J35Jj29k2L6J14Jj06P7J96j95j23q6J16K04
3195A64l17j01R5K32j71j85M13r0M2k24L38l84L8K2K43q2m7o0k39K77J30j80L44
3218B58n26L06J68J23l99k61K83k52J65L83j21j8lLm2J8p7j06K11j65K05k1kj11
3242A9P8j04K51l45J07n5J64J70j77l16L79m00L05j08K0j25L59Rk25K71m13k30
3264c66N55kj47j1J88m60J93J55k00L2p2K37k30K90k49J46m9l54L43o3Q4j06j56
3287b42L11K4j6J34q6o8K53k30nj69J13j71P3p0q0J90K73j58Q8l7r8r5j42jK15
3312Fj39j63N18l70J30P3j95O8j51L21K30m59K11k4k40K46j43J71j04Q4j87k25
$$ y = [215, -73, 71, 30, 65, -146, -205, 114, -277, -9, 236, -111, 14, 211, -125, 228, -151, -177, 156, 129, -182, 50, -23, -196, -107, 267, 214, 267, -19, 61, 56, -101, -55, 80, 81, -48, -70, -34, 80, 81, -25, 52, 248, 53, -70, -156, -40, 164, -153, -254, -159, 73, -98, -283, 130, 40, 82, -142, 196, -188, -150, -128, 115, 33, -14, -74, -313, -36, 94, -86, 258, -268, 38, 206, 329, -70, -331, -48, -300, -135, 248, 127, 109, 106, 109, 67, 85, 8, -98, 113, -52, 153, 132, 130, 19, 97, -7, 244, -101, 6, -49, 115, 285, 108, -208, 171, -229, 76, -32, -12, -137, 222, 231, 6, 277, -136, -366, 189, 187, 40, 29, 217, -243, -50, 105, -95, -63, -135, 102, -128, 162, -87, 59, 10, -344, -1, -64, 20, -86, -242, 69, 93, 77, 211, 125, 57, 310, 80, 75, -94, 19, -152, -79, -149, -229, -39, 234, 76, 164, 127, 29, -66, -208, -209, 6, -133, -296, 222, -148, -18, 55, -140, -72, -223, 98, 328, -131, 80, 56, -184, 62, -81, 90, -14, 70, -117, -342]
3334c42L50K84k96k50L91L7n40L72J38j76J21o0o1J79k90K95j4j74n1J02o1K98
3356B52r8k77l8K37j51O2J15k05j31j24N02R0j53N8o1K29l29M0K29j25l01J51
3378b8n8JJ4R8k64J03m1J36L71j95N2m21L03J46j34j09K01O0k30J20q1j36L11
3401B19l74J13J90l02P1J37L1m66O14j66j12j25L29j94K10p1j65K84K38n27K50
3422A84k34J6L61k01k39J03L2L6j45J8mr9K81J42k11P5M9k95J13K21k38P3r4J05
3446D9N0K43j57K7m74J47J95j31R6rk38R0j19K04J81j32k55J66L0K17j62L29k19
3469A28j76L3ml5r0M3J63J14l18J85q3J36m4k0M0qj31J1R5j4l62M18r4j97J25
3494h5m0K28j59N2P0j03J03k02J48O5j65J59K33o12L21l10L80J87K1l61J02j40
$$ y = [-342, 8, 292, -4, -254, 137, 174, -366, 6, 144, -32, 89, 29, -32, 147, -143, 152, 138, -36, -87, 15, -46, 252, 154, -123, -161, 76, -75, -13, 102, -103, -234, -358, 144, 234, 81, 139, 78, 307, -22, 18, 247, 122, -179, -28, -86, -85, -71, 27, -237, -134, -175, -39, 332, 137, 189, -232, 71, 217, 83, -26, 175, 235, 5, 125, 44, -92, 219, -155, -42, 148, -154, -83, 54, 85, -381, 233, 67, -45, -170, 159, -35, 175, 104, -61, 223, 461, -66, 184, -50, -34, 327, 126, -113, -10, 22, 58, -87, -69, -73, -172, 109, 251, 40, 115, 164, -131, -18, 203, -35, 38, -56, 49, 99, 342, 185, 212, -262, -115, 80, -51, 45, 36, -202, -112, -231, -27, 154, 22, -233, -67, -37, 180, 18, 347, 128, -48, -15, -19, -54, -144, -101, 62, 176, -142, 43, -40, 96, 52, 32, 72, 64, -67, -56, 39, 25, -337, 81, -13, -210, -85, -125, 103, -56, -4, 66, -37, 66, -136, 12, 77, -88, 71, 304, -308, 13, -297, 83, 270, 291, -70, 32, -108]
3516a08J97k20O2L24m83J38l36J95j3M64j01r7L21n04p1J76j95J08K4M61m87J15
3538c0j01J64j3M5r1J62m5k15L07j62j36l4J21O6J97j29J00o8Q9k85J16j66K91
3561A83k36j27J93J2K4r0m4q6Q3p6L45m6l2N4l36J01l3L96k18k00M13j43j57O6
3585D6J28k89R1L8K02r1k78M1L08k88R4n8K37k57J52m5k7J26jp2o2L1j7J2k85
3610b64K33L8k02K90j7j97p4J01J65k90L90l10K99j1l86K08oo8J68k63J56K18
3632A78j58j70k4L95n63J30k3k4M87l54j06K07K42m08J10Q8j92p9M51j93r4J68
3654F8R9k36L4n8J24j8K2r8M4J88j22K35m67J69K66m70M72j07o02K99K1J67LO6
3678I9J71k83J70k35K25q9o5j78K09k53K18n2l0N7J80k83J19k48K60m0J51j14
$$ y = [-108, 89, -131, -69, 255, -228, -90, -426, -231, -244, 220, 119, 22, 343, -161, -232, -56, -251, -143, -119, 342, -145, -30, -131, 33, 20, 65, -26, 136, 91, -124, 183, 21, -115, -149, -28, 38, 235, 106, 206, 138, 227, -58, 58, -108, 183, -53, -180, 13, 25, 49, -41, -85, -171, -88, -164, 181, 135, 103, 157, -179, -78, -111, 285, 67, -133, 280, 137, -20, 46, 174, -115, -24, 14, 216, 125, -153, -112, 196, -92, 2, -56, 181, -76, 76, 31, 4, 130, 129, 57, -5, 26, 9, 21, -264, -31, 7, -195, 95, 78, -119, -193, -92, 73, -217, 173, -137, 162, 151, -235, -27, -33, -101, 67, -196, -40, 178, 20, -150, -174, 221, -342, -212, -235, -259, 228, -126, -232, -25, 217, -191, -81, 7, -185, -264, 187, -6, -100, 68, 167, -69, -35, -93, 31, 13, 35, -63, -19, 169, 47, 282, -185, -16, 250, -220, 252, 145, -457, -158, -137, 30, 33, 99, 270, -13, 157, -78, 147, 58, -7, -185, 24, -229, -11, -63, -93, -36, 144, -139, -20, -268, -8, -48, 103, -11]
3700a1l03L01R3jq9K26j03r0j1L08l66QJ02r2j17o3K84k0K80k53l2j47J36j68
3724a28K07l86J90K36N2k44J41m43K28J25q0K60l39J75Mk21O9L30l36J29J14k92
3746b09M21k85r8J70k81K29J45p7r4O7K40k23j16N1m3N8l7O4R7l52L55j56M26
3769C52l63L2Q7j78K96j72J77p4l26n6L47o1j72PJ77q7j40L37l00L44j92P9m2
3792G2k16L16k29J45Mj29j88K65kl24L56k54J71L7M7j77J58n8J76k74J47k59J67
3815d9O2J93j03N8j12J06k17N5j58J12O8J15o2R1n2n1j92K46q3k45L85l70L03
3838A00j14K62l49P6J10j36N8j36L19j30L5l95J70K66r7j3j79L22P0r6M9k14J55
3861A33k43K96m11J86k15L26M9j91J37k24M14q8j53J77j32Pr0j62L03m8l02K77
$$ y = [-11, -314, -13, 80, 79, -10, 216, 113, 23, 12, 320, -46, -38, 64, -28, -145, -208, 76, 56, 336, 83, 51, -96, 40, -128, 79, -307, -117, 119, 171, -73, 68, -375, -147, -22, -102, 158, -181, -6, -2, -223, -154, 176, -160, -31, 83, -209, 212, -73, -171, -1, -282, -53, 92, 15, -79, -12, 228, 5, -111, -60, -103, -45, -82, -18, 79, -273, 82, -74, 352, -11, 21, 108, -70, 226, 54, 231, 157, -169, -225, 122, 61, -111, -104, 73, -14, -154, 183, -117, 227, 35, 114, 72, -144, 172, -57, 88, 92, -37, -225, 40, 38, -286, 70, -184, -13, 24, 71, -106, 52, -6, 170, -104, 43, -216, -49, 13, 206, 103, 161, 49, 155, -62, -7, -165, -53, 15, 130, 68, 159, 107, 56, -136, 110, 27, -218, 167, -203, 100, -14, 248, -101, -25, 85, -51, 7, -129, 190, 60, 95, -300, -130, 136, 39, 26, -153, 169, 239, 143, 192, -22, 133, -110, 186, -225, -39, -254, 72, 121, -70, 67, -157, 257, 169, 16, 193, 61, 68, -22, -184, 119, 71, -231, 46]
3883D6k28K7K41j00K4P5N3k42J41j19Q1k36M8J80J36k13m3L17m11K16k20M90r5
3906A68q5k33R2k3Q6j47k72M02Nj92K66J17k38K90j37M9l65J85K07k27j54q9K32
3929f3J57j31jm9N7j31L34j57L3J6M0J32j69jn6K23j80L0q4p6j36K14O3P5l75
3954b35o8J67j87K99j20M3J19O4k31K0J54K53j57k05K46j39j55L07j55j4j82N9
3976a17n8K49j50K33K3p9j06M7K65m28J82j3K19Qk23o2K01k56m2M12k92l16L91
3999H8l2M9j4k43M21j56O9p7K6k33O0r2R7J48k83K82Op6j71J51K2k35K17J08P5
4024B07k88j80M2J99j46L82l61K03k40N84k96K1j81o9K14J69m37K29k05K22j77
4045a08j45K53K47J55n13J52l0N8j9o9O1O7k42K59pK16l97K91k38J6k8J44k51
$$ y = [46, -182, -155, 86, -14, 10, 85, 138, -104, 37, -82, -1, -237, -189, -9, 127, -86, -129, 188, -223, -7, -227, 263, 168, 83, -150, -58, -81, 5, -142, -414, -12, -7, -199, 67, 184, -54, 236, 99, 148, -217, -32, 175, -52, -206, -295, -63, 94, -37, -38, -87, -30, -161, 173, 16, 49, 65, 105, 237, 68, 67, 11, 234, 54, 84, 0, -76, -212, 2, 65, 140, -235, -303, -136, -323, -24, -144, -101, 18, 82, -149, -129, 25, 278, 121, -84, 162, 23, -132, 175, 20, 6, -176, -117, -175, 74, -76, 157, 180, 101, -5, 42, 307, -121, 61, 48, 267, 275, 52, -10, 191, -65, -107, 305, 13, -303, 88, 56, 105, 91, -152, 269, 113, 182, 105, 131, -102, -42, -134, -37, 111, -172, 110, 116, 40, -131, 20, 42, -193, 24, 132, 207, -81, -261, -219, -20, -166, 216, -145, 58, -182, 402, 106, 127, -54, -123, 91, 260, -177, 52, -153, 69, -108, -253, 0, 247, 402, -111, 41, 11, 69, 50, -19, 42, 109, -133, 126, 119, 335, -62, 229, -9, 7, -21, 123, -128]
4068a28J99J70j84P5l17K45q8MJ11Qk34q4L23M7m03M67k37j12J88k17N0L63k29
4091A7j45L18k01J29k64Q7K11k65K39p6J84J40o17L48j25%L6J66j6j51J5k24R8
4114i6K06kk79p0J30r1K21J03l21L88m69M06j61j28p4J42KR8J14p4j85j3K20L43
4138D10k67J1j4j52J51o8q1l66P11j26j32j93QM7J45J9j37K62j01j7J09l09N5
4161c5M70m45k8M7m3j80L20k18lR8m4J7J28K68m28j09M72j80m10N11k84J72k92
4184a96L50k43n4J59j08j08N1J06K94o5j07p5j9L9K68j56k88J09J78M3l26L56
4206B08l60J10K15q1K32j18k8j42j50M46l44j71J44N3j72P9j72M08J9l22j14O04
4228C44k74j80J38N0k82M99k01O6M4l3j60l10M74L31m76j34R8j0K92l25MK67j20
$$ y = [-128, 71, 241, 57, 132, -185, 60, -28, -24, 87, 95, -139, -223, 100, 147, -256, 211, -26, -138, 50, -167, -117, 246, 17, -128, 190, -11, 118, -146, -59, 152, -113, 126, 50, 234, 374, -243, 105, -20, -20, 16, 182, 166, 15, 30, -194, -96, 110, 108, -171, -241, -111, -202, 19, 122, -199, 189, -280, 126, -35, -163, -237, -95, -93, 5, 119, 45, -140, -153, 67, 410, 143, 154, 140, -12, 139, 71, -10, -376, 335, 209, 77, -116, -108, -61, 84, 103, -34, 228, 127, 110, 219, -90, -35, 435, -10, -38, 9, -34, -214, 106, -112, -115, -17, -61, -44, 84, 352, -76, -185, 287, 107, -303, 208, -76, 96, -196, 154, -89, -143, 16, -92, -200, -149, -43, 251, 186, 79, 4, -15, 24, 292, 136, -152, -43, 135, 178, -148, 208, -152, -42, 173, 92, 324, 206, 178, 36, -114, 332, -12, -183, -39, 14, -158, -79, -251, 157, 176, -146, -260, 344, 70, -110, 28, 78, -204, 295, 94, 160, 204, 171, 11, -299, 175, 506, 30, -104, -6, -16, 276, -49, -45, 222, 102]
4251A02n64M80k38Q0j22M84m29L2nQ7K07k46L26j54pN7Q1k06K60n21K94J60k55
4274i7L31k13r6M2j51R0p7O5J62P4k31K3k8L6l63M73J7P6j35J35j34J25Q1k96
4298i1j00L81P0l92K06k17LQ7k5k5p4M6PJ3j70N02j43j5K21k33J51k05K91j98
4322I0M5J57j35n32L03J80l54M69m25O0j0L06J17l68J37M3l1J09J02l70n5Q5J00
4345B3K5k08jL72Q0o19P1J84j8K89r5k20J58j0q8J37K6j07j56J86J38k88L01k49
4369f9J55J29n93N27Q9k71J24k59o9J37O9L28l04K73j30l33K17j35r7N28k97J61
4391A80l9K11k90k90j20K38K52j90L1p1M10l87M5k14J60L6P3P0N1l79J51J25M3
4414I6l43N52l34q1J08J47p3j2P6l1r4l5n5K2J56P1mk76J09j00J50Q7n00N80K4
$$ y = [102, -462, 18, -220, -140, -262, 222, -207, -175, -180, -93, 114, -132, 194, 40, 33, 90, 171, -35, 225, -296, -2, 158, -97, 234, 21, -75, -33, -184, -94, -171, -106, 56, 130, -101, -78, -106, -70, -433, 40, 57, 133, -2, 133, -1, 124, 205, -91, -191, 190, 260, -132, 74, -143, -140, -53, -78, -103, -177, -131, -124, -111, -281, 221, 78, 63, 284, 51, 202, -3, 288, 90, 135, 292, 157, -375, -72, 108, -246, 223, -202, -142, -152, 154, 271, -97, 40, 83, 52, 161, 263, -107, -162, -77, 23, 48, -160, -161, 211, 291, -328, -257, -73, -91, 198, 103, -117, 41, 31, -57, 80, 106, -1, -157, 29, 167, -121, 180, -69, 86, 215, -378, 149, 238, -33, 91, -168, -237, -100, -31, 297, -7, 266, 136, -197, 20, -115, -212, 316, 19, 180, 141, 352, 62, -228, -348, -110, 142, -48, -17, -88, 322, -65, -20, -234, -74, -38, 35, 105, 156, -223, -72, 53, 96, -247, 305, -29, -110, -2, 145, 72, 60, 136, 105, 11, -24, -79, -57, 99, 170, 166, -110, -1, -101, 49, 136, -364, 216, 240]
4439B40m23J65%J35j67J35j9n7j15J5L02l66K42r8O6p7K80k59q4N4k05K55r5L
4463g3J84l75O25m47J6J25j16j57M47l45K32k94k5J51J85k04J86k00L7p8K44O3
4485A81m04K63k52J74J13O8j07P2k15J51m14L59J11j57M4J78j66J07K7p2m1Qj24
4508i6n4L2M65k66p5J97k20K37j39J54l10j35J29K09l7J1o8L4K9J73l80K38kk80
4532a54J77k5n5l1O8J14k15L67l57K00k22L9K7j04J44J63j95J78j4k10K87j01
4554H1M0r6q3M06m26K09j77K68Jk39j79L74l6q8j25L4K1j65L67j23J54n4k53m2
4578a31j2Q5O7K3j66L20l43O7J7j47J5J36k55J88J60j05Q0k95K99j68jL55k20
4601c1n7L22l04N8J49K4j75R4K44m21r3K33O5j52J96j04n7K39j30J0j31K43m51
$$ y = [240, -183, -18, -18, 117, -50, 85, 66, 9, -106, -91, 211, -155, 87, -11, 55, -22, 258, -1, -85, -31, -236, 19, -76, -73, 111, -264, 361, -86, -70, 55, -61, -218, 229, -116, 116, -178, -203, -52, 133, -71, 115, -85, -48, -126, 118, 181, -223, 40, -212, -38, 75, 143, 36, 108, -107, 44, -370, -11, 100, -57, -13, 165, -1, 106, 133, 61, 20, 28, -96, -150, -118, 347, 81, 6, 203, -17, 220, 81, 235, -75, -210, -81, 128, 91, 102, 34, 68, 97, 270, -110, 128, 126, -154, 23, -2, -57, -88, -20, 94, -121, 246, -111, 89, -133, -94, -67, -171, -27, 136, -59, 119, 105, -105, 182, 81, 121, 25, -58, 348, -78, 131, -46, 222, 223, -16, -195, 179, 143, 55, -70, -36, -15, -180, 187, 64, 218, 164, -89, -131, -143, -58, 9, 32, -134, 186, -157, -90, -73, -220, -205, -69, -324, -136, 24, -81, -1, -296, 3, -165, -166, 189, -31, -88, 234, -70, -12, 137, 161, -14, 80, 324, -97, -190, 43, 108, -44, 152, 48, -9, 230, 100, 110, -21, 222, -229]
4624b29P7K35k77J37L44l2k88L7J10k96J10j38K88k4l62L30k34J15L5J73J77k86
4646BMk17K83J00j24J47l54J03J51k80k5N47k01l37K94j27R9k14K99o1k5m62M90
4669I2M5j43J52j55j17K24M8l9k17L29l82L11j96k4K76k01j04n1r9N88l17k99
4691b79K50j11J17j92M5K89k04J69j46j21N4J68O1j17J78n9j46j27O1J28Pm9L7
4714A3j56J84j7k24L9K69l4k38J73k19J95M50n34NKj3J51J0j43m2J3Q8k34K50
4738a2N2%j49P5K16m65M12PN6K7R4J3k23L04m87J01k08J67o3j71K71j5P6p0P1
4763G9n45N48j61j6J55k94K05k20K39R7P7l49Q1M24l56j55J36M8l08M24r7L4J05
4786A51q2k62j91L46K18l23K74l01P6M32j06l68kL2J1j25M72k21K05m45K58j39
$$ y = [-229, -152, 83, -194, -57, 287, 255, -33, 4, 114, -182, -72, -210, 78, 54, -308, 22, -212, -97, -62, 111, 288, 2, 6, -211, 72, 172, 48, 195, -159, -56, 95, -185, -210, 337, 136, -201, 93, -34, 65, -149, 150, 89, 64, -398, 92, 137, -6, 146, -9, -126, 98, 146, 107, -110, 219, -163, 148, -48, -72, 204, 3, -101, -152, -251, 337, 20, -279, -29, -140, -23, -215, -170, 119, -85, 84, -62, -183, -129, 39, 100, -17, 161, 102, -44, -171, -110, 18, 25, -24, 13, -143, 41, 24, -200, -161, 108, 74, -164, 9, -210, -15, 435, -99, -94, -92, -105, 46, 56, -87, -129, -116, -28, -262, -12, 40, 40, -109, -34, 182, -283, 129, 136, 192, 219, 313, 326, 103, 407, -80, 21, -187, -20, -83, -254, 17, 2, 78, 8, 79, -466, 82, -79, -95, 60, -234, -29, -249, -10, 87, 164, -185, -104, 320, -36, -191, -55, -7, -315, 109, 12, 46, 151, 69, -193, -384, -38, 180, -143, 131, -170, -94, 338, 232, -136, -138, -106, -95, -220, 252, 31, 236, -209, 49, -90]
4808i0k18N23k16L33l35L2K30l36P9K0k4Mj30K59k71M8M2r3M03m14J91j89J13
4831c9L5j6p1k49J49K25Q5l2q6Pk86O80o44L77k32r5j2L37j0j65L33j38j26mK97
4856C20m33q1J0J23J2j40K10J30j84r3P5K50j21j11q6k5L00k44K29n7r0o7K28
4879A55k14M05j60p02O08k49J78m4j7P2l89L56Pk46L37j75Q8j62N17m27jK1J86
4902A44k40n3K59j59R4oK19l91j6J00K48l35K70k05l2L10l80Q8j42M50M9m80K84
4925G6j0j21L21l34r5K94j77R9K1K4r4m1k2k1K11j23p3J06K65l1l29J14J35l31
4949a36k47N76j99j16K13k13J35J03k03pn4M05l56J2J48or7o1J25K64l39J97l33
4972a89Q7K58j91n1J11j77J21k1J9q8K7j89J21J84j41K47j70L5l62K70L55l00
$$ y = [-90, -308, 215, -1, 332, -3, 29, 259, -77, 2, 22, -2, 2, -128, 131, -140, -92, -50, -143, 260, -154, 37, -152, -39, -4, -20, -91, -340, -191, 34, 119, 87, 1, 8, -278, 402, -242, 135, -97, -192, -204, 133, 123, -42, 291, 153, 27, 23, 320, -113, -194, -184, -61, -49, -189, 21, 151, -33, -126, -51, 199, 78, -33, -119, -144, 156, -88, 141, 84, -6, -73, 155, -59, 346, 186, -516, 92, -157, 21, -23, -40, 32, -357, -1, 6, -240, 97, -78, 10, -152, 365, -62, -63, -42, 144, -96, -149, 110, -49, 45, 39, 258, -133, -149, -49, 199, -136, 134, -71, -103, 207, -173, -85, -227, 223, 272, -208, 76, 66, -55, 266, -68, -163, 131, -46, 53, 74, 98, 4, -37, -59, -80, 131, 8, -65, 41, 306, 275, -54, 60, 195, -136, -383, 193, -6, -122, 91, -122, 13, 116, -87, -94, -148, 257, -99, -87, 61, 55, -42, -103, 22, 286, -53, 144, -189, -102, 156, -35, -86, 25, -152, -31, -52, -33, -121, -94, -283, -162, 22, -119, 128, -42, -7, -369, -99, 256, -44]
4994d4J44O4j03K45l84j82K69Q1j63j89QJ20l04P38l4j98P6k43k1l0J63j00J22
5017C5j07J48j03o9J97j01n2M9k78L48Q4k68l9J36n6O4j99K35K2J19l4k21j13
5040b03L14J60k17n4j28N4L7J57j56l1j20P6J56L6k92K43j87J1l6L17j95J14J28
5063A84m28O3L86k12p5J24k08J84M7j38R4J9J22m14J36J05M4k48oK13k25L69J3
5086A49l99J46J38n7m5M6J11q7l20K20l9M3L56l57M5K07k44J67j95L17j64K6J22
5109A86k59l3J77k62J54j26J61J8o7J58q4m80L35Q8j44Q7M7p5K32j35k3J54k79
5132a70J36MN38m17j26j31J36k96J97j7L54n9j40K73j84n5k7j59J24K03N3m37
5154b00K97l13L80p0k31K10Q1l64n6M10q7L6j09j26K52j60L7J39l43J08P4Pj59
$$ y = [-44, 100, 164, 61, 306, -78, -260, 9, 90, -73, -262, -254, -134, -438, 300, 266, 68, 144, -99, -120, -150, 13, -87, 35, -72, 76, -27, -96, 101, 0, -52, -3, -281, 67, 151, -117, -156, -20, -76, -12, -211, 24, 46, 165, 131, -90, -203, 111, 271, 54, 0, -128, -74, -37, 120, -36, -67, -187, -111, 45, 81, -211, 32, -155, -144, -180, 137, -58, 56, 184, -244, -181, 205, -7, -82, 42, -166, 18, 65, -73, 21, 40, 162, -252, -116, -11, 33, -215, -221, -8, -233, 136, 149, -250, -104, 34, -23, -68, -22, 89, 2, -318, -98, -137, -94, 262, -95, -50, 157, -87, 80, -115, 202, 38, 64, 186, -73, -106, 71, -191, -37, -163, -2, 16, -51, 107, 23, -457, -122, -34, -178, -91, -44, -119, 113, -22, -45, 109, -170, -34, -30, 508, 91, -35, -166, -30, -326, -129, -146, 208, 149, 9, 282, 98, 43, 16, -143, -19, 184, 237, -200, 97, -216, 164, 94, -137, 73, 154, -210, -266, 144, 57, 93, -16, -142, 110, -50, -13, 126, -217, -109, -35, -28, -187]
5177a87J27L99k40j44m2J78k07p2J37J6K32k73jK0J7p4j39K08K00l13K24k96L43
5200A13k5n2n6N7L82q6k10p7j95J60M4j05K0j0J24j92J7M7L08k21J56k41lJ52
5224A07k4j85P4n1P6j11j93M43j04R6j82K6r1J47J02k06N4J0K25j60j04M14l49
5247A4O35q31K15r4j09J63J21j48J36J6k63M86j42k18J26j92N2L44l81j41Q9J60
5269C8LJ26l34j89M23Qj64O6J64j69J39j54O9r8K43j61l02L10O7j4r7K09K04n77
5293a90K02k92N65n42L45K53o69K24j7L26l06j04J08R5o0R6p9m2J88J67j63n9
5315D6K13l62n0J85M5l70J71j20J58L95k06q1R9J95j34j77M3k3K23j94j45j0m
5338a03K99j68j24J01M3J35l31K75m4m96M12j60J48K2O0J25r4k27j77L50k47M64
$$ y = [-187, -60, 339, 99, -45, -87, 91, -116, -188, -51, -35, 197, -76, -77, -57, -40, -114, -253, -45, 155, -158, 66, -230, 113, 88, 36, -20, 37, 419, 333, 123, 46, -149, 11, 55, -50, -30, -40, 84, -108, -91, -44, 264, 43, 199, -42, -45, 107, 83, -102, -28, -79, -3, -114, -307, 136, 32, 128, -54, -28, -119, 28, 130, -76, -22, -12, 213, 53, -51, 363, 14, 649, -182, 33, -61, -170, -7, 114, -34, 102, 118, -145, 341, 199, -19, 107, -85, -33, 311, -70, -211, -122, 38, 41, 167, -167, -356, 67, 75, -89, -23, 141, -28, 111, -43, 26, -72, 171, 10, -292, 18, 85, 71, -26, 183, 387, -190, 12, -280, 285, -257, 88, 341, -328, -104, -121, 205, -101, -205, -97, -2, -62, 34, -45, -87, 101, 268, 105, 46, 259, -103, -153, 32, 77, -293, -122, -242, -84, 311, 105, 24, 123, 318, 184, 7, 50, 27, 250, 56, -89, -99, -103, 196, 28, -96, 5, 48, 183, -148, 127, 83, -413, -1, -161, -13, 9, 69, 194, 100, -127, -304, 46, -201, 263]
5360B63m33NJ67j01J57l24M80k54J26oj25Q1P5K6j81j57P4J16r2J7J39K31l22
5383c8o5J78j79N8l5J59o0K28k61J4L55m02o8L16j9j12k34J7O8n8L1r6L50j35
5407A2m5K08l01r1L93j59j50J23j49L8K40Q0j51k89R3J94K1k5l7J41K7k20R0k3
5431B0M5J17l52K2K96k2p9k53L15k29j13J60K53k94K3J16l6K7j51O0J82l13J07
5454i9J66RQm40L01Q1N6K4m79J09L18p5J83k04M3K87l32L40l73j27L8K51J29l72
5478a58q8J00M19j68l09K09K25k19q8k8R2K10k30m9K20o5k54J19j11J49N3K23
5500B52k62rl0J42N1l95J75K28j4r7k75L51j50J41j68j41L77j45p2P5k93N43n59
5523b75K98K8M3J2q5n6J83l8j35p1m49O20o2o3o7K1J17j20J30N4k53K50j40L3
$$ y = [263, -170, -165, 2, -99, 58, -266, 214, -40, 86, 80, -45, 36, 111, 137, -44, -201, -127, -11, -103, -86, 53, 284, -38, -103, 75, -104, -46, -81, 78, 18, 246, -15, -1, 354, -48, -116, 200, 181, 69, -165, -148, -80, -138, -107, -203, 147, 12, -33, 175, -126, -217, 176, 17, -133, -10, -159, -121, 119, 199, 48, -241, -148, 46, 67, 42, 5, 146, 173, -47, 43, 20, 65, 182, -170, -148, 148, 126, 47, -206, 109, -120, -233, -73, 180, -114, -91, 25, -11, 16, -135, -75, 107, -206, -99, 67, 76, 84, -356, -55, 26, 82, 106, -373, -264, 54, -21, 162, -42, 1, 288, -44, 296, -77, -204, -166, 85, 214, -158, -246, -146, 273, 105, -204, 5, 230, 11, -77, -105, -13, 197, -33, -82, 138, 73, -181, -62, -173, -24, 29, 252, -10, -19, -49, 93, 144, -251, -76, 152, 138, 41, -234, 117, -33, 108, -60, -201, 176, 31, -41, 34, -259, 284, -275, 23, 51, 94, 106, 21, -35, 148, 110, -25, -96, -545, 75, 13, -50, -117, -96, 21, -99, 31, 85, -168, 82, -58, -25]
5547b5K81j79q5J11O7m02M90n24M12k86L02lk21K85p4m5J96n13L80O1k36m6M6
5570hk5K22m02J26j4Q1J0PR0o3l1l0j50n5J91J11l0k62L8J86P3j88K38j07k0k63
5596b75N34k12p7m7K53m7k8Nn81N61K4K4r8k8m27L18J40k4k85L9K71q9K10n72
5620d11M13O5M0j70J18l87L80j76J83j24L5K41j47L0j44j74K42K64j36j22J89
5641B09k26k9P7L7k06M08p9Q7j42r8J30j17j12J4r7J96k98K50O1j09L17m64J31
5664f0o2J77p6jq8K29l02KJ35%p1K13k23ML05k7k27j9L01k40R9l18L36k94M01
5689A94m35l6L39R1n5l10M23k07n0J36K25m08j32M00l23J9K43q0j34K23R0m87
5711b74L22m0L8QK7k72n2K69J11L0n3k51j32J45K92j06K88m11q2K00j37P2P2J7
$$ y = [-25, 256, 77, -8, 103, 170, -232, 258, -266, 146, -140, 162, 159, -62, 223, 149, 104, 300, -213, 167, 228, -8, -54, -8, -33, 189, -213, -87, -101, -20, -10, -3, 87, 24, -7, -37, -187, -242, -51, 60, 30, -232, -194, -8, 65, -123, 115, 8, -12, -275, 259, 47, -30, -77, 176, 129, 101, 106, -475, 86, 110, 134, 36, 8, -419, -101, 39, 15, -270, -231, 40, -49, 161, -411, 2, 67, 107, -63, 55, -332, 48, -128, 55, -69, -34, 207, 60, 90, -54, -228, 14, 278, 142, 20, 209, -17, -46, 31, 68, -138, 270, 191, 278, 136, 38, 168, 51, -61, -47, -144, 52, -246, 4, 65, -44, 273, -191, -60, -122, 55, -21, -22, -110, 119, -183, -181, -46, -46, -117, 96, -127, -123, 182, 155, -72, -91, 210, -30, 69, -249, 87, -207, 194, -241, -277, 62, 153, 98, -212, 211, 4, -46, 90, 315, -93, -225, 175, -148, -129, 114, 34, -100, 123, 213, -274, 48, 8, 46, 54, 81, -191, -243, 26, 137, 167, 114, -137, -269, -124, 168, 62, 350, -61, -143, 57, -80, -8, 64, 81]
5735H1J6k32K44k82K60R1j0k13J02q6k7K59k34P1k58L53q1k4l01N98n7l24R0j89
5759a53L11m60J68K01j92j38K53K07j83Pm01K77K34j22N5J88o56L73J01k01J23
5780hk3qK7O8k91M07k42R2l19M16J47m69J56o8L3P6l37R9M95n03M30o5l43J34
5804i6Q8r4N7L0K30k53J97j74Q9j95L34o4l51j29L68k80N86m01J29l4J73r5j56
5827d1Qo4K7J2K15k55M9J77J6l02L01j59L12j82j43J87n7l04M58j20k68J65lk74
5851b45Q4K91L2k13j62L75l69L02j25j39K34M9k81L07k42J02p1N5pJ80l40J44
5873c9K33j84K9r1j26J70J33J99m59J66j06M6O2j9oK2j24J17j83j57M17k31k9
5896a60L9J67J22L5l72J69p5K40k26k14J47M11j85k01o3M65j55k08J23j03o1N5
$$ y = [81, 97, -135, 109, -173, 87, 178, 168, -45, 57, -29, -56, 203, -31, 40, -218, 135, 54, 30, -271, 327, 270, -54, 36, -153, 158, -302, -134, 67, -125, -263, -10, 197, 14, 21, -380, -103, 131, 9, 64, 252, -404, -31, 70, -131, -8, -31, -39, -12, 56, -235, 172, -70, 22, -297, 119, 266, -203, -47, -115, -82, -6, -343, -244, 251, -252, 178, 113, -230, -96, -8, -102, -45, -15, 215, -38, 159, -15, 74, -121, 213, 149, -202, -331, 37, -243, 343, -58, 71, 37, 210, 115, -41, -33, -97, -70, -58, 157, -98, -49, 128, 144, -158, 143, -16, 296, 114, -29, 158, 101, -203, 255, 135, -133, 32, 29, -245, -161, 130, 162, -51, -213, 162, -207, 95, -30, -169, 65, 114, -167, 140, -102, 0, -71, -16, -23, 157, -183, -39, 194, 10, 39, -52, -178, -8, 125, 324, -135, 31, -75, -29, 33, 14, 8, 30, -94, 23, -160, -317, 100, -131, -160, -121, 46, 168, 203, -169, 0, -75, 165, -61, -275, -128, 283, 98, -103, -166, 299, 144, -64, 59, -44, -105, -50]
5918e0L87k95J82l95Q2j51J77K94k54J4J08r4m9j22J22J07k01j77J62K35J57l51
5940a12J73J34k94N9J2j5o1j06L35P9k09Nj66L8L13k59L36l36J60m72L93m4P4
5963C7k49J02NpL7J32J16m68K51pJ72k45j37K62L3j56M4j35r0M93o3j24p7J51
5987G7j62L30l99N3r1l03M75r2j0J4Q4P5J11J69k90J15k32m5j97K64K62j94q5
6010g1J49j08n0Q4p7K37M4p8j63kQj72L37J52l09q8N1R9q9O8O0J66k30np8J17
6036E2j20L2K66l46j21J29K26O6l4j96P2J38j76j31L14l55M62m38pK24p7K07k40
6059e3L26l75Q8J25j16j35K37p8k37K15j49J28K48l98r4J1L12j88J14R6m6o6J10
6082G5J42m18L01j34J57j78j56K41k21O70o73R6j21K62j10J69j90J13R0k14N6
$$ y = [-50, 337, 42, 224, -171, -89, -240, -63, 231, -23, -9, 99, 5, -44, -166, -44, 63, -138, -315, -153, 82, 239, -112, 61, 195, -99, -40, -28, -43, -104, -210, 125, 204, -5, 0, -166, -128, 185, -74, 262, -74, 86, -386, 7, -37, 37, -212, -110, -105, -112, -75, 57, 173, -295, -44, -51, 121, -124, -261, 1, 34, -122, -78, -213, -303, 190, 127, 3, -74, 77, -85, 245, -154, -101, -192, -495, -20, -112, -122, -108, -24, 51, 162, 331, 41, 156, -76, -121, -318, -54, 208, 14, -71, 78, -30, -80, 4, -73, 164, 208, 130, -33, -35, -27, -199, 138, 290, -19, -107, -56, 43, -46, 22, 82, 248, 18, 13, -65, 52, -68, -36, 230, -116, -237, -108, 118, 184, 150, -46, 26, 164, -12, -143, 171, -184, 278, -160, -167, 57, -20, 187, -53, 273, -102, -14, 111, -5, -140, 97, 19, -218, -3, -152, -24, 224, -174, -268, -257, 55, -133, -19, 77, 31, -35, 75, 217, -201, 100, -34, 123, -55, -211, 30, -191, 479, -194, -98, -219, 43, -67, 102, -88, 25, 115, -99, -43]
6103d3P9k19L0j2j90L80K75n43K31J04M1p8O0j04J22j38Jk09K97J01m53K29k01
6126b40L93m06K40J86r1p1J46k78k6K36j06j21J3J42Q5j62n5J18O7J20k44P6L7
6149E9J04j72J87j42k39J5K80m7k3q3lJ64j98k4K79p3j76J08O9J10k04K8K10k86
6173e7K1N0nj58J28L3%P4L5K5k43J63PK1j49K8K02j64l60j95P33J83n69Q2j3L2
6199i6J29n3J05l75J58J25k64N76l30P8k3j40K96j54p0K00pk99K60J12j08k30
6221a10J48N0l57M15l30M47m50L0O3o5M5M2J81n5N5O7j57M6O5R4k80J2J2J15j07
6246b4K38k97P7Pj89J33K3P4R0p6O6Q5r4m49J64J92j16J60N1m5k0K44k60j42j2
6271a20O8q7L53k6j53jl4j99J00j22L00k32j7J68J28k73k11N31j02j64l8L06n4
$$ y = [-43, 36, -183, -153, -165, -355, 25, 300, -243, -12, 92, 133, 55, 115, 11, 133, -5, -4, -213, 84, 185, -268, -39, -240, 153, -253, -13, 173, 82, 11, 157, -121, -147, 89, -17, -138, -125, 17, 102, -60, -115, 3, 70, 190, -54, 22, 59, 163, -9, 178, 36, -203, -188, 92, 45, 22, -61, -64, 100, -98, -122, 157, 84, -92, 16, 85, 195, -9, 19, 229, -57, -36, 14, 9, -149, -21, 12, 12, 86, 121, 146, -97, 66, 73, 94, -55, -27, 175, 11, -349, -544, 189, 372, -197, -115, -128, -96, 33, -20, 85, -290, -132, -7, -271, 305, -25, 53, 30, -110, 186, 32, -38, 162, 155, -144, 116, 228, 120, -110, 38, 88, -269, 146, -184, 263, -187, -157, -94, -159, -114, -72, 109, 54, 109, 176, 19, 65, 130, 224, -56, -44, -32, 83, -24, 214, -83, -6, 1, -188, -55, -32, 42, 132, 56, 122, 207, 113, -336, -172, 20, -96, 64, 115, 70, 50, 294, 34, -108, -120, -52, -139, 214, 188, 35, 34, 0, -199, -99, -221, 79, -153, -170, -2, 126, -147, -358, 173, 71, -93, -131, 175, 121]
6294A21l33M07m8J20Lm46l7J19n3P9J62J32k14m07K57J51r4m1J52k19L0K80j9
6317A02k71M4L43j97K49j47K10l40ok10L21k60J88K0k25J21JK3J6pJ6J04k81N0
6341a36K42l98K48k46K10k46K84l2N2K10j34J51m03J98L11l30m0j17J56p5M7j8
6363f6J83q9j91K44p7k49J22%K1P1J45Ln48L87j83J04L35l31L38m14N17m13J10
6386A9K88k96R4j46L7j10O8Q4k92N44l42p8P4j35K47j77J85k1m8j22J7Q3J07k27
6410a47j51J30K15J09l37R7J59j84J33J6p2J42k19M49k69j4Mj14J68k48J97j61
6432i7K47l99K61J9M2K63j60j85r9j22J04M8l5m7J30J9J10J08k53J94m6J28k28
6455Bp7K53m54J94J38m1j5j28r3J60J22j78OL25j70k80J42O4Q3k81K45J8Q5n9
$$ y = [121, -212, 195, 147, 267, 270, -176, -213, -94, -147, -68, 94, 226, 12, -395, -138, 13, -81, -122, 30, -189, -159, 121, 102, -169, -125, 218, 21, 270, 123, 333, -7, -13, -223, 98, -162, 26, 46, -179, -58, -57, -34, -18, -25, -9, 95, -186, -136, 106, -292, -44, -290, -80, -326, -42, -74, -22, 188, 54, 205, -198, 0, 311, -19, -59, -176, -20, -95, -48, -66, 117, 28, -163, 81, 4, -245, -123, -123, -102, -31, 114, 117, -431, -44, -227, -123, 212, -119, 219, -195, 322, -91, 19, 307, 11, 105, -41, -4, -114, -46, 38, -254, 290, -52, -130, -56, -191, 56, -121, 64, 43, -5, -127, -110, -27, 80, -147, -298, -168, 47, 156, -181, -84, 75, -109, 24, 40, -32, 110, -109, 340, 71, 57, 61, -53, 115, -133, 64, -97, 150, -249, 12, 31, 73, 336, 176, -9, -108, -230, -126, -78, -113, -160, -30, -11, 99, 207, -46, 148, 102, 230, 2, -75, 178, -276, -82, 56, 15, 0, -128, -221, -61, 61, -117, -111, 214, 44, -236, -94, -30, 53, -228, 17, 35, 120, 61]
6479F1K4K5l27J99l8M5J77p2J10k53J88k13R0N6o1J19P2j32j64J00l04L45q8j21
6503a62M0L48k10K1p9j05L11j70K7K94o08p3N57j90K5m7m5k48K97K3p3J85m4k58
6527a84M59m32j7K29n9M6j80K61j94j3P2m7J30J07J11n12M17l8K6l89K04L5j47
6550a15J56l15K09L09l96J99q0J09j4k24m1L21J88Q3k46q8k85K26M6j46K33O3
6572A92j66l8K18j27k03K57r7O9J07p0j69O0j06L2j42j85K27l3K31J08j44K14
6594B35j94j9Q0K7k06M2j13q0K15M7J57j19N3J96p91M86j66K93j20Q1j1q1j23
6617a11p4L32Q8r8l3J08Pl0m05K00K7l37J21J73J05o7p5R6R1j39K31k00k8Q3K06
6642B71l46L00k87j27J97l7k03J47j52J71R9k8oJ06K4l8J64j14j84M7r1j20L60
$$ y = [61, 85, 110, -217, -18, -56, -11, 166, 94, 204, -49, 139, -74, 16, 72, 11, 130, 202, 70, -94, 6, -298, 47, -41, -162, -122, 226, 16, 37, -42, -147, 164, -6, 21, 315, -293, -366, 191, 1, 26, -21, -66, -314, -17, 6, -67, 118, 74, -184, 275, -157, -174, 55, -4, 42, -138, 123, -71, -84, -12, -59, 71, 178, 289, -223, 194, 156, 182, -207, -3, 32, -115, 41, -274, -65, 244, -152, 47, -33, 76, 62, -162, -203, 118, 306, 389, 143, 55, -230, -4, 42, -104, 129, 192, 26, -12, 206, 79, -124, 133, 36, 105, 212, 142, -27, 33, -73, -41, -183, -368, -141, -174, 57, 165, 21, 235, 41, 22, 102, 129, -77, -35, -148, -228, -13, 34, 191, 72, 125, 321, -470, 16, -150, 143, 23, 104, 93, 12, -111, -185, 147, 235, 137, 104, 212, 219, 189, -216, -16, 11, -326, -205, -32, 73, 6, -69, 27, 118, -21, 210, 10, -18, 65, 271, -75, 225, -62, -189, 8, -29, -232, -85, -237, -66, 33, 5, -1, 105, 129, 91, 255, 141, -43, 4, -87, -207, 153]
6665A53k91L16j74K94l35K48l93K26l23L0K88K02j54j20L60k74L2o7l7pj63L14
6687A25j31J5j90O7K13l51L32lk40J85O7L6P6n67Q33m16n0N6P5r6N3oj48n9J09
6712a5m5n0n7L29k80LJ61L6n9p8r7J55M6J2k48L74n22M24j39K36m2k28J06N2m16
6737c42J63J76J74M2j62r1l1q4k4M14k44j3L1j61K23j49M15m44L47O8k63J0K8
6760H3j51p8M3J63NK93m49q6o0K46J30o9l75L39r2J97J72m23J61R9k26M1R4l49
6784b92L90l71K24l62M90j57J20l37K38J36j59J62j65j83K67Pj11J23K74l77J48
6805F5m3r0L95l97M8K11l49l6J73o9L75k67K14n03K08J99k7j94L7K1K4J95l52
6828a62lJ74j85J70L6K1Pp1j44p3kL59lk75j3L3L9JNq7oM36k74J08J99m02J58
$$ y = [153, -138, 178, 4, 298, -37, 211, -182, 44, -279, -249, 39, 241, 87, -33, 327, 53, 85, 18, -19, -26, -189, 125, -6, 9, -181, -114, 99, -252, 80, 77, -163, 22, 89, 125, 201, -366, 467, 51, 1, 57, 132, 36, 89, 83, -65, -124, -15, -60, -110, -167, 162, -118, -115, 46, 82, 23, -55, -152, 3, 49, 61, -187, 187, -335, 89, -50, 186, 144, -84, 22, 74, -342, -179, -3, 171, 213, 51, -40, -71, -155, -179, 235, -9, -22, 9, -152, 71, -78, 337, -107, 240, 308, 45, 55, 83, -68, -146, -103, 60, 65, 358, -91, -177, -237, 9, 139, 70, -305, 34, -58, 139, 311, -112, 49, 148, -78, -37, 57, -292, 98, -273, -49, -411, 79, -78, 42, -295, -57, 79, -80, 82, -83, -266, 1, 8, -103, 20, 294, -83, 65, 22, -68, 327, -70, -22, 189, -160, -196, -23, -92, 283, 16, 230, -273, -65, 134, 107, -87, -50, -29, -5, 190, -162, -165, 9, -176, -6, 30, 51, 58, -13, -157, -230, -232, 127, 124, -151, -164, -131, -92, -91, -86, -173, -179, 257, -17, 91, 290, -112, 46]
6855D6o3jj85R3o8J61j68K63M2n9j10L1l9K4K09l37K99l38K3N70k00k53j55J85
6879c0j36K85k38K33k93L78k91J13j58K08K30m07K76o47L76J2j7L42m21N37k43
6900A09K7j2l00j1J58K22O1j83k21K65l21L20j70L28j25j75k3p9M14j56j57P2
6922D3j61j75L15m0Ll37L69Q5j91j16Q0J59j79L23Q9m45J43K03l8k45qL52M7j38
6946A38j0j22p9j1J27K07J12k67j29J3o3Q4J55j94m0J70J5j5k12K77j27n3j09
6969a33K82l00j14L17j42K19q2m0j26J78J68p0k7j15j91J23n9L55P3n47R7J34
6991@l6K26j70J40k86J87QM20o13J78k9M0j06r2M18k86k13J31K58r1j10n1J23
7014D6j68K92K6j58j67L37k05j69J4J82J6j92K46k95P6K13q2J53m08L89J02j37
$$ y = [46, -17, -18, -203, -110, -178, -17, -185, 78, 120, 61, -49, -18, -57, -33, 176, -161, 138, -200, -177, 393, 193, -60, -215, -30, -166, 119, -119, 114, -179, 199, -92, 21, -137, 71, 301, -106, 170, -477, -101, -89, -106, 236, -185, 352, 109, 136, 124, -176, -187, -29, 193, 254, 71, -150, 115, -206, 114, -56, 272, 147, -28, -51, -130, 284, 128, -29, 43, -118, -293, 22, -18, -15, -352, 17, 102, -89, -205, -125, 34, -145, 178, 267, -178, -35, 168, 130, -115, -123, 229, 276, 138, 128, 6, -73, -84, 43, 250, 362, 95, -34, -21, -84, 0, 155, -39, -79, 91, 106, 91, -121, 156, 29, -24, -133, 149, -151, -265, 52, -90, 129, 47, 7, -119, 59, 227, 157, 130, 15, -176, -53, -112, 243, 316, -231, -134, 0, -36, 190, 20, 160, -126, 61, 69, 489, -124, 54, 25, 65, -41, -133, 285, -1, -214, -83, 175, 84, -26, -77, 46, -122, 170, 196, 38, -129, 208, 3, -166, -152, 30, 46, -146, 100, -195, -119, 94, 12, 165, -243, 146, 248, 111]
7036A11j88J11L1j99K62l63K90K37l77l7j82J28K13j26j6J15J35k3k59k9J99M6
7058G9k25J8O3J3K16j61P8r8O0L4k0p3k8J6j3j6K28l11K61j04lkLl6r3j1M38j76
7086A37q8k56J30K69n08K56L74k67j92J05O2J4l1N3j62QL8lK28j26j70K02M1j42
7110b8k49J67J51J46j09j21J89q2N4ll25L33j41K09j29o1J41J91k32k96L9M47
7132B91n20j7K49n0J66j59J46j44K40j03R9K6j86J36l01M05k54n5j46L10j33O7
7154F7O5j41K11l10j7N18m10m5L26m6n37J38j1K68k65M20l66K17J09l6Q8m88K85
7177D0q2p4J49o7N3J77l98M07l92M9K83j63J20k94Q5J27j3j99L73l44J00J5J40
7200I2n7l1P5j10j35J66J07L1j00J79O1k71j62l6L70qj05n2rJ64j71K00ok58J28
$$ y = [111, -77, 34, 65, -134, 128, -235, 55, 292, -85, -122, -304, -176, 37, -89, -105, 10, 145, 122, -137, -166, 33, 79, -146, -128, -65, -52, 164, 3, 81, -17, 43, 77, 57, -16, -44, -28, -41, -57, 171, -140, 121, 17, 14, 12, 15, -21, -114, -125, 313, 137, 49, -207, -77, 192, -316, -60, 314, 47, -145, -40, 22, 36, 5, 58, -104, -96, -58, -61, 167, 41, -129, 73, 114, -28, -277, -110, 41, 187, 78, -43, 146, 64, 118, 115, -210, 123, -18, 191, 62, 1, 142, 333, 101, -195, -156, 291, -229, -246, 3, -47, 119, -40, 106, -38, 202, 99, 198, 224, 38, 174, -127, 278, 24, -31, -177, 133, 0, 67, 132, -9, 202, -108, -125, 393, -17, -62, 264, 218, -319, -181, -192, 76, -189, 231, -135, 82, 191, 155, 243, -245, 40, -42, -116, 33, -34, 19, 196, -202, 205, -187, -138, 145, -18, 102, -192, -107, 20, 7, -192, 181, -163, -63, -48, 92, 35, 4, 79, -31, -166, 0, 107, 138, 38, 217, 278, 7, -155, -191, 179, 171, 66, 14, 5, 169, -2, 198, 192, -66, 62]
7225F2j60J82k43J1J55k99N07l30J63J61k20J36k09P2l6J65P2j38j68J92j06M7
7247A6k22J34K14k60O7K29j59K26k00n6j60L63m4o9j13J96m53K83L0J04l7k48
7269a59K72j59J46k06K08j82K14j10%j08Oj3j31K69J77j26o0L7o9j9J18M7j75
7292b3o7J79p2N0L2Rj78L02L1j50O2k91N13k54k39J32q2M9K01n00L19o4Q8m0j36
7317a29K31k61J72q6j65Q5J65J26l08O8K63m16J91J25k13K68K21n49J24L08k20
7338@j80J36n6k9r6K29M0k30q0K15L91l29j70%L03l51L2J44P5J49n4o7m40J83
7362a85K80l8J95m03L09j98r5J66k28P9J61k29J08K53k38J47k32J25o4J23qj7
7384A1k7J1L0j07M11k57J17n0L29n54K31j10j57L63j57P7p5j42N4K88l15j03m6
$$ y = [62, -98, 84, -159, -148, 7, -292, 215, -115, 48, 209, -11, 125, -84, -12, -48, 117, 189, 51, -117, 75, -31, 16, -206, -72, 142, -118, -51, 178, 19, 245, 45, -11, -171, 192, 148, 79, -34, 162, -291, -8, 22, 126, 89, -159, 113, -46, 100, -106, 102, -80, 134, 24, 24, -84, -78, -91, -222, 47, 224, 98, 38, 75, 6, -13, 105, 152, -23, -90, 89, 17, 67, 99, 108, -70, 232, 263, 113, 175, -116, 397, 143, -96, 36, -46, 3, 204, -296, 23, -41, 47, 7, -129, 102, -159, 13, -73, -238, -153, 12, 138, -170, -102, 161, -255, -64, 61, -152, 116, 337, -212, -88, 220, 0, -180, -44, -100, -129, -225, 4, 44, -186, -266, -51, 340, 11, -159, -159, 144, -207, -175, -31, 44, 193, 139, 72, -368, -185, 95, 57, 252, -151, 158, -40, -135, 31, -197, -118, 43, -186, -78, 175, -63, 84, -148, -23, -87, 36, 28, 11, -16, -5, 25, -82, 329, 72, 189, 139, 468, -86, 145, 35, -122, 241, 84, 161, 86, -56, -2, 286, -29, -132, -178]
7407a78K2J53O7j67k30L02J38k5l79J00j8K60J86Q1m19J62m4J80p4j49K38j70
7429C6p4K98l00J90l57%J08J81j02K48j16j08j85J54k7J87j53j37J63k35J04j08
7451b33P5l3J97l7K75k66k3k11R9K98o9j57J7J48m0k31K83j24l2J36k34N9M85
7474C82l01j21K09l09J30K34k70J90j16K3Q0j26O1K24l75j3j5J05o5J15l26L98
7496A14k49j46J94J57j00l41l2K45M44l88K87m45K97P5P1o0k72M07l06j34K09
7517B7k08L33k27K91o6o8J77j56K41l85K19j89J64k93r8J11P3j31L47l71N35j92
7539A34j08O1j30J03o5J80j58r6J03p7M1P4j05J05j17J69l43J65O1k7Rl13N71
7562B37q2k37J3M9L3r0jK52j40L06n08J57j94K72r8P0r1j15K41p6j42L39k65J10
$$ y = [-178, -156, -3, 64, -103, -333, -31, 107, 82, -297, -197, -215, 45, 231, 312, -107, 55, 11, 191, 117, -32, 206, 36, -38, 260, -40, 150, -207, -207, -99, 82, -20, 228, 112, 4, -181, -27, -54, 133, -20, -157, 6, -229, -125, -233, -158, -191, 6, -31, 244, -22, -45, -256, -157, 141, 72, -85, -68, 80, 40, -191, 92, -32, -64, 72, -162, -103, 382, 81, -40, 169, -140, -10, 224, -46, 144, 28, 51, 131, 5, 66, 290, -85, -98, -113, -8, -73, 42, -284, 114, -135, -281, -87, 70, -30, -371, -403, -158, 286, -102, 185, -260, 37, 112, 183, 123, -149, 258, -48, -182, 27, -181, 152, -75, 216, 150, 82, 259, 103, 344, -41, 178, -11, 153, -140, -238, -127, -54, -185, 162, -209, 326, 134, 26, 87, -43, 60, -5, 175, 17, -79, 24, -53, -12, 62, -43, 62, -55, 114, -229, -64, -3, -30, -21, -334, 237, 155, -82, -69, -20, 13, -77, -78, 174, 34, 340, -168, -11, -205, 67, -31, 39, -52, -167, 74, -2, -144, 195, -70, 40]
7586D0J71L1j85N5j67J82j84J82l56P2K27q0j1l7M9r1J42l7K15j04m3n6J6J39
7610A70j44O9l44M39j43q1P3k09J38l3P2jMm14K32J26k49M78Nl82J85K08k04j84
7634a89M36l52K38k03K3K91j81k56L54l8MN8j2Lk93N2j73K10j00J26R9K0J17j80
7658E4k01K29j72J98R6k43j47P8n5J11J7Q5k05J70mn2q7p2L97p9o7J54k65r2J99
7683D7j67N1l0J99k09M39l28p6K2K74r3j49N2J43l5k1l06L59l08L19p2l02J10
7706h1m8L79l10K36j90J97l23Kj02K24K88n08J36L6K52k58J7K76k83k5K86j77
7728B4j69J22k5K6m3mj00J73k7M0p2J81k17M8J12%M2q8q3P1j62M12l56L1m3R6
7754a1j25j2K36j22J9j33p7K90mK79j93k96j1j9J91O1m0J30k49K14l9Nk22m9K26
$$ y = [40, 211, 242, 57, 112, -55, 127, -57, 125, -231, -159, 68, -12, -23, -60, -11, -102, 40, 3, 218, 114, 71, 15, 31, 170, 26, 95, -249, 190, 47, -34, 39, -170, -32, -65, 7, 6, 10, -404, -172, -46, -295, 183, 188, -194, -9, 199, -5, -189, 247, -105, 133, -70, -47, 244, 63, -193, 161, 123, 127, 185, 173, 176, -117, -65, -238, -28, -128, -2, 97, 117, 234, 54, -147, 82, -90, 108, 204, -39, -186, -108, -163, -52, -35, 50, -155, 15, 11, -41, -128, -200, 197, 118, 51, 205, -60, -152, 47, -120, -69, -99, 100, -109, 330, 2, -74, -52, 222, 129, -20, 32, 175, 140, 119, -187, 172, -136, 183, 111, -191, -81, -129, 250, -60, 176, -14, 183, -140, -138, -240, -16, 272, -236, -100, -64, 188, -70, -53, 223, -60, -85, 201, 24, -145, -23, -48, -22, -65, -69, -169, 4, -23, 17, -55, 126, -91, -43, 69, 69, 111, 23, -60, 11, -151, 261, -95, -64, -107, -11, -136, -148, 88, -34, -15, -148, -225, 65, 61, 340, 147, -149, -160, -179, 12, 73, 33, 163, -86, 128, 89, 94, -128, -177, 49]
7779D9l21J98j5Q3r1J50K4k35J41n8k72M46k58K09J59l39L30j68N2j69J79Q5k26
7802d7J09k37L24J61j80j38M5J2J35k59K90J3j36J72l4m30J55j29J91L16j42j75
7824A6K14P2j36k82K96j25k91K18M41l02m1Rk68RK48k9j08J3J76k32L8L78j96
7847A18l54J47L20k73K68j49q5j33K57j58J65J46k06k39K39j71L21l72r6n2L21
7868A4J41k89N9N8r9J54j48P6j79M31m49K61J71m6r7o0k14M9K02K9K00j0l61K7
7892h0J38l4k51K31k42J76mJ96J24j79O7j79J23J76m27K91j60J27k54J09J83p4
7914E7oL09k51r2K9j09K09k85K99R1l87p9N18k44j4L8l46K59J52j25r0j22J65
7937b4n4r8N7J63j28r0K78p8M8p0J76j99j93K85l10R3K39j73l6L78m55L41l05
$$ y = [49, -272, -74, -89, -6, -97, 53, 77, -158, -17, -75, -347, 99, -159, 50, 209, -130, 200, 32, 84, -85, 94, 179, -47, 62, -175, 149, 310, 130, -8, 37, 49, 184, -75, 215, 228, 92, 264, 230, -200, -45, -174, 17, 333, 191, 16, 230, 302, 166, -116, 180, 55, -236, -18, 423, 121, 80, 89, -179, -170, 78, 49, -59, -46, 130, -102, -64, 314, 118, -236, -89, 231, -42, 226, 77, -8, -141, 116, -42, 123, 269, 63, -176, 63, -108, 213, -159, -255, -307, 14, 155, -134, -75, -17, -116, 38, -110, -34, -213, 218, -231, 30, 201, 155, 58, -2, -216, -167, 35, 64, 264, 254, -107, -80, 58, 24, -227, 4, -238, -62, -66, 130, 254, 75, 142, -37, 86, 262, -165, 126, -34, 93, -161, -52, 131, 57, 51, 360, 109, 17, 46, -63, 146, -139, 160, 251, -136, -215, 303, 59, 45, 83, -263, -4, 148, 23, -67, -189, -24, -78, -176, -119, 44, -84, -174, 104, 26, 74, 4, 180, -19, -212, 73, -237, -144, 95, -78, -114, 264, -191, 150, -155]
7960a55J28q9K16L4j54L4k16J63L0L7m2J55k83o0J93L29k69j02j52K4L24q1k50
7983a86J38K28r8r5K8l3j4J63k68O5J94k49K66j36J18k24J64j33K1p8L8J83l43
8006b51O0K06J50m24L58nj0n26O04k41J13j96K80l76M46j41J31k4j45Rj00K62
8028A80l28L83k52M8K4qo7R3k88K65k33N0M4M48j20m37M59k53j2J4k8P3k56j01
8052c02M23j53R1J08L9j57K5j79K07M8k83J85RJ25q2k11K54j6J02J00l27j53K27
8075H0N3j22o9J27j04j72K10J43k03J38r8J87n08L43P1O5n4k03J78j04J11j72
8097a03J04j02K66l6j59J12j52l23M04L6O9J24q0r3JJ01j58Q5l94R0K52k7R9k01
8121h5J75j43P7j38J09J72k01l36L99J0j84K94k05k6J46o8j63K30l0k8L3j68K85
$$ y = [-155, -27, -116, 100, 134, -20, 14, -202, -39, -9, 28, -14, 141, -142, -202, -9, 320, 51, -51, -203, -179, 145, 64, -186, -48, 180, 82, -13, 15, -18, -32, 131, -137, -72, 122, -127, 139, 3, 121, -103, 61, -72, -51, -129, -91, 92, -251, -191, 15, 165, -259, 99, 94, 84, -442, 162, -79, 34, -162, 118, -258, 188, 47, 178, 154, 9, 18, -82, 180, -148, 235, -17, 31, 55, 47, -20, 73, -215, 50, -183, -133, -89, 359, 239, -198, 261, 8, -4, 10, -18, 55, -201, -302, 121, -32, 59, 167, 206, 49, 74, -105, 102, 150, -133, 52, 61, 186, 104, -107, 147, 131, 233, 333, 6, -147, 80, 133, 11, -58, 69, -35, -207, 3, 146, -57, 81, -17, 170, -338, 5, 76, 141, 87, -116, 62, -42, 69, -103, 1, -101, 165, 129, -30, 82, -70, -393, 11, 47, 116, 240, 160, 67, 68, 169, 11, 96, -298, -208, 44, 17, 116, -85, 90, -53, 24, -114, -5, 167, -34, -370, 29, 39, -145, 149, -56, -82, 64, -4, -167, 63, 33, 5, 38, -130, 155]
8144A55k38K8L58m35J07K43J17l07L70k32r2P2k28J48r1L30m57K05N3J30k58J47
8166A25n01L91o0kj21j06M17l8r5R5r1nl4j63M1K85j9j54q8M8L2r4L75r6l14
$$ y = [155, -83, -55, 303, -132, -25, 218, 335, 28, 398, 166, 74, 146, -82, 66, -25, 305, -152, 53, 106, 236, -22, 125, -376, 15, -45, -47, -168, -274, 143, 105, 10, 105, 14, 9, -25, -188, -147, 138, 119, -35, -123, -75, -43, -137, 238, 142, -172]
8191a72
$$ Imaginary data points
##PAGE= N=2
##DATA TABLE= (X++(I..I)), XYDATA
0@%%%%%%%%%%%%jRj6J6j6J6j8K5l1L3l9M6n3O0o8P9q9J00j13J26j40J57j76J97
36A04k19K44k71K99l32L68m07M50m99N54o16O88p69Q62r73J105j266J472j742
55i48K108k644L503n100R056l3877p7269N8780P5355J6269m6644l5523J9447N6082
69C8595J2883l8580k7655J5810J8048n027k2018r231K0872K2640j4122k2791J1915
82A339K5395n181k7477k0528R645K7728L007l4374j4688L0693L1961q969l3076
95a4525j5702K3473L2771j2538m5576r637L7356K8908j1322l0950r968K9907L0123
108C2320j8261l9527l405K8575J6239j2327k3716q57K9170J6957k1182j9913J2102
121c825J8098l236j8865j1748J3724K4283m369k7396j653K8464J5330j6999k7259
$$ y = [0, 0, 0, 0, 0, 0, 0, 0, 0, 0, 0, 0, 0, -1, 8, -8, 8, -8, 8, -10, 15, -16, 17, -22, 24, -29, 31, -37, 42, -47, 53, -60, 66, -74, 83, -93, 104, -115, 129, -142, 157, -175, 193, -214, 236, -263, 291, -325, 363, -406, 456, -517, 588, -678, 794, -948, 1160, -1484, 2019, -3081, 5975, -27902, -105171, -46391, 28964, 45233, -1411, -36934, -17487, 38595, 51478, 12898, -14757, 1053, 19101, 14074, -7944, -17175, 3697, 26337, 12215, -10576, 1339, 26734, 21553, -5924, -26452, -16807, 10921, 13928, -20446, -35134, -4441, 27520, 18551, -14525, -30227, -6754, 26017, 13479, -32097, -41734, -4378, 24530, 13208, -17742, -27710, 2197, 32320, 14059, -25468, -28873, -298, 15941, 3614, -20102, -20959, 8211, 25168, 3986, -15927, -3825, 14273, 11037, -7828, -19576, -5852, 18431, 14062, -13334, -14987, 13477, 28807, 11808, -15451]
134a5451n169K7538K1388k2792l4143Q037L4771J5039j9016k8072m74L1573J6999
147C0228k6909k8744R491K7533R164j5620j9779O249K7505N063k4408j2327J3542
160I88J3021m110j5742p237J6214J7530j1377k1856M692K0851M502j6584j9883
173a8991K872K6432R889k4606j9926J5511K6522L589k1549k0822R212K9338L614
186B1085k8086j5515J7105K3003K613j8828j5574J3287K3183m656k3417n406J3683
199B477J1329m784j4651l342J7548J0619j5280j4895P972J4484Pj5418j3516Q995
213h455K2617n2k3498q821J7898J6905l965k1268j3364J6659K3415p086k4427
226a3442m760J8592J6331m055j9765r138J7613J6334j1295j8280J579J3857Q193
$$ y = [-15451, -20620, 6918, 28306, 5514, -28629, -20592, 14179, 29218, 10202, -17870, -18344, 13229, 30228, 3319, -25425, -15934, 11599, 20763, 5143, -14636, -8387, 19118, 24181, -227, -12554, 988, 14009, 9899, -5843, -13080, 3134, 20664, 9287, -12569, -7877, 12974, 17476, 892, -18991, -16119, 10313, 20202, -4404, -24330, -8819, 17703, 21292, -257, -21079, -11867, 17471, 21085, -7001, -22516, -5411, 17592, 20205, 1377, -14197, -910, 22273, 17617, -5800, -11206, 2477, 13806, 9022, -5629, -8971, 8577, 19196, 3916, -10979, -3007, 11477, 11484, -3934, -17450, -8455, 14162, 14110, -9388, -18209, -311, 16594, 12629, -8639, -22003, -5344, 18071, 10985, -13442, -18202, 390, 16721, 12666, -7099, -16237, 1376, 17710, 6415, -11865, -10286, 3571, 11764]
239A1764o252j3669J284J6459L669j5174q511Q540R794j444j2548p357J2397J6300
253A5252p610j9059l93J5481R672p966j8633m323J9519J4668j3060j8256K923
266a1785J6744J0215r043j9529q50J9999Q014j4275j2529N332J3236N997r155
279B371j1775N251J4335j776j3274l608Q288P615k200j0990l745J3489R598j1548
293B031j2925M493J1423M553r422j3788K291J8497N559j5323j1002O455J3829
306F671M480j2239j4280O156J7523J374j3671o454O753J0868K887j0905q752Q340
320a249J0902m670j0115j32O949O265l256j0021m4J2286K610j1371o561N098Q903
335E594J367r628r120P191J4782k054j3670n450Q232J0682k74j2814q214J0763
$$ y = [11764, 5512, -8157, -6873, 9586, 13255, -1919, -10430, -1890, 7904, 6460, -6088, -13445, -1048, 15252, 7642, -11417, -11810, 3671, 13343, 5377, -13256, -17579, 1940, 16608, 3548, -14708, -11785, 4959, 15174, 6131, -13398, -14248, 5751, 13765, -510, -13039, -7707, 5529, 11526, 2371, -9404, -4153, 10182, 8406, -4868, -8476, -188, 7427, 5227, -5763, -9508, 3981, 13579, 2031, -10894, -6401, 5022, 9575, 153, -13635, -11344, 7153, 12712, -2611, -13613, -7158, 6671, 11151, -1088, -15368, -9212, 8311, 9685, -3986, -10440, -3687, 7181, 10068, -837, -9589, -1249, 9653, 4983, -5132, -5264, 1685, 7950, 4694, -5327, -5371, 6915, 9525, -1846, -8407, -3309, 5594, 6961, -2667, -11787, -4596, 10186, 8132, -5538, -10988, -2756, 7926, 7652, -5162, -13376, -2613]
349b613J3004m272j1638k530P380R096j001j2077m032R928P377o558o793P35O329
364B335M746m600q025L115Q833r45q969k198N034O061k81q602m828R218Q844o165
380C573r865r91P629O982k831j2123k295J1818P179o658q152p55P408O378l873
395C424j0387k0J0420K787n997m440J539N814L370n642n956M585O349l083n466
410b703k21L988M614j637q152o92Q563L558p329o211J651O646M550n425r124K142
426e782J0363K034p096n818J520O980M086o517p552M021Q191k3n213l121K146
441a781N224J307o025l352N250L595l320l219M97L170L164k889o008K052P130
456D795m01o057l056K645N048K110o023n805M918P196j610n739l543K664O487
$$ y = [-2613, 10391, 6119, -5519, -8049, -669, 8427, 7426, -4651, -8683, 1245, 8622, 2064, -4729, -3994, 2335, 7081, 2481, -5544, -2429, 6404, 5459, -3510, -5708, -674, 5387, 5106, -3496, -8324, 894, 9738, 3573, -6292, -7283, 346, 7328, 4497, -7626, -9921, 1897, 9076, 2418, -5734, -6489, 919, 7297, 3424, -6963, -6983, 3437, 6224, 227, -4213, -2674, 3140, 6510, 868, -5088, -503, 5846, 2763, -2703, -2924, 1064, 5678, 4041, -4111, -4803, 3760, 7318, -11, -6222, -4571, 2075, 6625, 1200, -7924, -5782, 4581, 6615, -481, -6299, -4779, 2201, 6287, -230, -7782, -3761, 4430, 4407, -806, -3927, -1781, 3443, 4750, -1275, -4627, 623, 4218, 898, -2321, -1824, 1346, 4510, 1621, -4387, -2335, 4795, 4394, -1663, -4719, -2074, 2974, 5084, -939, -6744, -1826, 5370, 3760, -1979, -5522, -2858, 3629]
471C629J218p273m073N718N184j913l808k531K349N152p37n623r92N017J553k286
487E84k018J60K653K385l550l861K966M265k074l667q19K357M068j29n801k602
503e083N862L666l155m109j657L376M918j378o307p19N313K917k375l093j799
518c623K829M291k161m441J088L461M06j218j344m04K314J499l467j856L400J974
534B748k222j866l06J857L112j614m847N15M718M57k812k435k26L492L136l231
550D76m733J732M236L50j814k870q01L994K527l380k637J775K242k22o02j610
566a337NK773j01k871j67K726L85j499n73J94J309J893k672k770K300K818j018
583A395j636j716O20K812J390l633k687K975K593p59j813j826M2L709P51l307
$$ y = [3629, 4847, -2426, -6499, -781, 4403, 2490, -1318, -3849, -1500, 3652, 2915, -2708, -3700, 1317, 2870, 584, -1434, -1274, 1379, 3764, 214, -3647, -681, 3584, 1510, -2157, -2976, -619, 3449, 3320, -2481, -5083, 779, 4445, 1290, -2819, -4476, -1100, 3818, 2440, -3867, -4586, 727, 3644, 1269, -1824, -3623, -794, 3497, 1336, -3105, -2017, 1444, 1850, 632, -712, -1116, 1198, 2697, -770, -2626, 774, 2748, 526, -1340, -1646, 211, 3323, 1709, -3138, -2623, 2095, 2552, -260, -2695, -2921, 571, 3707, 476, -4257, -2525, 1711, 2061, 247, -2623, -3424, 570, 3097, -283, -2920, -1145, 1097, 875, 273, -1337, -1332, 1441, 1340, -1531, -1698, 1028, 1413, -86, -659, -465, 844, 2737, 65, -2705, -405, 2413, 1395, -241, -1957, -1337, 1475, 2865, -768, -3455, -480, 2113, 1354, -459, -2285, -2243, 1466, 2217, -1090]
599a090j128J859J095P5n94j945R36K352r05k216J189J289k89n96m04l08J702
616A022R75k926r76K619P36j097r77p69O34K741k47l384n19K584J121q42j452
633g57j330J071K984n97k726J34J406M32J35j079j782J685J642j215j098J135
649D0L37l66M46l05n70J241K4j884J78J831m95n82j09o16J457J643j792k002P49
668g75J787j99m40j289q42K132J719j671k001Q84M32P57j03j042q87J921O85j694
686f26J45P66l84K10M62o32l26J341q24j162J130J041o54n09j27n62J472P10j920
705d49p80J178J063l51k9j475l89K360L40j765n99N75O14K67j68j259p3J521n6
724E25q44M63l45J69M71O8j421O15Q02o24l47Q03r1n00L87n48P7J257j49j816
$$ y = [-1090, -2218, -359, 736, 811, 217, -1728, -792, 1560, 655, -1561, -372, 917, 628, 32, -372, -680, 1022, 1997, -929, -1905, 714, 1450, 353, -624, -1393, -759, 1982, 1735, -1649, -2168, 416, 1537, 695, -757, -2087, -1016, 1968, 1371, -1355, -1221, 185, 617, 752, -327, -2109, -424, 1218, 3, -1095, 40, 377, 11, 457, 152, -418, 823, 847, -1037, -859, 972, 477, -105, -214, -830, 627, 2270, 478, -1524, -775, 1012, 813, 373, -916, -1758, 374, 2093, 422, -1579, -695, -263, 494, 391, -651, -1538, 383, 1068, -626, -481, 285, -99, 111, 573, -59, -385, 956, 132, -1030, 100, 1141, 487, -22, -149, -711, 761, 1471, -449, -1229, -51, 1012, 661, 632, -843, -1232, 1128, 1468, -297, -896, -321, 293, 560, 392, -867, -940, 581, 525, -319, 144, -201, -32, 439, 507, -914, -299, 503, -121, -468, 335, 244, -256, 131, -417, -340, 917, 768, -1048]
744a048M27J054K61k64l12q79O38J579j017j010K34J41J97N66l95j236P29J055
762G20o04n17K45n68M80P55k32j018R15K57q86O83L84j083K93M02n76K76P79m81
782B24q75J132L31p75O43o56r70R98R88j144m14M68k5L62N58j351l77R30P44q74
802h3rm9m59O45P83q82p32Q70j63l7M24l45q10J010O5m50j9N35q34L82O25k17
824B50m97K22l25P5Q17J11j254K25M00j53O11R0q73n73J448j73o58Q8J45k61O39
845C54Nq42K06K39j42L08J45q55k3Q60k33l05N89o06k52P61L55m99q4K87n75K03
867a04P45l44j020N36N59j89L51n98o45O21O82p05j94L63k72k0P73n19n36L93
887a23J99k90P49m17m43M67J63m64K87o0j99m98J029lo03M34l23j67P47k01m89
$$ y = [-1048, -621, 433, 694, 430, 118, -761, -123, 1456, 439, -571, -337, -196, 1, 567, 172, -1064, -335, 720, 116, -401, -156, -724, -244, 511, 279, -739, 176, 433, -453, 230, 614, -469, -176, 226, -350, -74, 705, 224, -651, 481, 812, 37, 680, 24, -946, 52, 1040, -104, -518, -50, -75, 287, 845, -506, -883, 47, 791, -83, -92, -141, -600, 45, 828, -54, -786, 84, -79, -116, 308, -37, -847, 163, 228, -222, -241, 294, -540, -158, 467, 250, -247, -25, -350, -275, 542, 653, -601, -376, 24, -129, 482, 572, -301, -874, 574, 401, -257, -169, -24, -285, 354, 359, -483, -277, -38, -180, 128, 273, -582, -605, 255, 22, -283, 306, -300, -552, 209, 564, 65, -19, 268, -307, -104, 641, 297, -723, -187, 372, 183, 534, -64, -709, -88, 594, -111, -305, 58, -214, -234, 539, 20, -516, -123, 76, -214, 535, 118, -325, 142, 305, -159, 128, 68, -131, -629, 400, 397, -206, 228, -95, -262, 485, 284, -205]
908b05k23P56k94J52K41o56n1Q37j0o48L1j35k65Q46J11m70l27N36j62j89M32
929C07p93p2N49M04p19M75l74k54N63M96o38o1J04j83j09O87L6r62L01J24J45
950B6K88K32r38K54N40r1k65O1m32R7L68J58r37N65J93k24l4N02o92j18O52K64
972D69n06J49m19m61Q48J33l38j73M67l89L79J79n27j48L40M1j68M18m67l74P24
993A77J15o27L34J54k74J78L53l43k09J69K40l42Q0K4l98N43O8k21j86L85o04
1014c84M0N90j85m09M67j82l59P49n20P1q6M34J9k23J10m49j03O34Nm91N84k93
1036A9n1M8J08k77j22N13j56j5K40n19r4O30j06n83K91P1j95M24J13o01K96K05
1058B39k48q5K73j53m18M62K45n67N5Jj27K86N14l21k80K31k45j24M73M2n29L94
$$ y = [-205, -428, 328, 34, 186, 427, -229, -280, 557, 547, -101, -70, -205, -470, 376, 487, 17, -310, 226, 64, -125, 307, -486, -558, -9, 395, -324, 151, -223, -477, 86, 582, -56, -117, -13, -196, -305, 382, 418, -544, -243, -119, 26, 314, 546, -392, -138, 402, 311, 46, 107, -325, -228, 140, 298, -639, -74, 119, -105, -139, 363, -329, -447, 205, 469, -37, 112, -307, -768, 80, 213, -125, -298, 169, -220, 159, 338, -189, -337, 3, 44, -124, 294, -173, -547, 177, 292, -335, -1, 153, -121, 57, 410, 67, -142, 27, 267, -75, 5, 29, -369, 174, 242, 21, -165, 220, -384, -344, 246, 61, -348, 119, -63, -422, 327, -193, -122, -208, 226, 245, 22, 132, -317, -420, 214, 219, -272, 312, 19, -32, 16, 124, -153, -275, 238, 82, 67, 307, -212, -306, 324, 218, -365, -74, -3, -198, 226, 339, -262, 34, 239, -9, -94, 179, 26, -392, 70, 315, -252, -197, -196, -323, -37, 477, 156, -124, 107, -138, -262, 211, 253, -276, 118]
1080A18k7J33j90k49OL04L01m53k80M60j23m50P02l10k36J76K48k10n1N94o56
1101a93KJ13l8k60M03K15n86O10o0k46k80N67m68M30N5l32l51L84K84l20O25o14
1123f0k91P12l4l95k69O75m61J52L85o10K36K0p4j86K83J59n97K85L47l78J60
1144E9R3k46L0L63m20K15J12k74k8K30o6l01J5M76l41J82K41l88q2N95m75k81
1166b91J53L45l47K46J33l85j47O45o1m38M06k27m14O86n95N1L67Lo01K75R7r
1188a08j41L43m25K29L95k22l60K3N19k59R4j52k92M14L41p77J12J98L9Q9k53
1209a93N7m6l5L87l61o0K88k65P9O46q63K20M46m37kK55L05n00J63j88N8J35L27
1232D16m76j86N92l12j52O13p03r7N59m10K43l50J74k7j38L88l72k5J61J68j33
$$ y = [118, 91, 224, 34, -215, -209, 95, 396, -57, -337, 123, 0, -450, 252, -58, -294, -118, 130, -80, -131, 463, -193, -191, -78, -116, -376, 27, 242, -344, 266, 206, -40, -320, 247, -221, 209, 264, -68, -419, -35, 249, -71, 554, -60, -351, 361, 327, -68, -337, 338, -123, 29, 414, -196, 40, 60, -14, -200, 83, 242, -355, -70, 277, -101, 59, 152, -94, -64, 299, -121, 94, 206, -68, -96, 134, 68, -233, -218, 258, -83, 99, 340, -48, -130, 465, -10, -291, -138, 207, -140, 106, 239, -146, -293, 352, 291, -147, 259, 32, -382, 304, -291, -240, 127, 130, -471, -196, -99, -108, -249, 94, -331, -102, 293, 71, -289, -266, 253, -6, 88, -64, -356, 58, 399, -378, -266, -68, -29, 60, -193, -136, -182, -217, 170, -191, -251, 37, -228, -149, 497, -366, -146, 300, -137, -139, 116, 421, -79, 84, -104, -46, 89, 416, -60, -246, 346, 34, -118, 495, -208, -305, 254, -156, 87, -263, -89, -116, -254, 134, -238, -263, -102, 66, -67]
1253f7j11L52m60O18j4n13R9K07j19J49M5n4j85J62K1j82K31j4n75J70R0p5M68
1276B43k29l24K9L48kJ95j38nn92M24J43l47M15K62l98q4J19j44m4L59m00k36
1298d06L64M09o85L26L60m32Q6j40Q0m7K05P8n01L27L8O4J20j83n42M37L56n39
1320b25J54K78j37j73K91j52k92O50m98J31R0j14M7N0Q2j27m8P4l33R8M73k77
1342D2j22L67o0n10N56j09l85q2K38J00J13K9k48k73M78q4k55K40K22m56M43j86
1364E8j2k12L12mk14k0J35n89P10l63j12J99L68j14JJ48k57m0K23n27M4J63Q8
1387a5j44J43P5l64N52l50r2J79L54m63j60L2M68qk84L24n10O20j32l46J55N8
1409I2j75K66l10J54k16M92m79J87n3l30M41l80M52k92M07j45n5j31J55J61o50
$$ y = [-67, -178, 174, -286, 332, 318, -195, -96, 111, -8, 141, 186, 132, -53, 109, 130, -52, 179, 165, -410, -240, -150, -225, 243, 14, -310, -281, 67, 65, 260, 122, 117, -475, -51, 92, -255, 160, 422, 24, -60, 59, -85, -129, 230, -170, -406, -42, 367, -318, 8, 368, -64, 22, -118, -38, -85, 120, 198, -303, 24, 62, 126, 246, 63, -479, -42, 314, -225, -71, 207, 70, -103, 188, 36, -256, 394, -104, 27, 117, 3, 50, 100, 182, 55, 7, 81, -252, -154, 319, 42, -80, 287, 227, -283, 273, 164, -221, -303, -65, 35, 148, 177, -71, -344, 134, 50, -205, 35, 257, -199, 244, 58, 46, -166, 146, 142, -72, -92, 43, -546, 164, -199, -311, -112, 256, 142, 143, 291, 34, -6, 217, -310, -266, -103, -15, -159, -16, 59, -305, 247, -103, -195, -16, 338, -125, -285, -253, 215, 207, -77, 247, -263, 357, 225, -121, 34, 92, -83, 183, -127, 27, -189, 303, -176, 11, -42, -372, 69, -311, 141, -151, 256, 111, 56, -75, 80, 241, -409]
1430d09O85k50l32O60M0o20M35j62j04j97M31n58K40M83l49J8J6j65j38L71nk7
1452F3q2K28j22L3k7l15N3O12m42M4J17k28j20L12j04j67K29N7j85j66J91M8p3
1475d4j84j1l5J39M08o33K45J89j84J67J33j19k10M83m61j95L53M3q7K0J02p6
1497D3j47J25j22J23Q6m98L12J16J61q8j25j56j03M09J9k05K1L42r6l33K38o0
1519F2l41L42m3l11K99J38l15L82Q3m14j23J57J77k8j25p3p1M62O5l03j9k9q0
1542a08l4L8M2J75l51K16k89L43j99QR3J69Nj39QJ56k48J52K6l84P14l09m16N99
1566B67l06j89M08m17K96Q1j31Pl66M97N5j04k91N11q3j73J37l84K59j55J51P0
1588A40j11k31K79P4lj63r6J60q0oK7R0r8K69l03l99N11lMq7L17n95L73p3k26
$$ y = [-409, 276, 26, -306, 354, 394, -226, 209, 47, -57, -254, 177, -381, -141, 342, -7, 11, 27, -138, -276, 95, 90, 63, -19, 209, 87, 120, 93, -222, -169, 443, 1, 45, 162, -66, -186, 126, 22, -145, 84, 141, -44, -210, -19, 29, -44, -228, -239, -274, -135, 273, -360, -115, 74, -110, 57, 190, 71, -139, 344, -117, -312, 41, 84, -3, 17, 119, 43, -104, 21, -101, 22, 108, -390, -78, 38, 199, 111, -14, -170, -273, 136, 155, -50, -29, 313, 217, -116, 122, 62, -279, 63, 20, -291, 8, 146, -169, 213, 296, -118, -241, -84, 93, 65, -60, -133, -204, 258, 323, 20, 1, -28, -108, -142, -104, -62, 113, -238, -22, -311, 32, -167, -159, -66, 103, 108, -31, -23, 133, -115, 37, 63, -321, 393, 84, -332, 267, -39, -228, 180, -237, 59, 140, 9, 16, -350, 147, 202, 98, -193, 318, 235, 62, 199, -185, 74, -81, 70, 140, 29, -202, 77, 151, 148, -15, -111, 49, -31, -37, -10, 80, -18, 251, -52, -451, 60, 57, 61, -26, 291, -304, 69, -4, -230]
1613b30K60J91l25Q4L64o13K09J11p1j37J28q9k41L89j03l2M69j40k19K7O9Q3
1635A84k81n5J39k34K32R6j35k89M73j01k82M46m10p8M22k39K89q6j80O9K3j39
1657a36l4J33J29p1m05K61L29j94J43J13l63O6Oj31J49k0m9J51o2J14k05J02M8
1680G4m04M72k70N8J76J42K9j23k42L23l45K11j90P4J04j13O8N7j75j27M16J7
1702B32j97m6J33lOM7n05L21K49m81J29L24N3Rl38K54m28O53l73N6n6J36N6k84
1726e3J58m47M45l0J08k38j3J37j45K19p8j93P4RL21l28J30o6k83K94J91m5j84
1749a7q0N1K7K79l88N5K60J45m97N6o4j18K99j12n1K08Q6j89j85o1K42k12r5P79
1773D18j96j66p0j35O4L6J61j92J5K09k56j36K30j17L11K01m03p0L83q3p7r4Q5
$$ y = [-230, 30, 221, -104, -20, 344, -269, -60, 51, -20, -157, -29, -118, -359, 30, -73, -105, 364, 224, 5, 32, 101, 184, -97, -152, -13, -247, -15, 81, -54, -343, 130, 29, -253, 193, -217, -295, 127, -112, 177, 91, -89, -20, 3, -136, -170, -37, 92, 21, -384, -123, 206, 12, 155, 268, -95, -29, -23, -154, -5, -25, -74, 77, 15, 129, -76, 26, 74, -330, 142, -128, -70, 106, 248, 277, 154, -88, 235, -110, 101, -89, -15, 89, -24, 44, 101, -74, -201, 215, 232, 35, -11, 122, 119, 125, 172, -333, -12, 237, -244, -115, 209, 262, 271, -67, 187, -241, 412, 39, 95, 39, 175, 231, -53, 105, -342, 103, 73, 181, -57, -70, 67, -78, 141, 63, -130, -56, -47, 274, -54, 76, 10, -273, 21, 212, 167, -17, -97, -46, -19, 260, -128, -73, 187, 332, -165, -109, -173, -291, 8, -104, -155, 53, 139, -50, -235, -296, -54, -266, -361, 418, 222, 56, -14, -149, -85, -49, 112, -80, -65, 144, -112, -248, -18, -135, 176, 377, -26, -96, 287, 204, 127, 33, 118]
1796A18k7j36j18J40J48m8k88L92j26k86QN12k72R4M4K56m20k28j7L9O9M47p8
1819B23l15j23J33j06M23l07K50k81R1j12%K72l81K65P0k39N0K11j40J47Nq1l3
1842B2j50K91l41P7j8k14M79j57J30K50o25J93M6j38J85k00K04K2m22O6M74k27
1864e3J44M9j43K6Oj30P9J04o2J46l52L10R6j85M8R2j91k3L19j29j45m7p4K38
1888A23n3k60K76M7m52L01M9j76L25q2j35K06M6O4j34l42L10j52n2Jqj15L11o
1912I2l27N82k67j06R8j83L40j03m5j10j91O9mq0K39m5J13l8K95m84j74J56M4
1935a29K02j63m6Q3J06lK08k06j05K60j59j52R1J24j65k0K6K33j20k16K17R4k72
1958a12K91l52K3k66N25M6l8p9M8J78j90l07J16K95j34l28K22L88n99M16j67R
$$ y = [118, 91, -45, -163, -23, 125, 77, -211, 181, 55, -231, -223, 289, 17, 111, 155, 411, -9, -237, -254, -215, -146, 301, 223, -92, -215, -82, -188, 235, -72, 178, -103, -12, -124, -124, 148, -233, 32, 102, -137, -87, 124, -16, 131, 136, 55, 22, -128, 163, -178, -101, -119, -333, 146, -11, 119, 369, -256, -63, -17, -155, 30, -170, 34, 56, -366, -300, 174, -53, 91, 140, -3, 23, 29, -101, -22, 82, 20, 166, -186, 124, 220, 35, 83, 175, -16, -39, 280, 151, 6, -41, -115, 123, 70, -190, 86, 133, -319, -18, 31, -145, 180, 98, -37, 169, 215, 279, 145, -197, 113, -39, -91, -90, -98, -213, 98, 92, -235, 347, 80, -26, 72, -111, 229, 126, 81, -29, -220, -151, -155, -235, 4, -41, 72, 34, 329, -155, -329, -173, -129, 73, -90, -136, -53, 53, 50, 258, 52, -53, 207, 48, -104, -13, 111, -54, -74, -48, 185, 65, -151, 66, 160, -112, 179, -173, -150, -416, 109, 155, 117, 38, 86, 264, 74, -233, -117, 178, 44, -284, -62, 326, -273, 143, -24, -15]
1980a5k45J82LJ70O3O1J48j51m60K04kK57m33P2J76J88l58K45J02k63M5K00j96
2003gk37J27J19J5m00K22K31k25N06l33J03l2o9k02M52j98K4O5K9j19J4j25J7
2026b3J62l06OJ59J47k03r7R4J81j98k06J75K90J15j72j45N3m1k40J81mr2J36
2049b8J5j82K70l9N8j0J19j62n6J88k74O4N3q3J8K06j52k68M49k38j01R8K58k23
2073b0J64l40L94l30J28J76j01L7n2K09l72P0J06J3P2o8k84K36k34K17J61l84
2095b02L13j01j20K04Jk73J15j12J35j9J5j6Q6RM8k60J97J59k03p1O9j66K61k18
2119a49K33K9l35J29M22j98q7l37L65k3Mn5n4j34L1J45N3N6q8j31l75P01j69j98
2143a65L12l10L38l87N31k19n9J30j05r1j03j17J44L83n13J69L8n6K87l16KJ43
$$ y = [-15, -260, -78, -75, 95, 158, 219, 367, 216, -244, -40, -42, 215, -218, -146, 30, 218, -140, 105, 207, -56, -11, 189, -7, -244, -117, 2, 17, -383, -161, 70, -155, 351, 18, 121, 89, 20, -182, 270, 72, 96, 161, 190, 71, 85, -40, -23, 139, -167, -161, -2, 145, -58, -155, -61, 120, -78, -284, -109, 181, 296, 124, -21, 32, -9, -249, -68, -72, -164, -28, -13, -195, 75, 36, 94, 84, 203, 41, -15, 173, -101, -37, 16, -67, -49, 157, 5, -263, 186, -52, -153, -55, 203, -20, 144, -196, 198, -132, -4, 172, 71, 108, 56, 265, -107, -37, 69, 82, 154, 86, -198, 38, -196, 21, 182, -202, 111, 10, -110, 94, 95, -178, -63, -175, -40, -59, -44, -60, 26, 35, 83, -177, 20, 179, -24, -95, -26, -192, 69, -149, 84, 113, -222, -93, 329, 131, 44, -293, 72, 49, 53, -2, -56, -190, -159, -14, 39, 95, 7, -124, -499, 202, 33, -165, 147, -163, 175, -212, 319, 100, 41, 171, 66, -25, -128, -245, -101, 282, -231, -62, -24, -80, 207, -109, -107, 36]
2165C6PN5o3j00N0R4j83J0J59N0k03M4j29K65n0N4j13O7m7J5J0l04K95J18k16
2190g9M19m28J37P4j50J92j03K2m3J59k27j83J56j26R0M44m20k7Q0k2J91k56J57
2213E7n5j02M32l4k01Q1j53N4k51J03K87k79J22j92N6k9K73j41j10J15j04J17
2235D6K11n75L01J35k44J5l5J50j60K73P9m22J38nJ82k36L08k88J0N13k97l6K14
2258B77j95J23j09j06L09l26l1K04k92L1J52m2M0k71J65P0J00k14k38M71p9j64
2280a25O1k6MJ21j45QL0Q6J32k40K36o5J63l80J6qJ24K06k95l80M50K18k36K5
2304b0j10K12k47Q1J65j16J8k95O18m54OL10j82n3j07K26j25J60nj29j71L21j56
2327e3P6j92R7O4J5m6R3j46K24J5m9K06l16o7k86K72n0K10M5l75K75Q3k41K20
$$ y = [36, 43, 98, 35, -65, -15, 79, -104, -94, 65, 115, -88, -44, -173, 92, 42, 96, -17, 50, 3, 18, 28, -276, 19, 137, -79, 340, -88, 49, 123, -27, 165, 62, 84, 41, 200, -27, -210, -54, -180, -90, 354, -66, -93, -13, -35, 156, -100, 57, 2, -100, 332, 298, 97, 178, 25, 79, -172, -69, 218, -61, 61, -131, -75, -104, 169, 28, -82, 33, -71, 46, 257, -318, -17, 118, -126, -111, -146, 4, -156, 117, 196, -226, -88, -93, 89, -147, 161, -127, -117, 396, 99, 63, 277, 82, 205, 96, -10, 299, -27, -58, 146, -146, -115, 37, -5, 35, -236, -71, -1, 99, -115, -353, 118, 39, -125, -64, -90, -86, 35, -110, -102, -72, 14, 146, -94, 142, 77, 240, -140, -124, -132, -8, 198, -97, -477, -27, 191, -45, -20, -130, 82, -165, -84, 81, -35, -17, -312, 306, -148, -142, 168, -14, -67, -174, 52, -73, 87, 82, -47, -218, 103, -53, 23, -169, -72, -8, 7, -39, 54, -92, 132, 147, 98, 304, -12, -79, -365, -93, -143, 67, 112, -263, 12, 95, -146, 74]
2351G4j46k19J41K03k83J09K75p7k5j27J12j47M2J88j73O4n8k22L21K1n6j33K10
2374I4N9n8k47L07p1j08j15K1j79K80j6k15J09O9N6N7J07L4k84M01m20j39J57
2397a01J28r2O5j79N7K03J38k84r7M45k46K3k00L44m26L06l23M19l9n28O11k33
2419iK28k43J62Q7m1k33k2K03j01K27k45j24K38J53m62K13j82J5L07j23k68j7
2441b37l18O42J13k25K28j74L67l03k25J60p3j87L02J24k36J67o1j5q3J41Jr2
2463A6nJ37k09k02L4J40J14k61K54m1J55k53Q1j34L90l60l2M11qn47L41j52J32
2486AJ8j0J70r1K7k65n6j35P1L19O6l14J33K26J56l25P9l08N87j45j75n6R8m6
2510B5n9j09NJ98p3k75L00k41L8K64o8j88p6K39K16o48N43j52Q5L1O2k04J33k06
$$ y = [74, -72, -291, -150, 53, -230, -121, 154, 77, 52, -75, 37, -110, -68, 120, -53, 11, -47, -269, 52, 73, 17, -116, 94, 153, 95, -152, 155, 84, -24, -139, -118, -297, -17, -33, -248, -139, -70, -14, 43, 150, 184, -100, 301, -119, -258, -101, 27, -65, 0, -179, -122, 81, 219, -65, -162, 283, 37, 60, -140, 204, -222, 84, -239, 180, 141, -387, 224, -9, 219, -24, 138, 225, 184, -49, -71, 132, 31, 258, 13, -111, 127, 280, -182, 31, -151, -136, 171, 48, -220, -237, -555, 87, 200, -25, 203, 29, 396, 93, -132, 28, -45, -232, 70, 194, -42, 125, 64, 49, -34, 107, 108, 16, 11, 148, -61, -263, -229, -89, 25, -236, 18, -23, 132, -121, -40, -174, 216, -144, -176, 235, 227, -320, 21, -131, 1, 19, 9, 179, 88, 115, -150, -206, -341, -270, 49, 115, -199, -66, 160, 316, -9, 70, -238, 349, 204, 29, -27, 71, 25, -34, -143, -138, 60, -13, -288, 12, -229, -191, 73, 5, -183, -259, -20, 196, -452, 91, -61, 24, 55, 117, -87, 46, -160]
2534a60K38j46l7n9K55J66m27L16l50J18K69k31j20J21J93N7l39P0J98Ll94Q4
2556a75J75j93N62n16K12L5m0R9k68k33K60j05M38l23R9JN3J28l31R0r9J48J95
2579B12k54j80M13M3m86N02p8k54J44k88J56J37J34l64J29j30j59M90j06k40L88
2600B09k42p4K42O8r1j01M0j69J32l20L1K33K37j42n1J10k47J76Pk85q6O51l43
2623a5m63O21k36L90m12J92j73K74j27Q3k08m0m5K6M59m26LK84k96K38p2j60j11
2646b14J96J49j41j08K15J7J06k05j1J99l64L18n46K54K02k63K83l61K54P2l23
2667b71J05o4J83J11k61K86k3l3r1J98m9l01M04o7j73J50J64q8l67m5L49k66J35
2690a4K66n08N03k20O5Om98L69J95Kk48M0k55M83p6m0l23L19pN8k47J62J95l85
$$ y = [-160, 78, -68, -105, -164, 91, 257, -170, 146, -204, -86, 183, -48, -168, -47, 146, 203, -136, -66, 132, 135, -259, -175, 0, -193, 369, -147, 65, 100, 60, 159, -109, -342, -82, -187, 251, -72, 27, 28, 81, 209, -122, -32, -131, 17, 212, -42, -222, 191, 234, -252, 250, 172, -82, 62, -226, -70, 67, 201, -163, -34, -164, -323, 167, 61, -179, 209, -33, -107, 135, 203, 112, 11, 51, -118, 14, -306, -275, -42, 195, 53, 2, 112, -135, 41, 48, -237, -323, 328, -15, -478, 143, -93, 297, -115, 77, -96, 178, 51, 134, -74, -114, -159, -133, 326, -100, -97, 187, -109, 129, 57, -103, -214, -18, 131, -10, -118, 97, 114, 220, 15, 4, 203, -161, 157, -389, -135, 67, -196, 87, -274, -20, 52, -271, -166, -230, -47, 64, -197, 89, 66, 33, -58, 140, 91, -210, 194, 127, -46, 104, 268, 180, -187, -232, 117, -149, -14, 252, -256, 247, 27, 92, 98, -400, -31, 164, 166, -82, -42, -297, 186, 110, 70, -253, 66, 59, 117, -130, 32, 227, -158]
2714a58j29K70Pl58L15r1k5K86j36L95l53j02J90j19j65L99k81o3J97j94J71J33
2736A89K01k46l48J90J38J62k17J02n09L13j59K59j76J23j03L28l4m31M07m23
2756b34L28o6j23j67N83k74J32K48m56n1L7J36j55K88j48J30j29J44j79j39K82
2777A87J5j15j92K47o1j5o1K97l67Q3l61L73J68k61J5K36q7k30QJ26N7j94m5j30
2801c07J38J75j82L41k42J85k96J09R2K74k04nj28K55l86K19j04J84r1l38N25
2822B14p2l67J76K36j13j50L7k8M39k61N1o8j36K06l40J19L65j76K1j01m65M31
2844A8j22J9M3J88k21O2O5j6k44k1J46J30j59J40m9K95k96l8k66K03K9p3K18j13
2868f2j27L34j29j42O7k8Q6k6j41J11J22l3J13j51J69k98M54k70n8m5j20P8pK9
$$ y = [-158, -287, -17, -10, -368, -53, -144, -169, 117, -19, 376, 23, -79, 111, -8, -173, 226, -55, -118, 79, -115, 56, 189, 390, 144, -204, -14, 124, 286, 69, 171, -338, -25, -184, 75, -101, 22, -81, 247, 213, -218, 189, -234, 94, 28, -95, -262, 321, 47, 179, 427, -29, -80, -43, 93, -62, 226, 78, 208, 79, 223, 44, -95, 187, 202, 87, -105, 142, 81, 66, 5, 302, -65, 18, -343, 30, 198, -63, -48, 188, 101, -129, -121, 5, 62, -132, -177, -307, -169, 6, -176, 165, -77, 108, -188, -79, 13, 287, 83, 78, -50, 205, -181, 38, -66, 118, 27, -311, 214, 142, -225, -49, 187, 74, -76, -39, -67, 372, 111, 162, 94, -42, 164, -176, -57, 308, 132, 153, 52, -413, 18, -104, -85, -42, 146, -75, -13, 52, 36, -208, -229, -83, 47, -112, 28, -21, 274, -22, -60, -326, -123, -94, -167, 51, -62, -189, 145, 16, -126, -59, -87, -1, -27, -168, -57, 65, 32, 145, -6, 163, -135, 319, 49, -9, -54, -174, -96, -103, -74]
2892g4j6M68j15k45p3L2K07j89K6J00l3r5O4j76j0L2L9j5j91L32l02J66J39j76
2916a05L2K8K05k37K04l34L02k29L75k08Lk44K37K19k5j79k97J65K44J40m13J04
2938a3j7L01j22k25j27K65j56n5L99j19l54K16J70l12k2K28J30r7j66K13jj44
2960ho4r7J45k17J99P0J34R6r1k68L4R2n0k60N23j79k93R8J94j32L3L22j17o2
2984A02l9j2n5l67N23k04J05n1K0K34l29N6j71L34k42LJ25j0J23j92p1J99Q6l8
3008A29j67k62K37K14j9r3m7n0O3j19P9Q0k6J6k2K5Q7mj11k21L78j82m3K01r5
3033D8m3L2J04m5l4j11J11l54L59M3k83L51n8k02P6m9K14j90N0j50L9k5K19j22
3057b0k63J74K14o2j9Lj61o2Q2j3p3J97K92l03o0O8L78l95O0J42r2k51P2J74j01
$$ y = [-74, -90, 378, 263, 18, -55, -23, 184, -5, 21, 121, 88, -7, 57, -119, -129, -97, -58, -73, -264, 68, -234, -68, 71, -105, -73, -45, 160, -77, 127, -207, 95, -134, 241, 33, 36, -208, 29, 248, 223, 44, -253, -88, 156, 296, -117, -13, -30, 271, 149, -76, -203, 62, -94, -149, 250, 131, -223, -7, 163, -149, -171, 57, 187, 90, -76, 137, 136, -8, -72, -169, -24, -241, -42, 28, 162, 258, 167, -101, -67, 25, -25, -285, 238, 59, -234, -136, 58, -74, -41, 281, 164, 102, 63, 51, -4, -371, 152, -52, 53, 2, 22, 256, -73, -17, -188, 146, -96, -93, 32, 22, 145, -47, -118, 81, 167, 129, -38, -300, -63, 151, 132, 39, -8, -58, 5, -114, -35, 45, 19, 35, 13, 38, 125, 121, 10, -211, 167, -15, -58, 143, 48, 5, 37, 141, 96, 62, -49, 62, -292, 67, 110, -173, 178, 120, -82, -6, -55, 159, -31, 19, -131, -92, -117, 102, -20, -283, -109, 105, 43, 24, 27, -134, -196, -114, -127, -200, -3, 289, -14, -74, -6, 372, -23, 37, 179, 87, -164, -92, 82, -19]
3082a9j39K51k80L53m4N1m67J21J77N1j90Q5m44K44J06M07j04l39n8L74k01M2
3104b3K04k22n0J36j66JL31p6K7j29j63J82k81J76L63l77j2J86k60k06N06Ll9
3127A11M1m22M89j55Q5J38l93J56k16K22K13o88N26K59k20k22K81k80Q2O6J12
3148A85J41r4m10k1K5J2R5j02K65n1J85l22R0J4L87j13m78K55j14J4m8L14k89
3171f0N8J74l09K77n74N24k34L69l78J28n2J35o7K50k71J45p0j38Q1L02l74J72
3193H8R8l81M66m58J65J21k6m6k78O15l06j84l8n7J87l54N16j11k65J73K43l30
3215a62M6l8J0J1K68j80K04m9r6k02O9N3k3J2R3r3M8J43J12l82L79q8r8j06o9
3240a38K68j89OJ29k67o4N04k6k45k55J32J94o5R5J72k96Km5K53J15n1j60j35
$$ y = [-19, -158, 93, -187, 166, 122, 173, -294, -173, 4, 55, -135, -50, -494, -250, -144, 263, 159, -180, -238, 136, -65, -23, 181, -41, -91, 45, -121, -120, 211, 135, 162, 33, -130, 52, -229, -53, 310, -67, -79, 107, -153, -359, 147, 150, 111, 152, -270, 219, 64, 149, 287, -106, 50, -166, 56, 269, -419, 107, 366, 146, -76, 205, -75, 7, 73, 185, 326, 232, -178, -199, -174, -162, -67, -169, 96, 45, 230, -92, -2, 12, 399, 286, -192, 63, -51, -37, -85, 229, -60, -2, 172, -137, 140, -434, 90, -144, 225, -153, -25, -77, 58, -9, 241, -30, 115, 45, -93, -12, 290, -84, 88, 186, -195, 271, -187, -22, 99, 73, 27, -251, 364, 58, -126, -164, -221, -34, -388, 128, 17, -248, -75, 168, -162, -116, -154, -144, -133, 135, -45, 159, 110, 14, -188, -119, -66, -89, -77, 16, -77, -29, 114, 226, -156, 223, 135, 37, -69, -138, 130, -59, -53, 76, -191, -255, 249, 223, -22, -277, -145, 49, -16, 79, 251, -45, -43, -88, 165, 280, 229, 69, -66]
3263f6L35l90J26J43l3p9N7k03j27K43j10o7J39j53K30j93K2Q0K13pp4O4j75K8
3287Cj82r0L42m9K67j11m21K41q5q9K48J43n6l04K09p9r9L5J94j37J2L00k12k97
3311b17J2L08j26J59o0l70J08K94k74K38l6L52p22Q1K42n3J3R3j43m9L84m95J59
3334a02L1O2L3j83J05O7J20k42L34p2k76q7J20M3n5J92j73o5J30J15l16J84O1
3357B6K02l15j85L39L8R3l21J26J00l05L11l56J75j62M53m2j32J82j61j13R6l0
3379A9k20Q7L47q4l27K66l46K76J12J17k57j30J98r7J48j61q7j20L30j88N0RJ47
3402H9K03m01J81k08M05m75K29m8j29R8L0p0r3K64l9M9k48L80k96q4k1J49n5K23
3426A33k74J41p1M4p9J29k98L96K25j85Q9l29K2L9J39j1L9q8j31j3L32j36k92
$$ y = [-66, 269, -121, 5, 148, 115, 36, 93, -110, -237, 6, -104, -171, -32, -185, 45, -148, -126, -46, 167, 160, 86, 150, -25, 3, -179, -269, 73, 24, 291, 180, -241, 0, -85, -174, 74, 217, 161, -143, 66, -13, -112, -77, 117, -20, -8, 292, 80, -217, -205, 103, -23, 136, 76, -294, -186, 108, -166, 72, 36, 388, -334, -253, -11, -64, -51, 42, -101, -150, 234, -261, -102, -71, -9, 24, -159, -54, 13, 133, -109, 225, 153, -123, -210, -90, -47, -102, 90, -83, -148, -18, 97, -219, -35, 26, 228, -87, -272, 67, 105, 198, -123, 3, 103, -202, 109, -247, -72, -234, 219, 177, 45, 227, 66, -47, 49, 19, -201, -114, 233, 149, -178, 88, -258, 18, 130, 247, -10, -140, 58, -39, 109, -52, -139, -259, 71, -117, -67, -58, 89, 292, -109, 72, -136, 269, -206, 23, -25, -154, -56, -26, -96, -189, 75, 36, 85, -163, 217, -79, -163, -184, -35, -90, 133, -141, 0, -71, -27, -106, 23, -275, 121, 346, 161, 250, -79, -57, -18, 121, 110, 149, 61, -70, -83, 249, 113, -179]
3449a79J52j8o3K85j05R7k97K22n7p2J7Q0r1l7k04p3L18j02K62k80J5K20j48J1
3473d7L2J66k91Q5j45M53l33qj24J13Jn4J72k0R2q0J0j54K05LL3L8l82M10j54
3498B1K16k71N0mj41P6J13k32J84k7M1M5m63L25L1n8J97j64l45K02L06q5q7K56
3522A86k33K86j93k44K10R5j35j51M02l10K08o2J74k28m14M41j76P4J72l1j63
3543i2l4P4J60K7k88J89Q0Kj17j87K20Q3k65K86k07N2P4N0J53m22L12j66j3l0
3567e9J57m7n9K74l88QM02l31O7r7K16j70q1L27k9N3k50p3Q0o9J12k43L53k94
3591a41K27l00L70k10J38L3l03L39k55K77Q5l29J91Q2m19L38k77J13K81k09n7
3612b6J98K5j06Q6j35l41M60l94M23n2J90n68P0J73r7Rj03R1J90J97m97K08j83
$$ y = [-179, -27, -45, -108, 177, 72, 169, -128, 94, 37, -35, -18, 62, -29, -66, -270, -343, -25, -127, 135, -145, -130, 90, -58, -47, -15, 151, -140, -55, -200, 253, -80, -88, -212, -99, -98, -152, 20, 0, 92, 12, 22, -132, 73, 76, 109, 147, -235, 175, 21, 237, -34, 16, 12, -129, -53, 60, -172, 12, -15, 26, 71, -392, -67, -36, -94, 103, -61, -406, -204, 102, 17, -70, 186, -47, 239, 46, -198, 12, 107, -28, -179, 223, -87, 121, 59, 233, 5, -409, 32, -144, -70, 102, 71, -92, -126, -52, 108, 135, -153, 36, 116, 118, 1, -186, 34, 117, -148, 138, -69, -17, 57, 107, 260, -162, 150, -16, -29, -59, 98, 51, -8, 266, -122, -114, 288, -43, 24, -73, 143, -27, -108, 219, 190, 243, -7, -80, 0, -69, 43, -200, 153, -141, 86, -214, 156, -54, 84, 117, -186, 153, -102, 175, 260, -69, 122, 204, -215, 123, -154, -41, 240, 31, -26, 172, 197, 91, 177, 42, -299, 161, -233, 190, 138, 328, -240, -170, 3, -94, -85, -188, -97, 93, 290, -207, 1, -182]
3635a82J56L0J7K08k53J02k90K90j65K74l0j20R5l03L59k64J58mm4k21L81n4l06
3658a66J60j07L74j97N2O1k62o1J42j06O1J91J02k08Q7m3k6J85j81k75M4K71k01
3681a03K83l23J88K84l07J82N3n51K56J09m5j73O7K05j67R9k6p6L4K27m86K64
3703fj63L02j33o7J90j17j38L41l73J71P3m5j22Q7K80j80j14o1J03M46l53n0k63
3726a92J72j81K88k35L38j60NMj13k8p6J72k0n6J12K2J04L3k31j87K99k34L40
3749A76l15M13k65k2p9o1J21j54M63n79K12k2K36j59R4j39J96j75m6K78j54J44
3771A63m25K06J69j49J83m96L98J64j58Q9J70j65j28r6K54j16N6k02O3M9J57m
3793A82n4Kq4N8Oj72J46k61K98J60k08j09M4J42k19k2J30k54J27K43R6k43K21
$$ y = [-182, -26, 4, 21, 229, -24, 78, -212, 78, -87, 187, 157, 37, 132, -171, 188, -76, 82, 78, 34, -187, 194, 140, -166, -6, -113, 261, 64, 116, 177, -85, -146, -4, -110, -49, 142, 244, 36, 123, 80, 54, 239, 58, -217, -173, 98, -103, 180, -143, 45, 329, 22, 204, 257, -294, -38, 71, 26, -147, -80, 125, -42, 57, 31, -45, -11, 216, -270, -6, -169, 133, 0, -67, 123, 6, -132, 209, -164, 7, 80, 35, -87, 0, 280, 100, -14, -75, 28, 474, 121, 71, -192, -20, -201, 87, -148, 190, 30, 35, 39, -74, -102, -178, -6, -26, -82, 30, 52, 156, 189, -42, -229, 70, -164, 176, -139, 274, 9, -13, -92, -153, -32, -186, 277, -302, -90, -112, 124, -35, 59, -80, 116, -59, -105, 173, 19, 163, -262, -56, 113, -36, 147, -349, 49, 213, 55, 144, 314, 149, 21, -75, 179, 63, 119, -83, -20, 29, 186, 182, 128, 130, 46, 104, 110, -62, 84, -177, 121, 281, 73, -36, 8, 150, -69, -91, 39, -215, -88, 155, 251, 8, 229]
3816B29j12j85N9J6j69P3r1J19Q7q7K20K84l24r4j77Q3K13k5k77R7k4K54j40j69
3840a40j02K83Qr7j71R9K9N4j32N37l16q4j6O6K16j54Q9k72J77j63j3R3J32j3
3864A10k95l0O2N5j9Q4R9L2j1m6m7O2M3K1j24J98k02n6J41j83J15l5k0K87j78
3889F3k21J59k4J81k68K45r5j5p4J69m36R6K82K4m86K61K79l62K86l09k43N38
3911E0j19J69J16l29o2J9k60Q4L11k12L35k15J68j08j93M05j58k9j97M50l23J66
3933F8j54K35Rj70J54n20L45M2N8P4l87K70K72r2J31l35m36N07k93J64r7J68j77
3956a64L84M05r16J00J61m05O42m15L44j16k93N41j91L9k94k14K81J11LL29l95
3977f3K03l02J30K14j00L1j60j75K66N0l49L00jj58j00K46k1j19L33l87J16J19
$$ y = [229, 117, -68, -9, 7, -162, -89, -180, -61, 26, -61, 159, 443, 119, 25, -152, -69, 144, 119, -158, -61, -85, 169, 29, -140, -242, 41, 49, -48, -219, -120, -91, -37, -169, 368, 52, -32, -48, 18, 234, 80, 169, -103, 74, -89, -102, -9, 123, 110, -185, -215, -153, -98, -117, -33, 66, 98, 87, 41, -6, 56, 99, 120, -4, 194, -8, -64, 77, -106, 9, -26, -46, 241, 63, -158, 1, -23, 158, -110, 135, 40, 25, -49, 120, -316, -220, 62, 86, -400, -139, 140, -222, 64, -245, -488, 50, -69, 100, 216, -113, -175, -156, -416, -332, -21, -233, 102, -113, 55, -53, -246, 159, 1, -28, -225, 225, -98, 68, -86, 149, 158, -12, 142, -378, -33, 9, 67, 141, -246, 24, 296, 204, 335, 0, -436, 71, -222, -58, -155, 13, -164, 220, 625, -291, -191, -30, -435, 207, -208, 136, 20, -273, 268, 77, 116, -178, -392, -111, 0, 3, 332, -63, 140, -162, -32, 182, 82, 113, -47, -222, 44, 94, -255, 45, 44, -114, -214, 32, 11, -108, 225, -162, -46, 73]
3999G3j49P3m71N46L43l73k37L03j07j07J00k53K68K36k18J20o6n2j10R9j59M19
4021B78k34K12k14l7J09k5q2l20K69J86j4k97L00j69m7r3M26j69m34L12mJ50n42
4044d39K88K09k14J84J99l98K69O0p0k99K61p5j51L43q2j72J7K57m24K00Jn4K98
4067B08M8m3m98O38k44j00k30M36l03P6r5O3k0q2R2J45K69l17j05K81k88m0K30
4090A21j64m0M2K64J61l22l1l55L45n9j02k9J89q5Q0O9j55J98l9k20k11J25J17
4113a01L5o1J11Om50N18k7nm0J2o0Nq1n1K32O1o5k23M2K17j23k7j65J15K77p1
4139H1J09m00K72j75k61L80J2j62P4q2L92k71N3L75n48L65k28M8k1K18R0k19K1
4162A23J2n16O03j88l2M09l72Oj24K97n41P9K38j35J64l46k4k36L94o8l1J43J68
$$ y = [73, -76, -3, -474, 72, 415, 42, -195, 108, 1, -106, -6, -259, 9, 245, 27, 147, 81, 29, -81, 18, -141, 278, 44, 256, 42, 5, 114, 89, 7, -313, -44, 142, 128, -169, 131, -38, -85, -178, 248, 79, -355, -43, -47, 103, -439, -151, 58, -156, 28, 227, -171, 98, 158, 88, -211, 50, -25, -176, 167, 85, -87, -70, 187, -237, -37, -36, -90, 208, 256, 213, -285, 353, 109, 9, -221, 215, -88, -12, -107, -44, -64, -146, -54, 91, 360, 43, -62, 219, -69, -109, 121, -43, -83, -41, 223, 384, 62, 31, -324, 21, -38, -140, -169, 20, -65, 15, 84, -71, 127, 88, -132, -343, -218, -101, -66, -127, -16, -10, -460, 58, 31, 26, -14, -2, -62, -57, -138, -189, 43, 104, 39, -184, -142, 75, -48, -75, -240, -125, 152, 81, 190, -210, 62, -113, -374, 6, 18, -144, -70, -152, 240, -31, 22, 397, -151, 214, -14, 34, 13, 231, 321, 102, 123, 135, -381, 222, 34, 2, 411, 39, 45, -79, 218, -323, -244, -6, -141, 23, -323, -347, -583, -189, -257, -288, -145, 23]
4185B3O8k78J82Q3p5K04j13q4r6j1M2Pj81p3L26J22k15mL85m04K35k25j26J66
4209d2m2r2J1K77j66J68j33M5l47N21j06j73L41j32k86j9J03K00J43k83j96K60
4231E2J53k2k95k0J74K51m63j3K53m2j32r2L04k28L37k96M42l59J5K9k79J36Q3
4254a2P1j84K52j48j21L07k98J39j36m0J7q9M21j22j23j33L23q5M65l45q0j08
4276b9j9m5M88l84O9j82R0j8P5N4N2m7j14o8J45Pk44L48o4m0j03L0j81J72j28
4301a36K34l39N26m36J74K45Kk92j57L22l36J80j24J22J7Q7j84L28n37K83M6j05
4323h0K16k30j67J28P0O5R0j83P1J2J9j17K21j74m6j05J10L2M8k83K34j36M96
4346B91j95l67O15n47L37k41K41l4J98k14k33J61j25R4O7k79K27Mm1k1j09mK10
$$ y = [23, 91, -187, -5, 78, 3, 207, 94, 10, -86, -97, -55, -48, -229, -302, 24, 146, -69, -73, 312, -92, 143, -82, -208, -42, -84, -176, -165, 112, -54, 114, -19, 26, -321, 200, 94, -79, 262, 130, -156, -175, -72, 128, 271, -12, -208, 52, 205, 183, -112, -132, 42, 293, -170, -183, 70, 28, -104, -196, 108, -120, 217, -79, 363, 4, 19, 48, -231, -95, -12, 59, -125, 127, -21, -142, 165, -133, 6, -130, -170, -153, -242, 179, 57, -66, -199, 124, 39, 504, 159, 79, -29, -48, -93, 395, 11, 80, -102, -12, -30, 45, 99, 151, 104, -10, -78, 67, 74, -170, 178, 114, 74, -29, 1, -180, -8, -136, 98, -241, 285, -151, 23, 268, 270, -22, -179, 143, -193, -13, -137, -15, 2, 89, -95, 233, -304, -21, 25, -80, 136, -94, -261, -133, -63, 2, 92, -91, -20, -8, 11, -106, 115, -59, -105, -210, -100, -68, -20, -303, -69, -205, 291, 96, -271, 344, -203, 134, -107, 134, 100, 298, 84, -149, 12, -113, -19, 48, -231, -4, 0, -41, -62, -171, -175, 35]
4369C5J39k12K14q8k22J17K02k07K0K54J12K7j25l51mJ99j0k56J8J10k50K30J83
4392A35j52l0k4N9L5o1J99j21j13l0p0k77N38j39J22L6j86M9j67L99m11J13J75
4415G9k88K97P8m47K88m0Q3j10k5P1n4O7k85M10r1k18j1L23J33m15J51J40k50
4438a14K21L3j15j98J67Q1qJ16p1J67m6l83J87k37Q2K75l35M41l09R5m6j34K49
4461A18r4R6k54P3J80o7j50j74N84p0l16O2l25K06J30J79j69k6M9Q4J5o5k68L46
4485A44l86J43p5%o6L76NJ32k69J69M8n02Q1K96j44j06M96j28l49J8N5R3l1N83
4509E83m55j60k6O1J00j49N2k67J11L06K04k51k42M12l62J7R4q1J09K2R8k13J98
4532A61j4j82j53M74j52j3L3K9k27j66J01P7K02l57J58Kj53j12K26r1N02l76p4
$$ y = [35, 174, -38, 176, 88, -134, -17, 185, -22, -2, 252, 364, 391, 266, -85, -89, 110, 100, -156, -138, -28, -278, -48, 135, -17, -47, -71, -12, 23, -38, 161, 40, -73, -103, -173, -450, 88, -51, 71, 107, -79, -30, -197, 202, -209, -96, 79, -209, 88, 166, -281, 7, -33, 50, -60, -85, -14, -68, -1, -286, 124, 33, -185, -196, 127, 260, -155, -4, 136, -114, 107, 140, 25, -173, -6, 75, 67, 183, 112, 279, 233, -150, 37, -200, -118, 157, -178, 263, -46, 49, 3, -131, 118, 24, 120, -134, -61, 119, 52, -98, -272, 312, 242, -74, -12, -337, -131, -1, 178, 9, -17, 32, 116, 131, 66, -202, 144, -242, -99, -174, -174, -240, 136, 141, 273, 4, 173, 221, -281, -200, 96, -48, -154, 342, 214, -135, -117, -62, 31, 0, 583, 128, -32, -58, 3, 103, -46, 6, -261, -150, 156, 360, 109, -133, 279, -83, -66, 28, -53, 56, 78, 176, -37, 161, 147, -35, -188, 286, 134, 121, 154, 183, -44, -210, -109, -32, 170, -187, -29, -27, -180, -292, -66, -157, 345, -31, -105]
4555a05J48j09J52k04r8J57J45j79l7O8Q3j18j64J64Q2j66L77k50J05N6k23J01
4577a5n0K4jk47M38k8k61QK33j70m8M42k14n39K56K40l17K80P4J07p5l6o3J08
4601A46P0qj32J5J68n35K99j48J15j8p9K17j05J61O7k70j52N1J17J71j8l6m21
4624c25L04J73j38p2K52m87K67O3k91p6M54j86p7j59L12K0j58n9R5J80J33J5k93
4647e3K25k79N0k4j61J78p2j28J58J35J57j10r7l1P9K7N7j5l6N8j7j07j77J96
4671A3K71l63K02j49l4l4R1R1j74R9M3k3o5M6j13l2J75l04M8N18l35J08j27P6
4695B8R9L0l61L35k59P3P6J41ll36P8K99J18p2j96p1m9K00j89r9K12k65K75k60
4719a96M50j30j80J34J50l11j36K36j10M07m85J65k09K49k92K48J33k11k82L93
$$ y = [-105, 43, -66, 86, -118, -216, -59, 86, -93, -130, -62, 21, -97, -261, -97, -15, -181, 196, -54, 51, 107, -116, -15, -65, -41, -42, -289, 149, 121, -140, -132, 101, -69, -117, 325, 111, -428, -172, 68, -249, 31, 105, 212, 137, 101, 38, 146, 216, 208, 76, 91, 259, -276, 23, -125, -10, -28, -107, 110, 5, 166, 233, -37, -189, -138, -21, 150, 132, 96, -325, -21, 152, 14, -58, 194, -293, -26, 37, -254, -330, 124, -62, -139, -298, 14, 34, -124, -183, -88, 92, 225, 240, -53, 172, -107, -57, -81, -242, -64, -136, -264, -106, 29, 186, 76, -21, -52, 27, 54, 111, 96, 60, 118, 101, -6, -183, 13, 284, -79, 123, -26, -60, -94, -3, 88, -86, 13, 56, 33, -32, 14, -99, -131, 44, -260, -212, 306, -29, 79, -48, 28, 127, 157, -204, 131, -128, -55, 21, 162, 159, -177, -99, 200, 318, 246, 50, -21, -70, 130, -59, -158, 54, -211, 64, -196, 254, 124, -56, 78, 228, -83, -219, 17, -93, 314, -171, -6, -215, 34, -258, -10, 123, -88, -370, 23]
4739B3pM4j35O6l3K13P4l95K01j0M1j7j44J30K0l50L73K46k65j74PLJ88k38L03
4764A64K08k17k25L68j20K43l52k45J51K6J09j48J88M4j09k2L6j15K23l03J82
4785H6n9j85K80k76o7K29p2J1j78J83J67k98J21Q3j41n0K06K48m43K68l22J83
4807b6J33%k90J33k15J82K38l60Q4k05L09j80L11r5J33L2l36K69m12L77M3j77
4829e2K81l39P5l8J27k8j95M38j9k07L9j25m0j03L30l58L24j60j36J58l3N0l7
4852d8K68j6R2n66L94k21j46L4K46k70J56k15K69L0J9l6K01j78K64p2k65P5m5
4875c0L02j91r6L63n63J80J19%j71L4P0l5j7j55L89N3j06j62Lo4J69j91J61J35
4899A97k7Lj90J86K40l13p9j43K94MN2j27O5n8j89P7j59R9j08J98L08n16K65k73
$$ y = [23, 16, 60, -75, -9, -42, 171, 245, -150, 51, 41, 82, 65, -79, 51, 71, -279, 94, 340, 75, -99, -92, -89, 99, -139, 164, 372, 155, -70, 298, 178, 421, 69, -176, -25, 1, 110, -38, 150, 194, 85, 63, 99, -16, 207, -96, 86, 27, -158, 122, -154, -221, 8, -64, -53, -231, -48, 119, -179, -58, 25, -116, -166, 40, 288, -155, 113, -209, -26, 107, 107, -183, -50, -265, -83, 155, -205, -121, -326, -17, -197, 114, 19, 152, 184, -152, 117, -295, 82, 125, -52, 229, -110, -35, -73, 54, 26, -169, 269, 250, 43, 82, -43, -83, -186, 144, -214, 110, -50, -186, -28, -61, -11, -48, 220, 204, 296, -270, 124, -97, -243, -209, 37, -233, -77, -292, -23, 7, 26, -10, 191, 13, 277, 205, -60, 15, -30, 272, 81, -15, 348, -215, -35, 84, 84, -87, -53, 17, -18, -35, -190, 199, 252, 146, -16, -13, -77, 92, -99, 62, 197, 170, 173, -17, 169, 409, 96, 17, -126, 168, 172, 224, 97, 162, 104, -85, -8, -167, -68, -176, 22, 330, -186, 79, -194]
4923a94J87K99k16k14J11k5J75k80M67l51J45J83j69R6J0k20j17L20j67p3R1O2
4945A20NJ49l07J11p5M6j67n6K50R8l20K22j0p8l2M53m33k19M82l66j73J27n1
4968b24L73l21J34K56m08M0M31j62j57J4R2K34m10J55j56M4M11l48o3J16Q9N5
4990A95j30k05L6j25j61N82Kq5Q4k29K2J0K16m43K18m2K16k29K38K31m22K8k21
5013b14jM32k55O4Ok54L44Q0j53k19O2l6L23N1m64N50l15R7k49p5L20P6l43K67
5037I4q0p3J05j22p2K20J29j99K06k03P9J14k66m5K98j64j13k16L03k44N5M13
5059B19j74M3q5J37l27J43K7R9k92K97%N3J5k81L43%j89J46J52j60k6j35j34M24
5083B95K9m0j66m3J0j26J1j39P9Q6L0j02Q2L00j43k68MK28m23K18K08l8j28P4
$$ y = [-194, -7, 292, 76, -138, -27, -52, 123, -157, 310, -41, 104, 287, 118, 214, 224, 4, -113, 207, 40, -33, 58, 120, 125, 274, -33, 78, 3, 49, -118, -174, 76, 174, -146, 76, 66, -12, -44, 409, -24, -243, 239, -127, -300, -173, -224, 149, -172, -38, 218, -190, -150, 281, 119, -38, -24, 68, 302, -108, 47, -109, -65, 346, -2, -65, 51, 140, 195, 65, -140, -104, -229, -390, 192, 194, 109, 193, -36, -14, -4, 212, -231, -13, -55, 161, -68, 170, 401, -21, 7, -214, -215, 217, -38, 26, 32, -222, 122, 202, 49, -170, -108, -144, 179, 230, -234, 316, 1, 98, -151, -226, 94, 170, -173, 94, 14, -59, 46, -76, -148, 72, 201, 2, 208, 5, 84, 198, -68, -113, 185, 21, -92, -308, -5, -249, -194, 219, 45, 88, 3, 140, -187, -44, -17, 82, -210, 87, 87, 140, 155, -126, 217, 217, 28, 174, 326, 166, 140, 5, -129, 295, 324, 284, 118, 75, 85, -41, -30, -169, -90, -4, 26, -76, 6, 306, 163, -105, -101, 127, -296, -78, 130, 92, -36, 38]
5107C8j55k03N61k38j13JL91k26j52j23J35K81k61J30j78J94M01o12N6L07k98
5128f4P8MM3k13K15k52J0M90l98N8M38m63j58K00k40M64m32K82k57j34K20j3J2
5151a10n3M83m40k05L19k76J07J18N4J87j74j03L03k36Q2k02L03j77L59n29L06
5172A16Q0M4k90L2r9L27ll46J21L9r7L96l12j25K62k2m17R8J60K96m12L04r2m7
5196A3k04K55j18M9J97j98K28k23j5K89j25k82J23O7p3l6J34j86K88j83j7J36
5218A19J3j01O9P2l57o3K68l2J01p3N7k17L07l30K3K84o3J33j73J36l94K53l71
5241c39m0M20J55j33K8K3K2Mp2Q9j80RJ10j33r9K1O6K8O3m9j01L0k9mJ85Q7m80
5268c19L21j96M6L7J40N8N4j80L02l78N4N5J17k22r4K00o9J86J96k01m0n7m6J26
$$ y = [38, -117, -320, 241, 3, -110, -109, 282, 56, -96, -219, -84, 197, -64, 66, -112, 82, 483, -129, -73, 234, -64, 14, 18, 61, -152, 63, -189, -179, 311, -87, -29, 409, -54, -212, -12, -252, 212, -220, 62, -195, -329, -109, -122, -110, -163, 320, -120, -325, -6, -282, -175, -57, -3, 184, 10, -93, 210, -26, 56, -146, 157, -20, 339, -190, 116, 196, 240, -50, -18, -117, 210, 207, -139, -18, 21, -76, 320, 8, -117, 145, 123, -294, -196, -36, 260, -152, 152, 60, 13, -191, 64, -54, -5, 192, -6, 222, -1, -16, 273, 148, -134, -11, 56, -17, -53, 81, -105, 183, 0, -17, 119, 132, 31, 100, 172, -185, -248, 20, -12, 89, 16, 73, -144, 163, -167, -144, 140, 77, 210, 37, 173, -221, 32, -339, -379, 41, 196, 63, 91, 114, 136, 140, 68, 157, -23, -14, 96, -37, -136, -115, -49, -21, 42, -7, -108, -78, -107, -111, 74, 161, -319, 2, -194, -148, -111, 29, 87, 141, -39, 263, -115, -61, -6, 111, -111, -205, -5, -74, 112, 308, 107, 67, 10, -36, 90]
5292I0R3j23k04j30L11k5J39m98K96J06j19N0J47j68R1O7j58K77j72j59j19L81
5314A73m85Q6J80Q5k07L08m18J12j00J67NJ68M3K1j32K34k78R7K89l82j77L14
5336A03k14K03pL64p13K05k89J97J97j74K14J41J42m35rj19K28lR7l8O9Rn1q1
5360C6KR6j47kM1J38m09L74k97L07n1j10q8N2K78j17k08J87N5L00o57K43j46L21
5384A98l57J35l9J89k7l23L81Pk4j04k56L46l02M0J7o5K57j06J27k21m7O9O0N
5408d0k4j08J75k5L3j88K44o4K96k69J93l41j04J50R6o3P3r2j52M09j73J46n0
5431A22l44L90k08jL09k82l6N0k65J46L61l67l2J75p9J08M7J17l29J98MK69l50
5454Cj34m9J10J3j70J95K45l01J36j13j14N8P8K1l8L9P2J2k01M3N8J5O5j18R6
$$ y = [90, 183, 60, -144, -274, 37, 12, 151, -347, -51, 55, -64, -14, 133, -35, 56, 123, -35, 242, 70, -89, -208, 173, -312, -226, -46, 39, -168, 140, -278, -166, -266, -99, -94, 74, 117, 138, 6, 240, -38, 59, 348, -34, -211, 103, -111, 92, 85, 449, -264, -59, -348, -151, 46, -128, 86, 227, 369, -66, -75, -194, 34, 31, 128, 90, 159, 168, 117, 36, 38, 134, -13, -15, 26, 164, -245, 129, -168, 139, 88, -22, -110, -58, 220, 103, -105, 82, 137, 437, -220, 23, -123, 198, -159, -24, -63, 126, 99, -224, 157, 164, 140, 36, -220, 126, -176, -136, -119, -184, 73, -33, 94, -127, -174, -105, -45, -40, -64, -172, 3, -22, 11, -177, 67, 3, 299, 30, 223, -118, -222, -72, 24, -39, 34, -58, -210, 199, 26, 172, 122, -222, 168, -40, -41, 268, -14, -50, 0, -265, -119, 242, -125, -157, 18, -61, 47, 94, 211, -118, 80, 84, 353, 3, -131, -180, -70, -57, -227, -32, 213, -88, 48, -65, -179, -121, -43, -22, -60, -21, 51, 63, -138, -95, -37, -22, 43, -75, 21]
5479B1m3N0K03m34j03M13J5j22k04K57K1j08k5j44K01Q6K64k43N2LM4o35O08j40
5503C7oJ79Q8l88k98L19R5K20l09q4L30m85M04K9J67k21j23K66l41K22j85J03
5525A9k86M56m90O65m22n8P4k30K44j52K76l8K13j99j99J12j24M18l98J5O4jO7
5548B6J38j28r3k21M77m5l95M20j54K38k99k1k05O05l01N3k01J42J53j49J06r7
5570D9j22K27k20k08K68ml30K81K79j73RO5k39j12J96L1J18j6k7J14m35J06L15
5593A72l25M58j20k66L8k7j17J59l0J24J89j40j5p9k23K83j09j04J0J00o3K05
5615A20J90m18K93j40KO8p7o0J34J7m15J60p7M26n23L35j72K29j67J38K7j66K7
5638d9j29K93j41K5r0J15l39N6K85J26m31K42Q0l6k61K63k19R2K77k34p0k53N25
$$ y = [21, -22, 28, 231, -203, -306, 107, 122, 0, -204, 53, 74, -34, -59, -203, -2, 84, 348, 105, 157, 160, 204, -431, 177, 37, 31, 210, 298, -90, -388, -69, 26, 246, -63, -147, 183, -302, 102, 131, 298, 77, -46, 220, -121, 101, -84, 19, -267, 189, -301, 364, -58, -116, -42, -272, -28, -180, 96, 58, 271, 72, -127, -15, -139, 279, -119, -104, -40, -41, 26, 164, 36, -57, -278, 199, 154, -241, 179, 25, 263, -36, -57, -262, 343, 42, 95, -106, 36, 189, 40, 146, 49, -73, 154, -66, -274, -6, -10, -340, -59, 220, 47, 56, 121, -118, -230, -34, -3, 115, 99, 72, 186, -249, -143, 172, -153, 305, 185, -81, -43, -70, -187, -28, -58, 66, 255, 115, 100, 21, -202, 81, -28, -132, -122, -22, -85, 120, 310, -108, 185, 45, 47, 115, 38, -22, 112, 129, -286, -126, -203, 223, -300, 35, -137, 92, -75, 63, 90, -76, -49, -178, 115, -26, -1, -91, 24, -315, -259, 26, 152, -279, -37, 43, 7, -254, 9, -210, -118, 159, -75, -145, -398, 127]
5661A27J4k20j83L05J11q0r7Q6p8J38J05k67K56P2l86M2J18N0k7k1Q3M1k39k37
5685b87L20k3qn5n6Q6K59l30j3J42j10o3K20j15L3oP0K3j82L04k92R4p4Q2J0j17
5711h8K29k16J89r4M4R1j07j0p5L6k33N5J0J58K57k36J19o5J2l8Q8j62J32kM9
5736A43l43J94m0J20l39M34J32o36L60M8j9k15L43j08k07N16l39O3j79M2N4p5
5758e1M17k28k31K9L9K76k11j02j30J22j61J24O7Pj34K03J02k1J05l31J35J81
5780B07l56K02j58J23n1O3J40j42J04j64M01k55j82k37J16K4k7J30j4j34K04R
5802Cm5J29j45j60L38k44j39L60L52l29j91J25j54Rk7J30K04n2N4k97J40j03j41
5825a83J3N5j35L30j70j40jL35k5j98Jl74M07j61L98k44J93k88M03j37P3K62n95
$$ y = [127, 141, -79, -262, 43, 154, 74, -23, 63, -15, 123, 228, -39, 217, 289, -97, -55, 63, 113, 86, 65, 148, 189, -50, -287, 33, 10, 2, -53, -109, -23, 236, -94, -107, 35, -75, -138, 82, -33, 0, -6, 64, 87, -95, 209, -83, 11, -63, 19, 29, -88, 141, -75, 114, 20, 64, 155, 48, 38, -37, -1, -234, -179, -169, -11, 246, 10, 129, 64, 76, 38, 126, -36, 96, 94, 143, -200, -6, -46, 74, -265, 169, 301, -335, 25, 73, 54, -161, 182, 74, -133, 383, 44, 107, -72, -30, 24, -51, 366, 138, -93, -64, -25, 251, 40, -62, -192, -70, -231, -107, -40, -33, -167, 36, 138, 117, 222, -109, 26, 207, -149, 53, -105, 18, -33, 30, 170, 28, 132, -32, 369, 114, -68, -305, -189, -165, -192, -62, -76, -210, -6, 3, -42, 87, -58, -218, 120, -124, -263, 97, 449, 120, -71, 54, -100, -91, -118, 12, 216, 164, 218, -79, 61, -42, -183, -170, -115, -250, 80, -90, -230, -231, 104, 79, -119, -118, -492, -85, -246, 152, -92, 101, -187, 216, 79, 152, 414, -181]
5848a81L38l9Oj94J6r7L09j7Mk09n5j65K09J42J61k05K22k11m3j12l5J51k5k3
5872e3JJ86k31M25l69o1J02J8q5n9O8O5q8J97k20j90M15l0l61M20J16k09k62K49
5896D4J09k94K43K4q0O0k02N7Nrk9K0J83k19j12M0L62j51k64J44O0P7J4L8k98
5921a78N4L28J8n64K63M78l38j1j53L3K1K0m0J20k91L11l6M2L77l20n8K9j87L17
5945B35j13j15J91j77K87J08l37l06L49J56j83j37O1N3L6Q6k01P8J72n75M36k09
5967a05J22N0K33j70j20Q2O1l5nk93j68M42l96J06O8J10K27J39n18K19p8k2M03
5990C52n40K90J46J41k81j07n6K63k41ORK80l70K05l33K64K7j88M4K6M18k10j31
6013A4j14J31j40K17j00k4j54n3K03jp2k54N16k55K43m4M9j06K1J22k19l06L58
$$ y = [-181, 157, 118, 124, -70, -54, -151, 158, 141, 145, -64, -119, -284, -75, 67, 228, 23, 245, 34, -9, -121, -156, -5, -30, -53, -52, 134, -97, 328, -41, -102, 0, 18, -67, -126, -58, 7, -81, 116, -104, -294, 121, 91, -270, 150, 266, 57, -205, 44, 153, -141, 102, 126, 46, 106, -96, -39, -34, -43, -72, -52, 131, -88, -200, -160, 202, 51, -213, -69, -9, 68, 82, 120, -178, -124, 204, 222, -342, -79, 399, 61, 50, -103, -70, -49, -29, -69, 51, -240, 71, 35, 77, 454, 134, 76, 105, -82, 235, 122, 7, 198, 21, 308, 416, 79, -227, 122, 278, 95, -42, 19, 72, 108, 194, -7, 71, 243, -332, 104, -105, 17, 67, 300, 130, 10, 92, 153, 118, 113, -180, -348, 94, -302, -196, -128, -18, 209, 348, -170, 49, -29, -51, 352, -188, 102, 248, 389, 108, 1, -55, 208, -33, -27, -18, 262, -108, 97, -236, 28, 55, -133, -89, -63, 355, 145, 14, -100, 31, -109, 108, 8, -16, -170, -223, -20, -21, -93, -347, 169, -86, 157, 113, 162, 56, 77, 199, -20, -326, 32]
6036C2n8M2K04l45K4j6J43nj6J00m1j52%R4L45m04k40N13l16O3o6j09J41J67N8
6061A58N7k02J60o4K52k84j78j02L89O1mn28K79j37M12l71L27k91j40K72j77K16
6083A05M9j68L31m44K88k87K45q0kj40J63r6J43l73J94K11k34J82Rj77J03J36
6105A58j46P1K90n76K08n6J36j77j5J62q6K25l32j2M8j00R7J1O0K30j73j73K58
6128A08q9k6P6Q3n3k25%Q4k61M52M6m45K76j04J10j1j75m7K14j43J80k53L04l67
6152b66J71K64j34j3j57k3L73q0k60K60kM4k67j33M33j10k52L11p0j03J37r0L6
$$ y = [32, -26, 16, 220, -125, -101, -117, 26, 21, 5, 105, 64, -88, -88, 6, 351, -53, -293, 220, -96, -33, -99, -208, -67, 100, 158, 215, 13, 173, 109, 361, 77, -101, -203, 186, 247, 243, -285, -6, -143, 269, -102, 225, -66, -206, 66, -111, 105, 154, -14, 317, -127, 161, -126, 119, 39, 37, -103, 60, -36, 107, -266, -72, 139, -95, 87, 96, -81, 22, 158, 12, 83, 373, -203, 5, -51, 85, -92, -107, 55, -31, 194, -138, -150, -102, -202, -105, -94, -34, 196, 23, -150, 108, 19, -7, 69, 152, 99, -126, -126, -42, -303, 149, 195, -250, 26, -78, 32, 21, -154, -201, 13, -130, 50, -203, 101, -266, -95, 169, 35, 22, -135, -158, 215, 135, -125, 135, 133, 177, -90, -223, 210, 100, -152, 159, 89, -14, 123, 33, 69]
$$ [...]
8191b92
##END NTUPLES=NMR FID
##END=
