##TITLE=1H_TG-2255-A
 DMSO, 8 sc, 
 1.10.2020
##JCAMPDX= 6.0         $$ Bruker NMR JCAMP-DX V2.0
##DATA TYPE= NMR FID
##DATA CLASS= NTUPLES
##ORIGIN= UXNMR, Bruker Analytische Messtechnik GmbH
##OWNER= root
$$ XWIN-NMR		Version 3.5
$$ Thu Oct  1 12:11:48 2020 Russian Standard Time (UT+4h)  she@DPX200
##.OBSERVE FREQUENCY= 200.1315066352
##.OBSERVE NUCLEUS= ^1H
##.DELAY= (6, 6)
##.ACQUISITION MODE= SIMULTANEOUS
##.ACQUISITION SCHEME= undefined
##.AVERAGES= 8
##.DIGITISER RES= 18
##SPECTROMETER/DATA SYSTEM= spect
##.PULSE SEQUENCE= zg30
##.SOLVENT NAME= DMSO
##.SHIFT REFERENCE= (INTERNAL, DMSO, 0, 15.7039)
##AUDIT TRAIL= $$ (NUMBER, WHEN, WHO, WHERE, WHAT)
$$ ##TITLE= Audit trail, XWIN-NMR		Version 3.5
$$ ##JCAMPDX= 5.01
$$ ##ORIGIN= Bruker BioSpin GmbH
$$ ##OWNER= she
$$ F:/spectra/data/she/nmr/H-F/1/audita.txt
$$ ##AUDIT TRAIL=  $$ (NUMBER, WHEN, WHO, WHERE, WHAT)
(   1,<2020-10-01 12:10:36.45 +0400>,<she>,<DPX200>,
      <created by zg, POWCHK disabled, PULCHK disabled
       configuration hash MD5:
       00 E9 B6 7A A2 85 ED C7 34 08 36 98 17 FE 4E 26
       data hash MD5: 16K
       66 33 58 21 CC FB F0 3D A0 88 E8 FF E8 00 97 0D>)
$$ ##END=
$$ 
$$ hash MD5
$$ F4 FB E2 D2 87 88 47 E5 BF DB 5D 5A 6A C5 3A 92
##$RELAX= 
##$RELAX= 
##$RELAX= 
##$RELAX= 
##$RELAX= 
##$RELAX= 
$$ Bruker specific parameters
$$ --------------------------
##$DU= <F:/spectra>
##$EXPNO= 1
##$NAME= <H-F>
##$PROCNO= 1
##$TYPE= <nmr>
##$USER= <she>
##$AMP= (0..31)
100 100 100 100 100 100 100 100 100 100 100 100 100 100 100 100 100 100 
100 100 100 100 100 100 100 100 100 100 100 100 100 100 
##$AQSEQ= 0
##$AQ_mod= 1
##$AUNM= <au_zg>
##$AUTOPOS= <>
##$BF1= 200.13
##$BF2= 200.13
##$BF3= 200.13
##$BF4= 200.13
##$BF5= 200.13
##$BF6= 200.13
##$BF7= 200.13
##$BF8= 200.13
##$BYTORDA= 1
##$CFDGTYP= 0
##$CFRGTYP= 5
##$CHEMSTR= <none>
##$CNST= (0..31)
1 1 145 1 1 1 1 1 1 1 1 1 1 1 1 1 1 1 1 1 1 1 1 1 1 1 1 1 1 1 1 1 
##$CPDPRG= <>
##$CPDPRG1= <>
##$CPDPRG2= <>
##$CPDPRG3= <>
##$CPDPRG4= <mlev>
##$CPDPRG5= <mlev>
##$CPDPRG6= <mlev>
##$CPDPRG7= <mlev>
##$CPDPRG8= <mlev>
##$CPDPRGB= <>
##$CPDPRGT= <>
##$D= (0..31)
0 1.2 0 0 0 0 0 0 0 0.06 0 0.03 0 0 0 0 0.0002 0 0 0 0 0 0 0 0 0 0 0 0 
0 0 0 
##$DATE= 1601539835
##$DBL= (0..7)
120 120 120 120 120 120 120 120 
##$DBP= (0..7)
150 150 150 150 150 150 150 150 
##$DBP07= 0
##$DBPNAM0= <>
##$DBPNAM1= <>
##$DBPNAM2= <>
##$DBPNAM3= <>
##$DBPNAM4= <>
##$DBPNAM5= <>
##$DBPNAM6= <>
##$DBPNAM7= <>
##$DBPOAL= (0..7)
0.5 0.5 0.5 0.5 0.5 0.5 0.5 0.5 
##$DBPOFFS= (0..7)
0 0 0 0 0 0 0 0 
##$DE= 6
##$DECBNUC= <off>
##$DECIM= 32
##$DECNUC= <off>
##$DECSTAT= 4
##$DIGMOD= 1
##$DIGTYP= 9
##$DL= (0..7)
0 120 120 120 120 120 120 120 
##$DP= (0..7)
150 150 150 150 150 150 150 150 
##$DP07= 0
##$DPNAME0= <>
##$DPNAME1= <>
##$DPNAME2= <>
##$DPNAME3= <>
##$DPNAME4= <>
##$DPNAME5= <>
##$DPNAME6= <>
##$DPNAME7= <>
##$DPOAL= (0..7)
0.5 0.5 0.5 0.5 0.5 0.5 0.5 0.5 
##$DPOFFS= (0..7)
0 0 0 0 0 0 0 0 
##$DQDMODE= 0
##$DR= 18
##$DS= 0
##$DSLIST= <SSSSSSSSSSSSSSS>
$$ [...]
##$SUBNAM2= <"">
##$SUBNAM3= <"">
##$SUBNAM4= <"">
##$SUBNAM5= <"">
##$SUBNAM6= <"">
##$SUBNAM7= <"">
##$SUBNAM8= <"">
##$SUBNAM9= <"">
##$SW= 16.880792210976
##$SWIBOX= (0..15)
0 0 2 0 0 0 0 0 0 0 0 0 0 0 0 0 
##$SW_h= 3378.37837837838
##$TD= 16384
##$TD0= 1
##$TE= 0
##$TE2= 300
##$TE3= 300
##$TEG= 300
##$TL= (0..7)
0 120 120 120 120 120 120 120 
##$TP= (0..7)
150 150 150 150 150 150 150 150 
##$TP07= 0
##$TPNAME0= <>
##$TPNAME1= <>
##$TPNAME2= <>
##$TPNAME3= <>
##$TPNAME4= <>
##$TPNAME5= <>
##$TPNAME6= <>
##$TPNAME7= <>
##$TPOAL= (0..7)
0.5 0.5 0.5 0.5 0.5 0.5 0.5 0.5 
##$TPOFFS= (0..7)
0 0 0 0 0 0 0 0 
##$TUNHIN= 0
##$TUNHOUT= 0
##$TUNXOUT= 0
##$USERA1= <user>
##$USERA2= <user>
##$USERA3= <user>
##$USERA4= <user>
##$USERA5= <user>
##$V9= 5
##$VALIST= <valist>
##$VCLIST= <CCCCCCCCCCCCCCC>
##$VD= 0
##$VDLIST= <DDDDDDDDDDDDDDD>
##$VPLIST= <PPPPPPPPPPPPPPP>
##$VTLIST= <TTTTTTTTTTTTTTT>
##$WBST= 1024
##$WBSW= 4
##$XGAIN= (0..3)
0 0 0 0 
##$XL= 0
##$YL= 0
##$YMAX_a= 194422
##$YMIN_a= -155552
##$ZGOPTNS= <>
##$ZL1= 120
##$ZL2= 120
##$ZL3= 120
##$ZL4= 120
##$ABSF1= 10
##$ABSF2= 0
##$ABSG= 5
##$ABSL= 3
##$ALPHA= 0
##$AQORDER= 0
##$ASSFAC= 0
##$ASSFACI= 0
##$ASSFACX= 0
##$ASSWID= 0
##$AUNMP= <proc_1d>
##$AZFE= 0.1
##$AZFW= 0.1
##$BCFW= 1
##$BC_mod= 2
##$BYTORDP= 1
##$COROFFS= 0
##$CY= 11.3945322036743
##$DATMOD= 1
##$DC= 2
##$DFILT= <>
##$DTYPP= 0
##$F1P= 16.9975609425685
##$F2P= -3.02152046262296
##$FCOR= 0.5
##$FTSIZE= 0
##$FT_mod= 4
##$GAMMA= 1
##$GB= 0.15
##$INTBC= 1
##$INTSCL= 1
##$ISEN= 128
##$LB= 0.24
##$LEV0= 0
##$LPBIN= 0
##$MAXI= 10000
##$MC2= 0
##$MEAN= 0
##$ME_mod= 0
##$MI= 1.114404
##$NCOEF= 0
##$NC_proc= 0
##$NLEV= 6
##$NOISF1= 3.799351
##$NOISF2= 2.8
##$NSP= 1
##$NTH_PI= 0
##$NZP= 0
##$OFFSET= 15.70392
##$PC= 1
##$PHC0= -9979.326
##$PHC1= 21.60089
##$PH_mod= 1
##$PKNL= yes
##$PPARMOD= 0
##$PSCAL= 0
##$PSIGN= 0
##$REVERSE= no
##$SF= 200.130013532006
##$SI= 16384
##$SIGF1= 3
##$SIGF2= 2
##$SINO= 400
##$SIOLD= 16384
##$SREGLST= <1H.CDCl3>
##$SSB= 0
##$STSI= 0
##$STSR= 0
##$SW_p= 3612.71676300578
##$SYMM= 0
##$S_DEV= 0
##$TDeff= 0
##$TDoff= 0
##$TI= <>
##$TILT= no
##$TM1= 0
##$TM2= 0
##$TOPLEV= 0
##$USERP1= <user>
##$USERP2= <user>
##$USERP3= <user>
##$USERP4= <user>
##$USERP5= <user>
##$WDW= 1
##$XDIM= 8192
##$YMAX_p= 0
##$YMIN_p= 0
$$ End of Bruker specific parameters
$$ ---------------------------------
##NTUPLES= NMR FID
##VAR_NAME=  TIME,          FID/REAL,        FID/IMAG
##SYMBOL=    X,             R,               I
##VAR_TYPE=  INDEPENDENT,   DEPENDENT,       DEPENDENT
##VAR_FORM=  AFFN,          ASDF,            ASDF
##VAR_DIM=   8192,          8192,            8192
##UNITS=     SECONDS,       ARBITRARY UNITS, ARBITRARY UNITS
##FACTOR=    0.000296,      1,               1
##FIRST=     0,             0,               0
##LAST=      2.424536,      0,               0
##MIN=       0,             -155552,         0
##MAX=       2.424536,      194422,          0
$$ Real data points
##PAGE= N=1
##DATA TABLE= (X++(R..R)), XYDATA
$$ [...]
1727B1k2k8J16q3R9n6J26k24n1M1P8J2k53M23l75K4N5J1J84J45l08N1P5j60K08
1752A09l46L60l0j7O1j40o8K4o2K63l27P6J27j05Q5J79j36Pk31L89Pj59J17j17
1776F6k2M8J00k15K9J3j00mJ5l8M9P9K2p4P2l0nM0k26L54r5k08N9N9J6J47j01
1803E0k6N9k16K62r4m7L30l05Q7k52l4L12j85M2O4J24l22J49j07j94K37K57k12
1826b1L2j58P2nJ37j9K5L7j71j63J37O7j20O7J51K04k58J3k48M02j31R8J02k90
1850d0L09k04r4J01j72j08q6R6O4R4L2R2k78J8K75j6r2J25j04J14o1K3k83K98
1874A03l3l93K44K01k65J12K10k61Q7j06M1o5J3K83m4k36L24j53k99P3J89j54
1896a29J41O3k87l3K67j63J04j58J4J00K16l0q9m1q2J20o4q7J05q2q8n2m8K86
$$ y = [21, -1, -29, 87, 4, 103, 47, 173, -51, -102, -61, 17, 29, -224, 199, -176, -152, -97, -86, 98, 243, -65, -14, 61, -99, 109, -237, 123, 93, 76, 137, -3, -71, -47, -109, 154, -173, -97, 30, -75, 10, 189, 53, 60, -171, 218, 225, 66, 183, 66, 44, 92, 192, -23, 6, 19, -81, -85, -70, -108, -59, 20, 42, -32, 40, 10, 5, 45, -181, 173, 78, -130, -71, -12, 4, 151, 50, 24, 83, -133, 129, 35, -12, 318, 13, 100, -152, -186, 126, -59, -17, 47, 171, -151, -2, -109, -303, -66, 191, -21, 11, -147, -75, -80, 57, 38, 63, 100, -71, -234, -97, -30, -150, -83, 68, 272, 14, 27, -221, 181, 50, 148, 250, -40, 269, 65, -29, 72, -100, -208, -294, -198, -134, -40, -8, 84, -194, -176, 99, 83, -9, 116, 12, 126, 65, 88, -195, 103, 70, -323, -79, 122, -143, -31, 179, -82, 5, -101, -60, -125, -112, 171, 127, -109, 215, 62, -237, -164, 25, -129, 12, 75, -212, -245, 22, -141, -37, -195, -181, -81, 135, 105, 16, -25, -107, 13, -51, -138, -33, -115, -203, -255, -303, -17]
1920a7J60k56J2J16p3J83J61m74K20O1j34J69M3k59j2J24j14P5J4K36l31j8K14
1943A00j99j9p6K59nj15L3j17K48j52K65j49q8q4J46K6J11Nl47K31J15l00m4Q8
1967f8K22j2j50m7J45nk07L2N5K7m1L41l01l9j31J08R9J59k82J4j41m8L95j03
1991B2o3K49o7pp4oj61L50q3l6l2l13J57K5p6J55p7k1J65j69L8oJ42j48k1O4m4
2018c7K53l24J39L9k15K6KK07k00J47l3J9p0N8l3M7j1J00p5k34K61M2k36QqK66
2044A38l7j46K85n48K98k24J29J89r0k3O6mK8l7K45j5k18oq7j8MO7K7J63k65J35
2070E6j10J82O2j61O4k63J47R1j49J21O0P4n4l16K34K0L1p3K59q5j41L3O1j67
2094b4J03q6P0L2m9j16K5%j96K46j9O6R8j99K09k05j07J61j46K29pj24J15j76
$$ y = [-17, 143, -113, -101, 15, -58, 125, 286, -188, 32, 93, -41, 128, 171, -88, -100, 24, -90, -15, -1, 235, -96, -114, 100, -99, -118, -194, 65, 60, -55, -22, -139, 109, -43, 222, 73, -15, -99, 47, 73, 184, 189, -158, 73, 188, -112, -156, -68, 154, 142, -8, -55, 90, 85, -122, -90, -35, -8, -49, 292, -9, -48, -179, -71, 28, 187, -95, -81, -222, -270, 125, 22, -41, 208, 141, 134, 60, 54, -107, 243, 160, 124, 92, -221, -64, -39, -115, 40, -37, -58, 107, -62, -24, -30, 112, -36, -57, 7, -37, 216, -108, 31, 70, -145, -119, -117, 90, -110, 37, 4, 23, -47, 11, -22, 25, 14, 114, 39, -195, 66, 108, -128, -120, -128, 138, 101, -45, 240, -308, -10, -234, -105, 84, -6, -29, 37, 33, 61, 24, 269, 254, 36, 30, -57, -75, -71, -4, 23, 186, -79, 56, -54, 128, 190, 29, 93, -170, -23, 68, -81, 40, 100, 174, 120, -196, 38, 58, 89, 16, 275, 190, 49, 82, 143, -24, 79, -7, 63, 95, 46, -70, -45, -45, -241, 5, -14, 52, 150, -49, 160, -45, -152, 9, -137, 92, 85, -39, 76, -100]
2118a00j39K44J64k02J9n2K38l31J92q9R4j18K57k59K49J16l44J33q3J97j08l0
2140D8m2P4K8l36K41J46j25r5K71q1j40l8R1j88K71jj50J93K2j20j3k00K07K36
2164B99m60P7j6J78k05K29l9%j71m9J44O9o8J66j65J43j71j77R0J47l7k05J57
2187f4l1J14J26j71K31k48J81p7J6j27K52j74j07O2L3j84J86L2N6j31j35L25k62
2210i7Pk56K56J00J46k15mJ01J33j82K1M2j07K30j96J75j50j31J75J04j06J27
2232A73r1j47K72j38j56J66l03P8P8K31j19p6J1N3j56K4K89k59J99j97K14r9j22
2255g5k29L38q3L6j50J28M10l90J11Pj69P4p1K11k05K02O7j18q8MJ06l3j97K51
2279A37j94J2j08J57r3L44m49L31j31K76k70l5l5%J89j63Jj15R2q8J72j47J38
$$ y = [-100, -239, 5, 169, -33, -14, -66, 172, -159, 33, -56, 38, -80, 177, -82, 167, 283, -61, 72, -11, 186, 78, 48, 6, 80, 108, -228, 13, 159, 34, -61, 210, 129, -11, -49, 42, -146, 125, 124, -26, 167, 189, 69, 56, -144, 63, 299, -161, -84, -100, 78, -127, 102, 63, 63, -108, -157, -13, 56, -12, 154, -11, 132, -39, -216, -126, 21, -16, -221, -64, -95, 19, 145, -26, 205, -43, 138, 61, 77, -50, 202, 28, -79, -17, 16, -168, 18, 50, 106, -25, -160, 165, -97, -90, -346, -90, 10, 156, -59, -63, 38, 171, -11, 10, 52, -55, 175, -21, 154, 4, -127, 48, 152, 46, 173, 82, -65, 207, 69, -87, 79, -224, -146, -68, 163, 44, -32, -21, 32, -124, -100, 189, -70, 129, -68, 146, 47, -75, -304, 34, -49, -13, -163, -35, 375, -15, 96, 103, -66, 8, -63, 148, -57, 145, 212, 94, 6, 10, 116, 83, -114, 137, -57, -45, -153, 4, -89, 255, -194, 137, 6, 282, 12, -23, -58, -58, 131, -32, -31, -146, -54, -142, 30, -117, 21]
2302B1r8J89m8k92M53l0n5Q2m47M93m17J09K63k3j94K11o6N5p6M2k57K41j69K
2326a1j10J14o9k11J70q8K23Q8n3p2%m3j07k1K41Nr1J56j2k51J0J66JN7p5j30
2352a13P6j1nR1q9J48r0j86J26K42m4j35j25K29q6r9J23r4q7Q6K8n1j5P7K04j18
2378H2J78k03m8J20j53O9j05N1Lp8K0J52j07qL34l74Nm5L06l47M1Nr5N60k63q7
2404A3K5o7O8m1m1k3l1K65j02j59J25K1k5J51l76K13O8j25J69r7j50K7K05j87
2428g4r3J66p0J48k88L21k79L11k17p2L7L74l72K47k20MJ10K00k14j55Q2Q7L8
2451G1rL2j06O7l3J00l25O6J51l3M2mN0l58L18N7j45R3m45L69rK6J56j28j50J72
2477B5j29J37l3J6j59L48l03j6M17k55Ql9l5Qj34P7j07J77J77j10k28j07K13p7
$$ y = [21, -77, 112, 64, -228, 225, 195, 140, 222, -225, 268, -149, -40, 223, 200, 6, 217, 151, 206, 130, 172, -85, 156, -13, -11, -121, -7, -76, -287, -117, -205, 18, 106, 53, -19, -19, -62, -169, -190, 51, 56, -35, 121, 109, -142, -132, 34, 35, 92, 17, -113, -37, -48, -53, 38, -51, 97, 7, -179, -53, 189, 145, 10, -115, 114, 28, -71, 52, -42, -129, -43, -15, -66, -81, -4, 200, 82, 260, 57, 9, 129, -24, 45, -60, -9, -6, -84, -64, 88, -19, -27, 307, -67, -62, -107, 199, -148, -107, -102, -197, 363, 100, 13, 38, -29, 39, -2, -43, -66, -97, 168, 66, -93, 32, 53, 28, 179, -197, 16, 84, -41, 128, 31, -119, -92, 113, -74, -167, -1, -71, 77, -211, 110, -169, 142, -75, -147, -110, 264, -108, 139, -81, -77, 33, 233, 19, -136, -54, 33, 71, 62, 94, -12, 55, 22, 122, -203, -137, 14, -19, 23, 19, 69, -289, 29, 86, -59, 34, -411, -42, -51, -25, 131, 3, -147, 25, -104, 33, 0, 16, -143, 205, -98, -114, 303, 48, 56, 17, -18, -10, -144, -67, -174, 3, 180, 70, -158, -265, -52, -129]
2501a29R1n2L62m58OL64k30R0k83K43k0o7Q7j53O8j26K23J29j22K96l53L12k21
2524E7k55L33j57r7M59l01k60J74J07j28q7J88k04J97k4L1j90P5j09K73j72L9
2546e1J53j75K84q5n9j46k15K42k25M9J22J61k44K39Q1k08M02l10J89mk30Q0J09
2569A59j12J10m71K84N4L4n5J51l9o2m9k17L11j7j60J06k60K48r1J46P6j59k1
2592c4m1k3j84M35r7K2Q1k56J01M2k77K24O0k18J53J92l30j8R5Q7J69n7j36NJ57
2617A52j75ll77K96Q8OK2J40l41K09j49M0j02K42j05M5om3p8R3K88l45J99m06
2641c10J96o4M9K79j53j68J30j4J92k96J52k9j16L21q4J39n2j32j28J22J55m63
2663b74K30M8j84J46O8M4j5j69m1J44j52Q9R1n2K79k10j03J40k27K56j28p4J00
$$ y = [-129, -38, -90, 272, -186, -180, 184, -46, 44, -239, 4, -16, -83, 4, -149, -81, -207, 16, 145, 23, 319, -34, 278, 57, -198, 135, -22, -119, 340, 39, -221, -47, 60, -68, -155, 33, -171, 26, 2, 33, -157, -82, -191, 82, -90, -51, 102, -73, 211, 126, 67, -79, -294, -52, -277, -228, -106, 55, -189, 50, 131, -77, 325, 15, 204, 200, -30, 50, 159, 47, 157, -314, -30, 24, 58, 3, 154, 115, 53, 4, -213, 98, 81, -79, 27, -233, 15, -76, 70, 146, -13, -34, -75, -98, -282, 153, 56, 78, 159, -97, 4, 46, -231, -7, 53, -165, -12, 180, -150, -168, -73, 14, 183, 126, -10, -5, 152, -23, -26, -403, -107, -19, -13, 9, 149, -192, 17, -132, -92, -194, 48, -57, -12, -18, -61, -139, -46, 242, -103, 96, -310, -114, -178, -129, 150, -3, -171, -41, -55, 137, -159, -7, -36, -152, 169, 85, 224, 172, 40, -88, 34, 189, -274, -44, 4, -180, -34, 34, 78, 63, -106, -147, -3, -155, -66, 25, -27, 252, 42, -61, 79, -148, 108, -20, -94, 6]
2686Fk30J17j6O2R0k7j10J52j22J84L8j40N5j59j25L69N6j19p9k78K43q6J30l1
2710b0Jl1k5J62m08K63LN6J27o4n3K0J36m0P3j26O6j59p2J66j8J07L6k95O0P9
2736D4J06j94n2k19K38P3Mk04K14l5K13k47J66j45J8n6L64j83l60K81l5K6j97
2759a80J77l5J94Nj53J4J57r4j85L07l15J76J38K3j63j23K60k76L3j74K56J2p9
2782b5J20J3l48J03J82P3j15j74L15k65O8K78j51l7r9J06j37m7M3J65M5P6m5k83
2806a39M0Q0K5k27J99k5n2J53n0L0R8l9j21M6N4n9L6j68J67k22J21J74j1q5n4
2831b9j4Q4K18k92J38j88O6J80l78K41n9j24K94K7j48o3q3R1J98k60j06L08k56
2854a55L06k99J72L5l12L34l28J76J9kJ36k19J79j22K54k21J44k75K62J30r1l2
$$ y = [6, -224, -107, -123, -61, 29, 2, -108, 44, -78, 106, 144, 4, 59, -100, -225, 144, 200, 81, 2, -276, -33, -119, 11, -20, -19, -50, -75, 87, -321, -58, -55, 1, 128, 64, 11, 31, 167, 127, 200, 74, 140, -19, -91, 75, 57, 164, 200, -95, -35, 44, 150, -44, -96, -315, -77, -4, 0, -204, 10, -25, 188, -59, 107, -38, -20, -76, 288, 105, -255, 26, -9, 17, -180, -3, -38, 156, 161, 8, 22, 179, 85, -100, 207, -108, 68, 206, 229, 66, -57, 203, -73, -40, -214, 42, 54, -25, 95, 108, -240, -137, 45, 118, 3, -171, 144, -121, -53, 225, 74, 37, -62, 44, -93, -140, -97, 68, 113, 189, 144, -139, -99, -19, 6, -221, -22, -47, -99, 54, 4, 34, 132, 93, -28, 18, 72, 13, 49, -119, 48, -174, -53, 121, 110, 25, -29, -43, 41, 259, -33, 105, -83, -17, 163, -215, 26, -33, -157, 137, 164, 16, -47, -130, -39, 159, -101, -207, 101, -155, 151, -148, 24, 59, -253, 81, -247, -71, -52, -54, 82, -137, 42, -80, 174, -47, 97, -178, 84, 214, 123, 91]
2876I1n4J33k05J82j87k61J72N7J59j70K32l39J80k00K8L40j25k44K25J85k19
2897b0K10l21K33K7l01L68k5Lj61m1l4J40j25K4m9J57J07l69O3K00j56Q5j02L2
2921e5K07L8k9j14K50l26k7mN0P2r9k0J12l3m9k10K02JM5K5k25K47k32K03m2j61
2947a74J65j81J51k19M35j40j48P6K10j25PJ41K7m81L57m6Lk6K4n2q0PN6P5k0
2972D2N4P1j21p5J95k28J03Q6l9p8r9L05k35j71K18k25P5m6L31J48o13L76j11
2995c7J87j28j55Q8J24K3j40J47j21QJ91k0j39k38K81k40J43M00j75m37K31J59
3017A52l13N2l8R3J36k28J62nP3k07J74J16l2Ql88L35j60J42j06KJ87k20L17l8
3041B14j52K4J1k37o4K22MK0m8R6j55N6j96Q3Q9Q6k32J54j79K48Q7J2k60N0J67
$$ y = [91, 37, 170, -35, 147, -40, -301, -129, -72, 87, -83, 149, -190, -10, -210, -182, 158, 33, -211, 14, 199, -20, 190, -131, 102, 129, -172, 196, 171, 174, 13, -28, -62, 78, -47, -23, -72, 85, 192, -177, -114, 86, -70, 15, -87, -55, 152, 190, 161, 47, 297, -29, -56, -60, -10, 62, -37, -57, 55, 22, -27, -237, -35, -34, 11, 36, -189, 58, -174, 29, -13, -174, -9, -190, -39, -258, 177, 37, -111, -35, 175, 50, 57, 198, 225, -256, 101, 55, 58, 32, 56, 4, -76, -69, -13, 62, 42, 96, 167, 46, -29, 166, -62, 41, 127, 88, 10, -89, 216, -19, -190, 28, -197, -122, -168, 163, 311, -302, 74, -37, 150, 22, -133, -45, 79, 102, -38, 109, -12, -4, 187, 167, 28, -210, 71, -169, -26, 374, 199, -238, -7, 152, -161, -109, -147, -54, 82, -146, 16, 11, 84, -123, 51, 167, 135, 143, -245, 90, -70, 72, -34, -32, 155, -65, 252, 214, 62, 86, 97, -140, -204, 18, 22, 42, -6, 90, -65, -9, -205, -122, -33, 53, -179, -25, -204, 44, 131, 143, -117, -67, 100]
3066A00j47q4J49j34R5m3j44J69r3j63J71R4L18l45p3lL7J66k15L24j23J06j87
3089b5K03m03L83l9j62l6q6P6r5J54J12O3j44l4m7J1j4R6K1k18K49OK8N4k30K02
3115A25j05k23L58l44K84m1j62P7J7J60j15J49l56J07j01J27j47J97K1K1J7K8
3137I4L7j08l9J1P4j43L4N8k58J64k12K11J02J3k14J50K23l78J79j3j67Q8p8K18
3161D6j37o7L9L93l81M5P4m5J39k08J22J58k77K92rl61Q9j14K26k12Q5k29L31
3184aj72K54j82j93L14p0K09k50K8M6R6q2J22j40k33K28n4jJ33l9P4M8j68q5L1
3209h7lK81j41m9M4o7oj78J53K15l41L19n4j25L1J42q8j64K64j49K1M8j16Q3m2
3234iL4J05m1R9m4j58J26k00j83K97Ll22L84O8r1J23k54J55k26J71o7j9p2MM9
$$ y = [100, -47, -131, 18, -116, -21, -64, -208, -39, -132, -295, -124, -30, 288, -57, -130, -133, -96, 70, -145, 179, 56, 162, -25, 178, -225, 158, 119, -43, -79, -165, -89, -184, -30, 82, 145, 1, -33, -80, -69, -83, 13, 34, -184, 65, 71, 99, 153, -77, 125, 20, -203, 155, -189, 95, 54, -108, -31, -14, 146, 31, 180, -176, -69, -170, -43, -190, 7, 28, 49, 66, 94, 131, 23, -16, -5, 69, -74, -40, 18, -240, -76, -288, -77, 25, 38, -176, -26, 197, -181, -2, -15, -182, -94, -172, 46, -91, -158, -119, 274, -107, -62, 12, -33, 106, -102, 20, 178, -99, 193, 184, -177, -88, -202, 24, -188, -103, -332, -1, -173, 81, -101, -294, 20, -50, 159, -91, -63, -17, 79, -3, 119, -21, -254, -26, -80, -81, 52, 13, 87, 135, -33, -118, -87, -90, 191, 50, 1, 45, -22, -28, -206, -53, 162, -179, 140, 86, -39, -8, 134, 46, -118, 146, -3, 18, 66, -50, 33, -9, 25, 130, 89, 188, 144, -14, 112, -88, -271, 26, 29, -293, 91, 159, 68, 191, -63, 92, -134, 37, -30, -49, -121, -117, -68]
3259f8O3N3k09J08rj53L76l51K29L1J23M4m53J34Q0J4K24J2l59L33l86p3K84K51
3283B98l52On9L94k49j72L19j30J60l46M39n62L07m8J01k52K1J13K16j70j98L01
3305A37M5j49J05o9L3j09j52L38k81J66k63M92k86r4K63l03K15K5k7Q5k34j88
3327b51M71j1l07K4J72j21J53k82K59j93pk25J95j67L78J12l55J38R8M5k60J15
3349a9m4K04k35mJ38l2j6n7M7J32J5m52M85j93O5m9Q2j6N5j13P7M9K1r2j84J97
3375F1J91k73J60q9k9L59m68R7k40J84J27J64k10O7P6m36R1q9K35K06j36j74M5
3398h1K78k79k8P8n0K69l04K88q2L8j96qL55k54j84J3P9j4K25j32O3j8K63k40
3422G9rK18j61j47k7r2r9M6J89K37l18J44K8j18M9p1k45M43rN2k45M6k9N3j48
$$ y = [-68, -5, 48, -161, -53, -62, -215, 161, -190, 39, 70, 193, 237, -216, -82, -2, 12, 236, 248, -111, 222, -164, -237, 47, 298, -54, -48, -107, 287, 38, -134, 185, 55, 215, -131, 308, -254, 53, 5, 106, -146, -125, -12, 204, 34, -164, 137, 182, 33, 138, 69, 102, -7, -159, 179, -102, 64, -199, 293, 7, -87, 176, -127, 88, 113, 86, 171, -63, -251, 220, 209, -98, -74, 98, -23, 130, -152, 107, -86, -93, -318, -123, -290, 88, 200, -155, -17, 81, 126, -134, -19, -63, 141, -94, -98, 40, 8, -8, -65, -18, 114, 129, -323, 162, -31, 34, -15, 67, 51, 106, -7, 70, 119, 140, 48, -136, 61, 252, -21, 139, 50, 21, 380, -88, 9, -231, -47, 80, 244, 34, 101, 177, -259, -168, -257, -22, 184, 48, -126, -81, 197, -82, -110, -32, -82, 187, -117, 171, 89, 127, -69, -77, 278, 24, -160, -147, -68, -82, 143, 11, 74, 56, 319, 79, 70, 288, 127, -20, -47, -139, -238, -192, -3, 234, -84, 60, 88, -30, 19, -52, -297, 146, 137, 189, -56, -10, -39, 14, -134]
3447a34n8M9J88J0k8J37k24j6J65J38k12p4j6J89J8j10J4q5OJ0R7j34j55K65J13
3472A53j32k1K66m1n21L48j99j9K70j36R1j52R0J32j66Q6o2k28J10J93j20K85
3494B27k28j13O6j24K92k33P1L3P6j92J44k17J69k36J66J02l5j30N5j66K67l3
3516c9J1k09M47k69J1j11J16j10N8p5J61J05j33J28p9K48j75j20p1k21L18J38
3538A29o3o4K15k29lJ31M4K11m19J6n1J20j06q4M26j16k8l21J83nJ85p9k5k17
3562a50J99m9q7K49k56J43Lp2l1j40J93J89k00j03M06l31k15J68J38j37O2m3N2
3585a2J04l30L65k9q7j37%J46j77J08N0j2k11L53j12k6Q2q9j89p5M82n25M60n0
3609H9j05L7R1l49L95q6p9L8r8J46j42J06J3j65K75K8k32j05J75j64J69O4l34
$$ y = [-134, -192, -143, 45, 55, 27, 164, -60, -76, 89, 227, 15, -59, -75, 114, 132, 22, 36, -49, -43, -33, 64, -70, -225, 40, 153, 21, 0, 266, 225, -296, 52, -147, -166, 104, -32, 59, -93, -3, 129, -37, 49, -13, -241, -131, 62, -58, 227, -1, -114, -48, -172, 120, -113, -42, -9, 67, -125, 19, -198, -29, -265, -99, 3, -32, -162, -107, -273, -6, -39, -28, -237, 210, -59, -48, -159, -43, -153, -95, -170, -9, 96, -37, 91, 12, 260, 85, -35, -106, -327, -9, 129, 66, 2, 217, -12, -15, 116, 160, 371, -48, -32, -83, 37, -69, -153, 273, 157, 129, -192, -9, -14, 171, 92, 67, -150, 49, 0, -87, 162, -94, 49, 52, -20, -51, -191, 2, 191, -9, -112, 294, -37, -252, -84, 54, -83, -21, -64, -12, 92, -238, 127, 98, 11, -126, -126, 20, -157, -49, 1, -11, -222, 131, 19, -7, 75, -14, -203, -278, 204, -321, 139, 89, -16, 21, 112, -237, 158, 72, -7, 31, -67, 79, -63, 43, 56, -109, 166, 194, -38, -143, 32, -132, 37, 101, -233]
3632b33K2k5K87j82J2j51J91J22M9J83o18J97L8K58l1k60K79j67j3J25j04j08
3654a29K35L3k71J04Q1j63J51j9N3j45J18p8J04j71k9j52K96R5n7j45Ok16K09
3677i0J1k5J86j33K2N7J84k51oo8L16l52J60J28j01k11L10j82O1p0K50k57Q1l
3701A7M3n5J21O3l95J32n1RJ04p9p6L01Q7l00n3M06l74O7J6Q9j27r0K21K7p9R0
3727A14lj08j18J35O0q5J00j2M0j38J35j94n8L9O3m1L04k72K38M0r5L7n28K24
3751a23L3O0L1k18Q0J70j71L14j29R2q3k29K81O2q5l76J67o9J27K90j83N6l2j9
3775D6lj80K49R6k67o9K27l4k27L32j57N5k8j01n2M0L1R4K0m3k99K81J24l08M0
3800a33J45K4n0o5K53k84J76j31j65L48l67K26k25J66k03K58k5L80n11L8L46k64
$$ y = [-233, -211, -236, 51, -131, -119, -270, -79, 43, 92, 275, -343, -146, -108, 150, 119, -141, 138, -29, -42, 83, -21, -129, 106, 139, -132, -28, 53, -110, 41, 22, 75, -70, 48, -30, 74, -97, -126, -278, 18, 113, 56, -89, -83, -299, -90, -79, -104, 82, -51, -29, 28, 212, -39, -45, -113, 203, -149, 11, 139, 38, -173, 137, -45, 16, -54, 196, -61, 20, 17, 60, 5, 126, 189, -206, -74, -125, -116, -12, -91, -167, 134, 221, -79, -132, 274, -100, -33, -17, 72, -55, -145, 76, 103, 24, 114, 111, 3, -115, 20, 80, -5, 95, 83, 123, -15, 120, -74, -132, -93, -30, -71, 233, -39, 199, 239, 144, 181, -347, -123, -90, -30, 1, -217, -137, 33, -138, 176, 47, 139, 56, -173, 108, 170, 85, -291, -124, -193, -66, 224, 41, 97, 65, 46, 43, -137, 112, 208, -59, -128, 99, 65, -162, 170, 13, 68, 40, -61, -113, -73, -42, 52, 72, 29, -270, 11, 135, -173, -133, 12, 36, -14, -79, 174, -110, 66, -65, -230, 118, -249, -23, -248, -82, -285, -27, -52, 328, -183, -145, 201, -63]
3822f3J44pj58K36k77K36M4Kk74K43o1O1p3k03J06j58J00N0J29m8J06Ml28K31
3846D2j5J85o34M18n3q5K6J96M8J6j19Q9r7j23r1M1K27j05mJ13j05j9L53n41J95
3871d2J30k43L0K20j03j96J93n8qJL1J14n8m8J04j76J54q1J51j20j1K29l37J40
3895A6j51n0L4J43O1j37J40J69l89R9K0M2LJ27j84k6J56j40k35L90p3O0Ql4j94
3920a45j59K88r5J22O4k29K59K4%j00j66OM6J74j22J44K1j76k7j81K39K58j66
3943G9p4q0m5L42P2l75%K7Q0q5n4RL16j08J76k24J30k06p6n6rJ21J06j83J17n6
3969e6K15l79L79M0k29N5j14JL17k67O6Q9j30Ll6q1Q7P4o6R4j03J62k77K2K62
3994A28j84p3J17j64K43j14k48K10J40O3j77L82l52O4k51L79m6j94L02l15Q9O1
$$ y = [-63, 81, 74, -84, 152, -125, 111, 155, 157, -117, 126, 65, 126, 53, -150, -44, -202, -102, -52, 77, 29, 135, 139, -189, 42, 27, 212, -422, -4, -57, -142, -116, 80, 128, 144, 25, 114, 17, -106, -197, -156, 71, -34, -38, 75, -30, -49, 304, -237, -42, 88, -155, -125, 95, -8, -204, -11, -69, -77, -76, -45, 69, 11, -37, 67, -109, 45, -36, 115, -5, -16, 213, -124, 16, -135, -185, -151, -8, 53, -84, 56, 225, -164, -65, -45, -3, 0, 127, -57, -83, 73, -67, -302, 88, 15, 75, 83, 49, -145, -304, -16, -111, 11, 75, -154, 105, 129, 129, 29, -137, -131, -85, 89, -33, 111, 132, -44, -71, -252, -13, 245, 79, 5, -75, -120, 222, 294, -81, -81, -54, 26, -59, -113, -104, 212, 104, 280, 56, 186, -20, -96, -152, -161, -40, 66, -117, 0, -56, 159, -220, 159, 199, -30, 25, -89, -88, 229, -38, 28, 117, -13, -10, -46, -127, -40, 34, -32, 62, -41, 121, -156, -134, 128, -56, -129, -12, -176, 67, -47, -295, -85, 55, 118, -59, 323, -29, 35, -216, 163, 117, -77, 225, -90, -1, 60]
4016F0k45J82N5J24l64p8L03j63R2P1j31K21k83J16j23J34M6K7O8j09J53k36R3
4039A3k56J84N3n5Q6j92K14K43k55l91M13k20K40j39j44M29q9l07o5L85k39J83
4061I1p4J10j70p6m7J22j24J13K83m22K12N6j80L7j00L8K9J72o3O0J13j59o3K43
4085B01k06j4J59O1l52q1L07j24N3M0j21j13L06j26j63K40q1L1q4o8O7K24l42
4108a86L00j13k00J45j95L94j51j68J76J30k00l5J69R2O4k97Q4K60l98N7K40q1
4130H7j97K17J57k94k9pRN2l9J19j15j9P2J81k60L18k09q6J11n2K42m79J5L23
4154A17m9r8j17m7K37J56o7k46O5P4J13M5l44J82p9L80k78o0L41k41P8p8j3p7
4178fJ0j8J3K7qm8QL1lj88J19j09K90l33L12k2o7m5Q6P8j96r7K49Q5j01J01r7
$$ y = [60, -185, -3, 52, 176, -188, -266, 37, -126, -34, 37, -94, 127, -156, -40, -163, -29, 17, 44, 112, 3, 156, -80, 13, -243, -59, -6, -61, 25, -167, 47, 290, 35, -356, 57, -163, 77, -62, -206, 223, 134, -173, -238, 147, -92, 91, 17, 127, -43, -119, -166, -44, -168, -55, 228, -194, 18, 74, -106, -69, -169, -131, -102, 70, 7, 67, 180, 21, -42, 201, -5, -19, 140, 201, -151, -232, 75, -49, 4, 44, -77, -190, 116, -10, -173, 67, -14, 17, -67, -135, -68, 156, -186, 114, 1, -199, -54, -249, 145, -6, -174, 2, 132, -68, -103, 66, 158, 222, -75, 9, 269, -129, -72, 168, 87, -110, 107, 264, -30, -59, -66, -57, -5, -44, 75, -40, -59, 13, 194, -66, 252, 43, -43, 68, 16, 258, -221, -206, 117, 68, -30, -147, -194, 43, 199, 132, -114, -49, 25, 138, 183, -161, 21, -58, 322, 44, -16, 325, 84, 162, 84, 71, -6, 4, -14, -1, 26, 18, -30, -22, 9, 6, -182, -63, -172, 118, -215, 97, 75, 8, -37, 49, 127, -69, -166, 83, 168, 67, 168, 71]
4205G1j2j51o6K22j45L7k0J91l33R8j51K50n5P5k19J98k8N3J2m3J16Jk03M7J42
4230H7j19J5n8K31j74k0J17k93J59J53j24M05k48k17q4L36k27N0l6J16rj89p7
4253b06L64n2j10k39K24M2kJ46k68L8N5J83O3l90K54k55J75n1j7J5J21l3k1p8
4277d2n8J4K30l53K27j03J49m1nL5j06R0l44L89j16R9k69L51k62R2j86J75m3Q1
4301DN2pK5k29K99J31k97k48K61J66j94J51l30J66K4L4m2k5OM1J85l25K4J88k18
4326a58m7J44R4k06K76j74O6MJ11l10M26k45J85nj40k17K7L11m7j11J1O4p0R6
4350H5p2K04j44n5jl16J66K56j30j06J78M7m1j13N7K2J39j24n8L2l7J9RP6l65
4375b72R7J28R9n0J02j10n0K40m02J60K4K63L3l57J18J69j5p7M3m6J48j15j83
$$ y = [71, 59, -92, -158, 64, -81, -44, -64, 127, -206, -108, -259, -9, -64, 11, -208, -10, -38, 15, 27, -16, 100, 101, -102, -55, 87, -32, -17, -75, 156, -18, -38, 79, -214, -55, 98, -26, 379, 131, -86, -170, 166, -61, -11, -47, 69, 60, -129, -206, 158, 106, -4, -243, -19, 23, 21, 167, -101, -63, -8, 175, 238, -152, 102, -153, 22, -29, -46, -31, 90, 57, 36, -42, -100, -86, 144, -209, 18, -85, 64, 23, 18, 53, -53, 37, -307, 82, -34, 65, -204, 147, -115, -23, -209, -34, -77, 4, 56, 49, 74, -155, 144, 275, -22, -270, -9, 157, -37, 114, -216, -50, -26, 8, -34, -59, -53, -12, 173, -152, -128, 60, -158, -205, -61, 33, -173, 103, -71, -5, -1, 110, -200, 226, -19, 166, 161, 21, -196, -169, 142, 95, -16, -5, 59, -11, 85, 13, 217, 73, 18, 17, -299, -133, 123, -7, -113, 65, 112, 71, -42, 15, 37, 176, 52, -6, 26, -11, 8, 17, 93, -272, -175, -47, 52, 2, 104, -6, -56, 184, -218, -58, -34, 229, 262, -95, 23, 192, 177, 100, 143, 97, 245, 130, -53]
4398e3J42J97l23J00k08K56nJl3j40Q4j15K22l45J52Q0k53L07k26j52L66k89L93
4421A58k19J5K23m82K77P4j48k7J23N3r7J55k47J08J00j36J00j56J54q3no6L32
4444B06m50J88jq1K7K82o8k17O8L2J24k46L17k17rN2mJ04q5N7J10p9j15J40J02
4469B37l25M2j72K38J33n9l67Q9J73k46J18n1K88M3j00r7JK19j90J7Q4j0n2M3
4493E6k09J95j90J01LM5O1k23oJ99O4J2L6k20K10k05J03J83q1j61R8k96K53j07
4517g9J6j37K73o4k7O8M4j57q2K5M9P7j16n9J63J71J21l07j03M34l45J00n9J03
4541A09j4k8K4KL8k04Ok4K9j02K42j07m4k09K07q1L09l68J79K4J75o2k04P2k16
4566b47M01l42L03m8o2m2J27j06j64N9r7J75J92p1j4K7r4j6K3K1P6m2l3j03J56
$$ y = [-53, 89, 286, -37, 63, -145, 111, 106, 107, 74, -66, 18, -97, 125, -220, -68, 12, -241, 66, -160, -312, 54, -235, 158, -61, -46, 177, -305, -28, 46, -102, -129, -6, 47, -50, 105, -142, -34, 66, -70, 30, -126, 28, -55, -60, -126, 206, -244, -56, -57, -138, -111, 171, 103, -114, -46, -14, 110, -136, 181, -36, -45, 7, 3, 107, 22, 79, 189, 110, -5, 135, 237, -88, -46, -218, 20, 153, 94, -273, -184, -11, -257, -139, -190, 98, 141, 41, -56, -55, 164, -26, -9, 75, 65, 13, 56, -153, 42, -148, -47, -44, 1, 62, -161, -167, 32, 96, 108, 144, -76, 134, -71, 32, 215, 134, -27, 71, -225, 28, -79, -63, -200, 73, 9, -18, 50, 94, -63, -145, -120, -71, 6, -110, -169, -6, 165, 286, -21, -124, 310, -35, 65, 6, 109, 95, 67, 91, 93, 131, -73, -67, -91, -62, -164, 78, -29, -73, -282, -75, -156, 153, -215, -36, -12, 163, 101, -103, -31, -247, 154, -188, 115, 67, 5, -37, 90, -16, -180, -121, -218, -43, 149, 78, 64, 91, -3, -19, 4, 25, 101, 59, 26, -77, 79]
4591G9j83j46P0J03R9k71K35%j89K94R1k20PJ38n5j34L5k23K79r1J81l06K64O3
4615A20j02m4l2K95m13j3K70l80J61K48M0j93P4P2J90k67j23j26J08K68j42J96
4637B07j85J39l50J33K20l21L9M3Q9J68L3r1p4K63l81l8K06L9k0q2j03O6J4j25
4661a11L6J72j79P2N3j08J20J98l48K43o4l93K07L14p4k02J50J29k18n9R3j61
4683a30K02R8k45KO6k0k4q2J38j06J26j41K1O7N3K32l46k1J30M6j23j35L73j34
4707D7k00K02q1N3J94k36r2q7K91k62J91K05k95M1j97L12j38j8J78N9m6j23J05
4730A03K52l71K5j54K02j2J05j10k4N2k18J25j3KJ14m2l02kJ32K31o4k3N7l6j42
4755a13K52Q0k44J70k58J30j68j4o7L10n9jJ69l61K8n2K26r0j61N5L80m18Q5P1
$$ y = [79, -104, -250, -180, -77, 22, -249, -14, -14, -203, 91, 182, -38, -31, 107, 52, -82, -47, -270, 9, -82, 99, -207, 57, 120, 18, -26, -58, 237, -176, -189, 81, -299, -138, 110, 150, -43, 31, 103, 293, 26, -97, -223, -115, 153, 11, 207, 22, 161, -189, -56, 164, -157, -118, -75, 14, 182, 215, 124, 50, 313, -68, -106, 100, 139, 119, 37, -66, 0, 14, -111, -75, 97, -82, -10, 43, -65, 55, 253, -95, 148, 84, -309, -102, 212, 138, -64, 86, 215, -3, -62, 31, -130, 72, 170, -75, -73, -7, -27, -51, -133, 5, -101, 25, -116, -95, -28, 25, 257, -89, -110, 20, 66, -57, -192, 181, 47, -153, 49, -32, 21, 215, -21, -113, -200, 91, -171, 20, 225, -70, -29, -226, 86, -52, -70, 108, 167, 121, -2, 103, 355, -16, 9, -145, 57, 45, 150, 40, 16, 68, -150, -25, -38, -36, 78, 36, -266, -268, -136, 95, 31, 8, 65, 29, -113, 139, 219, -25, 145, -113, 17, -151, -165, -232, 78, 19, 18, 187, -174, -146, -198, 28, -62, -223, -168, 212, -206, -121, -50]
4779e0O7J9J15J06k90j4o2QJ56k5j14K88L6k28m0K15J3l31m6J60M5K00j16k38
4803a26J57m3O9j4n2l7J01j48J68k84J29J20J77k70jOJ5J15j11K11m06K69j98
4826a53J99O9j36QL7l3J48k69K03o2K39j28p5p8MM4j06J82k4p6j09K4n0J16M4
4851A8j7J61N3k94k22K03j4M0J7J88j87L5P4P5k22K55q0J68j21k40N8J14j75q7
4875b00L10j09K2J04o1k14L56j56k64M57k37Q3q2N7j53Q2J42J25j68j17O8j14
4897f9J26j03p9K70j89P3J15j98L3n2L8r9lJ15J27Lj75P4K60k09j47M1K71P0j66
4922A27m8j93K18K1P2k95J11K35m01O7R5J19O1l24K85j84K9l45K25J60j37K19
4944A17j27N1j46J00lj27n8M38j33m1m8j98J43j58J52L8j4J53j08J01k98J55j43
$$ y = [-50, 17, 36, 151, 257, -33, -47, -109, -101, 55, 30, -84, 204, 240, 12, -28, 187, 200, -131, -177, -17, 28, 228, 112, -126, 31, -12, 57, 43, -9, -46, 55, -93, 75, -209, -80, 40, 217, -53, -54, -48, -33, 82, -29, 182, -224, 45, -153, 46, 115, -21, -13, 24, -9, 139, -130, 73, 11, 250, 122, 47, -31, -27, 17, -89, 93, 69, -7, -116, -92, -142, -26, 18, 1, 162, 215, -79, -301, -98, -112, -72, -55, 133, -54, -19, 55, 130, -92, 163, 83, 251, 130, -110, -52, 62, -113, -200, 110, 1, 23, 127, 66, -148, 208, 52, -212, 245, 8, 91, 9, 66, -87, -5, 137, 262, 94, -23, 45, -69, 57, -46, -125, 145, -44, 29, 144, -54, -21, -73, -35, -134, -137, -22, 105, 108, -67, 7, 267, 58, -89, -48, 223, 293, 127, 79, -114, 104, 125, 197, -98, 13, 248, -153, -86, 9, 128, 189, -135, 150, -34, -5, -350, -125, 35, -102, 117, -10, 41, -105, -5, -8, -135, -193, 245, 112, 71, 23, -175, -32, -190, -38, 0, -14, 139, 31, 132, -166, -11, -154]
4967a54L50k49o5qj5J22J7J51j12J02k46K39j95q4J55j44K84J40m45J14N7K09
4989B23m78J76jj30lK57q4R7O4j88k19J95J21M4K6j8k68K20Q0o8j05K56l33K46
5013A10j47j20J92k31j39J51Q5j13K03k18J23N2J32J0p9M0j14k1K37k28K06K26
5035C57r8j37k91jJ59k13J87L1p3j34K71J5Mk81K03J6R2p8q2K71m36L44l36K31
5059B1J4j54jQ4K67k64R7j39R2j90M00l48n6J80J88l20NK1J05j17J37J89k21J5
5083EP2l9J4k71J83K51j57j84k4J04O0J71k93K25n3o2N4n5o6k38K92q4J10j64
5107a49%J45j64J51j2Q2J15RQ8j32Q5j53J5K3l84K24K19J61j21j71r1N0j4L8p3
5132e9R0p8j30L00Q9k33j89J37J60k65L16l59M17k16j03N2J33k34K31mj66j31
$$ y = [-154, 196, -53, -118, -126, -141, -19, -2, 149, 37, 139, -107, 132, -63, -147, 8, -136, 148, 288, -157, -43, 14, 223, -255, -79, -80, -210, -213, 44, -40, 57, 121, -67, -286, -91, 30, 74, 100, 82, -186, 34, 114, 46, -59, 197, -136, 110, -37, -157, 35, -196, -335, -184, -99, -212, -9, -227, -104, -52, 80, 90, 11, 51, -63, -84, 153, -75, 131, 357, 259, 122, -169, -170, -11, -224, -37, -6, -79, -213, 58, 73, 77, -204, -1, 15, 107, 29, -53, 218, -218, 126, -210, 21, 35, -119, -120, -36, 231, -33, 64, -75, 17, -173, 227, -121, -177, 3, 191, -129, -124, -103, 2, -115, 22, 211, -10, 5, 77, 38, 52, -219, -36, 215, 58, -126, -150, -46, 14, 185, -108, 117, 64, 2, 56, 1, -65, -303, -11, -95, 15, -149, -149, -4, -168, -17, -29, 53, 168, 177, 265, 133, 218, 65, 80, 103, -281, -57, 162, 323, 202, 31, -60, -10, -24, 14, -59, 31, -47, -177, 123, 212, -21, -210, -73, 87, -178, 138, -221, 196, -20, -123, -71, 62, -172, 59, 55, -111, -242]
5154b42K04kk3n4j9P6J10J10k72J75J0k09J73L0NK6k70M27l72R2o5J02J72j50
5178C4N4j30J15j21N2j0j20K16l8k24m2K24p0RK04J23l73O5L7l1o8j7K96r9M6
5203A32j78L7K08m01j08J80M53n00L02M2k70J68K9ok46M1N95l41l47J02R4n5o6
5226a35RK25j04j60L36k13M0k9q0J41l19L09P2j63M9kj89L06K90l77O6j29K93
5249B36k14k36J48q0J46R1j03o5R0J04l36L32K0k63R9o0J13J03k31J06l8L05j42
5272A25p4L5j7M9q9O5p7j47L0j9L6N5J01n9%K03l93J42j91J36K81j98J22j26L3
5297B3q7l0L42j25n8Kr7J10j1J2k80L88k31J2j57K55j85nK67J55k87M3l60L40
5321C6K65m24K16k05l7J00o0K64j80J33k3p5K3J02j48o4J52J03j15l8r7N8K90
$$ y = [-242, -38, -40, -63, -117, -136, -60, 50, 160, -112, 63, 73, -136, 37, 67, 72, 98, -172, 255, -117, -25, -90, 12, 184, 34, 88, -42, 73, -48, 4, -6, -126, 90, 52, -172, -214, 10, -60, -51, 153, 276, -97, -32, 5, -26, -94, -111, 185, 86, 132, -46, -9, 199, -202, -310, -130, 323, -177, 125, 167, -103, 65, 94, 88, -158, -117, 478, 137, -210, -108, -14, -69, -135, -126, 99, -5, -165, 171, -42, -2, -31, -111, 30, -289, 20, 92, -71, -22, -24, -213, 93, 383, 6, 72, -57, 236, 22, -214, -66, -146, 0, 91, -12, -77, 13, 117, -219, 113, 133, -130, -31, -91, 22, 125, -106, 0, -38, 267, 125, 51, 86, 69, 118, 29, 94, 17, -130, -100, -119, -83, -28, 73, 14, 14, 217, -176, -34, -225, -89, 192, -6, 116, -10, 23, -64, -94, 248, 123, 65, 67, -30, 80, 69, 81, -199, 189, -42, -30, -187, 68, -117, -122, 145, 300, 13, 56, -304, 36, 301, -123, 93, -112, -149, -49, -109, 155, -25, 108, 85, 10, 33, 135, -13, -77, 75, 178, 63, 25, -72, -14, 276]
5344B76k25j77R6k20L81m6l1O6k53J60K6p2j58R5J19j11k09L15k77L56j3m06K46
5367f2j69L62j58j19J31jL2M0N2j48k9J87l46N4N6o6M8J43J93j90k31K86L3k64
5391a66J38qJ36k69M53l24K35k45J32K03m65L71mk89p4K60k81J53J41r2Rn3O3
5414B4m5K7L1l6l4j37L29l62K46J78m18K75j42K76n9l03P0j98M23l73J65R8p7
5437d2K1j99K99l7J09k9l32L37k0l5j70J20k29J40J88K34l56N1m0N0j02n3K0k
5461g7K3J14k07J92RJ61p7k02q9K82k8j05j92L19j10n6J15K1j19n0K06O8k04J00
5485I4r4l2J66P4j26l64J62K24J20k72J91k2k49K93p5n3p4J22l7j18J18L1J01
5508A80k24K7p2J63o7Q4J77k84k2K92k85J06p2j16K0J48k2j12PJ79k15K1mq8P2
$$ y = [276, 51, -126, -30, -250, 131, 85, 54, 120, -133, 27, 53, -19, -177, -82, 37, -74, -283, 32, -245, 111, 98, -308, -62, -231, 131, -27, -146, -15, -16, 16, 56, 108, -40, -69, 118, -228, -174, -118, -184, -136, 7, 200, 10, -221, 65, 98, -166, -28, -36, 100, -169, 284, -40, 195, -50, 82, 285, -180, 191, 187, -102, -176, 84, -197, -44, 97, 5, 14, -39, 24, -21, 6, 37, 1, -33, -170, 159, -203, 43, 221, -197, 78, -64, 212, 153, -150, -80, -278, 145, -228, -63, 35, -42, -21, -220, 79, 42, 151, 122, -210, 127, 107, 72, -98, 22, -207, -67, 121, 355, -1, 50, 10, 60, -42, -95, -75, -77, -54, 60, -147, 45, 54, 215, 138, -64, -153, 129, 101, -4, -196, 123, 13, -43, 72, 93, -26, -76, 130, 198, -6, 94, 0, -32, 134, 208, 82, -282, -120, 104, 224, -48, 143, 121, -128, 165, 90, 37, -37, 85, 48, -70, 48, 79, 180, -44, -17, -89, 74, 7, 91, 268, -16, -38, 254, -31, 75, 3, -113, -93, 55, 33, -79, -72, 107, -108, -87, -91, -179, -107]
5533a07J86K51j23Q9p2j76r0L5MK56j40j65R2RK9k13k3K1J95j59O6R8O9m3m6R
5559E2J9k08L26o2q4k7J33k66O5N4N0J25l0j25j42QJ89jq7L4J41l19J84M9k28
5584a50K66k15K57j31j8K14k69N9J25r7q0r7J99j57K49K9m30L63Q0J70l73M2K7
5607F3k54L64j93J19o4J50j50M7%k24O8J44K3j0j14j16M5K54k42L9M8J36j76M4
5631Ak8N3J49k46J50j94M9k58R9L37j22J50j61qP7j12m6J14M8L0J86m63L68n9
5655A14M2j2j78J38nP1k26J01j66j5R0L6j06J34K3O5mj19M7l0m8p1k6O8N8J04
5681H5k55K65n7j07J6K82k04q5J95j34L6R6l7ON5Mk90ML75m22K02j77n5J91k20
5706b31K47N5J14L7j61m4m5M1k2J10L2j08J75k93j92J08Q2J12R4r4j08K78p9o2
$$ y = [-107, 79, 330, 207, 296, 224, 48, -42, -7, -3, 253, 113, -52, 40, 49, 78, -135, -158, -137, 58, -101, -35, 63, 132, 89, 43, 52, 71, -137, 189, 127, 43, 16, 149, -117, -52, 2, 52, 177, 147, 22, -120, -112, 77, 76, -11, 23, 164, -155, 29, 78, -150, 116, -99, 158, 27, 9, 223, -46, 13, 138, 41, -39, -136, 63, -94, 155, 184, -246, 117, 197, 367, -6, 36, 63, -191, 173, -20, 99, 35, 185, 35, 82, 82, -142, -74, 70, 93, 83, -31, -147, -102, 152, -90, -51, -3, 133, -43, 1, -27, 26, 175, -71, 79, -115, -66, -324, -225, 112, -10, 140, -21, -29, 48, -64, -110, 4, 52, 82, 268, -195, 173, 114, 156, 144, -34, 104, 99, 170, -56, 45, -121, -136, -46, -10, -116, 18, 41, 106, 102, -17, 30, 0, -48, -119, -145, -77, -19, 85, -170, 95, 38, -69, -53, 229, 25, -60, 135, 1, 37, 133, 96, 102, 157, 161, -129, -125, 250, -172, 30, -147, -202, -11, -231, 16, 71, 185, 222, 61, 17, -28, 13, -9, 101, 133, 25, 200, -93, -285, -177, -95, 17, 111, 17, -91, 187, 108, 46]
5730D6J16j9J36m27L27k26J56K1j48J73o13N28j41r4K66j40J20j04q6K3O4R4k92
5753b20Q9O3P9k74K92r7j92J4M56j76r2K06k77J52j59J54p1L19l12Q3N4k64J42
5776c1J00l02K48O2K39m92N5P9J85j46K1NR1j03R4L4m0k48J94q5J15n5N6R4M6
5801B16j67j14j7K37q2J02l75R8L8K13p8j77J12N5j81L22o5k01L2J57r8j52J84
5824E9k55K13j25K23k37J18N8j08nj40l6J37k14L44k52O5J88j85J61q1O3m7J9
5847c7J47p0J10J0l20n6J87N2k52J94J87j67NL3O8j8j73J22n0r2M5N7l8j41J43
5872e4K26k04R5j40L55r1l85L69n14L97J34k76J40j99lM01l24L29j76o5N4Q6k74
5895a19oJ27k03J02r6L92j73k01L0L66q6k6q6J07j0k74K3N7j01J72J76k35p1K99
$$ y = [46, 162, 143, 279, -148, 179, -47, 109, 130, -18, 155, -458, 70, -71, -165, 101, -39, 81, -23, -109, -86, -22, 72, -220, -131, -68, 11, -263, 29, -68, -260, -246, 210, 34, -58, 148, -129, 23, -136, 18, -53, 266, -46, 37, 91, -173, -31, 69, -233, 15, 77, 316, -176, -121, -42, 143, -3, 18, 23, 114, 11, 105, 139, 99, -149, 45, -40, 75, 20, 76, 170, 216, 49, -65, -82, 155, 73, 175, -200, -102, -64, 149, 71, -106, 6, 61, -120, 202, 137, -64, -32, 125, 27, -125, 59, -196, 17, -108, 115, -122, -4, 54, -54, -59, -199, -235, -98, -312, 32, -220, -155, 33, -152, 9, -72, -9, -56, -37, 110, 40, 150, 160, -160, -216, -29, 23, -229, -35, 152, -15, -10, 23, 91, 73, -100, 22, -28, -120, -75, -18, -56, -197, -54, 172, -32, 63, -77, 278, 187, -198, 171, -343, 54, 188, -88, 52, -147, -150, 251, -73, 256, 80, 15, 69, 155, -119, -125, 2, -201, -99, -195, 197, 24, -177, -147, 219, 133, 107, 21, 128, 118, -156, -133, -76, -177, -5, 171, -64, -135, 164]
5919A64l49K25k56M44n98J51K84r0n3rK47k96L77k13l19K53k0j41L63l28R9j5
5941h0K17k17J69k65J64M3j3ll9p1J03k6N4j40J02J75p0j21n6N4MJ0K0J36j30
5966B0J5r2K26m01J09K82j25l16M32j23J94l74J53K59l36J65m67L38N6r7J39o2
5988ej89j5O5jK31j03l8q6kK77l5m9k0j11q9K53K05k71J7Ql3K4Oo5J32k42K40
6015A04J59j60j1k12p0L08k65J34Q9k24N4Q3J12k19N3qR6J64l03Q6J35J79j95
6038H9n5K5j63K3L75l14L6p5M2l3J11j91R9p7J79K2l05K50k18J90NR2l37L87k95
6063a38J5L09r5p8p1J22Rr9J04j40L5P6K1j84O3J43j65K41l5j86mlj23J83K94
6088B94k33j43P7J11k37J61l9%O7j59K37j66j8K21k05j35K06R0n2j42L60j59j03
$$ y = [164, -185, 40, -216, 228, -370, -219, 65, -25, -78, -87, 160, -136, 241, 28, -291, -38, -58, -199, 164, -164, -65, -80, 137, -80, 89, -176, -12, 31, 18, 15, -24, -95, 8, -18, 36, -104, -2, 173, 103, -18, -74, -20, -16, -6, 14, 150, 20, 35, -57, 169, -232, -123, 159, 34, -282, 150, 27, 221, -153, 0, 259, -77, 88, -379, -41, 15, -82, 57, -5, -194, -209, -144, -145, 86, -17, -55, -141, -143, 134, 99, 50, 30, -81, -170, 83, 288, 17, 34, 42, 9, 33, 39, -26, 106, -136, 104, 263, 103, 92, -120, -190, 118, -147, -13, 76, -148, -94, -11, 101, -118, -65, -73, 23, 187, -116, -30, 105, 284, 89, 34, 59, -104, -81, 294, -20, 16, -59, -17, -50, 61, -130, -31, -108, 71, 93, -212, 38, -180, 10, 15, 107, -230, 157, -138, -123, 186, 91, 13, -58, 64, 73, -26, 78, -62, -27, 49, 70, -114, -51, 92, -73, 168, 133, -53, -57, -60, -183, 0, 294, 61, -82, -5, 106, -131, 30, -9, -9, 58, -101, 136, -30, -48, 173, -32, -167, 39, 129, 77, -65, 295, 136, 33]
6111C3j60J94j6j57j00K90n1j64R4j8J60j30J6mj85K52j77J70L5k07J12l9J67
6134A15p1O4q2M5N2l21K87j66J35l23L95k5l04Q4J28j7N3J75k18l9K4K25l17J52
6158E1k70L24kk00J08l4kN0rK3k03Q7J92QJ18l25K0rJ52j40Q8q4K3Q9j21L99m89
6185a56K17j73K61j77j37P0j31K79j12K06p6k27M2j01N19j12k00Q2KM7l03J8K48
6208H6j17l0K11k51J98k42K99j06J8q8J07j56m3K29l28QK3L10j36K31n4k31J91
6231A29P3l44J19o6J55r8O2j0M3j32K35j37k70J35m1K52l2k59K14R8k02K03k60
6254a33Q8J42K9k68J97k57J25J98k19j41L37k43M4j40K64o2J81Q5k81k1J11j58
6276a22Q7J20M5j44P8j79J72l4k7p1J51j35N3P1J5r0Q6J05j48L0j7k13K28N7L7
$$ y = [33, -127, 67, 51, -106, -206, 84, 33, -131, -37, -55, 105, -25, -9, -13, -198, 54, -123, 47, 82, -125, -13, -52, 115, 44, 108, 26, 71, 123, -198, 89, -77, 58, -265, 130, 105, -199, -115, 13, -4, 49, 224, 6, -33, -9, 216, -101, 51, -219, 105, 103, -97, 11, -23, -25, 25, 16, 39, -164, -77, 115, 123, 241, -84, -64, -73, 79, -61, 27, -57, -34, 55, -66, 333, -156, 61, -112, 149, -28, -165, -95, -226, 53, -59, 147, 71, -156, -114, -215, 304, 192, -8, 74, 76, 123, -180, -162, 86, -31, -61, 150, -101, 97, -145, 154, 48, 66, -22, 85, -71, -114, 115, -213, -205, -182, 128, -8, 223, 169, -62, 129, 202, -142, -23, -89, 66, -32, 30, 20, 63, -69, 166, 29, -241, -106, -147, 105, 73, -186, 28, 126, -76, 127, -133, -45, 97, 126, -142, 55, -202, -77, 121, -98, -239, 98, -145, -101, -241, 23, -39, 142, 227, -54, -75, 36, -122, -35, 85, 130, -14, 64, -115, 57, 23, -4, -75, 76, -59, -6, 65, 80, -10, 76, 181, 33, 63, 46, -167, 61, 118, 155]
6301A55l32K05k48K85J1M7p6j34O9j00K63j85J01k31J93Ol08L00L9J54j45j71
6323a02J79J28k79p9J49J06k81J72J42j33L0rl2Q6L3Q9k30J13k48L32k51J82j31
6346c4p1K22j38m7J25O9k58R9J47M0k34K97k29j09P4J4N8j16J07k8k3L36l78J24
6370D7M5Q2k81J56M6k06J47k2m1J57p1n6r4K84k94j11O38l72j55K76l01Q4J72
6393A30j29n9j26J51J02J63k85m4j32K38j62J43K22m6j59j04M27m82J43q2J26
6414C5m8j21J49j8l04L69l8j47J53n7o3K2K7j97L70j43J28j19k21K33J83k24j19
6437a50K89o1r0K67k50j3J33o0R6j31j56L00J33k86J21k50K98l6l57L91j96p8
6459h6J83n0kJ2p8j3N9j99L09m5j5J02nl4j29k1rj63L82j82m7Q3j41K56J54j09
$$ y = [155, -177, 28, -220, 65, 76, 123, 47, -87, -18, -118, 145, -40, 61, -170, 23, 29, -279, 21, 60, 214, 69, -102, 77, 205, -74, -153, -4, 102, -179, -7, 135, 2, 32, 23, -9, 77, 110, 199, -31, 82, -166, 166, -85, 97, -34, -105, 117, -21, -68, 57, 126, -132, -33, 114, 154, -80, 217, -12, -121, -47, -33, 25, -91, 16, -12, -35, 301, -77, 47, 92, 174, -107, 49, 95, -111, 36, 14, -27, 130, 59, 3, -91, 193, -101, -212, 426, 54, -101, 175, -126, -42, 130, 1, -58, -184, -33, 69, 232, -53, -97, -229, 9, -153, -10, 212, 166, 7, -97, 330, -152, -9, -91, 35, -13, -134, 15, -3, -307, 62, 24, -123, 30, -27, -90, -68, -41, -238, 132, -11, 117, -2, -223, 10, 193, -31, -150, 139, 78, -12, 255, 5, -8, 125, 65, 161, 30, -126, 174, 307, 21, 142, -108, 190, 154, -203, 188, -8, -86, 97, 47, 45, 57, -21, -34, 25, -174, 135, 90, 75, 177, 172, 138, 9, -12, -21, -184, 198, 16, -31, 52, -89, 167, 321, 212]
6485B12o7n62O19m08L54l3l89K05J02J07j86N7q9P6o1J7K35m32L61j1J3M8o6K17
6509C19k76k65M42k35j25K9M0J47m7MJ5o4K12j63n4M9j90K10j61QJ0K44k87J69
6533C1l9k64K22j85K44J3j9q3J10K38J1m47P7J23k50L75j43q0o9K64q9K6O0k26
6557a00K73j93k13J73n2L13j24K0j29M6k57O9L60l33R2j58K28J32j72m7J0n9J78
6580E7j64P7J77j65q8o6K8J31J22j79j69L62l12J84K26m25K19O9k66K19k51O44
6602D30j97k59K25q7j67MK48l00J83q0j53P3j08J15K65j79k2j79J55K87k54r5
6624i5J2n6N8K45l30K36lR1q2j77j5L96l28j02Q4j3R1K6Q7oj6j40k8K61k02j84
6650a90J29K19p7j67K16J12k72j64K20M1q1K93j30J20k54j43L59k91m9J67k03
$$ y = [212, 145, -417, 202, -206, 148, 115, -274, -69, 33, 140, -46, 11, -78, -2, -63, -46, 189, -243, 118, 107, 120, 168, 102, 319, 43, -222, 220, -15, -140, -111, -71, 76, 29, 33, 48, -16, 196, 33, -21, 28, -162, 48, -113, -105, -95, 149, -138, 31, -8, -272, -50, -235, 9, 22, 3, -80, 30, 268, 279, -168, -91, 32, -218, 157, 14, -66, -135, 129, 40, 66, 126, -100, 173, -20, -233, -60, -112, 201, 77, 97, -32, 14, -243, -174, 186, -147, -55, -213, 15, 147, -25, -72, -62, -121, 57, -107, -30, 147, -18, -106, -172, -144, -13, 109, -70, -239, 123, -189, -5, 221, -204, 15, 84, -182, 37, -214, 430, 233, -26, 199, 112, -55, -51, 197, -103, 80, 0, -153, -80, -188, -73, 192, 13, -9, -188, -33, 254, 0, -95, -83, -139, -81, 164, -166, 70, 67, 158, 76, -101, -116, 280, -48, -150, -66, -79, 12, 38, 125, 119, 103, -37, -65, 196, -6, -190, -61, 158, 81, -86, 130, 242, -30, -194, 26, 67, -14, 279, 149, 269, 15, -128, 231, -60, -109, 58, -145]
6671a45J22L9J3j03L20j85n8L56k37j36j36J80K43j09j23o2L20m59J89j16j45
6692b32L58p2R7k93L50l32M05l36M5J95k76R2p7J25q8l5K04j7j78K90q1P3k38
6715b1R5j6j38j61K73O6k33n3K29Q4k53J27P5j29K1J3O8p7m1l3J69j99K62q5n5
6740a2r4J66M3k10q0K42J20k67K53j06Q6j32J26j13L7P0j93n6Q9R0J13k07K04
6763A69o5k32J26L2Pp9J40K7j20l6j31K20j00R9j11K36j32j4J21l05J96Q8j91
6786e5R1j99R9J8n8J44j3j39K44l3p3k18J86n6L8L46k28j82R0j24j09M16k11J70
6810A44j59L3Q0Qk47L91m8j44r5K7Q4j91m8K61j41j84L24k10K3J58J39n50M10
6833F5Q6j92j60o5J41L9N7J32P6l01M8j76L87l04K96j48j24J36j39J47j42M68
$$ y = [-145, -23, 16, 29, -74, 246, 61, 3, 359, 122, -14, -150, 30, 273, 164, 41, -21, 299, -160, 29, -87, -232, 126, 54, 151, -142, 208, -124, 281, -55, -10, 185, -91, 1, -76, 49, -39, -74, 130, 113, -65, 225, 144, 217, -21, 74, 58, -80, -241, 32, 98, -135, -188, 41, 125, -128, -1, 74, -55, -34, -21, 47, -30, -71, -104, 65, -134, 128, 43, -12, -106, 60, 103, -107, -187, 55, 175, -92, 161, 55, 141, 9, 135, 22, 59, 129, -64, -120, -31, 59, 172, -35, 169, 104, -128, -2, 30, 37, -42, 98, 125, 5, -31, -162, 58, -42, 57, -54, 182, 50, 36, 157, -148, 48, 136, -55, 36, -163, -64, -46, -104, 40, 27, -112, 132, 99, 26, -192, -6, -62, -24, 322, 94, -88, 2, -122, -231, 185, -26, 144, -15, 18, 98, 106, -141, 250, 202, 58, -37, -10, 74, -117, -165, 96, -45, -229, 95, -115, -92, 66, 205, -345, 65, 151, -41, -201, -266, -125, -86, -29, 103, 179, -122, -74, -250, 137, -167, 129, -19, -143, -7, -146, 1, -141, 327]
6855C27m36L6K20k13lJ97k39K11J9j74j1J9O4J20n0L6k14KJ91k69j11J63J77Q6
6879A48n8k3k09J42J15k83J85r5N5L2j24j4J7j97K37M47l47j04J62j88m3J87Q4
6902A26k08k8K78l03J13K2R9q4J59j27q8O4o8J38j02J02m7Q0l34K07K14k17n0
6925e4k6R8J14J2j25j47n0JR7k6n2Q8m3J08j52J33J47r2r8M25q6k59K8j31K45
6950A55l21J18k14K05n4J72l11L00oRj08j9M8Q1O9n1j5r5J45k27P7J18j56m5O2
6975f3K2J13q2J64l08J84k6J23j82jJ85j43r6M2K05l52K56M2j70K19k18m2N9n5
6999a24K12j71L61l53m8J13k11R2l4K7J13N8n6N9oN9j57J43K07q3j19k23J68J33
7023A60p2k69Q1J89j48J33J53l46J33P0j25J29o7K53j37j99O8r8L2O7J02j08k30
$$ y = [327, -109, -73, 147, -66, -69, 128, -111, 100, 119, -55, -66, -47, 17, 137, 87, 123, -91, -89, 102, -167, -278, -115, 62, 148, 90, 67, -142, 0, 115, -168, 17, -78, -23, 9, -115, -129, -112, -309, -72, 375, 28, -76, 86, -102, -145, 42, 126, -82, -110, 168, -135, -22, 0, 99, 15, 174, 47, -41, 23, -45, 93, -9, 93, 46, 126, -208, -1, 213, -4, -54, -80, 18, 132, 144, 19, -128, -178, -177, -80, -106, -158, -70, -113, -5, -157, -24, 123, 31, -67, 358, 272, 13, 41, -90, 155, -166, -48, -262, -57, -111, 61, -250, 50, 44, 53, -55, -74, -26, 55, 124, 73, 58, -37, 108, -119, -42, 76, -80, -125, -63, -41, 72, -10, 154, -154, 30, 4, 127, -55, -56, 129, -14, -110, -68, 137, -215, 41, 83, -87, 132, -86, -128, -69, -124, 88, -83, 278, -75, -123, -10, -221, -129, -163, -136, -23, 35, -21, 38, 32, 91, -66, 77, 284, 201, 82, -141, 27, 160, 88, -181, -100, 89, -59, 74, 227, -119, 14, 84, -41, 88, 21, 274, 137, -62, 6, -92, -60, 7, 109, 1, -229]
7046b29M31m27K75j89P0J46K21l82L0J33j9l1j11P2R3J16k06K4L5j97P4k4J53
7069E8k0m8K72k32J56j97P3OO5j30K6m0J83k07k8R0J57k29R1k5j32J47j14P0p2
7094h0K4J44p6j36K39j14l7q7Q9j69J75L65m85K12r1J8k49K67k9j83J68k3M7j29
7118a40J91L4k09K44k74J54J22j1m1J15j69jK32k17m0m1O6L3M6q5j80J75K58k55
7142GJ7J12j85k60N27j73r8j70L48r5j62K72jJ5k65j35K83K45m09J34Q9l49L98
7165A45k53K58j06j12O7j98M63P4m69K24P7r4j46R7l5k07K57Q8J54m51L46j71
7187Hk69N5L73k81N4n3K22r1j2j88L08r2J2R8j57K46r6j69O8j40J56m1J71J1l09
7212a16J44r8L00l22j31P8J8O8r0J42K16l19K34k69R7J51r7j47J20M5l79O51k28
$$ y = [-229, 202, -225, 50, -139, -69, 77, 298, -84, -54, 79, 60, 29, -82, -10, 83, 199, -7, 17, 52, -145, -71, -95, 58, 38, -10, 262, 30, 186, -11, 62, 68, 133, 3, 29, -11, 172, -35, -63, 27, 184, -45, 46, 21, -111, 36, -78, -8, -80, -56, 88, 12, -124, 115, 1, -36, -123, -34, -203, -28, 337, -148, 64, -27, -9, -258, 9, -20, -203, -35, -58, -11, -140, 51, 85, -124, 120, -154, 0, 122, 111, 70, 185, 16, 15, 247, 30, -10, -51, 15, 48, 94, 9, -171, 4, 262, 7, 24, 136, -49, -309, 218, 45, -53, -223, 125, 30, -132, 140, 139, 154, -111, -246, 37, 282, -127, 7, 96, -253, 145, -108, 150, 44, -68, -1, -199, 264, 338, -131, 93, 170, 76, -70, 27, -8, -215, 42, 130, 284, -167, 179, 8, -261, -206, 167, -114, -60, -113, 109, 18, 6, -182, 126, 34, 46, 144, -13, 233, 137, -32, 36, -104, 52, 11, 182, 193, -116, 28, -70, 230, -92, -223, -145, -127, -59, -149, -7, 209, -110, 124, -145, -48, 103, 6, -141, -21, 24, -355, 296, 68]
7235F8j47n8J09j05J47j72N6P1K11j69m3J65j95o1K44j43M5p8J45p0J28k66J15
7258cO6LJ90j59j51K19j52j10J86jP7L1k59J10l14K96j42J74l97M90j82K19k96
7281a05K04r9k36K71qk18K89J99l35p3o1K21n4L5K5j94K30N9j83K7j3P7J21P2
7305B51j64J41j00j13n8K23p2n4k10l9L27k32jQ4j42K66K2oo0m3J32k59J83p1
7329Ej98L28j05k9J7k00R2J12k69K87lJ47k78N2J0o8J55M1L8p8k8n8q3K82K5n36
7355c42K49p7J17K05j05K0j33K11j6j77j01J99M2k91J87K8k90L15m4r0rK42n9
7378H1k14R4k00K66r2M3O8P0l0j87K20j7q0j0J08k03rn4J43n0m7J65j39J05N5
7403H6j82j02O2J26J41l00n2K11l3K19j4qp2o8l4r2J09J58N8k69N1r9J78j49L4
$$ y = [68, -79, -137, -28, -133, 14, -158, -102, -31, 180, 11, -32, 133, -62, -123, 121, -22, 23, -55, 90, 20, 148, -118, -3, 63, 66, 256, 97, -54, 165, 13, -97, 89, 88, 165, 196, -63, 47, -267, 29, -113, 61, -336, 154, -28, 191, -105, 99, 0, -236, 35, 27, -191, 98, 297, -38, -111, -172, 49, -5, 30, 55, -139, 91, 150, -33, -6, -19, 58, 179, 251, 87, 228, 128, 15, -43, 180, 108, 54, -156, -195, 132, -100, -101, -17, -159, 107, 129, 123, 63, 20, 152, -107, 76, 5, -193, 135, 30, 1, 18, -182, -90, 22, -247, 40, 37, 184, -94, -42, -32, -100, 55, 96, 134, 56, 28, -30, -113, 169, 194, -342, -93, -170, -53, 152, 47, 67, -66, 145, 129, -48, -149, 50, 92, -199, -12, 16, -274, 41, -3, -93, -102, 140, 81, -133, -39, -239, 27, -65, -22, 46, 116, 86, -101, 119, 102, 22, 12, 120, -83, -92, -146, -3, -53, -100, 65, -74, 31, 86, -96, -198, -136, -10, 131, -169, -221, -10, -43, 176, 162, 154, 82, 14, -20, -112, -3, 155, 213, -56, -5, -104, 74, -75, -41]
7428d1j14LJ95k02K65l50N7k6K80R1l60K25j09j07K46p0k11K52N8j29Q5k31K84
7451I1j90J98j87nM8O4K06pnk40q6K70j46j13j0qK03J59k57M1n7P0Q1k45K8Q9
7477hj53K23k9p9M8M8k10K02J98k73J1K6J0k88K89j61J38k04R1j9L6Q5k68M4L17
7502G4j80J33j51J74J71j88R9J77m92L01j60O3L1k54K24p9R1k2j31J39K08l69
7524a41K09q4J0k5K5J43j31K46j10n4p8O6K03k13k60L02O4j51k77P9M5K60k25
7547i7n4K7n4J25J73K68l24j03mJ4q7j84K33PK25r9r8K10k8q3M1k44J02J05J5
7572H6l05K33K7j15J09L1p7k2J8%J95j97m5J44j84o0K33l47n2M07L3J98m02J03
7596A1kj0O1J20k22J17j46N5l3R4k27J91J20m8P3j70J41Np6Mj6l3o4R2j63J67
$$ y = [-41, -155, -152, 43, -159, 106, -244, -187, -213, 67, 158, -202, 23, -86, -193, 53, -17, -228, 24, 82, -47, 38, -193, 91, -99, 99, -88, -93, -45, 19, 225, 218, 213, -27, -113, 157, 11, -102, -112, -120, 83, 242, -15, 26, -31, 39, 120, -125, -97, -8, -161, 62, 33, -46, 2, 50, -160, 42, 240, -33, -22, 4, 14, -274, 15, -146, -8, -212, -121, -140, -104, -19, -287, -243, 74, -106, 27, -124, 50, 221, 33, 132, 309, -183, 118, -42, 21, 52, -202, 22, -57, 34, 12, -119, 20, 228, -141, 68, -16, -6, -31, -6, 137, 6, 252, 142, 88, 10, 76, 279, 66, -194, 108, 172, 21, -256, -177, -132, 128, -97, -151, -124, -178, -53, 120, 388, 64, -39, -43, -29, -116, -300, -67, -60, 165, 66, -32, 178, 150, 67, 108, -136, -34, 71, 86, -219, 14, 41, -74, 35, 66, -11, -33, -15, -15, 180, -17, -62, 82, -102, -162, 71, -276, -328, 79, 112, 310, -92, 11, 9, -1, 60, 180, -42, 75, -71, -16, -49, 45, -182, 9, 129, 81, 154, -16, 125, 130, 54, 58, 42, 9, -55, 37, -126, 41]
7622D1j35nL04J42j44k70j36J76N1k6m7j5k1j7J10j5l7J33k11j09K62j88L94j84
7646E3QJ12l58J35k08L53l65K83Ko1J08m9J2P8n7j8r9L0no8L56j96k59K72j61
7671a02J92oo1j11J6R6J7M1m0j28P4Jp6J81O3n0j00j33nJ36O7K72l04j19K62k43
7697f0q9K79l45J17N3J83k26J24j59mJ20L9j36L05l13L01m07K94J34k86L28k97
7719d5J26j29K96k46L1q7m0J03J45J11l13P8k63K64N9kk5K3P4j58N8j23K09j07
7743C9k87J12M54l24Q1j36J11Mj79j46M19q7k32K43J2k30J80j23L21k32j65J54
7765a1j77K95k27J37M7j72J15j46K70l66J56K0J24k8k47k7M4K10K3J33l23j00
7787b50L43j21K11k47J94k85M6J18j01L4J00k43L00r1N9K01k53j23P3k7j40Q3
$$ y = [41, -94, -99, 205, 347, 203, -67, -203, -27, 24, -2, -49, -64, -85, -102, 8, -7, -44, 89, -122, -231, 31, -157, 237, 53, 61, 173, -185, -50, -258, 95, -270, 13, 15, -46, 62, 13, 25, 103, 46, 28, -71, -41, -46, -114, 242, 46, -213, 59, -102, 90, 84, 23, -88, -72, 24, 41, 82, 42, -86, -12, -11, -87, 94, 157, 107, 7, -126, -131, 5, 72, 344, 40, -79, 183, -60, -149, 130, -215, -98, -45, 138, -88, 36, -123, -127, -7, 32, -104, 201, -112, 189, -218, 76, 210, -76, 252, -45, 81, -48, 248, 2, 33, -54, -94, 9, 154, 265, -48, 30, -233, 31, 90, 88, 63, 86, 160, 2, 60, -63, 146, 39, -248, -136, 318, -6, 75, -61, 50, 54, -125, -271, 148, 61, -171, 72, 84, -146, 34, -89, 232, 0, -165, -11, -188, 107, -120, 17, 64, -108, 7, -139, 131, -235, -79, -59, 65, 37, -210, -237, -193, 17, 40, 173, -150, -250, 93, -28, 183, -64, 130, -155, -109, 9, -92, -58, 42, -201, 99, 8, 67, 268, 15, -108, -35, -62, -202, -119]
7809a19J42J33k77Q8k14M09j38r8rJ23Lk9n7K9l7k60L67j12R3j07Q2j07j18J06
7833a07K61j24j17R4o7K67n9j88p1L12q8j55j64J89J81j20n3J07j19K04j72j34
7855a23N5R6Rn8Pq3P0JJ70o2p7n5L3J51j32P1Q3l53K32k4pJ32j18j79J66j78K90
7882A17k54k2J25l20L70m3K60k48K42L7R1l72Q9L5k26J77l70M61m69K19L17l34
7904a18K12j41L6j26J59r2p0L38j59j85K6K04o4L9j90K72O8m58N1L52r0n1J84
7927A97p2m4J5M2q0j01K65j64RL2j91L9J29j93j22J73J04j10P2n2J60j33Q7q9
7951b7r7J50k42J27Q5k35K69J17k14K80j61J76k46O1N7l14Q0K06k6J04o8r5J05
7974I2J68k64l26J29K33r9J64oj80J54l3j09L02l32N6N1j50L21j77L1j5k49N76
$$ y = [-119, 23, 156, -121, -33, -247, 162, 24, -74, -83, 40, 43, 14, -43, -14, -51, -311, 56, -56, 37, -70, 12, -95, -213, -107, 154, 30, -87, 7, -60, 207, 148, -40, -111, 201, 113, -42, -206, -17, 164, 44, -9, 98, -21, 183, 11, -123, -68, 28, 37, -21, -14, -97, -27, -26, 144, 82, 5, -50, -17, 134, 2, 73, 156, -197, 35, 11, 4, 136, 18, -161, 5, -173, 117, -137, -159, -34, -354, 16, -27, 233, -15, 227, 264, 355, -17, 72, 107, -119, 58, -312, 149, -320, -101, 216, -118, 94, -47, -11, -137, 22, -70, -140, 198, 39, -146, -120, 84, 20, 59, -131, 141, 209, -249, -198, 154, 64, 13, 197, 125, 81, 96, 138, 58, -43, 222, 58, 67, 99, -92, -53, 76, -117, -239, -66, 38, -72, 0, -52, 108, -25, 62, -27, -124, 26, -216, -89, -4, -239, 30, 147, -67, 213, 52, 228, -18, 43, 100, -214, -134, 72, 46, 150, 82, -13, 92, 260, -4, -330, -201, 32, -67, 97, 91, -89, 65, 32, -77, 225, -107, -51, 0, -150, 171, -6, 25, 10, -239, 337]
7997C37k94J33l03K24J0k15K57k3l0j8R6k82K91o5j56L23j97LLj16R1J16k73L5
8021e3J33mK21k33J87l38j61K90q0j50R1o2qJ15L4K66k48J2q0o2J47j83pJ83K1
8046C1l1l79M49j8k47L31j32n5j02J81M3jJ21l09K31j23l0k19K54J6n4m6J17L
8070C1j0J12j76J87j18K56k25N9j79j11K31L09l08j74nK65M3j01P7j38j93P8J13
8093B3j72J68N7j57J79j68M5J33j98J60q6J43j7j77K00qJ14Mk41R8M0k48L03K3
8117B18k19pM9j02M1J32k59p1M3J16J73l41L87k51l4K33m23L86k62K91J64k68
8139dJ06k20ML3L13j29j83J16j1K52k08K51l79N4Q5J06N6j78j18l6P6K2J51j92
8163c3R7r6r2P6l7J15J36k45L65k92o8J19m6n0J29j32l4j41J70J46mj62p5J46
$$ y = [337, 43, 176, -127, 97, 107, -108, 149, 126, 96, 78, 174, -108, 183, 118, -38, 285, 88, 91, 94, -22, 69, 185, -88, -53, 80, 76, 297, 64, 251, -87, -248, 42, -38, -188, -97, -159, -167, -52, -18, 248, 0, 12, -68, -130, 17, -166, -173, 10, 31, 0, -379, 70, 52, -195, 136, 4, -51, -153, 28, 71, 70, 191, -118, 113, -10, -40, -259, -5, 11, -43, -89, 28, 31, 21, 133, -43, 144, 26, 282, 57, 116, -63, -174, 57, 366, 58, -116, -121, 144, 187, 86, 163, 25, -168, -90, 23, -149, 19, 76, -81, 98, -70, -25, 108, -90, 70, -16, 127, 110, -67, 133, 125, 239, 243, 2, 100, 140, -108, 195, 218, -1, -8, 41, -61, -20, 112, -147, -218, -175, -59, 114, -227, 160, -91, -125, 108, -315, 71, -191, 100, 264, -4, 102, -118, -114, -81, 232, 103, -80, 36, 25, 277, 69, 320, -59, -5, 80, 186, 242, 64, -54, -90, -14, 8, 159, -33, 64, -32, -124, -48, -85, 30, 166, -79, 286, -6, -74, 45, -1, -51, 78, -54, -88, -229, -59, 87, 83, -79, -154, -8]
8187hj54J58L0J21
$$ y = [-8, -162, -4, 26, 147]
8191A47
$$ Imaginary data points
##PAGE= N=2
##DATA TABLE= (X++(I..I)), XYDATA
0@%%%%%%%%%%%Qj6J6j6K4l2L2m0N1n9P2q8J04j20J40j64J92k24K56k90L30l76
33b00M27m83N44o11O86p66Q54r52J057j172J300j440J589j754J938k137K352k588
51a356K850l142L465l827M237m700N229n841O561p421Q470r779J1468j3748J7000
66I466k2045L0989n1512J82743M4781l41175J06173J52922l0003j59522K8728
77d8455J12321m479o9054j7955P979O2678m2307o4991N8610O0080n4176l6888
89c6637M2564K3180m9032J0079L4359k8004k125L7253l6264k5618M7849P839m9629
102b4186J4023M8355k8300m1961L5660J4946l8983J0542K6431j5242K079P499
114A0863j7704l177J9625j3435j9984L4211J6657m2273N769M1597l0555l2293
$$ y = [0, 0, 0, 0, 0, 0, 0, 0, 0, 0, 0, 0, 8, -8, 8, -8, 16, -16, 16, -24, 27, -32, 40, -48, 56, -64, 76, -88, 104, -120, 136, -154, 176, -200, 227, -256, 288, -323, 363, -403, 451, -501, 556, -616, 684, -756, 833, -921, 1017, -1120, 1232, -1356, 1494, -1648, 1817, -2010, 2227, -2473, 2756, -3085, 3476, -3945, 4525, -5254, 6214, -7534, 9466, -12579, 18410, -33102, 149641, 194422, -146753, -40580, 112342, 82339, -77183, -48455, 63866, 59387, -9667, -27622, -19643, 43035, 728, -64263, -5653, 54427, 251, -36637, 5927, 29107, -19925, -9846, 24513, -3491, -5616, 31637, -4627, -30245, 17604, 25443, -24186, -10163, 38192, 9892, -32069, 3591, 18537, -20446, -9904, 16527, 1285, 3364, 10863, -6841, -10018, 9607, -3828, -23812, 10399, 27056, -15217, -9448, 32149, 1594, -30699]
126c0699M0602J4715l9501P908L6635k0755k4273K4904O103k8382R370J7461j9526
139e438J80J4019j4122m756J5135o119j3732J6019R835k8537M747L1191k3834
152e412j4465L5005J400k9406Q715K5446k0791k0321L1003N392k7628J4220J3843
165A7001j8394m031Q414m001o318J0397J081j1268J2850L982k3184Q323J7743
178A2595j9132o597K4205J384k3948Q034K0819k0049j1380K5104j353k0189J1467
191I60R772j3098k948J1097k983p638Q840n88j0434Q229K601j3320P439J1523
205I452j3853m237J6387l941j8996J1254J4473j7070m169K0921l504j8141J0498
218i26R278j3807j505J2535k623o553O563P65p564M482J996q908N321P410j0916
$$ y = [-30699, 9903, 24618, -14883, -6975, 29660, 8905, -15368, 9536, 15639, -12743, -3373, 14088, -5438, -5258, 8761, -5361, -10117, 5018, -1101, -14833, 1186, 11021, -17516, -12769, 18422, -5412, -19877, 15128, 16528, -12878, -4163, 21283, 492, -19829, 11174, 16566, -11062, 3158, 17001, -1393, -5424, 2990, -1011, -7329, 3068, 4149, -7119, 5731, 9713, -13471, -5148, 12595, -6537, -13134, 11071, 12455, -11493, -3459, 17360, -2689, -14069, 11035, 9682, -10507, 960, 10732, -2366, -5314, 5783, 2800, -4838, 4002, 3414, -7020, 1209, 3810, -9510, -2071, 9452, -4401, -8638, 7749, 3808, -15188, -3934, 10539, -6531, -10700, 10221, 6717, -11424, -926, 8352, -5455, -6960, 5575, 2952, -3601, 2962, 3727, -3837, 645, 2641, -6267, -946, 6464, -4452]
233d452j423J2348m845j2357R636R508j4386k677J6798n541j2788J1267O588j1251
247c575m28J0334l165p827O743J687o873M261K913o044L317L539p631p12P410
262C949l331q066Q683N824j2245L92J2006p096q841J0057M241r554O07R368m095
277A899p042P120J399o192L012K518l823J833J866l589n77N296k818n499O613
292B016K790r751J974Q830o576n901Q803K212q549M57P885m436n504O875J513
307B638m842K191K673l246J33J956k141j03L387j412l677N035P06p352K835N580
323D361n167l016O620K64o666J348O513m853l770O190P13m775J611K744k308q50
339a041K083q36l51J789j085j928L443m26m467K684L694m482j754N370k33n688
$$ y = [-4452, -5875, 6473, 1628, -10729, -1093, 8415, -5971, -8648, 8150, 2609, -10179, 1088, 7676, -3575, -4003, 6331, 3166, -4661, 2082, 3769, -3104, 1157, 4070, -1974, 1343, 4882, -2749, -3461, 3949, 618, -7448, 1235, 7059, -5186, -4794, 7212, 116, -8725, 1332, 5573, -3981, -3374, 5994, 1899, -5143, 1977, 3376, -2816, 196, 2714, -1109, 724, 2590, -999, -1576, 3720, 902, -4597, 2016, 4806, -4945, -2971, 5859, -717, -6618, 2185, 4397, -4152, -3695, 4190, -246, -5750, 1125, 2638, -2204, -13, 2660, -586, -453, 1503, -638, -741, 2646, 1234, -2443, 2592, 3298, -4054, -1219, 4361, -806, -3822, 2798, 3062, -3604, -2256, 4257, -596, -4366, 1824, 2537, -2238, -627, 2117, -191, -1041, 1042, 206, -145, 1644, 559, -1369, 2074, 1648, -2819, -135, 3559, -923, -2677, 2693, 2460, -3228]
355c228J899M909m525k477N496m90m201J905K319k048p98J854J47j255J190k41
371D56j639K236k5k686J983K218l287r72L716r53l713K494L210l707j238L999
387B092p72l340J378K361k084r01J969K39j589P27L00r14J099n50q59J463Q39
404A458k093l60K900j312k338K256J834l266l08K609o72k353J636J472k201k04
420i42J480r9j300O72L36n53N61l8p23P18L90j616O58J433r44j249J726R00k752
439a342K82K513j450j637J777Q65j432n40J277N30j864Q86O85o07j9q1J42M60
457D45m08l20L76N21p90p98J473L80k071R01J380j091o73P87M49j169l15J696
475G73n01r55R34L09o86o42M29K48l06j0J72J11O10r07q4R58l48j112P57M87m04
$$ y = [-3228, -1329, 3580, -945, -3422, 2074, 1584, -2617, -712, 1607, -441, -1239, 615, 762, -493, 697, 456, -1183, 1053, 1028, -1658, 325, 2543, -744, -1716, 2000, 1047, -2666, -172, 3038, -669, -1907, 2092, 1320, -2020, -642, 1719, -365, -1266, 703, 942, -647, 80, 380, -534, 565, 15, -844, 619, 1458, -635, -995, 1905, 593, -1745, 511, 2345, -921, -1229, 1380, 708, -1645, -9, 1463, -738, -942, 538, 439, -861, -189, 147, -406, 155, 117, -606, 112, 502, -1114, -456, 977, 33, -1216, 510, 1410, -1342, -1060, 1453, 3, -1634, 143, 1008, -424, -964, 313, 843, -1021, -135, 550, -57, -76, -157, -15, 445, 37, -283, 93, 614, -176, -974, 499, 879, -1192, -291, 1089, -2, -675, 112, 561, -608, -923, 773, 272, -683, 251, 560, -126, -768, -339, -91, -397, -407, -235, -124, 486, -421, -505, 453, 105, -1007, -250, 237, -167]
496a67o90J241N46j620M37R71q63l66N80M90n86p6J87K70l13J94l59K43R4o75
516d62L56O32m02m00L91M24r06k44J022m24m02J78P65l01n81N54J83n32j22L48
536G7N8k81o7O29m74m52K67m7L60l17j73Q25k11o35J22N97p3o30K71P15o27n33
558e99P90N1k24j68L46J19n43J96K05j62j20J16K00J06n60N16J06m02j57K58K96
579C70k54k31L23J76m70k41M53k8m88p3R26o70k74O46j25o9j51o1M71k94p9p7
601b20K14j52k32L95K18l62J03K91o3k83J8M41j66l30J99M2l4j86K95j04j81P
623i0M1K13k16p1K18mr0k52M20j45J00N8nj51m42O56m5l98NL74j7l65J0L74r9
648G9j64j13L04J74m61K8M18j76k36O3K54m3k65L2M48l53pJ60r5k26J72N0J87
$$ y = [-167, -857, 384, 930, -690, -253, 718, -145, -511, 69, 559, -27, -103, 84, 354, 41, 235, -124, 119, 213, -462, -106, 526, 124, -276, 115, 539, -367, -611, 411, -13, -415, -237, 528, 227, -354, 200, 383, -149, -271, 77, 135, -146, -213, 416, -58, -510, -243, -290, 70, -247, -420, 405, 194, -441, -319, 278, 205, -425, -154, 561, -66, -599, 191, 242, 18, -150, 196, 315, -228, -32, 173, 11, -109, 7, 207, 313, -247, 269, 375, -27, -184, 74, 370, 116, -115, 208, 384, -86, -327, 126, 98, -390, -463, 463, -207, -481, 165, 40, -29, -180, -241, 230, -64, -143, -220, -6, -158, -390, 5, 223, -139, -36, 255, 192, -91, -73, 368, 202, -128, 71, 113, 79, -107, 188, 84, -97, -90, -49, 164, -52, -123, 95, 91, 1, -251, 169, 24, 124, 182, 177, 26, -416, 240, 195, -203, -198, 176, 159, -206, -196, 178, 79, -85, -198, 106, 280, -181, -153, 265, 89, -147, -84, 170, 127, -138, -106, 342, -11, -18, 142, 47, -179, -7, 43, 230]
671B30l32o1J78m9K2Kr4J56k12K4J23j1l5J76J08k70j41K77J30m71Q4M03m3k01
695gl6K18Q9n43J16J77j17N6R9mo4k73K21K17j23j77m8K31k19J51J71j29j69J53
719a0m1l10L47k1K41r0j41J26j90K38k72M6Q4rJ34k72K33Q4k41L05j87j17J06
742D3o9P7k82RJ98K06j77oL2o7j78N02l08j11J72J57j99k6L1J11l9j57L71l48
766e8J27k27J85M2Qk9j14J62j16j66K63j56J40k85N09k41P0n0j19K99l02N9L0
789C1K6oo2J30M5j31j52K02n0K3q8J33j55J10N5l31J90J11j2k21K41j55P3J09
813A16j57L6K19j48k81L12j07j43M7J13R0M7m88L84P8l33K75N3j2k55R9k01L88
836A32k31L42k58J02K2J82k85k25R2J84pr5M4j8J48l37L07k01Q9J10J9L9j38j31
$$ y = [230, -102, -163, 15, -34, -12, -10, -104, 52, -160, -136, -13, -24, -59, 117, 225, -45, -186, 91, 221, -250, -166, 237, 194, -7, -43, 175, 264, -279, -163, 14, -103, -47, 52, 48, -16, -289, -68, 149, 26, -151, -199, 32, -187, -36, 135, 6, -163, -10, -51, -361, -14, -35, 206, 116, -25, 101, -89, 149, -123, -77, 7, -2, 132, -140, 93, 177, -64, 241, 54, -63, 43, -26, 51, -231, -222, -24, 182, 5, -1, 31, -36, -214, 288, -20, -131, 41, 198, -1, -27, 4, 115, 76, -81, 290, -58, 69, -158, 27, 69, 77, 48, -66, 96, -20, -186, 77, -79, 61, -224, 285, 44, 114, 64, -55, 244, -58, 1, 31, 57, 51, -11, 119, 164, 33, -119, 83, 33, 56, -32, 101, -54, 56, 111, -220, -30, 81, 69, -152, 89, -66, 7, 116, -41, -5, 214, 66, -215, 97, -10, -153, -106, 7, 97, 144, -344, 40, 118, -215, 60, 113, 101, -154, -55, -256, 132, -99, 243, -15, 87, 109, 291, 6, -219, -127, 57, 50, -45, -1, -19, 129, -208, 99, -102, -13, 97, 116, 155, 17, -114]
860a14R4O2j74J48m6j01K62j63J09j39J53R5l09L28k92K6j60J40j7P5J10k29L62
883B20k26K83K2k85n2l6lJ46q5K1j29K16q3p8K29M1O4l57O0J27l38M3L58p4J09
908A93j44j05O0k13J66J7j28J64J37k44K65O1l62J35M8P1j18L5j76J89j92J27
930a4J59R2j17l06P7k2K68k46r3K63j02k8J8Q1P1j40j24N9j49K00J8p7J24P5R3
955A80j26nl17J53J78P0k48r4R2K73o2O2q2j06J79m49L67p5L1l7M3o6q6J81J4
980G0m4l7J81j58mj31K15J4j75N7p6K91n8q4K3l27L19p7K1n3P0Ol0L0L5J7K32
1007C27m56N4N2j71K72l74L01l03m6L91j45L33k55r2K32k04j99J06J03MJ75k1
1029H4l17L50j46J29J4j05L4J04k29rL19j52P7l40K67p9l9J57j36P8J55L7k77
$$ y = [-114, -20, 42, -132, 16, -30, -131, 131, -32, 77, -62, 91, 186, -123, 205, -87, -61, -221, -81, -98, -23, 87, -142, 220, -6, 277, 299, 14, -38, -74, -77, 69, -16, 5, -124, 92, 9, -69, 160, 201, 265, -92, -32, 95, -243, -200, 158, 84, 193, 49, -56, 4, -209, -43, -26, -154, 10, 147, -97, 168, 229, -133, 2, 50, 121, 3, 38, -138, 51, -141, -14, 145, 237, 120, -186, -109, -131, 137, -109, -202, 61, -41, -69, -51, 30, 101, -39, -163, -104, -253, -53, -35, -112, 12, 87, 180, 54, 49, -268, -115, 63, 133, -115, -209, -117, 156, 94, 156, 74, -32, 147, -302, 65, -10, 21, -16, 27, -39, -125, 56, 70, 26, -11, 170, 12, 8, -123, 92, 106, -69, -12, -88, 203, 145, 61, 84, -243, 76, -1, 20, -33, 37, 43, 13, 43, 78, 95, 327, -129, -75, -23, -194, 78, -296, 5, -298, -344, 47, -98, 235, -20, -112, 120, -84, -283, -177, -74, -70, 105, 84, -233, 117, -29, 100, 114, 9, 43, 147, -82, -91, 228, 76, 153, -187, 80, 1, -38, 119, -17, 61, 216, 253, -24]
1052b4J90m50L04J19j03j01k33M56j60n7n0J09o4l9J31O2J0l19L96m17K07J70
1074A37L5j47k05K43j60J77m8k73J81L66m62K06p2P6j77J91l63K06J27m7J99k42
1096e2J22l01R3m7N06j16m29L88k4J16k72J09j89J11j12K09p1j79J15n4J27M2
1118I2m1o4k26K73k39L05Q5l2J78l75K29k31k00L57k4j82Q6k49J63N2j6J92k35
1141a02j55J53L2K37k57J11l6M3nj45K10J20k39l8o1N2k0K78j42J9J01o3j56J1
1165e2r0M34l93oJ96q4m2L2J94j49j60J60J38m9j5j56J37k05p1K62L9q7J02N2
1189A87k00j81L11j26m95O42j33m3O3M5p6N2n5N6k81K37K21m33K9K34k11L79j35
1212H7j51k04K21K1N9J15k98O41l98M7m31R6K19j38m8J84L2N3j09J18j13p7M2
$$ y = [-24, 166, -284, 20, 139, 36, -65, -298, 158, -2, -59, -109, 0, -64, -103, 28, 90, 100, -219, 177, -240, -33, 137, 172, 25, -180, 63, -97, 80, 32, -241, -60, 306, -156, 50, -22, 54, -123, 68, -295, -89, 38, -9, 190, -52, 70, -231, -138, -185, 321, 205, -224, 164, 140, 256, -16, 93, -96, 15, -97, 112, 41, -138, -23, -77, 50, 92, 51, -13, -239, 34, -205, 100, 185, 153, 331, -44, 185, -46, -246, 111, 87, -95, -9, -258, -95, -43, -59, 133, -102, -257, -104, -72, 165, -92, 19, -17, 26, 21, -124, 86, 206, -33, -71, -132, -80, -100, 178, 36, 55, 156, 93, -63, -52, -142, 292, -101, -107, 89, 5, -37, -5, 189, 40, -120, 40, 178, 129, 114, -42, 95, -110, -181, 81, 120, 33, 135, 187, -13, -194, 117, -9, -504, 138, 5, -38, 25, 70, -6, 46, -9, 47, -234, 3, 224, -209, -180, 54, -157, 222, 87, -64, -268, -47, -26, 33, 148, -150, 491, 93, 140, -291, -195, 24, -114, -162, 22, 54, 107, -2, 116, 3, -74, -32]
1235c2k13M17j3j71Q5j35N4K1KJ69n0Nq6Q4j32N6Q3k26R1o8Q6j62J96j4k24J68
1261iJ57j92K5L23k63K31k87J23k58J06J22j06N2j10K7l1k9J59K12L8j40r5l5
1284B0J65k40M4n3J83k85j49M16j18k69N13k69oj2J05o5r1L45j88j6m8j29N45
1307C98m99J26k18J72J98m8k94K61j29n3K6K7Q4j19J96J2j70O2M0j41R8k07K24
1330D6J06J15j60j41j25J61p1J09n2m5j61K07lj08J76%p9M5L23l69J23o6J55n0
1354A36k10m5M0N5L8pj65K22k0km7j91L25l44L1K36k5L8l3n6K17Jj28l27L23P7
1380A39k45J90k35J53j83L1M56j76k65j5K59j03o2P1P1J72m26K65J31k40J49j63
1402b6j54L22k44K00k12K00r1l12L40L08l55k5R8j91J62m2L34j70k60J13p3n8
$$ y = [-32, -245, 172, 159, -12, 73, -62, -8, 13, 15, 184, 134, 139, 53, 137, 5, 61, 144, -82, 9, -59, 27, -135, 61, 47, -177, -9, 148, -44, -19, 304, 41, 272, -15, 108, -150, -44, 78, -28, 24, -86, -59, -90, -119, 40, 252, 290, 150, 55, 20, 185, -55, -11, -64, 119, -166, -315, 101, -17, -286, 227, -42, -48, -60, 45, -20, -111, 234, 46, 30, -18, -147, 398, -101, 25, -193, -21, 177, 129, -165, 96, -33, -86, -60, -33, 51, -68, 128, 140, -30, 32, 72, -69, 29, -178, 46, 152, 267, 107, -34, -159, 2, -69, 40, -12, -57, -218, -11, -14, -122, 54, 54, -25, 20, 343, -26, 97, 31, 186, 136, -74, -119, -79, -24, 14, 7, -158, 64, 44, 42, -5, -196, 129, -215, -184, 52, 27, 65, 32, -24, 193, 194, 66, -261, 62, 139, -106, 84, -151, 2, -181, -150, 306, 130, -135, -150, 109, 6, -56, 15, 86, 258, -168, 97, 228, -12, 137, -26, -180, 142, -102, 98, -114, 86, -5, -317, 23, 331, -24, -49, 49, -142, 20, -22, 312, 142, -118, -5, -78, -136]
1424a36k4J04J27q7J7j73K24O1J50j23l84K80r9k2J1l33K82J63p7R9k4n9M9K64
1448B90j91r8p1L7j8J25P1l22m2K53N9k38J9K59j79J31j93K99l40J03j32K85P6
1471A83m94K03L2J00k01J43k25M42k60K73k31J69o0k9k76K01q6J61Pj41Q5Q2j36
1494e8M6r1J79o4J24k26r0J85N3R1j83Q2j77nL09j44n5J05J7o7K07j95j83K10
1518G0j90J94j49j11J54J44j59J40j06K07m91J58M02P7j68Km2J28l38P2j44N8
1540i2n2L57l57Q5l0L8J90l5k22o2J90J8q8n4J36P0n0J61J2J31k85k68J15J20
1564B8k2pn2J05j73j9P8K17j90K3N2j95K65k52K61l13P7R4L3j90j30K12K7J15
1588D4j97P9J25j0N6J0K0j63p2K23j89J25j88Q5K50m09n2K52k3J3J14Rjj78J89
$$ y = [-136, -160, -56, 71, -16, 1, -172, 52, 113, 263, 140, -244, 36, -63, -85, -74, -407, -125, 38, -39, 60, 36, -23, 26, 290, 99, 1, -70, -33, -51, 74, 145, -177, -219, 34, 93, -145, -126, 133, -46, 85, -108, 191, -149, -46, -178, 107, 183, -311, -108, -76, 24, -177, -34, -259, 183, -77, 196, -35, 134, 74, 45, -231, -30, -116, 45, 52, -89, -4, 78, -58, -12, -103, 76, 12, 136, -90, -180, 5, 58, 149, -34, 48, -129, -134, 175, 31, -24, 81, 98, 31, 238, 43, -140, 70, -120, 74, -75, -186, -32, 112, -47, 93, -13, 194, -297, -139, 263, 340, 172, 174, 132, 260, -78, -6, -150, -92, -144, 213, -144, -59, -89, -51, 139, 104, -118, -180, 10, 28, -60, -114, 22, 92, 42, 203, 215, 346, 61, -207, -92, 28, 6, -1, -53, 52, -121, -140, -62, 155, -35, -12, 40, -155, 110, -142, 119, -194, -117, -23, 10, -180, -310, -98, -71, 44, -153, -74, 51, 41, 97, 107, 127, -36, -108, 115, -74, 51, -137, -52, 198, -211, -263, -11, -34, -21, 93, 102, 101, -77, 112]
1613A12k03K50k48jN7L80k71J2Q6l91M82k98M8nr9K97k66K78q3k10K32k35N2L3
1637Ij29J6R0K7Q4j40r5P1m2nJ00K30k10N3J7r0j04K21k35j9J8J11l3K16J07K3
1663B91j67j76n7L85l33L9J89j18j53O7K39k41L2K8k09L44NJ16l23Lq3J22j08
1686a08L7k8J52MJ66j89j9o5P1k13K5J94j8m8l8J67j40n0oJ16j78J72Q6j22L17
1711B85j47k41k1J56j2j46L09j89J26k19J98J8j56P6l4Q3l58K82n4J83j92J50
1733I7k40P2K61k43K10k95l7%L0M7R2k81L86P4J5j03p8l19L84m6j59L32k06K15
1757B08k69P1K5l77L17q9K56j39lK4j24K18p9j90Q8Q1l61L61J50k60K2K54j66
1780A8m3P5o2m5j54K12k7J86o7l46L92j35j51P6K6o6J70k92J30N4J29k6m4J22
$$ y = [112, -91, 159, -89, -90, -33, 347, 76, 88, 174, -217, 265, -33, 15, 10, -89, 208, -58, 220, 137, -73, 159, -76, -24, 9, -120, -104, -14, 13, 97, -43, -138, -67, -109, -114, -14, 216, 6, 59, 76, -14, -118, 103, -132, -151, -133, -22, -55, 161, 268, 291, 124, -52, -109, 276, -57, -18, 171, 53, -100, -33, 206, -35, -3, 25, -184, 160, 165, 281, -42, -39, -122, 0, -108, -71, -99, 53, 57, 223, 34, 15, -50, 21, -192, -167, 27, 9, -39, -77, 90, -50, -100, -106, 10, -168, 4, 90, -32, 285, 138, -103, -124, 32, 20, -126, 183, -6, 120, -99, 99, 117, -39, 37, 3, 86, -272, 10, -44, 139, -53, 97, -143, -71, 190, -53, 157, -138, -175, -175, -145, -98, -6, -287, 99, 173, 188, 85, 7, -312, 72, 26, -133, 199, -7, 208, -61, 10, 35, -342, -25, -114, 142, 3, 0, 24, -100, 118, 39, -151, -63, 18, -343, 18, 168, -92, -70, 184, 18, -25, 50, -12, -57, -211, 1, -26, 160, 93, -253, 139, 4, -147, -71, -45, -111, 59, -233, -103, -49, 80, 54, 10, 132]
1804A32l5j95O4m3J75j23L0Kj34L54k84O8J49j41N7R1k30R7o1j83m5J40J67k49
1828a97K50j21J76M5k78K71L9k80J72l6p5M9k2j42q9L73j78j18K92k95N3L12k06
1851ep6Q4R6n2q7J7r2J3J20j23J05k0nk29L10j26k42M46r3n0L54j85p3or5L19
1877C05k63J21j07j15Q9Q3m02K64j22K89k50P6J8J74k12J09o0n1J39p7P9j7j69
1900i9q9K60K75m13p2K06R3j63r2K65l12J85k03J74J41k59J08j64J56J58l26K8
1922a43J75j5m3j87J44Mk9k74M08j61k9K23q2n5R8k8r9k6J94j23L2k1O8q5K96
1947B42k13o3J51p2j89J02J37J4j18o2J10Q5l4j17j45J88Mk19K27j23J9k33K74
1970c5P2J1k66K35L4Q2r7p7J6O8J06l00J78r4J23K7j60R3m8n8n1J21lq7J4R6J83
$$ y = [132, 97, -98, -34, -77, 98, -25, 5, 7, -127, 227, -57, 11, 160, 19, 76, 167, -63, 34, -27, -210, -255, -115, 52, -197, 53, -68, 108, 153, -125, 146, 185, -95, 77, 41, -34, 15, -7, -149, -238, 135, -43, -161, 131, -164, -111, 201, -5, -81, 3, 99, 47, -40, -23, -115, -102, 18, -105, 0, -20, -25, -254, 56, -70, -312, 134, 41, -9, 345, 160, 87, 81, -14, 305, 42, 163, 56, -59, 30, 113, -289, -25, -147, 142, -108, -32, -14, 160, -52, 57, -3, -54, 85, 8, 87, 70, -99, -188, 72, 347, -66, -138, 68, 161, -2, -94, 171, -141, 44, -159, 15, 156, -103, 5, -159, -3, 155, -171, -143, 32, 17, -26, -213, -69, -65, -94, -368, 40, -121, -150, 73, -9, -64, 34, 6, -93, -119, 75, -48, -16, -37, 31, -54, 242, 29, -34, 117, 45, -144, -42, 95, 109, -9, -71, 39, 124, 90, -27, -172, 16, 20, -199, 28, -95, -76, -309, -35, 37, 48, -218, 17, 51, 133, 36, -41, -25, 43, 149, -151, 27, -67, 56, 83, -77, 16, -32, -90, -141, -20, -23, -110, -96, 0, 183]
1997A83q0j11j06L4J8n4K85k00j3J10k37K25q2r5K31j29r0j10N28l16L8k04L87
2020B12k29K47l09J34Q1r1j37K62j61K39l3k18J20q8j23M62k78J0k51J24o1L82
2042B94j17m1r3p6Q5o6k51P7L80l01K14j52J2O6j5k4J19n1j37JP0J38j36q4J64
2067G6j0J8j12K11l59L78j94r6K58l11m6J22J19k26K41mk14L33j43J22j2m0k5
2090H6k8Ql5L3q3k67K11L6O3K2k3Qj81K09j28j83L17j14N9j38j06K83k77K13m1
2115e6J4j4p6k2K36J2o5N0m0M8K4j05p2j69M13k85j50M17j09j40K24l4J57j16
2139A42r0p2k9J06j14K03j02k3j33k2K68J53m27k1j4J59k36M30j1l80K51j66N5
2162g3r9J22j79P1O8K41L3j83p3J03J12K1j0j63q8K11r2K6j90n8M01j66J91j23
$$ y = [183, 103, -8, -114, -80, -62, -116, 169, -31, -44, 66, -171, 54, -28, -123, 108, -21, -111, -221, 307, -9, 29, -175, 212, -17, 230, -79, 55, 136, 45, -92, 170, 9, 248, 215, -3, 117, 29, -94, 368, 90, 100, -151, -27, -88, 294, 177, 136, 43, -33, 52, -14, -265, -188, 192, -109, 105, -47, -35, 31, 16, -8, 111, 60, -77, -76, -6, 132, -4, -88, 76, 66, 84, -28, 183, -176, 202, 8, -88, 170, -141, -187, -65, 54, -172, 69, 65, -149, 184, 41, 163, 151, 111, 86, 58, 66, 31, 64, -19, -286, -75, -39, 24, 46, 23, 31, -150, 59, -69, -252, 65, -49, 10, -128, -234, 49, -228, -15, -56, -42, -56, -132, -154, 82, 94, 29, 79, 39, 87, 111, 6, -66, -235, 178, -107, -257, 160, 51, -89, 135, 101, 258, 142, 52, -20, -49, 57, -57, 146, 44, 21, -112, -134, 134, 287, -140, -161, -175, -16, -252, 178, 167, -213, 38, -128, -73, -172, -50, -229, -158, -90, 151, 184, 1, -72, 31, 143, 164, 154, -9, -97, 114, 22, 48, -142, -200, 201, 35, 226, 103]
2186A03j4P8k70J80n1N0l39L38Mk21J10P9k62L09j57j34P4P5O0P0Mk52J56O2l1
2211B1n1n7O9K57l14P0k5N9l2k24M42k53j1n7K65l24J38J5r4K72j36M1Q4j20k42
2236b07M03J47j99j63O0J33j45OnK4o6K9n9K40j90qM6J36k86J41K48m71J54q0
2260a12Q8n4K25m02J71L01k58Q1M57n39j95L39j41J56j43j16J69k09J50mk6L0
2282c2N6j93P6K6R3j61J92r6j55n0J05J70k56K57Lk78L30j08n6J44p3j48J42M4
2306C2M5j80q6L17j32J40k55J12K03j71K27j58k81M38k34P7N1r5N3p9r8o6O9N0
2330b1n3l4J35M5j47j11R3K53k62Q3k32L59k29l7K23Jk03J72j36%j34K18J38J00
2354B21m57L64p3J34j67lO9j40J54n9n9J44n0jj03K24l49M1K78j50qk6K8j43p5
$$ y = [103, 89, 167, -103, 77, 26, 76, -263, 75, 79, -142, -32, 47, -215, 94, -63, -197, -123, -48, 12, 82, 86, -166, -10, 52, 21, -30, -87, -18, 239, -75, -5, -30, 29, -3, -227, 215, -38, -49, -106, 159, -165, -27, -12, -106, 166, 30, 71, 155, 35, -207, 196, 343, 144, -19, 41, 174, 29, 35, 30, 54, -12, 17, -42, 198, 8, 0, 46, 182, -104, 37, 285, -186, -32, -112, -24, -78, 147, -255, -84, 217, -41, 40, 497, -42, -237, 102, -39, 117, -26, -142, 27, -182, -32, -36, -62, -32, 24, -169, -93, -67, 26, -135, 57, -39, -194, -244, -139, 31, -225, 32, 35, -243, 87, -21, -77, 67, -6, -154, -12, 32, 77, -103, -189, 128, -4, 136, -119, -7, 196, 25, 252, 94, -187, 251, 17, 94, 145, 50, 103, 24, -74, -140, -71, -21, -74, -108, 27, 72, -75, -186, -93, 160, -102, -19, -251, 108, -121, -158, 65, 66, -137, 35, -101, -101, -235, -17, 121, 221, -236, 128, 55, 189, 22, 19, 88, -52, 102, 43, -16, 128, 78, 77, -26, 198, -151, -110, 168, 18, 10, -16, 12, -131, -206]
2379b06K82O2j81K41k34K06n5k06N3m2L72k82J36j25j24M44l30J81J5k40j1J75
2401A31J48j53m62L12J06j40j49J12J27m7J9j06l5J38Mj36M73l95N9JL5j49j67
2424b74J35K14k0q2q2j58K49M9l62L18N9p3K5M0j7K2M1j03j9J61j86K29m6p7l24
2449b81L32m2m3OM0Q7j32oj05J81r1p5K22l45L38k52K76o8M5L1o6o3k16K96o7
2474BK49k06rk8o2M8j2Q0j23J52j79J89J59l63K36j48L8o2K15k89K13j79nJ19
2498C5j90K25j97M0J48J15k30R9k38K81oJ39j48O5J34l7l25J78q7J89k40L0k12
2521b32L11j3Q0k67K13K71l58m8O5M5j97q8J68j00R8K23j69L9j78J49j02M70l82
2544bO7L0J70k88L75m70l4P8J12j22J52J58l73J98kq4K07j60J64r4N6k23Q2J7
$$ y = [-206, 76, 138, -43, 198, -36, 170, 115, -91, -38, -80, 292, 10, 146, 21, -103, 341, 11, 192, 207, -33, -44, 131, 279, 126, -336, -24, 82, -58, -207, -95, 32, -15, 4, -102, -137, 1, 5, -131, 342, -53, 6, 7, 42, -107, -274, -139, 75, 55, -27, -109, -267, -18, 31, -331, -13, 46, -27, -2, 38, 21, 43, 84, -19, -38, 123, -63, 166, 120, 43, -281, 51, 9, -34, -28, 12, 99, -33, -39, -144, 37, -54, -129, 93, -252, 86, -166, 110, 42, 87, 118, 52, -11, -227, 69, 2, 251, 45, 36, 8, -54, -6, -18, 62, -61, 91, -88, 101, 260, -103, 133, -15, 23, -39, 176, -113, 100, -79, -84, 35, -155, 70, -127, -87, 61, 176, -54, 45, -193, 88, 82, 221, 73, 138, 272, 235, -90, 88, 1, 190, -50, -20, -232, 79, 66, 146, -121, 92, 363, 5, -43, 22, 67, -130, -218, -50, -150, -52, 171, 2, 41, -137, 12, -90, 380, -2, 65, 95, 265, -23, 352, -118, -152, -74, 38, -84, 68, 226, -147, 51, 49, -35, 172, 12, 176, 82, 138, -85, -3, 14]
2568A4j01j00R2n1J31k55L08J3R9N8k33q6R6J34j87j70J95j5N7P7l1j1K00l12
2592g8L03j62J25p4j00O5j56O4N9n2%J00j37J4N5lL2jN0q6N1o8J6l44L52r8m2
2619a15r1K42J70j04k21M32m43N4m9J53r3P6k08J76l6j74J37J0J64j62J81j68
2641f9K06j52j22M6O5J33N1q3k45P7K17k29J63o6j13QJ86m62J92J14L0K57m17
2664b13K65n1N0j79l25M88j19K03k17n8J30L57l18K61l83J24n5N4p0K07K0m3p7
2687E1j14L83l50j59Q8K47l05L43r4J3Q9p6N3j91j59J25J78K5m57N24k0k15Q1
2710F0P1j66Q1k4KJ95k97K4m9L20L0l87l7Q8J40k54L13mK5j98K17j17j75J68j20
2735i4Q3J37l9l06K31j21j7J81l18L58j16m3q3Q7J04k7mn4N8RJ49K3k77n0K19
$$ y = [14, -87, -187, -95, -146, -15, -270, 38, 51, 150, 208, -25, -111, -15, 119, -68, -238, -43, -58, -1, 76, 45, 34, 234, -78, 225, 63, 188, 114, 14, 79, -77, -13, 46, -6, -6, 94, -43, -29, 26, 23, 55, 54, 104, 18, 69, 1, 17, -327, 25, -73, -115, -206, 36, 206, 102, -119, 313, -130, -76, -125, 28, -65, 11, -197, -21, -57, -231, -94, -84, 80, -82, 99, -69, 137, -15, -137, -91, -26, 107, 158, 75, -170, -93, 124, -105, 58, -8, -121, -113, 73, -389, -197, -83, -53, 204, -213, 52, 1, 51, -128, -453, 35, -84, 119, -98, -156, -26, 331, 13, 274, -109, 15, -40, 14, -56, 151, 171, 128, 51, -63, 320, -30, -189, -101, 146, -159, 184, 90, 103, 192, 116, 169, -22, -181, -56, 122, 147, -310, 214, 194, -21, 60, 131, -35, 46, 22, 24, 219, -78, -54, -103, 217, 247, -140, -177, -89, 51, -203, 110, 106, 131, -67, 150, 33, -142, 26, -94, -11, 126, 87, -219, 12, -109, -126, 55, -263, 95, -21, -64, -147, -60, 44, 17, 13, -41, 17, 26, 175, 198, -79, -129, 90]
2760I0k16J27P0K4q5J13p0j36L5p3L68k42J0j4L41k85m8N3j11j4J83k10l8J00
2784b8Q4J73j11R8k98Q1L2J54k07k9k9J49k46L16m24M78l10n7J44J74j96Oj22
2807a68P9J1q5R0l0J23l7j6k12K06Lj15P9J66j87N4O2j9j66J98J23o0m0k3k94
2832b58M29k18m3K00K4k20K1J5k16L37J01k85M0J84j43O1R1j5k56n5K01J69q2
2855H2J57j54k29J10N2L1J07j22k33L08q7j1j6L4M5j73K22J15j68q5Q8p1N1m2
2879A1M3k24K1J6K22N3j56K29j35P0n6m50K19K20p8p2m3J48r9j16K68l02L62k26
2903g5Q6QM9l5n3p7J38K46l21K76l19J37j72J28qj0j63J24P7j48J92k0o4Q1J18
2928A95k34Oj39K21j49l8j09R9J36j83J67K85l9k38j27J41M1k67P4k1K75l57M91
$$ y = [90, -126, 1, 71, 95, 10, 123, 53, -83, -48, -121, 247, 5, 15, 1, 342, 57, 9, 62, -49, -63, 120, -90, -128, -28, 56, 229, 118, 216, -82, -1, 31, 185, -22, -51, -80, 69, -177, 139, -285, 193, -117, -174, -30, 144, -52, -46, -168, -89, -78, -163, -73, -103, 20, -17, -33, -245, -39, -36, -151, -72, 94, -93, -39, 23, 4, -162, 36, 159, 99, 59, 36, -258, 171, -47, -90, 110, 134, -86, -65, -50, -266, 71, 172, -113, -73, 111, -32, 29, 120, 105, -151, -206, -5, 164, 82, 239, 85, -144, -34, 18, 49, 156, 34, -199, 109, 22, 11, -5, 29, 74, -99, 123, 238, 70, -15, 73, 2, 53, 11, 54, -170, -149, -133, 89, 142, -14, 215, 80, 150, 94, -356, -137, 83, 5, -67, -110, 38, -61, -177, 91, -211, 151, -75, 11, 19, 68, 33, -20, -97, 41, 287, -34, 242, -77, 60, -112, 16, 8, -2, -165, -41, 36, -112, 80, 60, -4, 77, 195, -39, -33, -172, 49, -100, -138, -247, -148, -12, -195, -28, 257, 218, -20, -147, -6, 35, -232, -158, -179, 96, -261, 230]
2951B30j91oj62J64K05l61L06j86pJ11k85J87%N9j62J91k53J64j74L19r5Rq4j65
2975a86J00J29L6m2j71J44j7L5L6J31k36K08j64n7J66j5J54j25K32l00J38m27
2997b31L27j04n3K40j78k2m2j72l3Q7j9J45Q6j78J24J56j90j84L70m8j1j75K04
3020I9j18P1jr1J57k95J68J84j15M4j68jK29k52R7J27k74K00n9J87j26l75K75
3043c7n7M5r0r5mK7N6L68q0k48K06m1K0J00j19k5K0k40M17p3J9j98j8J94k91J66
3069B2Q9k68N3kR4j07L08k86J46j19J28K35m18n7J38J36k53j32L99J7l8J5k42
3092a42M5J74J7j58Q0J4K1M9J10k07J21o1J2j04K26k11J51l3j3J00l39o9N7J14
3116d6k4K32k37K16L5j60R0q5n4J09K16l10o5k6K38j96P8j42L5K63j72m6Q4n9
$$ y = [230, 39, 33, -129, 35, 240, -121, 185, -1, -8, 103, -182, 5, 5, 64, -98, 93, -160, 4, -170, 149, 54, 63, -21, -186, -86, 43, 79, 37, -134, 10, -7, 28, 64, 195, -41, 167, 3, -54, 112, 97, 251, 126, 358, 58, 196, -231, 96, -8, -61, 179, 1, -21, -63, -235, -268, -181, -200, -55, 31, -147, -23, 133, -57, -241, 129, 81, 70, -105, 99, -19, 52, 51, -40, 117, -178, -10, 174, 59, 103, -65, -66, 163, -89, 8, 135, -139, 61, 2, 189, 63, -312, -37, -94, -49, -139, -234, -238, -211, -155, 213, 133, -115, 91, 50, 70, 170, 51, 26, 46, -194, 223, 150, 169, -29, -47, 147, -144, 22, 111, -157, -104, -106, -12, -119, 189, -97, 49, -70, 58, 293, -125, -182, -44, 92, -161, -293, 106, 123, 85, 100, -142, -97, 77, 94, -64, 16, 30, 51, 100, 210, 3, 124, 63, 75, -29, 197, -14, 137, 104, 91, 191, -148, -217, -160, -46, -70, 162, -75, 141, 176, 16, 106, 21, -33, 76, 292, -18, -83, -109, 129, -67, 11, -131, -96, 167, -5, -51, 33, -26]
3140b6p4O7L9k11m6K61l9M0j35L2p4J20j07K89q1r7J17J18J7j70qJ69l45J61j0
3165Gj8K19l53L69l09Q3J44j69Q6j00n7m4M1j06L78l89J60L5J9P3o9r0K51j29
3189C2J45j30j93J66M15l15J62n10J87L52m01J76m8k01j57K18L98l57nJ4l0P5
3211gp6j23J24N4j19K12L3m7n2j39J06J7J15l16L11N0j34k22K41kJ70J06k79J94
3235B17k78Nj5M0Q9K6j18J0m7j44M8L36k02P1j36K68l25J89l9P9J00j69L1l9J87
3260A84l44L9N3K2o6J56k03K49r9j57K38q6K14l64J16L1j66L7J74m0r3q3K71m9
3284C4J11k95o8L02r1j20J05r6Q3K8r4K88l86K28m0O9k41J87qp6k19K65J36j04
3308bj23p0J76L70m86J18N0k56O9K62j81J04j0j63Q1q9J26R4k46K41j41r2L64
$$ y = [-26, -100, -33, 6, -205, -251, 10, -29, 11, -124, -92, -166, -46, -153, 136, 55, -42, 75, 193, 210, 40, 32, 201, -144, 17, 7, -11, 208, -145, 224, -85, -2, 142, -27, 59, -41, -98, -142, -101, -207, 171, -218, -58, -23, -4, 69, 0, -90, 161, 32, 177, 47, -146, 20, 435, 120, 282, -228, -41, 311, -90, 86, 38, -163, -320, -102, 296, -61, -66, -52, -82, -7, -83, -206, -82, -28, -147, 65, 98, 51, -1, -140, -34, -17, 98, -218, 93, 143, 9, -213, 28, 26, 196, 302, 23, 217, -61, -56, -71, -31, 58, 84, -34, -24, -71, -215, -167, 169, -33, 38, -98, 170, -155, 34, -5, 74, 174, 5, 36, -3, 184, -160, -121, -68, -46, -112, 44, -159, 90, -9, -166, 72, -14, 200, -164, -48, -17, -183, -146, 28, -12, -105, -188, 83, 34, 145, -150, -218, 84, -7, -127, -22, -118, -35, -7, -101, 187, -199, 29, -11, 58, -183, 4, -4, -80, -299, -34, 102, -2, -125, -195, -19, 351, -135, -17, 33, -223, -154, 108, -73, 31, 21, -142, -61, -150, -24, 70, -176, 65, -76, -168, 196]
3331A96j70ln7j47J24J30k6P1j15j65K54p5J6J55n30J37J24Ll2M8O9j10K58k44
3355h9J68n6k01J81j2Jl2r7J07j24K51k69J6K19j95K13j50K03N9o5J0j56J59l
3379A38l8L1k2r2j87J03L09k28n9rJ14k23j0K13j07K82l17J67j74K36j49q1J89
3402H6k7k16J07l6L5K61qj02l74K28n5K75k33kK97k44nL8P7l8J28k95K61J1j86
3427a7K5q6j06K29L1n5O4m0m5k50L50oj8p1J12n4J15k02J77l29m5L40j05j04K0
3452g0j43J34K01k87K9N2P8LK8q1M1k36K65j67j24J3L22j97L40q5O6j76o4J55
3476I7p5k76L01J08l9N6j86KK36l54J11K21j12l42J07L66j85k4j06J12l4J91k71
3499i6J01J42J70p2k52N3p1J82l93k5L06m0k42R8L2nJ91j84L01j41J05m0j35J34
$$ y = [196, 26, 23, -34, -181, -57, 73, 47, 118, 3, -162, 92, 17, 33, 188, -342, -205, -81, -78, -110, -62, 7, -103, 155, -89, 79, 23, -178, 3, -9, -8, -40, -137, -30, -154, 97, -172, -156, 63, -132, 81, -69, 134, 193, 128, 138, -18, 141, 138, 100, 131, 109, 17, -170, -67, 242, 14, -45, -54, 60, -163, -173, 40, -67, 215, -102, 65, -109, 127, -22, -103, 86, 59, -157, -50, -86, -51, 210, 202, 100, -274, -46, -101, 174, -59, -61, 236, -8, -13, 25, 102, 64, 192, -103, 158, 169, -17, 8, -78, -184, 45, 76, 21, 85, 45, 0, -250, 100, 94, 76, 5, 117, 63, 178, -24, 153, -176, -221, 119, 14, -90, -70, -213, -79, 122, -165, -136, -84, -6, -3, 25, -56, -15, -251, 14, -153, -277, -264, 58, -139, 201, 116, 182, 6, -58, 97, 22, -254, 47, 155, 116, 172, -14, -12, 224, -130, -19, 202, 90, -252, -145, 221, 36, 12, -94, 18, -16, 175, -96, 5, 147, 317, 245, -7, 46, -25, 157, -236, -261, 45, 5, -237, -139, -107, -112, 79, -105, 196, 55, 160, 120, -15, 119]
3523A19l24J21K80j78j44L41k81K01j26%N4M3j97J6K73j22k9r4J10j14r2K38J68
3546B63l70J04m2K3o4j04J25l20N13k2M4l43r8N36m18Q2L24k68J41j87N1J48o9
3569D9P9n9m4q1L4J69q1q2p7K16r2k95K77n5j1K09j54j70L92jk47j61K28N2O5
3594A60k60J75l9QQ8j32O3m04M52p0j93M5mL27j59rP2L1k48R7K18k73K32j48N0
3619G9j22N9j93R8j62L77J0m2l22P1L21K5k80R0k60J93M5j4J48l0p4J13l45K35
3643B0J11k19L36j07l8mR6j54P4j32N2o3K46j63j1J0p2K2o4K22k5Nk97K65k03
3668i3J73J27l64M36m70M08r8m5j13K44j92o3K36k58K55j42o2m5j07J1K06m0k52
3691b48J67J2K78k60J70k06J65k16J52J8L1j23L3L8j31J53K4o8K03j05j99K78
$$ y = [119, -205, -84, 196, 18, -126, 215, -66, 135, 9, 9, 63, 106, -91, -75, 198, 76, 47, -47, 63, -51, -143, 95, 263, -107, -3, -45, -22, -86, -190, -65, -385, 128, 106, 150, -193, -291, 245, -173, -91, 233, -35, 106, -81, -30, 118, 49, 128, 69, 25, -56, -22, 147, 66, -16, -93, 123, 31, -264, 13, -42, -53, 156, 2, -168, 224, 223, -24, -185, 43, 95, 160, -100, 75, 36, 44, 132, 0, 63, -341, 111, 41, -152, -107, -111, 216, 57, 48, 120, 151, -97, 0, 218, -55, 177, 29, 79, -43, 16, -177, -79, -241, 136, 146, 104, -218, -147, 174, 199, -81, 9, -251, -58, -13, -27, 121, 91, 17, 130, -215, 20, 131, -88, 248, 141, 103, 99, 195, 41, 115, -17, 35, -28, 218, 55, 44, 54, -18, 4, -60, 162, 137, 142, -155, 110, -93, 80, 207, -157, 279, -191, 217, 119, 74, -39, 205, 13, -50, 186, -72, 183, 41, -21, -66, -173, -162, 44, 4, -248, -81, -69, 209, -51, 119, -87, 78, -138, 14, 32, 63, -60, -27, 11, -120, 33, 57, -11, 192, 87, -112, 166]
3713A66k36j5K81J1n4m4L8k17J63j59J9n5K6p8K51k05J69m0n5K11O5k32J23k81
3737a48L47j19l7o0J57k37J04n2j85l8J28N7J6K7Oj48J90j23L74l24r5J75ll5
3761b3j6j89J74K48rj34J15P7l41mK63J57k85r6J6j03K02j62J03j7j21K91l2j07
3785Gk58K63J46nN3k33n0N5j42K38J2m2k31M52k07N6R7k79L6J76l1j39k1o8M0
3810g5L29l81N1M3J15l21L2K87J4nM2N1q8Q8j9l52K08k72J89J67j55P1o4Q0J58
3835A93n05L75k16J44j58K48j83J73Q3k69J82j64k39N61j92j29Q3J3K8J66k86
3856i2J85k03J57j46K16k92K41n0j49J99k65J55P5K58m19P5J67O4j58N7q9L49
3878C35m06K24k8J82k20M6j80J07N2p8m8MK31k74J0j47L57J40m68M2R3J2O2p1
$$ y = [166, -70, -85, 196, 207, 153, 109, 147, -70, 93, -66, -47, -102, -76, -154, 97, -108, 61, 21, -34, 177, 242, 10, 133, -148, 199, 80, 43, -17, 140, -97, 7, -45, -230, -268, -140, -83, -67, -40, -34, -182, 8, -115, 259, -65, -160, 15, 12, -23, -39, -228, -54, 194, 185, 51, 166, 243, -98, -102, 161, 318, 33, -63, -47, -150, 52, -110, -7, -24, -145, 146, 114, 7, -251, 12, 158, 153, 206, -27, -77, -22, -164, 74, 86, 44, -187, 265, 58, 114, 211, -68, -32, 144, 113, -26, -47, -115, -75, 254, -127, -76, -33, 82, -239, -207, 80, 94, 89, 131, 182, 94, 182, 163, -189, 19, -253, -64, 103, -52, 19, -45, 35, 193, -312, 63, -153, -9, -167, 81, -102, 71, 154, -115, 67, -97, -336, 225, 33, -96, -13, 0, 28, 194, -92, 93, -110, 47, -99, 117, -175, 66, 16, -133, 66, -199, -44, 31, 289, -130, -55, 112, 176, 18, 75, -14, 335, -71, 153, 125, 307, 87, 133, -47, 60, 112, 34, -14, -10, 221, -53, -43, -190, 167, 307, -161, -119, -26, -14, 48, -23]
3902b3J13j18q2J06LJ89l44O9q9J7R9J25k28K70j88M0j54J65j90K78k14K51j56
3925f1N3M4N4j14L8j93L4M01j51n1j72J91j58l8J08J3Ql8o3K09p9k3j77L2J11
3950b2Qj05R3j8R8k8O5j13j6K1M0j36p4M91l29j98J94O3O5J6j7L3KJ0j34j86J8
3977a59jK24k22oJ86j1k5m3R3k36J90K11k56K6R1K5n7R5k34j76R8J73Ll0J12j14
4003d3o0r7L9K45j06J71j38Q6j11j8j53L03j94r0K33K22j14o3j44J39o7O1k72
4026a71M8J25NO8j59J77k56N0O6P2j62J93j51L48m25J47J58k20J93l59L33Ro4
4049B5j69J47l3jQ7j98K5K49l7k17J08j10J73n7J01j76J91J39j42J08k79J61o5
4072C0r2q0l1J93j0K29j58j53j4N6K23j46rJ07j58P5J04j60J90j26j10m6R7J75
$$ y = [-23, 90, -28, -110, -4, -1, 188, -156, -87, -176, -159, -60, 65, -163, 107, -81, -41, -195, -30, -220, 58, -156, 95, -61, -8, 36, 90, -24, 14, -179, -145, 256, 105, 54, -118, 73, -85, -123, -15, -2, 6, -32, -95, 114, 35, 12, -165, -133, -22, -14, -119, -26, -44, 54, 26, 91, -22, -38, -17, 23, -113, -187, 304, -25, -223, -29, 34, 99, 115, 98, 131, 133, 143, 9, -177, -159, -160, 64, -158, -164, 22, 11, -14, -57, 36, -200, -10, 201, -55, -29, 62, 87, 30, 125, -109, -285, -187, -14, -11, -41, 71, -43, -103, -200, -161, 84, -22, 149, 11, 97, -14, -32, -185, 118, -76, -166, 67, 289, 175, 112, -32, 107, 40, 101, -171, -123, 2, 7, 75, -84, 93, -163, -113, -47, 25, -137, 56, -95, 253, -172, -25, 133, -87, 106, -253, 80, 89, 25, -144, 3, -30, -31, 56, -142, -117, 132, 95, -122, -14, -124, 49, -8, 93, -83, 108, 247, 105, 213, -66, 95, 30, -62, -142, -173, 20, 10, 239, 81, -72, -86, -30, 193, 47, 38, 145, -13, 62, 166, 6, 196, 70, -40, -86, 11, 186]
4096A86j7j23K74l08J97j93q3l9K14q5NM1J86j65k65K57j5K03m04K66J6k66j17
4119b35J25nK42k9j81P5K71j85l7J20k26M70n02j20J88L56m72J47p2N9n8m6J62
4142D7k6j87J22K1j76K77j30j92K12p0J48o2o2R5n7K2r7L81j92l16K27n3K68l30
4166a30L23o6k60J90mJ09K01k58j86k7j41K55P0q6K09j1j68j52K21r7o8o4J51
4189A1qqL0J0l2J30l18J4K17k12N4J79j12r0Q5J43q5N2j17o2Q0j51k8J58J18n2
4215Fl6k2j08L4L8R5k09K32l3j81J12J19n5N1J33j74j24q0K47j57J62j37P5O0
4239D8o8M4PJ04k04P8J66j35L56k44M1N6k91n3N1J67k5p6j18O5k05M50r5k04m7
4264a32R0J64j44o4K2Q8J57K9p8LJ3j52k20K96j75K80k39L7n0lk04R3L76n7o7
$$ y = [186, 169, 46, 320, 12, 209, 16, -67, -106, 108, 23, 28, 69, 255, 90, -175, 82, 67, 270, -134, 132, 148, -118, -235, -110, -115, 127, 98, -83, -8, 263, 78, 41, 161, -65, 405, -97, -217, -29, 327, -145, 2, -70, -11, -69, -115, 47, 21, -166, -44, -23, -199, 78, -52, -244, -32, -102, 46, -16, -78, 17, -40, -18, -115, 266, 74, -242, -15, -68, 200, -130, 193, 127, -133, 57, 53, 162, 363, 105, -81, -108, -249, 6, 76, -10, 199, 188, 20, -132, 89, -8, -76, -140, 11, 3, -5, 25, 35, 3, 133, -185, -171, 46, -166, -112, 67, -45, -135, -50, 93, 8, 60, -57, -119, -39, -190, -218, -60, 58, 6, -30, -52, -160, -126, -88, 7, -202, 30, -3, -184, -72, 47, -8, 43, 176, 2, -122, -202, 45, -112, 50, -87, -12, 48, -20, 24, 31, 135, -69, 9, 175, 40, 396, 152, 193, 249, -42, -95, -44, 123, 98, 22, -96, -31, -236, 214, 119, -85, -132, -42, 122, -22, -86, -64, 24, 181, 210, 132, 135, 148, -4, -224, 72, -103, 177, -62, -25, -75, -78, -282, -189, 187, 130, 63]
4289F3J84l9j15l3J29j11j18J8J83m0o1J3J11q2J98l95p2K53j54J4M1K2p0L0M5
4314A4k47K64Q5%L2l3K7k63J25k9K47j38j42O1j81J92k11Q7K7J14M6j29J97j31
4338A4l20M21k9J58k28PN3j92J12M4Q5M9j08r9j0l8J36Pj14N7M3k1j87j58K14
4363a04N1mn5Q4J3J24k2l4l6j19j9K04R7j21k18K95l8j86k7NL61K4j59k24J64
4388E6j88K17K17k66L5J12l21P7J5lK3k36M23j05O7j08r9J11p3j69P9J34nL6l1
4413bo3L91j34j90O7J44k09Mk93L70k93K30K6q0OM2L2J2l97M08K0j05N8k86N80
4438C38l95P6q0J49j12J20q5P2J8j11l4N6l13N65l37O7k13K81p7K4j03L04k62
4461e2J17P2qr6J32q9r3N1L1j12J50l07M71k96J05M1Lr2J6k05j73J87M2J03k00
$$ y = [63, 247, 208, 93, 60, 189, 78, -40, -22, 161, 121, 60, 73, 184, 102, 300, -95, -167, 86, -68, -54, -13, 9, -61, -31, 14, -233, 31, 116, 116, 148, 115, 142, -121, 4, -25, 222, 84, -58, 3, -178, 14, -197, -110, -83, 31, 77, -52, 145, 14, -306, 115, 86, 244, 16, 23, 76, -116, -4, 40, 125, 174, 66, -33, -43, -81, 55, 62, -52, 5, 48, 27, -160, -318, -104, -53, -57, -112, -28, -15, 109, 87, 53, 17, -102, -121, 83, 180, 59, -159, 136, 98, -88, -115, -110, 251, 275, 116, -108, 56, -132, 85, 302, 36, 71, 183, -138, -61, -46, -49, -26, -262, 161, 56, 123, 15, -84, 27, -46, -215, -136, -2, -7, 29, -2, -65, 326, 192, 2, 69, 213, 4, 8, -285, 85, -208, 22, 48, -32, -26, 16, 48, 60, -337, 71, 91, -14, 44, -242, 338, -57, 19, -61, 88, -24, 96, 11, 83, 101, -10, -44, 12, -301, 264, -73, -6, -219, 62, -15, 9, -94, 210, -52, 65, 137, 129, 33, 165, 76, -17, 34, 65, -47, 103, -204, 267, -29, 76, 117, 120, 28, 44, -161, -334, -147, -105, -2, -202]
4486b02K12j31N6J5J74l05J80q1J26k91K55J67j40M6p5J2J39k49J49J4k90J19
4508a00K65k00R9R1j81q2J61k88J8O0j66K69k77L82N9K2r4P7l05K44j41J14J22
4531A49k36K66Ro3o3l17L05K08j50j7m8J2jj60M4J49J38k88k58K96K96r5k84q9
4555a97N0P4L0L47l53R2l61M67m18P7K05j24M8L7j1O5j17J37Ql2l0J81j09R2l12
4580a54L15k13N7j13JL90l58J78M7j14k10L10q4k54L09m4k35L51o7j97O0K16k45
4603e4O7p9k96L92r2J03P2j78K5m6P8om2n5J65R7Q1l91J06O4k1j9j86J30N5J27
4629I7k46J74L8k93J73J32k21J08%J6K35j94p7r7K61j05M9J04k95O3M3m1J75r0
4653Iq2j61K55P1k1R2j17j76Q0P0L7j75J09J18Q2j44J77m22K95j09M6J08k99K67
$$ y = [-202, 10, -121, -65, -50, 124, -181, -1, -82, 44, -247, 8, 175, 35, 81, 6, 18, 157, -92, 57, 71, -219, -100, 165, -35, 64, 155, -26, -108, 53, -235, -217, -157, -323, -54, -331, 51, 110, 132, 38, 115, -190, 54, -87, 27, 149, -87, 179, 188, 125, 62, -255, 50, 258, 108, 91, 43, 55, 54, -106, -62, 87, 225, -63, -321, -25, 271, 176, -108, -197, -147, -73, -43, 304, -49, 43, -318, 149, -269, -192, 13, -111, -63, -26, -37, 28, -89, 48, 56, 24, -6, 175, 66, 158, -154, 161, -52, 5, -108, -107, 283, -75, 103, 150, 36, -174, 136, 52, -202, 107, 63, -172, 179, 112, -85, -25, 191, -54, 13, -66, -362, 30, -62, 41, 113, -65, -40, -86, -8, -14, -56, -111, 54, 151, 232, -159, -53, 11, -10, -29, -215, -85, -30, 97, -149, 25, 63, -230, -57, 75, -146, -38, -38, -22, 213, 19, -58, -155, 106, 1, 50, 154, -141, -78, -35, -76, 99, 9, -73, -234, 21, 92, 71, 163, 46, -130, -50, 20, 57, -118, -9, 109, 191, 47, 224, -198, 97, -12, 34, 142, -157, 110]
4677A10j48J18l34K13J79l82J40J24r5Q8l9k5K21k27mR7R1M1l36K86O4k08pN2
4701A9j12K06J79k45m2j57K01q2L6l35L47lrk0j51j2J43k9j67K19j5M1R5j58J50
4726I9k14J4Q7J04k02N0K40k18l7O0O9pJ42k74J6J64j23q3K61l38K15R8k58P4
4750f1L87k87r8O0L28k53k68M59m87K62l29J31J50Kj87K04J99M7l74J28M5R1%
4773A49j19K23l76R3J74p3j10J50k97L20k54K01m9L3O7l29J76J45M5J20l63J45
4795G1K2k21r2L49p6k74L76k31m1M0L09k07j3p9j04K31n1q2j4L58j93o4j06M6
4819d6P8j94J91J6P2q5J18r7j92K03P6l86K78j64N2Q1q8k7Q0P0k02J20m4P7p7
4844i0K1Q5j02R4J22j49p8J00N4n7k39L66n2n2L1J06p4j71MMj37K35J09j46K35
$$ y = [110, -38, 80, -254, -41, 138, -244, -104, 20, -75, 13, -26, -51, 170, -57, -61, 36, 127, 168, -168, 118, 182, -26, -33, 19, -93, 113, 292, 47, 5, -152, 49, -33, 3, -332, 15, 12, 3, -17, -168, -180, -37, -66, -233, -14, -29, 12, 107, -51, 99, -115, -101, -14, 90, -112, -62, 178, -40, -77, -17, 52, 45, 187, -87, -71, 93, -30, -113, 148, -190, 25, 123, -135, -61, 326, 39, -59, 1, 329, 76, -192, 267, -220, 42, -287, -156, -6, -4, -191, 13, 212, 259, -115, 13, 58, 149, 149, 30, 253, -123, -30, 144, 71, -39, 111, -186, 134, -120, 81, 32, 65, 132, -197, -21, 124, 169, 289, -74, 71, 93, -128, -220, 129, 53, -221, 155, -76, -117, -77, 232, 25, 12, -67, -171, 60, 9, -73, -87, 271, 78, 14, -92, -46, 32, -162, 29, 45, 117, 32, 150, 53, -139, 64, 140, -246, 32, -132, -80, 1, -87, -114, -34, 36, -166, -46, -90, -13, -90, -69, 16, -86, 8, 130, -19, -97, 3, 57, 0, -239, 127, 75, 23, 54, 160, 86, -85, -81, -77, -214, 21, 130, -16, 219]
4869B19l7k05j20K50j14j79L37o2O2m44K33N0j61K91j89p1J86Q6j4j98K65l13
4891a28J01M8M0n3m3j00j0J58kj20Q6Q0r9j92L08N2k46j62L23j72Q0j57Q6K50
4915A28m18L76K4j29K6q2L6J48j29r6L98k84j5L6k52M04j04P9k08q5k2L81j31
4938H1l7n4j0n0q1l9kJ26r5K06nR6Q1l49L8K02k97K4J04J73l6k94r6L64j28K03
4964A25j97m1J52J16o5M9j90L7p5p1J1J04K3K3q5N0l1J95P8k11p2j63L46k00J27
4989C5J4r6m5J44l10M12j65J33P5R5l55j97L33l0O6Lj82J38O0L1k12o7J97J24
5013B01l68n4L69j40o8J0j21K71k72K33JM3Kl4O7l00J67k16J95K3J9K0L7O3Ql07
5039a51p1K22j02J53m6K2k4p1M3j49K09j30m7M33k68k27J16k94O94l64L4J82k67
$$ y = [219, 182, -23, -143, 107, -7, -186, 151, 89, 151, -293, -60, -10, -171, 120, -69, -140, 46, 132, 118, -80, 185, -128, -27, 21, 61, 8, -35, -135, -145, 13, 11, -109, -23, 57, -42, -234, 74, 126, -120, -282, 41, -131, -51, -208, -122, 128, -290, 86, 110, -19, 7, -75, -39, 109, -20, -116, 282, -2, -17, 19, -233, 171, 67, 146, -62, -147, -169, 212, 81, 44, -10, -20, -70, -151, -190, -192, -66, -161, 45, 40, 136, 217, -132, -94, 108, -189, -165, -61, 112, 76, -218, -314, 50, -78, 125, -72, -113, 39, 155, 90, 139, -51, -14, -89, -160, -149, -45, -22, 1, -84, -34, -65, 130, 208, -3, -75, -238, 108, -92, 35, 49, -47, -92, 52, -258, 154, -11, 122, 197, 292, -63, -260, 73, 43, 109, 112, -70, 68, 128, 159, -53, -120, 77, 201, -167, -221, 148, 8, -60, -50, -171, 100, -172, 61, 62, 105, 107, 73, 140, -160, 7, -209, -14, 9, 28, 48, 85, 148, 156, -151, -222, 0, -102, 51, 5, 27, 3, -68, -25, -174, 35, -95, -142, 291, 23, -204, -88, -382, 312, -52, -18, 164, -103]
5062a03J48j43J17j16M06l77MK34j17J81j88q5N4Qq4j30j21K58j00K15j04Q0J01
5085A38oj01r7k72M60k40M7R9o8J41j61j19K46J35j44j14J46k02N9j0O1j4pj16
5109a39R3P0j02l1M8J9K57m36P4J27j08K96k31j6j31J41O0o2J19L4j12j51K31
5132E0k24M19l95L07k28l4K03k63J66K3LK5j96J92j51J51L7r4J10j52j98K72k20
5155a97M4P5N4R2j99K98k89L23k47o4K84j59K24j75Jj34L04k6j98R0j42K26j20
5178F5r4QJ92q6R0j58k10J46L05k24j14L2K41l94qK09J49k26Q5J98j84k5PP2o5
5203A1J05j34J40k70n7J06J23J11k92L13J77l75J19k53K76j79jJ92l84K57J00
5224H5Q9j46m4N8N8k82J49M5k7J7j33J09l4oo8J22k35K37j11KJ79k9l54J51Q9
$$ y = [-103, 45, -98, 19, -97, 309, -68, -64, 170, 53, 234, 46, -39, 15, 23, -61, -191, -312, -54, -154, 61, -43, 37, 138, 132, 31, -66, -338, 122, -118, -71, 28, -40, 101, -60, -179, 67, 202, 58, -56, 90, -112, -53, -63, -2, -16, -23, -139, -46, 24, -78, -109, -61, -42, 215, -221, -147, -20, -128, 168, -63, -79, -210, -69, -9, -71, 48, 82, -30, -181, 50, -174, 245, -150, 157, -71, -105, 98, -165, 1, 24, 27, 52, -144, 48, -103, 48, 85, -9, 101, -51, -249, 23, -197, -153, -78, -24, 68, -131, 167, -122, 201, -46, -110, 174, 15, 239, 64, 65, -69, 235, 209, 11, 101, -41, 185, 65, -29, -21, 171, 85, 175, 17, -193, -47, 258, 34, -80, -48, 193, -201, -209, 0, 149, -77, 8, 206, 22, -3, 4, 76, 11, 116, -18, 122, -148, -205, -99, 24, 135, -157, 156, 333, -42, 77, -176, 100, -79, -80, 112, -272, -15, 85, 174, 28, -16, 42, 100, -182, -33, 12, -15, 2, -131, -22, -56, -62, -130, -8, -243, -6, -117, -115, 64, 35, -319, -168, -79]
5249g9K08p3j00j03J25R0k82J58m5L3K22J42k91P7l89L80r0R5k93Q1K17o3k32
5272b12J82j14R3R5q6K6L0r4j26J20m0J59pK4q1k2K97k98K05l72K44N8j70N7J06
5297G4Oj22k6l6NP2J18M8k83k9K52l84K27J18k85K63k4J2q0K86j56j63K17j26
5321a6J50j73J51R1p1l55J71j52J88j30K60r8M3k17O2J38j39J40q6q7K65j37J5
5344A3J06o6p2o7J2J91R3kj11j98M88l50J53j04j29J50m60L42J57R4j41k27j4
5367a42K07%k86K18L1J7NJ42m0j21Rj20r4Q8M9mj64K01k28K66j55M4K11j23J36
5392A47k37J37J64j56j41J03K2j16O6k11L19k39J74k61jK21J04j99K86k32J38
5413H8k93NJ27M6m2NJ06n5j92J58J73k4k85L73l01k1L00l20K38N0O5k79J54Mk7
$$ y = [-79, 129, 56, -44, -147, -22, 68, -214, -56, -101, -68, 154, 296, 5, 82, -307, 73, -17, 78, -215, -134, 83, 20, -212, -30, -144, -51, 44, -42, -16, 14, -80, -206, -86, -126, 33, 26, 50, -31, -53, 244, -54, 151, -221, 23, 81, -89, -32, 74, 80, -42, -68, -104, -99, -27, 91, 139, -144, -173, 79, -305, -78, 40, -245, 18, -6, 6, -74, 212, 56, -107, 110, -16, 134, -39, 112, 203, 132, -223, -52, -204, -16, -146, 114, 16, 59, -158, -96, 42, -97, 43, -43, -130, 135, -2, 13, 119, 53, -19, -86, -74, 117, 210, 208, 97, -101, 387, 37, 190, 86, -43, 107, -353, -11, 146, 240, 99, -128, -142, 65, 65, -221, -3, 28, 45, 50, 192, 152, 31, 40, -80, -174, -86, -37, -41, -205, -4, -232, 34, -121, -77, 134, 11, 147, -90, 47, 211, 55, -86, 17, 39, -77, -11, -222, 97, -142, 32, -229, -230, -9, 95, -104, 182, -50, 88, -205, -200, -73, -27, -69, -64, 42, -13, -205, -47, 126, 102, -183, 190, -111, -132, 168, -152, 86, 136, 201, -78, 76, 80, 53]
5438E3P8j67K09rj74p8K40j95K19j12r3o2L67l70j33L93m04K26q0M3J66k41M4
5461h0K54k75J5q6J36n3K16j03M6o8J62k33J00j1l8J31l84M26j10J68K4k90m6
5484i9M8j1K17j53k0P3j14n3J89K04m04J86k40R8P6J3J20k76R6k9J17J17k55P2
5508b8J22j2m8l01J24J44r2J47j14k51L04Q5j62j72M09k40J52k68L2L04l84P1
5530a78K38k38K77m08L35J13r4j02R3r8k46M18j82K36k27j8K25k10q5L2K7K07
5552A15l0NO0j99l61L88M8k10P9m5K20K5J08j9j39L7j76K77N2k33p8J75j07J06
5576I8o7k06J46n0K10q6p1O6k17M00j39O1j37J20j58O2m8j60L04l82N5K96L5k30
5600i8n4K35J31l05M3N1N8q8J39j47K26j91j62L73L6o03L48J82j44o8o6J57K2
$$ y = [53, 131, -36, 173, 164, -10, -88, 152, -43, 176, 64, -29, -91, 276, -94, -227, 166, -238, -12, -92, -49, 117, -124, -80, 174, -101, -86, -172, -36, -89, 127, 24, 70, 2, 164, -69, 31, 20, -18, 113, -271, 155, 45, 213, 237, -53, -99, -51, -62, 155, 2, -18, 55, -59, -112, 77, 281, -123, 63, -177, -79, -3, 10, 130, -146, -50, -79, 38, 155, -100, -28, 94, 82, 34, -267, -143, 1, -91, 56, -58, -309, -5, 80, -82, -254, 155, -85, 67, -201, -169, 135, -249, -178, 60, -178, 99, -309, 26, 139, 45, -57, 36, -62, -308, 110, -72, 164, -63, -81, 144, -66, -151, -119, -92, 115, 85, 90, 150, -49, -410, -22, 26, -184, -105, -150, 70, 95, 203, 184, 45, 82, -94, 183, 235, 2, -76, 99, -8, 98, 31, -175, -29, -79, 131, 45, -26, 40, -177, 223, 84, 145, 8, 128, -30, 32, -16, -176, 128, -254, -199, 97, 132, -98, -152, 83, 214, -91, -48, 3, 61, -27, 112, -35, 191, 0, -162, 211, 247, -356, -8, 174, 30, -38, -104, 53, 75]
5623G5J26k61J73J41j69j67r8J37j3J17j04J66n0o5j46k3K06k3n9J63j61J66o4
5646F7j64P3J38j20P0N7k67Q5J99r2K76l17j62K98j52J04r7k2P4O4J4j12l2J40
5670A22Q1l29m5K40J56m58L68k3j61r7J98k56K35l8k34J84j51J86N1l7q7L03l91
5693a83k6K33l71N17k35J2r2N9Q5J6J23q1q1Q6J28l14J81R7j14j2N1j77P8J21
5717A01r1j50J6L68m64L11m27K47l5N7J07j73J13J24L2N4j21o8J52k21j8R9r3
5740h0n0K16j05J59k3j30j4k88J48J26p6l6L70j65J25l57l1L51j51R2J8j15k36
5763b52J72J56J40l41J91n3l9J72kk18J66r7J45j82j56J60K9L13k61o9M1oJ18
5786A27m5k9l20J50j3R3J39k92K03J65j6j96J35j63O9jk0j30L89q3k11J29K9j22
$$ y = [75, 201, -60, 113, 254, 85, -82, -180, -43, -56, 61, -43, 123, 73, 8, -138, -161, 45, 22, -37, 126, -35, 131, 67, -97, -24, 114, -6, 64, 121, -146, -61, 138, 46, 322, 5, -157, 141, -11, 93, -4, -26, 48, 112, 126, 14, -18, 122, 203, -126, -171, 69, 225, -233, 135, 112, -49, -146, 52, -204, 31, -7, -241, -57, -208, -22, 29, -8, -95, 208, -183, -209, 24, -347, 170, -65, -53, -145, -86, -1, 15, 138, 57, -24, 62, 190, -124, 57, 154, 40, 28, 79, -98, -20, 101, 10, -140, -124, 244, -220, 91, -336, -89, -124, -67, 40, -133, -20, 104, 136, 190, 69, 1, 153, -68, -86, 13, -80, -130, 86, -19, 140, 117, -13, -27, -315, -167, -41, -117, -153, 217, 52, 177, -180, -211, 140, -11, 81, 99, -16, -252, -80, 76, 216, -125, 66, 13, -26, 146, 144, -74, 92, -5, 140, -42, -198, -38, -9, 304, 43, -26, 15, 9, 127, 82, 53, -267, -117, -130, -37, 102, -190, 13, 178, 162, -34, 101, -62, 7, 6, -14, -144, 245, 162, -49, 80, 109, -13]
5810a3NJ86j32n4m0J31l2j85K2m6K03o2J23J75k98P1Oj46J25k16J93j33K63k59
5834a13J47No5j92J73N4j21K77k24J64M2k61J31j51K89k91Q8r5m2K40j4J34k27
5857e2J23k17J17j4L78n33J37K66j83k30J13M9J22k41n2L21L7l0J62m09K34j83
5879h5J19P6j74r2m1P1K07L2N8m40L9K01J08j09m1r0n6J72l1OJ81j52O2j15R8
5904DL27k42j38J29R1j02p1K7j74j54J41N1k0O9K3K73l43N8K1L5j39P6L99m22
5928h1N1J28j85J53o6Q7j02Ok84K70k7J26L2j67L2Jj06J50P6j41J88j78J37k04
5952a04K78j06l0q0J67j81R0k31L35J91m16k52N06K0j75p9M16m83L4J82J82n93
5974c29J69k1P2L29k31J5qNn4J94j24j44J11k15L95l4j56J00o5o7J12J31r6k4
$$ y = [-13, -8, 178, 46, -8, -48, 83, 51, -134, -112, -158, 45, -17, 106, 281, -17, 54, 60, -86, 39, -177, 16, -117, 146, -113, 34, 39, -26, -218, -45, 9, -112, 165, -59, 105, 147, -114, 17, -134, 155, -136, -48, -143, -185, 55, 41, 175, -52, 71, -146, -29, -43, 335, -198, -61, 205, 22, -208, -95, -46, 76, -165, -217, 104, 141, 111, 273, -136, 98, -85, 34, 110, -64, -156, -197, -126, 81, 113, 171, -269, -230, -29, 79, -30, -71, -161, -217, -45, -76, -70, 111, -41, 21, -94, 4, 331, 89, -49, 80, 171, 69, -2, 25, -149, -303, -162, -111, -131, -62, -39, 234, -109, -51, -30, 5, -134, -58, 341, -81, -30, 98, -87, 66, 0, 87, -15, -9, -293, -23, -50, 76, 108, -59, -27, -26, -132, 18, 94, -47, 141, -37, 100, -104, 174, 68, 38, -42, 125, -56, 34, -197, 138, 329, -87, -339, 167, 187, 12, -67, 349, -134, -100, 82, 264, -329, -160, -181, -109, 220, -11, 4, -4, 1, -53, 141, 17, -127, -16, -231, 164, 130, -26, 74, 9, -58, 54, 185, 89, 65]
5998F5J1k33J4J56L9j38M6J6pJ50k84J77J1j76J60m5j90J61%j0Q6J28k7j85J66
6023I1k54J04J80k56L83k81J58j03j40k6K58J54k11q5M9K68j68j69J30J68J2k88
6045b6j7J75o9j60L52m41K30J15l19L30k53P0MJ59k94J66l7k07J94J11j57m1L05
6068A90k43J6o9o2n4L14k00J12k09L43j81j04J3R4k0q8K02K29m86P4N4J71j26
6091c0P4j92R2j46K82J75k41J99k51J31j68N0P7j85K40J47k09l54L00P3n6l63
6113c55M91J49k42j26P6L3K9n1k38M2l2L48j08K17l09K69r7j41j17K88k02j60
6135b36P3L59l23J59j19J19j00Q7J40l47J05k45M19K16k63p4L5P0j78J2J99j31
6157b3N3Q4j39l6J13m2L2J55k62p4o3J85J21q1r3N5O4k29L12n9r0J36o8j29J16
$$ y = [65, 76, -157, -143, 13, 52, -86, -40, -24, -31, 119, -165, 12, 23, -153, 7, -38, -228, -67, -67, -77, 9, 137, 110, -75, 91, -163, -59, 121, -135, 248, -33, 125, 22, -118, -144, 114, 268, 57, -28, 21, 289, 121, -48, 82, 250, 262, -26, -43, 132, 63, -97, 255, -186, 44, 159, -160, 170, -83, -13, -9, 150, -144, 22, -15, -222, -28, 83, -74, -115, 190, -53, -37, -106, -168, -222, 92, -108, 4, -205, 138, -43, -147, -134, -40, -60, -148, 54, 283, -203, -129, -75, 96, -30, 44, -148, -56, -202, 80, 255, 14, 213, -38, 93, -75, -25, 52, -133, 107, 254, 45, -309, -9, 64, 8, -355, 136, 285, 43, -83, -7, 26, 55, 4, -234, -192, -224, 124, 16, 233, -76, 193, 96, -45, -162, 126, -76, -236, -163, 196, -127, 32, -87, 32, -68, 19, 159, -188, -83, -328, 91, 307, 44, -30, 5, 75, -103, -91, 108, -23, 30, 114, -25, -61, 52, 10, 42, 197, -65, -139, -202, -17, 104, 23, -70, -15, 49, -180, 132, 73, -17, 119, 51, -78, 38]
6182C8j8J50l54L67j05j25O6j16K33m08M06k18K80l55M4j55L52j84K72Q6j74k61
6204a79L72j50J87k44J9R0p9K5K5j54O2p8J45K45l75J59j83J04j71L10k65J22
6226a3j24J3J20K09j22k03J46J25k96M2j51N9L38lP0m56K59R9j79K33r0m7k3k2
6250a6N9L1L9k21j05K31J23k31J10n6J48k93K64J8m50M47rQ2m42J83J30k24k3
6273b05K02O9n9kJ49l90J65J15N3q4J92l30K90q5k64K84k53Ol7J85J41j42j38
6296a38J8P3P4k45L43j64m9K81l13j08L02q7J73j80J34j66n5J38k03K11p0J88
6318A57j44O0l48J29LK18nq1RO4n9l09L98j72J52l45K24Q3j08J51Q4m4o3n9J7
6343A2r3K57jj26k78K78k75K42J71j66K1PJ09%l04p9M37mk72P4M7p1j87J97R8
$$ y = [38, 20, 170, -184, 183, 78, -47, 19, -97, 136, -272, 134, -84, 196, -159, -115, -270, 82, -102, 170, 256, 82, -179, 193, 43, 230, -14, 5, 95, 16, 41, 66, -88, -26, -104, 41, 286, -89, 70, -113, -9, -180, 130, -135, -13, -137, -124, -4, 205, 83, -120, 26, 151, -145, -103, -254, -195, 143, 140, 210, -246, 13, 112, -67, 166, 76, 29, 6, -16, 43, 74, 113, -108, -213, 18, 141, -90, 20, -36, 112, -181, 83, 101, -349, 98, 89, 171, -271, -88, 42, -182, -205, -3, 66, 7, 5, 154, -236, -71, 44, 97, 13, 205, -125, 165, 80, -184, 100, -153, -147, -184, 1, 142, 0, -138, -120, -47, 27, -218, 125, -39, -88, 193, -120, -228, 74, -13, 160, -20, 114, -52, -107, 31, -172, 39, -31, 157, 13, 73, -275, -146, -143, 75, 70, -11, -2, 62, 3, -306, 92, -80, 72, -273, -49, 34, -74, 77, 161, 117, 54, -5, 12, -81, 176, 175, 49, -229, 49, -226, 16, 187, 21, 42, 49, 158, 158, -146, -225, 212, 208, -64, 10, 57, -14, -201, -4, 94]
6368I4k02N8l4n6K50j41J10r0J7J29O1j80K3j02p4O9o1NJ57j9J09k21J90J29k69
6393d8K24j48rk41J9J83r8m2rJ96L8j66J82k37J39NJ07o6K6j13K19m6j35M2Q8
6418A10j69K28j00j13Q1m7j43K2K04M8j18l0R6Jm7k84L40J25l18l3L7j72L12J3
6442D3K8J10J0r7J4j32n2r0K40M7J14j48k18K5K09j3p2L9J47k21Lj65J16J35j99
6467a27K51p7o6N7l11L24j50Q5o3j05J60J27j5k64K63j19k5J5r4m3J7Q8K45n1
6491A22o5K6kl3j04Q2l0M1j95Q5l2J42J07k89K5J02q2J00n6j3J68l6n7q7K6L2
6517b3q8Q9j24K22J12l6l25Q1o9J9J91j10J78o1m1K1Q9j08q5k75N45j40l0N2j81
$$ y = [94, -108, -50, -84, -140, 110, -31, 79, -11, 6, 135, 196, 16, 39, -63, -137, -68, -129, -124, 33, 14, 123, -98, 92, 221, -48, 176, 28, 19, -222, -203, -20, -118, -160, -169, 27, 65, -101, 81, -156, -17, -12, 95, 29, 55, -58, 161, 115, -20, 22, 110, -59, 169, 69, -44, 37, -10, -153, -131, 73, 121, 3, -27, 69, 70, 23, -261, 79, 204, -114, -147, -110, -282, 30, 43, 71, 181, 191, 94, 108, -24, -76, -166, 74, 121, 235, 87, -131, -106, 103, 90, 18, 57, 204, -17, -14, -179, -63, 72, -127, 124, 47, -19, 38, -273, 51, -99, -14, -77, -182, -22, 105, 90, -174, 89, -30, -55, -40, -134, -177, -160, -72, 173, 122, 57, 83, 81, 48, -56, 26, -4, 37, -158, -73, -105, 37, 144, -145, -120, -18, -100, 0, -56, -69, 99, 63, 6, -81, -55, -23, -111, -22, -146, 76, 188, 152, -173, -92, -161, -142, 49, -61, 117, 56, 15, 36, 125, 17, -68, -343, 202, 62, 32, 84, -97]
$$ [...]
8191A2
##END NTUPLES=NMR FID
##END=
