##TITLE=1H_TG-2255-A-1
 CDCl3, 8 sc, 
 2.10.2020
##JCAMPDX= 6.0         $$ Bruker NMR JCAMP-DX V2.0
##DATA TYPE= NMR FID
##DATA CLASS= NTUPLES
##ORIGIN= UXNMR, Bruker Analytische Messtechnik GmbH
##OWNER= root
$$ XWIN-NMR		Version 3.5
$$ Fri Oct  2 10:27:47 2020 Russian Standard Time (UT+4h)  she@DPX200
##.OBSERVE FREQUENCY= 200.1315066352
##.OBSERVE NUCLEUS= ^1H
##.DELAY= (6, 6)
##.ACQUISITION MODE= SIMULTANEOUS
##.ACQUISITION SCHEME= undefined
##.AVERAGES= 13
##.DIGITISER RES= 18
##SPECTROMETER/DATA SYSTEM= spect
##.PULSE SEQUENCE= zg30
##.SOLVENT NAME= CDCl3
##.SHIFT REFERENCE= (INTERNAL, CDCl3, 0, 15.7039)
##AUDIT TRAIL= $$ (NUMBER, WHEN, WHO, WHERE, WHAT)
$$ ##TITLE= Audit trail, XWIN-NMR		Version 3.5
$$ ##JCAMPDX= 5.01
$$ ##ORIGIN= Bruker BioSpin GmbH
$$ ##OWNER= she
$$ F:/spectra/data/she/nmr/H-F/1/audita.txt
$$ ##AUDIT TRAIL=  $$ (NUMBER, WHEN, WHO, WHERE, WHAT)
(   1,<2020-10-02 10:26:49.12 +0400>,<she>,<DPX200>,
      <created by zg, POWCHK disabled, PULCHK disabled
       terminated by command 'halt'
       configuration hash MD5:
       00 E9 B6 7A A2 85 ED C7 34 08 36 98 17 FE 4E 26
       data hash MD5: 16K
       8E B4 90 B3 C0 99 CD DC 1C 1B 73 ED 5C FF 14 30>)
$$ ##END=
$$ 
$$ hash MD5
$$ F1 EC 23 9A E3 EF 2C 1B 36 EF 36 81 E6 48 E3 F5
##$RELAX= 
##$RELAX= 
##$RELAX= 
##$RELAX= 
##$RELAX= 
##$RELAX= 
$$ Bruker specific parameters
$$ --------------------------
##$DU= <F:/spectra>
##$EXPNO= 1
##$NAME= <H-F>
##$PROCNO= 1
##$TYPE= <nmr>
##$USER= <she>
##$AMP= (0..31)
100 100 100 100 100 100 100 100 100 100 100 100 100 100 100 100 100 100 
100 100 100 100 100 100 100 100 100 100 100 100 100 100 
##$AQSEQ= 0
##$AQ_mod= 1
##$AUNM= <au_zg>
##$AUTOPOS= <>
##$BF1= 200.13
##$BF2= 200.13
##$BF3= 200.13
##$BF4= 200.13
##$BF5= 200.13
##$BF6= 200.13
##$BF7= 200.13
##$BF8= 200.13
##$BYTORDA= 1
##$CFDGTYP= 0
##$CFRGTYP= 5
##$CHEMSTR= <none>
##$CNST= (0..31)
1 1 145 1 1 1 1 1 1 1 1 1 1 1 1 1 1 1 1 1 1 1 1 1 1 1 1 1 1 1 1 1 
##$CPDPRG= <>
##$CPDPRG1= <>
##$CPDPRG2= <>
##$CPDPRG3= <>
##$CPDPRG4= <mlev>
##$CPDPRG5= <mlev>
##$CPDPRG6= <mlev>
##$CPDPRG7= <mlev>
##$CPDPRG8= <mlev>
##$CPDPRGB= <>
##$CPDPRGT= <>
##$D= (0..31)
0 1.2 0 0 0 0 0 0 0 0.06 0 0.03 0 0 0 0 0.0002 0 0 0 0 0 0 0 0 0 0 0 0 
0 0 0 
##$DATE= 1601620008
##$DBL= (0..7)
120 120 120 120 120 120 120 120 
##$DBP= (0..7)
150 150 150 150 150 150 150 150 
##$DBP07= 0
##$DBPNAM0= <>
##$DBPNAM1= <>
##$DBPNAM2= <>
##$DBPNAM3= <>
##$DBPNAM4= <>
##$DBPNAM5= <>
##$DBPNAM6= <>
##$DBPNAM7= <>
##$DBPOAL= (0..7)
0.5 0.5 0.5 0.5 0.5 0.5 0.5 0.5 
##$DBPOFFS= (0..7)
0 0 0 0 0 0 0 0 
##$DE= 6
##$DECBNUC= <off>
##$DECIM= 32
##$DECNUC= <off>
##$DECSTAT= 4
##$DIGMOD= 1
##$DIGTYP= 9
##$DL= (0..7)
0 120 120 120 120 120 120 120 
##$DP= (0..7)
150 150 150 150 150 150 150 150 
##$DP07= 0
##$DPNAME0= <>
##$DPNAME1= <>
##$DPNAME2= <>
##$DPNAME3= <>
##$DPNAME4= <>
##$DPNAME5= <>
##$DPNAME6= <>
##$DPNAME7= <>
##$DPOAL= (0..7)
0.5 0.5 0.5 0.5 0.5 0.5 0.5 0.5 
##$DPOFFS= (0..7)
0 0 0 0 0 0 0 0 
##$DQDMODE= 0
##$DR= 18
$$ [...]
##$SUBNAM2= <"">
##$SUBNAM3= <"">
##$SUBNAM4= <"">
##$SUBNAM5= <"">
##$SUBNAM6= <"">
##$SUBNAM7= <"">
##$SUBNAM8= <"">
##$SUBNAM9= <"">
##$SW= 16.880792210976
##$SWIBOX= (0..15)
0 0 2 0 0 0 0 0 0 0 0 0 0 0 0 0 
##$SW_h= 3378.37837837838
##$TD= 16384
##$TD0= 1
##$TE= 0
##$TE2= 300
##$TE3= 300
##$TEG= 300
##$TL= (0..7)
0 120 120 120 120 120 120 120 
##$TP= (0..7)
150 150 150 150 150 150 150 150 
##$TP07= 0
##$TPNAME0= <>
##$TPNAME1= <>
##$TPNAME2= <>
##$TPNAME3= <>
##$TPNAME4= <>
##$TPNAME5= <>
##$TPNAME6= <>
##$TPNAME7= <>
##$TPOAL= (0..7)
0.5 0.5 0.5 0.5 0.5 0.5 0.5 0.5 
##$TPOFFS= (0..7)
0 0 0 0 0 0 0 0 
##$TUNHIN= 0
##$TUNHOUT= 0
##$TUNXOUT= 0
##$USERA1= <user>
##$USERA2= <user>
##$USERA3= <user>
##$USERA4= <user>
##$USERA5= <user>
##$V9= 5
##$VALIST= <valist>
##$VCLIST= <CCCCCCCCCCCCCCC>
##$VD= 0
##$VDLIST= <DDDDDDDDDDDDDDD>
##$VPLIST= <PPPPPPPPPPPPPPP>
##$VTLIST= <TTTTTTTTTTTTTTT>
##$WBST= 1024
##$WBSW= 4
##$XGAIN= (0..3)
0 0 0 0 
##$XL= 0
##$YL= 0
##$YMAX_a= 3118
##$YMIN_a= -1537
##$ZGOPTNS= <>
##$ZL1= 120
##$ZL2= 120
##$ZL3= 120
##$ZL4= 120
##$ABSF1= 10
##$ABSF2= 0
##$ABSG= 5
##$ABSL= 3
##$ALPHA= 0
##$AQORDER= 0
##$ASSFAC= 0
##$ASSFACI= 0
##$ASSFACX= 0
##$ASSWID= 0
##$AUNMP= <proc_1d>
##$AZFE= 0.1
##$AZFW= 0.1
##$BCFW= 1
##$BC_mod= 2
##$BYTORDP= 1
##$COROFFS= 0
##$CY= 11.3945322036743
##$DATMOD= 1
##$DC= 2
##$DFILT= <>
##$DTYPP= 0
##$F1P= 16.9975609425685
##$F2P= -3.02152046262296
##$FCOR= 0.5
##$FTSIZE= 0
##$FT_mod= 4
##$GAMMA= 1
##$GB= 0.15
##$INTBC= 1
##$INTSCL= 1
##$ISEN= 128
##$LB= 0.24
##$LEV0= 0
##$LPBIN= 0
##$MAXI= 10000
##$MC2= 0
##$MEAN= 0
##$ME_mod= 0
##$MI= 1.114404
##$NCOEF= 0
##$NC_proc= 0
##$NLEV= 6
##$NOISF1= 3.799351
##$NOISF2= 2.8
##$NSP= 1
##$NTH_PI= 0
##$NZP= 0
##$OFFSET= 15.70392
##$PC= 1
##$PHC0= -10419.79
##$PHC1= 22.40089
##$PH_mod= 1
##$PKNL= yes
##$PPARMOD= 0
##$PSCAL= 0
##$PSIGN= 0
##$REVERSE= no
##$SF= 200.130013532006
##$SI= 16384
##$SIGF1= 3
##$SIGF2= 2
##$SINO= 400
##$SIOLD= 16384
##$SREGLST= <1H.CDCl3>
##$SSB= 0
##$STSI= 0
##$STSR= 0
##$SW_p= 3612.71676300578
##$SYMM= 0
##$S_DEV= 0
##$TDeff= 0
##$TDoff= 0
##$TI= <>
##$TILT= no
##$TM1= 0
##$TM2= 0
##$TOPLEV= 0
##$USERP1= <user>
##$USERP2= <user>
##$USERP3= <user>
##$USERP4= <user>
##$USERP5= <user>
##$WDW= 1
##$XDIM= 8192
##$YMAX_p= 0
##$YMIN_p= 0
$$ End of Bruker specific parameters
$$ ---------------------------------
##NTUPLES= NMR FID
##VAR_NAME=  TIME,          FID/REAL,        FID/IMAG
##SYMBOL=    X,             R,               I
##VAR_TYPE=  INDEPENDENT,   DEPENDENT,       DEPENDENT
##VAR_FORM=  AFFN,          ASDF,            ASDF
##VAR_DIM=   8192,          8192,            8192
##UNITS=     SECONDS,       ARBITRARY UNITS, ARBITRARY UNITS
##FACTOR=    0.000296,      1,               1
##FIRST=     0,             0,               0
##LAST=      2.424536,      0,               0
##MIN=       0,             -1537,           0
##MAX=       2.424536,      3118,            0
$$ Real data points
##PAGE= N=1
##DATA TABLE= (X++(R..R)), XYDATA
0 0 0 0 0 0 0 0 0 0 0 0 0 0 0 0 0 0 0 0 0 0 0 0 0 0 0 0 0 0 0 0 0 0 0 7 -13 13 -13 13 -13 13 -13 13 -13 20 -26 26 -26 26 -33
49 -33 39 -39 40 -46 52 -59 65 -72 78 -85 98 -111 124 -148 174 -205 255 -332 465 -788 3118 3094
71 3094 -78 2319 690 1296 -110 1943 1837 1814 79 2207 -436 339 -4 906 1521 -444 1046
88 1046 -90 -2 -1242 873 -73 494 -448 477 209 -1481 523 50 589 -742 988 46 -20 -748 1433
107 1433 131 -324 1197 -289 627 -919 1092 246 294 -119 565 -414 -374 -177 126 670 -1200 874
125 874 -801 -411 -1142 273 -77 -403 -94 40 -401 -1537 538 -526 405 -489 966 -195 -660 36
143 36 347 132 67 1341 18 785 -617 957 20 379 743 796 653 -267 561 178 378 -475 1450 -128
163 -128 213 -67 345 -39 -667 721 33 76 -546 775 -611 24 -348 514 -231 -455 603 -312 131
182 131 -409 584 -334 205 -503 654 -178 -221 367 -40 206 -824 696 -292 -90 -225 699 -505 -222
201 -222 -12 -95 -82 -645 801 -501 51 -412 346 -500 -159 69 220 -49 -333 586 -507 290 -428 665
221 665 -66 99 149 451 -26 -224 662 -61 371 -261 1053 -297 148 261 302 -26 68 561 -13 314 -252
242 -252 734 -503 288 -73 372 9 -123 399 -164 10 -330 509 -401 305 -285 442 -328 -287 248 -162
262 -162 18 -279 568 -432 21 -274 422 -528 105 222 -178 70 -333 357 -401 170 -184 437 -377 126
282 126 -32 39 -16 -243 576 -396 182 -230 389 -340 159 28 237 -173 -133 472 -383 276 -122 581 -360
303 -360 190 77 146 -141 230 383 -136 353 -263 543 -321 325 120 382 -55 74 266 -64 149 -65 644
324 644 -357 363 -106 215 -222 49 282 -24 41 -99 324 -504 242 -203 309 -326 86 31 -252 -14 -153
345 -153 245 -245 234 -286 324 -443 140 68 69 59 -70 332 -332 196 -67 410 -228 389 -20 104 -43 -15
367 -15 363 -180 365 -63 307 -300 247 -101 189 -28 134 194 -231 205 -297 312 -222 245 -43 210 -231
388 -231 62 91 -124 201 -82 408 -337 323 -94 171 -65 218 110 25 127 -71 337 -293 379 -130 229
409 229 -175 147 19 -54 59 -32 155 -310 200 -318 256 -293 169 -27 -113 -78 -85 70 -241 251 -102 253
431 253 -296 271 -164 75 115 92 274 -38 265 -68 284 -166 428 37 319 84 167 165 -111 278 -39 348
453 348 -58 339 -101 214 -158 145 103 -59 261 -78 221 -201 230 -154 185 -71 223 -15 77 149 -137
474 -137 283 -214 289 -68 244 -58 219 -4 93 84 4 205 -124 350 -167 296 -135 134 -54 53 15 49
496 49 122 -122 237 -242 174 -195 197 -75 148 49 7 68 -64 162 -131 332 -132 342 -46 164 19 64
518 64 103 42 260 -12 292 -78 279 -165 271 -1 169 172 53 213 -64 176 -88 245 -116 310 -15 165
540 165 -24 10 105 -112 238 -68 231 -92 188 -159 150 -125 80 103 -44 163 -120 162 -230 160 -138
561 -138 135 -69 143 -22 -33 76 -142 168 -187 219 -73 157 -111 129 -50 15 83 -2 180 -110 267 -150
583 -150 173 -115 131 4 106 75 82 138 -115 232 -128 185 -90 267 -2 93 78 28 67 -28 195 -42 262
606 262 -92 288 -87 82 28 104 115 16 242 -9 154 -102 223 -111 210 13 151 88 -48 108 -85 97
628 97 -127 249 -99 134 -86 83 -98 -62 84 -70 128 -113 173 -128 88 -122 187 -55 53 119 -17
649 -17 91 -126 219 -113 140 -25 215 -16 121 27 69 96 -54 262 -56 213 -25 232 -62 89 58 79
671 79 52 34 222 -49 193 -103 188 -77 104 50 155 42 25 184 -68 160 -45 282 -59 190 37 116
693 116 12 19 143 21 160 -35 264 -133 146 -49 109 -27 46 151 -38 56 -69 150 -140 138 -68 173
715 173 -50 27 58 -44 30 -49 194 -109 153 -32 157 -104 105 75 38 96 -3 217 -71 152 1 211 -79
738 -79 162 80 99 59 51 202 -85 177 -23 202 -43 142 36 113 0 57 160 -51 179 -8 220 -99 157
761 157 16 103 12 82 117 -3 126 -30 215 -114 146 23 129 -24 98 77 -24 87 -14 178 -98 174
783 174 -40 132 -73 47 70 -28 29 4 133 -137 140 -51 118 -107 116 34 0 42 4 132 -77 133 -5
806 -5 167 -110 169 45 46 40 46 140 -57 153 -10 168 -74 174 23 117 5 86 147 -55 154 14 149 -76
830 -76 196 8 93 3 115 76 -23 115 -30 143 -104 151 -6 82 -58 124 48 -17 85 5 112 -94 174
853 174 -59 89 -62 94 18 4 27 34 112 -100 160 -25 101 -85 131 -2 13 35 47 76 -77 157 -45 122
877 122 -99 154 -8 5 30 67 63 -48 138 -8 138 -71 192 -20 73 10 85 97 -14 152 39 123 -46 206
901 206 -18 102 24 141 62 -8 122 9 112 -62 179 -8 107 -30 145 15 -24 100 5 91 -59 155
923 155 -55 71 -62 124 -2 16 64 29 82 -98 145 -52 63 -30 152 -14 37 48 36 54 -49 154 -28
946 -28 108 -55 150 -25 24 33 73 35 -7 152 -26 97 -39 167 -34 86 40 84 50 -17 118 5 93 -46
970 -46 196 -36 107 40 106 15 30 127 26 127 6 216 -24 121 0 135 21 33 135 6 69 -18 135
993 135 -62 97 -19 131 -22 30 54 -9 36 -44 145 -34 76 -6 117 -62 60 37 31 59 -4 131 -51 79
1017 79 -43 124 -36 71 59 85 39 2 128 -40 128 -9 158 -27 119 33 84 22 14 121 -10 100 -7
1040 -7 159 -54 96 19 92 5 64 122 18 117 3 174 -31 136 55 144 25 80 105 15 72 30 160 -40 134
1065 134 19 125 -20 56 62 13 57 14 137 -43 89 -17 104 -52 91 52 20 35 6 87 -52 100 -22 124
1089 124 -32 95 23 49 27 23 120 -24 106 13 124 -37 95 19 83 43 63 113 -7 100 0 134 -51 119
1113 119 34 103 10 85 76 -6 83 17 131 -22 133 25 99 -20 70 63 27 82 39 140 -31 128 -10 96 20 98
1139 98 42 49 69 24 112 -44 126 0 108 -27 101 23 14 26 26 71 -30 113 -5 104 -43 91 2 49 34 52
1165 52 77 -22 95 -6 78 -43 125 6 73 29 49 58 -8 82 9 113 -21 126 29 85 9 80 60 12 82 25 100
1192 100 -21 112 -6 89 -7 83 59 32 79 26 82 -31 122 -2 93 2 98 33 43 50 29 82 -10 100 12 87 -20
1219 -20 82 -1 37 51 42 58 -7 104 -17 102 -30 104 18 57 34 52 44 -12 94 -16 73 -26 102 -5 59 21
1245 21 35 36 10 92 25 95 -39 124 -8 68 21 105 62 34 103 11 74 9 132 0 129 21 97 49 52 77 36 92
1273 92 -7 119 13 92 -7 102 17 53 69 27 78 -5 97 -13 85 -7 92 12 59 53 51 64 8 101 -1 89 16 100
1301 100 13 73 38 57 40 19 87 -8 79 -10 82 -24 52 13 49 35 31 69 7 84 -19 93 2 63 25 69 19 36 67
1330 67 9 73 9 104 2 98 19 80 48 64 62 39 80 20 131 11 93 30 89 10 70 57 41 71 24 81 -1 98 8
1359 8 92 14 69 43 39 34 19 98 -3 88 13 78 4 85 34 67 49 38 78 9 91 22 87 -7 69 28 57 44 62 73 22
1390 22 97 9 102 1 85 21 68 26 50 65 7 78 11 79 4 88 29 74 38 51 54 45 86 47 101 14 105 26 98 51 78
1421 78 69 38 77 46 80 20 88 26 101 39 83 43 40 57 43 70 16 77 4 84 6 66 20 52 46 27 56 6 70 12 89 5
1453 5 92 38 69 55 47 54 17 74 15 92 19 75 19 56 23 54 52 27 92 22 72 19 89 11 72 45 62 50 39 55 14 76
1485 76 5 88 20 82 24 70 45 55 75 41 76 36 121 20 92 40 90 58 67 71 52 82 15 91 8 72 18 76 22 53 50
1516 50 41 43 17 59 8 86 12 85 9 57 35 42 29 28 77 14 68 18 64 8 71 43 63 62 51 78 9 78 30 88 30 99 50
1549 50 77 45 48 65 33 62 19 83 12 76 12 58 29 49 71 46 84 44 80 4 64 32 72 43 80 49 50 78 32 90 15
1580 15 91 44 80 23 65 48 38 51 41 84 23 85 8 75 1 64 28 27 37 35 54 23 61 8 71 12 73 32 53 47 36 46
1612 46 29 73 36 95 29 78 41 67 36 62 47 24 70 32 82 23 81 29 86 50 63 66 40 78 36 67 24 83 24 72 43
1643 43 69 45 47 55 31 79 14 82 34 74 15 75 39 43 62 54 59 21 89 24 73 46 75 46 48 55 50 55 12 70 15 70 29 73 23
1678 23 46 34 40 44 31 63 12 61 20 81 22 43 35 43 42 35 56 20 57 19 86 37 85 48 65 61 36 84 62 97 47 92 37 72
1712 72 33 64 38 55 66 41 85 31 60 5 66 24 68 37 40 52 45 57 18 78 25 70 30 64 30 53 40 59 67 28 80 31
1744 31 89 29 74 34 76 61 66 56 39 69 30 77 23 70 14 40 31 49 20 30 55 17 56 38 60 29 72 37 71 48 41 59
1776 59 46 50 29 89 39 68 41 84 33 45 72 46 56 35 74 28 84 41 64 33 48 48 45 41 36 58 27 52 15 66 34 46 41
1809 41 49 55 28 67 19 64 27 70 32 68 52 59 58 51 70 25 76 28 73 25 73 34 57 38 35 66 17 62 42 67 23 55 32
1842 32 51 30 41 34 38 53 21 60 40 64 39 67 38 62 61 57 82 44 84 34 78 52 83 55 65 71 50 62 35 73 23 73 46
1875 46 74 37 60 36 52 65 43 55 36 59 36 71 18 68 53 49 50 30 47 16 62 25 59 35 66 38 60 52 65 73 26 69
1907 69 47 58 35 78 35 59 45 51 55 28 61 34 50 17 62 45 55 28 49 40 45 63 48 61 39 71 33 71 29 67 49 48 52
1940 52 50 78 35 86 44 72 52 93 60 61 59 58 67 32 73 38 66 31 84 38 46 36 47 54 33 59 26 50 11 69 36 61 37 45
1974 45 60 47 53 35 62 35 76 39 61 50 60 56 37 58 46 61 38 65 28 62 30 67 48 64 61 34 52 31 69 25 65 27
2006 27 58 40 47 49 44 61 29 85 47 76 36 71 59 52 61 69 71 51 74 54 82 40 81 46 58 54 70 58 49 77 40 81 42 62 31
2041 31 64 43 52 52 30 50 34 51 20 68 34 55 34 40 36 37 68 40 54 32 67 32 73 46 58 59 54 78 63 60 50 60 48 77
2075 77 32 65 42 47 44 50 49 32 69 43 66 40 76 39 60 60 58 66 29 69 42 58 46 66 31 65 53 53 64 57 70 53 77 49 77
2110 77 43 85 49 53 56 50 65 38 60 38 64 28 58 34 59 38 45 46 42 56 47 64 31 57 40 69 57 44 45 50 50 49 69 37 68 41
2146 41 63 65 71 47 69 55 48 84 40 75 51 76 52 69 44 36 54 39 44 44 57 24 60 23 74 51 64 53 49 62 33 61 29 72
2180 72 45 85 42 56 48 54 51 46 64 47 63 43 67 32 66 35 60 53 46 68 20 57 30 64 37 56 26 49 49 32 43 57 57 39
2214 39 59 44 54 41 57 55 50 49 52 86 52 68 57 78 53 61 62 58 56 47 62 55 61 43 70 33 67 55 61 55 61 46 41 59 19 62 34 74
2252 74 40 49 47 40 46 42 65 30 60 40 68 49 71 58 71 54 42 56 43 67 49 67 44 39 36 46 40 43 51 27 60 31 69 28 54
2287 54 54 62 46 61 57 28 55 50 70 39 59 45 71 44 55 64 62 60 48 71 50 90 49 81 56 76 61 66 68 51 57 44 60 40 69
2322 69 51 50 46 41 37 46 52 34 60 46 70 40 60 52 60 55 52 81 50 60 39 68 45 69 37 63 46 54 47 56 56 37 61 32 51 38 53
2359 53 64 73 60 48 54 39 46 31 43 30 63 32 58 55 53 41 53 47 55 64 45 71 49 71 53 67 62 68 75 42 72 32 68 35 66 61
2395 61 34 52 40 53 42 64 39 65 39 52 39 43 41 44 53 32 45 38 59 36 59 46 56 43 51 49 54 67 52 77 55 73 53 81
2429 81 52 63 58 50 62 39 62 35 66 36 54 37 64 48 55 37 43 57 36 57 35 52 39 48 50 49 60 53 67 57 60 35 63 54 64
2464 64 47 65 63 70 64 56 72 70 67 55 62 61 52 35 59 50 45 59 40 51 22 56 45 45 44 59 54 49 51 31 59 33 58 47 61 46 63 43
2502 43 50 59 64 54 62 86 52 64 63 78 67 55 58 61 62 52 63 39 63 41 45 46 48 53 48 38 36 51 34 47 43 59 43 57 54 44 54 60 53
2541 53 59 69 50 64 44 62 57 59 69 48 75 44 65 46 74 53 60 44 52 58 57 55 49 61 36 51 39 44 46 58 40 55 50 47 49 48 60 41
2579 41 67 44 59 54 66 55 59 73 53 84 56 83 71 72 53 59 52 52 51 45 51 36 58 35 63 45 53 46 57 57 63 58 28 40 40 55 53 68
2617 68 44 64 46 51 66 39 68 58 67 54 75 66 61 73 59 60 56 72 45 51 26 58 43 50 59 42 45 38 55 46 55 43 51 53 46 47 48 37 45 57
2657 57 44 62 52 47 49 62 48 72 62 62 70 52 72 68 65 65 63 56 71 55 49 60 49 52 25 56 46 49 41 46 44 46 40 37 48 36 59 36 65
2696 65 53 57 47 53 62 56 63 46 70 54 68 38 69 65 49 64 76 71 76 53 51 71 42 62 37 64 38 40 37 32 46 34 49 34 52 44 38
2733 38 32 52 39 49 55 54 56 48 72 50 75 60 60 54 68 77 58 66 57 54 57 66 48 57 58 55 50 50 45 54 61 41 54 32 48 51 47 48 41 43 35 49 37 55
2777 55 41 60 56 68 48 70 72 64 62 62 70 44 65 53 65 42 53 47 44 66 51 56 59 59 57 42 49 49 36 47 52 40 49 39 46 45 45 40 46 41 48 49
2819 49 48 55 42 67 55 62 49 70 40 79 58 71 78 68 69 49 71 55 72 55 63 54 53 47 40 49 36 46 37 50 37 54 46 54 45 36 53 58 55
2858 55 40 63 48 48 52 61 57 62 56 50 65 56 70 76 82 68 67 67 65 54 56 51 50 68 34 46 38 45 44 50 43 59 50 49 46 36 52 47 48 41 61 57 59 39 54
2903 54 62 61 63 48 62 56 61 66 61 58 64 77 78 77 68 72 53 75 65 59 53 52 68 43 52 45 60 46 42 39 54 35 49 41 38 43 47 62 53 65 43 58 58
2946 58 57 63 60 70 60 66 51 72 58 82 47 60 68 37 53 53 51 48 58 46 63 35 44 44 38 44 41 52 44 50 26 50 35 60 49 68 59 63 62
2985 62 66 65 60 71 50 78 46 75 57 58 57 56 71 49 59 57 64 42 48 39 62 33 52 62 55 51 45 41 42 61 50 50 52 50 54 70 62 46 65 54
3025 54 67 54 64 65 72 67 58 80 60 58 67 72 54 56 52 51 38 48 46 43 46 48 49 46 51 41 53 53 27 52 41 54 45 50 47 55 52 61 52 55 61 46 56 52
3069 52 69 52 61 60 58 54 61 57 55 69 57 55 42 58 54 52 44 34 36 43 25 32 42 34 36 37 34 33 31 32 54 36 47 56 50 70 43 65 52 70 52 56
3111 56 54 45 56 46 69 56 64 51 64 55 60 42 61 46 48 46 44 36 38 44 28 44 37 42 34 40 46 49 44 35 55 51 64 59 55 55 54 67 61 62 46 64 50
3154 50 69 56 59 64 49 60 53 69 51 55 50 30 31 57 44 48 47 41 39 47 48 32 44 22 47 31 33 44 54 46 49 71 49 60 47 65 49 65
3192 65 59 71 63 56 67 50 54 53 67 48 44 46 42 42 35 43 48 44 47 54 36 58 45 55 38 47 45 48 51 38 49 50 70 50 62 49 62 55 70 56 58
3233 58 56 47 69 63 70 56 56 55 53 51 46 47 43 55 29 45 38 47 40 35 48 48 42 41 57 42 37 27 64 46 62 52 53 76 57 62 50 78 54 64 53
3274 53 60 71 73 61 65 59 54 67 40 51 36 46 35 48 45 37 39 50 58 36 38 44 46 39 43 52 38 50 50 38 50 71 61 69 46 72 50 61 62
3313 62 53 59 63 62 43 68 52 58 55 52 51 49 51 42 46 44 45 28 43 35 48 38 48 37 40 36 31 50 42 43 35 53 55 50 60 63 75 60 68 64 79 45 58
3356 58 57 67 52 60 59 55 51 46 65 52 60 48 47 32 41 52 46 54 36 48 47 45 30 61 47 37 47 58 51 39 65 47 76 63 78 47 53 66
3394 66 62 63 61 64 56 66 47 55 49 58 42 37 52 39 43 42 44 27 61 42 41 49 50 50 46 63 52 56 38 50 41 51 45 51 61 58 59 59 61 61 67 50 62 63
3438 63 67 62 60 59 63 51 44 52 37 50 31 38 32 37 31 35 56 25 45 32 61 46 48 41 52 43 46 52 64 60 49 59 49 68 49 68 67 47 60 59
3478 59 56 55 72 47 46 48 64 53 49 45 35 46 21 44 36 44 33 48 26 40 33 35 46 41 55 56 51 43 57 63 73 50 60 64 63 79 64 60 57 60
3518 60 44 46 46 59 52 59 66 56 38 37 44 41 53 35 37 34 26 49 31 51 54 37 40 43 36 34 33 49 46 55 59 59 64 60 62 61 56 54 58 51 53 59 50 53 39 54 55
3565 55 34 30 49 45 43 41 36 45 36 44 39 39 43 54 36 42 28 38 49 45 51 46 74 39 63 58 53 60 70 66 62 64 58 65 60 56 67 55 58 43 57 31 51
3608 51 31 38 33 36 39 33 42 45 45 56 43 41 53 34 47 38 45 35 45 46 60 59 58 55 66 69 55 67 60 62 56 64 67 67 65 48 49 50 56 42 50 40 45 42 41
3653 41 42 40 43 32 41 40 45 48 48 64 53 66 40 56 56 67 44 71 60 58 62 65 67 48 61 52 52 40 69 58 64 62 64 50 39 49 43 49 43 39 36 38
3695 38 31 44 26 25 45 37 51 45 48 67 66 61 65 55 70 60 50 70 41 67 48 62 55 66 55 49 56 62 44 38 44 56 55 46 60 50 46 44 43 33
3735 33 34 33 39 44 42 50 38 61 36 49 49 48 56 52 42 58 69 57 65 69 73 54 70 60 49 60 50 52 53 46 44 64 47 46 54 44 47 31 51 45 51
3776 51 39 47 46 37 42 39 45 45 58 40 49 40 61 56 62 58 63 53 61 61 66 63 67 56 60 73 62 59 46 44 58 37 57 36 39 48 53 56 57 37 44 43 46 49 42 51
3822 51 53 75 46 44 65 48 72 65 73 56 78 69 67 67 87 78 61 61 63 71 67 64 48 79 48 66 55 53 47 55 57 41 43 39 45 45 48 36 45 55 55 66
3864 66 49 71 67 55 59 80 53 61 54 59 72 68 73 51 71 65 43 61 64 56 48 51 60 63 51 78 48 59 45 58 33 51 45 42 43 34 52 37 53
3903 53 45 54 67 62 49 50 62 69 61 71 75 66 64 62 73 66 64 65 55 51 50 69 55 50 39 54 53 51 52 39 44 42 48 37 54 37 51 41 38 42 58 33
3945 33 46 51 45 68 41 57 53 67 82 61 68 66 62 58 61 50 58 60 66 56 52 45 49 58 48 49 49 47 33 35 38 41 30 41 51 46 34 50 53 46 55 52 54 49
3989 49 45 53 60 58 54 75 59 67 70 69 65 71 59 65 56 56 48 51 53 29 61 36 36 48 33 34 47 34 32 32 35 60 37 52 47 57 57 57 58 51 36 52 49 43
4033 43 53 49 48 52 65 56 64 68 61 72 51 55 58 51 54 57 50 53 52 51 50 47 45 39 54 34 38 40 34 51 47 52 66 55 61 54 57 59 69 61 66 56 63 60 72 57 74
4080 74 59 50 50 64 52 55 46 44 45 51 42 41 43 48 44 45 36 36 30 40 40 48 37 37 40 47 43 64 48 50 63 69 63 54 65 63 69 57 72 61 48 52 59 59 47 52
4126 52 58 60 45 46 42 49 44 46 39 38 41 32 37 28 46 43 41 39 25 39 41 50 40 43 33 46 61 62 49 69 72 62 68 67 70 48 66 57 53 41 41 37 53 44 42
4171 42 43 36 43 49 42 44 53 38 43 33 42 47 53 63 39 47 53 60 46 51 52 58 40 57 65 39 50 56 70 65 72 66 61 62 50 46 58 55 42 50 27 57 47 35
4215 35 34 43 35 21 36 36 44 33 42 48 55 45 51 56 57 59 40 62 50 51 47 53 57 65 64 60 65 63 82 50 63 51 57 59 55 47 54 44 45 42 46 54 28 27 37 42
4261 42 27 44 47 33 47 43 47 49 64 59 60 51 59 54 63 58 66 63 59 52 52 71 47 51 58 46 59 42 51 38 52 41 47 37 37 29 44 34 37 44 37 31 43
4304 43 43 39 54 41 55 46 42 55 49 70 57 61 61 77 68 67 71 54 61 66 78 53 36 39 51 39 46 39 48 43 39 46 31 43 39 43 27 36 39 52 51 44 52
4347 52 44 55 59 56 38 53 49 66 58 51 59 69 62 62 66 66 76 66 62 64 63 60 47 47 51 49 45 53 42 45 45 39 26 42 40 36 52 37 46 51 49 42 56 43 59
4392 59 62 64 56 58 56 60 71 66 55 69 65 71 60 64 52 59 54 45 59 54 50 51 40 45 50 52 38 37 44 33 50 38 36 54 48 55 47 51 56 55 60 62 55 57 47 58
4438 58 54 62 56 45 73 66 65 51 64 64 62 38 45 55 41 53 45 38 29 52 49 44 20 35 37 49 43 64 63 46 49 43 69 62 72 70 62 66 68 64 42 54
4480 54 66 66 56 67 65 61 54 54 61 46 56 36 54 43 55 42 46 50 37 54 36 35 40 35 34 37 40 36 56 63 43 55 51 58 63 48 75 61 50 65
4520 65 71 69 79 76 61 77 64 61 61 49 52 46 43 38 52 36 39 44 41 42 42 42 50 39 45 45 31 42 54 40 31 54 49 50 41 60 54 55 64 48 67 56 64
4563 64 66 65 54 55 53 51 50 36 55 40 42 41 42 31 46 48 34 33 42 48 39 27 36 38 29 44 57 49 35 46 65 53 54 44 58 67 64 65 60 57 53 54 61 67
4607 67 56 44 44 51 42 54 39 34 34 40 30 36 47 35 28 34 37 34 46 39 56 45 55 60 64 61 60 62 60 71 56 72 52 51 54 59 69 58 71 68 63 53
4649 53 47 52 44 55 49 46 38 63 40 42 37 39 42 32 38 40 32 52 38 37 59 49 54 55 59 60 60 68 47 53 59 52 57 56 63 46 42 43 45 50 42 41 49 43 53 37 41 40
4697 40 34 38 42 40 40 39 43 38 35 31 31 37 41 48 34 41 54 45 56 55 72 56 36 56 54 57 66 60 40 57 53 39 53 60 41 40 43 32 48 46 32 32 40 22
4741 22 42 42 25 35 34 36 40 59 38 45 41 59 61 69 45 52 44 48 61 54 64 60 70 70 73 59 67 56 55 50 44 44 33 42 36 29 34 31 13 32 48 48 41 41
4785 41 58 42 51 36 54 48 49 62 52 74 61 61 51 64 60 71 60 57 66 45 70 57 67 74 65 62 59 61 54 47 51 47 43 28 39 50 46 44 47 21
4825 21 40 55 31 42 44 43 53 45 69 55 51 64 57 55 58 69 64 71 53 64 64 70 72 54 45 55 45 56 56 42 59 43 54 32 41 50 47 40 48 32
4865 32 30 35 37 49 43 51 49 54 62 52 56 59 74 62 70 51 71 60 68 54 57 54 63 57 56 47 38 38 60 55 45 29 38 34 44 43 46 37 47 35 36 35 20 34
4909 34 26 45 49 50 60 66 61 54 53 62 67 64 70 60 61 64 70 63 57 58 68 59 63 57 48 58 43 48 31 43 38 34 40 40 47 36 54 40 42 44 45 50 53 47 51 50 54 61 63
4958 63 56 47 65 41 52 52 63 58 63 65 49 63 49 63 58 62 41 55 39 45 45 28 48 37 23 11 26 34 33 31 37 47 43 56 44 36 51 61
4996 61 49 53 72 58 59 56 71 62 56 53 57 50 59 46 59 61 75 48 45 51 48 53 50 55 44 45 33 26 40 31 35 45 40 50 55 32 64 45 54 52 57 66 59 69
5040 69 57 69 54 67 59 55 71 56 71 50 47 66 51 45 55 49 45 49 41 38 43 49 39 45 31 48 47 46 29 40 48 45 36 55 51 34 57 60 56 68
5080 68 66 57 70 81 79 63 60 70 57 51 52 49 57 58 43 53 24 49 39 39 47 45 50 58 59 42 49 33 45 67 56 47 49 54 40 55 58 52 67 53 66
5121 66 59 70 52 63 57 58 66 51 51 55 53 47 56 47 40 39 44 38 46 33 38 31 35 29 48 43 33 50 43 45 51 57 59 58 50 56 51 56 62 61 57 55 62 50 56 41 59 50 51
5170 51 56 66 68 50 49 48 41 45 51 45 42 49 23 44 47 53 43 49 42 38 58 27 55 57 61 56 73 56 62 52 66 65 63 63 53 55 47 60 47 63 50 56 63
5213 63 54 56 53 49 47 36 39 52 36 42 52 44 40 43 46 47 49 46 48 54 45 30 49 46 49 59 61 59 57 61 63 67 62 55 53 51 67 62 49 62 55 51 42 53 48 46 41 55
5261 55 35 52 52 56 38 37 46 39 48 43 44 28 38 45 56 54 57 48 71 69 59 64 77 62 83 76 63 66 71 77 64 56 51 61 39 49 56 44 42 34 32 49
5303 49 41 47 49 38 48 44 47 52 55 51 49 46 38 53 63 56 67 70 65 57 65 65 61 58 72 71 69 61 66 68 57 53 59 54 46 40 29 28 32 45 45 39 48 46 35 37 52 48 57
5352 57 42 44 47 48 49 40 52 57 66 67 66 67 70 74 60 57 61 64 60 54 51 71 62 57 58 45 44 39 55 38 44 38 34 32 34 42 35 45 42 47 52 45 67 62 55 54 62 71 63 60 72
5403 72 66 66 67 62 52 55 56 67 56 68 62 64 58 51 57 60 43 52 49 46 46 46 46 40 33 44 43 44 38 39 39 48 49 42 54 71 67 70 67 77 80 67 66 77 59 61 58 55
5451 55 51 75 36 46 51 46 54 41 46 36 41 43 51 50 47 35 43 42 40 37 54 52 53 50 35 52 41 62 58 69 48 67 65 70 71 60 62 72 74 63 68 51
5493 51 59 50 57 55 54 43 50 39 30 36 38 25 36 28 60 40 53 52 44 49 44 48 58 63 48 56 62 53 54 60 56 59 78 47 68 75 67 55 51 45 52 65 59 57 54 37
5539 37 41 42 45 41 48 36 43 46 36 38 36 51 46 42 46 47 54 60 59 56 68 60 78 73 71 73 63 70 68 71 61 69 62 70 66 62 60 60 65 53 52 34 43 49 49 32 39 24 44
5588 44 43 45 32 50 38 50 51 45 58 65 53 59 81 73 69 65 66 64 69 64 67 53 54 62 63 53 62 54 54 51 65 55 60 49 41 60 41 53 42 47 39 40 42 35
5632 35 40 53 54 35 51 46 52 57 58 58 76 65 77 73 66 67 63 70 76 59 45 49 57 60 53 47 55 48 44 47 42 59 36 39 43 51 39 49 47 60 50 56 51 55 48 51
5678 51 51 55 65 54 58 51 63 58 70 60 68 61 67 60 62 44 54 57 64 48 54 41 46 45 32 52 30 50 39 47 38 45 41 33 48 49 64 48 58 45 52
5719 52 64 64 59 70 60 55 63 69 67 62 63 64 53 65 62 62 52 60 55 58 60 42 44 40 35 38 41 32 39 39 42 43 36 39 34 47 44 43 50 52 65 56 57 61 61 60 55 73 53
5768 53 72 72 72 68 67 69 51 61 68 57 61 47 47 47 46 46 46 35 38 39 42 32 44 37 41 49 34 40 65 61 49 54 54 59 70 57 55 60 69 55 77 61 61 59
5812 59 59 52 77 63 44 55 58 52 43 45 52 51 36 39 44 38 41 41 42 42 46 51 48 52 49 53 43 54 59 47 53 56 59 68 58 75 59 65 72 59 71 54 47 58 48
5857 48 37 51 56 54 40 50 39 34 51 47 45 40 50 43 44 46 47 60 56 51 51 44 54 38 60 57 50 63 61 71 69 72 70 66 70 83 63 62 57 51 63 44 53
5900 53 54 44 41 45 41 49 23 45 42 43 39 39 49 53 51 43 53 43 42 45 62 53 61 55 49 41 63 69 60 69 73 58 52 55 52 58 53 55 63 60 51 52 49 46 53 50 46 44 28 32
5950 32 39 40 43 42 37 44 49 60 63 50 49 64 53 58 72 66 57 48 63 56 63 60 57 59 55 59 49 55 39 39 44 50 51 40 45 41 51 42 49 27 34 27 40 28 54 37
5996 37 52 59 35 54 49 59 52 62 66 63 66 65 62 83 78 66 63 65 70 60 68 57 54 65 53 52 63 41 53 42 45 45 28 43 37 41 44 50 39 43 50 65
6038 65 64 40 50 49 63 59 59 67 51 74 69 64 72 70 61 75 47 50 60 44 56 45 45 52 41 43 40 39 32 36 39 31 45 49 37 60 59 61 52 46 40 45 55 53
6082 53 42 56 52 46 68 64 60 56 81 67 70 69 63 69 47 46 53 44 42 55 50 56 51 44 53 32 35 41 41 42 42 37 50 57 48 52 71 61 61 55 54 70 50 68 64 59
6128 59 55 58 69 68 60 72 79 60 66 66 51 62 59 63 46 43 45 56 43 47 41 37 44 47 44 42 39 52 46 48 46 65 70 62 55 52 62 70 72 79 64 75 67 60 70 61
6174 61 55 68 48 41 52 58 45 43 53 42 51 59 49 54 50 35 39 45 48 28 38 51 42 42 49 53 51 65 66 61 69 77 55 65 66 70 69 78 65 75 66 60 61 73
6218 73 45 46 47 56 70 52 40 50 54 54 55 41 55 55 37 49 49 52 37 42 56 59 59 51 61 54 56 57 64 70 64 59 65 66 72 75 59 61 66 56 62 56 43 44 38
6263 38 45 40 40 56 51 37 42 38 33 47 47 39 44 47 51 58 45 54 68 60 65 43 65 57 59 59 65 62 57 59 57 70 52 57 66 73 59 55 49 47 47 44 39 43 43 41 37 30 39 34
6313 34 39 32 46 44 48 51 37 51 49 57 65 58 54 60 57 55 53 59 68 53 72 68 63 63 52 61 62 51 48 36 50 43 48 59 38 43 28 37 34 52 32 25 42 55
6357 55 46 50 62 59 39 49 65 69 75 56 52 62 53 65 72 60 64 63 61 56 46 47 56 60 57 44 56 40 33 48 38 64 46 48 52 42 45 38 52 42 44
6398 44 38 46 43 62 54 67 66 54 64 49 60 64 64 65 72 70 65 72 73 56 54 53 48 60 50 47 49 42 40 45 37 45 44 57 57 50 35 53 47 44 51 44 41 47 56 56 63 59
6446 59 52 59 49 66 58 61 54 60 61 65 68 48 56 53 57 50 45 50 39 48 40 37 55 46 46 35 37 40 46 43 35 22 42 46 50 62 47 54 64 61 63 58 48 69 51 57
6492 57 52 55 61 48 62 55 48 57 54 56 50 56 44 45 46 39 47 45 40 42 28 30 37 34 41 43 34 46 42 52 66 64 64 59 57 50 49 75 63 50 63 68 70 71 58 57 59 45
6540 45 62 58 60 64 64 44 60 46 62 51 31 56 45 31 34 41 38 38 45 42 46 39 53 58 59 56 74 71 72 76 57 69 74 60 67 62 57 70 50 59 38 46
6582 46 43 40 50 50 35 32 28 38 45 45 49 38 40 48 46 51 43 49 46 49 53 57 56 60 68 68 59 67 70 69 61 65 75 57 62 61 59 46 56 57 54 51 47 46 44 46 39 42 33 41 48 61
6634 61 53 59 41 34 46 49 49 49 55 52 56 60 62 75 53 56 47 59 64 68 61 58 74 69 70 61 53 53 44 47 41 33 37 35 44 31 54 50 48 43 48 42 51 40 45 59 52 52 49 70
6684 70 54 63 63 62 59 64 56 58 45 61 64 69 54 51 74 60 52 61 34 67 52 37 53 44 41 54 49 43 36 31 39 34 45 28 42 41 35 45 45 63 55 56 52
6727 52 62 64 69 45 69 48 59 59 63 67 68 56 50 66 38 60 33 50 44 39 41 41 43 29 50 43 39 37 36 44 43 34 49 36 40 33 40 42 56 40 52 56
6769 56 69 63 52 49 63 62 66 56 42 56 57 55 44 59 46 51 44 33 29 48 37 36 36 39 33 44 33 49 44 41 39 47 53 47 49 46 47 54 60 54 55 57 61 61 59
6814 59 49 61 64 55 74 65 51 46 59 53 44 52 30 31 26 39 36 41 29 30 30 39 39 25 29 47 54 48 39 49 48 55 55 54 44 50 54 56 74 44 62 67 59 55 52
6859 52 61 55 60 59 43 64 48 54 48 43 38 37 31 40 58 37 34 39 46 39 49 56 52 51 39 52 57 52 62 56 48 54 63 51 55 57 61 47 50 43 49 43 48 39 44 51 54 50 42
6908 42 53 43 48 47 38 45 32 37 32 36 39 41 27 42 50 46 46 48 51 69 64 71 67 53 61 63 72 65 62 63 44 51 47 58 58 38 49 49 59 31 49 53 40 46 35
6953 35 55 52 45 40 41 46 55 47 47 46 43 58 40 66 64 51 54 55 74 69 59 70 69 63 78 70 62 63 53 51 46 55 45 53 37 39 39 40 37 38 33 47 57 58 43
6998 43 55 48 32 47 41 48 48 41 53 55 60 59 47 66 75 71 59 73 61 62 58 58 66 61 47 46 45 41 45 65 48 41 45 28 33 38 48 35 35 49 60 50
7040 50 61 62 59 52 43 55 47 55 57 48 51 56 55 58 57 59 45 56 59 51 37 61 51 55 56 63 45 51 43 43 45 45 35 47 44 26 47 43 57 44 52 39 40 41 44
7085 44 64 41 54 55 63 64 64 63 59 57 55 61 48 42 56 60 58 57 46 49 45 43 50 45 51 36 45 46 43 42 52 37 32 35 51 42 33 44 48 51 40 58 54 59 62 59 65
7132 65 60 64 51 69 47 54 54 55 62 51 52 49 52 39 33 45 45 44 32 39 43 39 27 28 48 49 56 39 49 44 49 51 46 52 45 45 59 60 47 71 60 59 64 59 73
7177 73 65 62 63 67 60 46 50 47 54 65 51 46 51 42 39 46 44 30 35 39 34 42 33 36 43 38 49 57 54 46 52 54 52 56 58 68 58 71 59 51 66 68 62 65 58 54 55 47 64
7226 64 55 47 46 45 49 44 45 31 45 38 35 31 44 50 51 52 55 56 48 55 58 53 60 54 58 52 55 70 71 60 58 63 56 61 63 58 46 50 60 46 40 48 44 46 42 52 44 35 36 40 34
7277 34 41 31 38 46 33 51 48 45 51 54 68 70 71 73 71 74 59 59 70 76 62 61 63 71 54 47 55 40 50 30 53 56 35 61 39 41 44 45 42 40 33 37 43 48 52
7322 52 58 53 58 48 57 52 72 64 54 67 62 72 70 61 62 70 64 60 58 57 61 51 52 39 54 52 53 44 50 42 45 45 39 46 51 51 50 44 43 59 47 66 47 41 38 52 50
7369 50 60 51 62 60 59 60 60 68 52 66 65 73 50 51 65 56 57 57 46 51 52 41 38 33 44 44 35 47 38 53 36 42 54 57 52 61 59 54 57 54 58 55 48 54 69 52
7415 52 67 63 68 56 56 60 68 54 64 75 68 48 60 62 65 49 52 52 46 47 23 40 39 42 37 44 46 46 48 50 41 57 69 56 56 50 54 62 71 48 70 64 70 68 67
7460 67 48 53 62 57 48 65 44 62 46 42 59 48 44 38 43 51 40 30 39 45 50 46 47 50 56 54 51 54 45 51 60 50 65 67 69 70 55 65 61 69 48 51 47 50 42 42
7506 42 44 48 52 54 39 45 48 50 57 38 39 34 45 40 42 48 43 34 50 42 47 45 44 55 61 51 61 59 57 61 57 62 62 45 57 39 70 55 47 58 44 48 41 32 49
7551 49 39 48 48 40 46 36 36 38 53 51 54 52 48 60 50 43 46 57 46 44 42 64 54 51 58 57 59 56 66 62 53 63 53 65 56 59 56 64 69 38 46 40 43 31 38
7596 38 41 25 39 45 38 47 35 52 64 56 54 56 60 62 53 47 60 62 63 56 59 60 47 61 65 59 56 52 61 54 60 52 54 64 67 47 43 44 34 43 39 31 29 25 32 44 47 36
7644 36 36 56 51 55 61 63 60 55 48 70 55 62 59 58 69 69 68 60 54 41 48 67 37 56 57 60 54 55 50 46 47 43 60 37 49 44 35 46 33 48 55 50 62 45
7688 45 48 60 56 66 61 63 67 62 64 68 58 63 68 54 60 39 46 50 39 53 45 38 42 45 40 40 47 44 54 42 43 40 43 47 58 66 59 53 51 53 46 45 49 49 51 54 56 65 58 66
7738 66 66 60 66 76 56 64 52 46 53 55 41 52 53 40 41 39 54 49 44 48 44 52 45 38 38 58 46 55 44 42 44 49 57 54 50 60 62 56 70 43 50 61 54 67 49
7783 49 67 65 61 49 42 52 46 37 53 60 43 31 35 42 35 35 38 33 42 31 42 46 41 50 57 61 49 45 47 47 60 52 49 55 51 52 52 54 52 63 56 58 47 44 52 37 41
7830 41 47 47 33 40 38 57 51 36 40 40 45 45 51 50 33 49 53 43 50 53 52 51 65 58 50 65 45 58 62 52 52 53 51 45 54 57 41 60 48 40 33 46 49 43 52
7875 52 35 63 51 45 42 42 31 49 33 40 35 42 50 55 52 39 52 60 64 55 45 48 58 56 66 51 57 57 58 68 57 47 53 29 39 55 53 43 37 40 38
7916 38 39 45 43 46 43 46 48 44 37 47 31 55 54 48 41 48 44 39 66 50 45 52 65 47 56 60 64 55 62 50 46 36 54 33 41 44 52 38 45 41 36 42 48 38 37 42 45
7963 45 47 56 52 58 45 64 42 59 50 53 53 51 62 47 55 49 50 58 45 63 58 82 55 53 55 43 59 45 43 52 44 49 49 49 48 46 41 50 49 38 52 45 48 42 52
8008 52 54 55 55 69 59 54 67 61 58 54 63 72 60 71 58 47 58 61 59 66 51 50 55 42 48 40 56 55 40 59 54 43 47 53 34 36 53 47 44 60 42 57
8050 57 51 48 56 60 63 63 60 60 66 72 63 58 73 47 64 54 66 55 47 52 56 44 52 50 59 40 50 51 58 52 36 33 39 49 56 54 50 44 50 35 54 42 48 66 67
8095 67 55 53 49 50 58 64 59 64 82 56 78 57 73 56 51 50 41 43 57 43 51 35 41 51 44 51 51 53 54 58 39 57 43 41 58 52 65 48 53 50 58 63 62
8138 62 68 62 55 58 56 72 68 73 68 44 41 53 63 61 42 41 45 35 42 41 44 51 55 49 50 44 42 45 60 48 57 64 60 68 54 64 70 66 55 50 55 63 45 58 66 57 46
8185 46 51 49 53 53 50 49
8191D9
$$ Imaginary data points
##PAGE= N=2
##DATA TABLE= (X++(I..I)), XYDATA
0 0 0 0 0 0 0 0 0 0 0 0 0 0 0 0 0 0 0 0 0 0 0 0 0 0 0 0 0 0 0 0 0 0 0 0 0 0 0 8 -13 13 -13 13 -13 13 -13 13 -13 20 -26 26 -26
51 -26 26 -33 38 -39 43 -47 52 -59 65 -72 84 -95 107 -124 147 -185 235 -356 1588 -1143 846 609
73 609 361 152 966 1567 367 -687 125 -38 -1494 854 -384 1501 -1341 6 -358 -637 -810 311
91 311 720 -474 219 -587 847 -1520 705 653 433 -216 407 710 -420 158 706 1317 -1129 1473 -194
110 -194 343 -178 534 1026 -344 258 -10 303 -698 765 -37 1082 -880 410 228 -703 213 240 1165
129 1165 -473 602 -8 405 -957 1063 730 368 528 398 779 -905 814 539 856 -41 1337 37
147 37 153 -128 189 875 -357 1037 39 422 -809 217 7 120 -449 569 243 -979 210 -522
165 -522 240 -1050 552 -65 -332 -618 186 -225 -715 149 -263 262 -1068 625 -417 -178 -360 149 -132
184 -132 -368 -69 -107 387 -898 598 -360 151 -686 324 227 -435 150 259 93 -737 605 -236 412 -475
204 -475 755 43 -275 186 74 241 -389 680 29 352 -486 677 -221 32 119 193 440 -421 410 -71
224 -71 231 -599 660 -101 106 -156 377 101 -655 526 -188 154 -364 580 -253 95 -315 287 -140 -329
244 -329 402 -227 296 -599 411 -355 -55 -316 280 -178 -175 64 -214 116 -788 477 -298 49 -319 327
264 327 -262 -339 32 25 15 -402 655 -463 180 -282 351 -107 -9 172 138 107 -248 507 -186 420 -300 656
286 656 -122 4 185 185 156 -111 478 -85 241 -391 686 -249 147 114 216 -12 -270 429 -164 160 -143
307 -143 536 -392 213 -199 187 22 -138 384 -101 138 -335 398 -259 196 -132 440 -168 -119 226 -199 171
328 171 -255 496 -215 100 -216 308 -305 47 216 -11 118 -299 409 -386 230 -98 342 -118 142 -9
348 -9 92 106 -148 574 -153 352 -195 439 -162 163 238 267 107 53 379 -223 344 -163 578 -111 254 93
370 93 89 -36 4 305 -69 322 -140 383 -347 242 -103 187 97 -9 228 -99 81 -201 398 -247 315 -81
392 -81 264 -143 16 212 -138 198 -89 296 -247 227 -189 292 -200 114 103 -113 112 -160 298 -242 227
413 227 -131 226 -247 152 -18 70 144 -103 351 -269 188 -100 321 -140 311 83 106 30 20 276 -147 451
435 451 -56 361 -125 176 -39 140 21 123 245 -92 229 -233 244 -280 237 -47 147 -10 13 22 -134
456 -134 107 -150 344 -248 282 -112 91 -102 42 62 -51 150 -69 202 -226 281 -246 228 -102 71 102
477 102 -39 100 -91 160 -192 213 -176 257 -160 205 -26 -14 82 -123 209 -119 242 -76 268 -149 230
498 230 -61 87 111 72 252 -55 300 -116 229 -79 260 -49 264 100 74 180 -139 222 -117 249 -73
519 -73 270 -66 146 -53 42 -11 -38 235 -109 279 -168 190 -136 94 -41 142 32 39 164 -125 149 -210
541 -210 244 -174 217 -10 86 -12 -15 16 -99 132 -134 257 -191 163 -149 71 -103 5 80 -27 131 -67
563 -67 162 -193 205 -152 202 -37 114 127 9 101 -38 194 -106 283 -38 260 -70 202 27 1 136 -15
585 -15 232 -69 199 -87 202 -148 173 -25 57 74 30 166 -162 150 -141 124 -124 186 -49 115 -17 12
607 12 84 -180 193 -67 198 -112 194 -79 27 -71 42 40 -32 180 -107 155 -216 119 -114 73 -65 104
629 104 27 -87 55 -110 90 -194 239 -103 134 -66 69 -14 -22 52 20 175 -119 264 -97 142 -92 174
651 174 32 33 142 65 122 -56 191 -57 214 -101 247 19 53 65 37 90 -95 194 -53 150 -85 197 -89
674 -89 70 -11 29 66 -77 173 -41 107 -150 170 -120 72 -31 108 36 -79 130 -117 89 -122 176 -71
696 -71 108 -66 109 -62 -70 109 -42 124 -95 222 -108 83 -69 124 -29 40 108 9 112 -140 216 -99
718 -99 105 -27 189 -30 45 81 14 70 -44 214 -74 171 -56 192 -28 53 78 73 58 -11 224 -56 149 -45
742 -45 218 -83 112 64 73 73 -6 138 -51 101 -94 217 -92 107 21 77 -18 -27 120 -63 98 -58 172 -120
766 -120 88 -67 98 -40 -18 128 -41 70 -63 167 -126 107 -21 141 -55 65 89 -18 77 -58 210
787 210 -52 116 1 184 -67 92 91 41 63 1 206 -77 143 -30 175 -51 85 67 80 19 8 192 -84
810 -84 144 -28 191 -72 118 55 64 12 44 146 -50 123 -46 201 -86 120 37 59 -12 36 109 -56 68 -29
834 -29 138 -127 115 -31 88 -48 21 71 -56 44 -37 139 -125 132 -49 92 -76 57 72 -30 68 -29 144
857 144 -105 125 -14 149 -90 124 69 4 64 17 163 -64 136 -11 147 -73 134 39 67 34 35 142 -89
880 -89 128 -5 125 -84 145 4 56 6 63 98 -68 134 -17 157 -92 119 26 47 -17 80 78 -40 118 -18
904 -18 121 -111 133 -34 82 -42 74 46 -36 50 -33 99 -134 136 -42 60 -77 59 2 -30 26 0 92 -99
928 -99 132 -55 92 -103 97 30 -11 63 55 94 -74 141 -18 118 -40 169 38 47 38 55 91 -56 131 12 130
953 130 -49 167 -20 46 23 70 72 -32 123 -10 113 -67 138 -22 65 -17 112 47 -44 117 -18 88 -71
976 -71 139 -26 92 -15 92 9 -27 69 6 89 -79 154 -46 46 -53 91 -34 3 64 5 58 -86 107 -74
1000 -74 75 -42 104 10 5 33 26 31 -55 149 -31 111 -39 124 -20 25 46 44 71 -18 142 -14 93 -59 137
1025 137 -30 65 44 81 52 -15 102 -19 102 -36 147 -13 73 13 96 19 -19 102 -1 74 -30 139 -40 77
1049 77 -22 87 -8 4 92 26 69 -58 109 -55 50 -13 115 -27 24 53 -10 38 -53 113 -35 67 -35 103
1073 103 -40 27 29 25 41 -7 137 -57 73 -44 96 -40 66 49 50 47 -6 103 -44 74 -13 142 -21 69 48
1098 48 60 24 29 88 -11 110 -15 142 -24 84 28 81 16 33 98 13 68 -27 125 -69 84 19 90 11 31 55 -9
1125 -9 45 -35 100 -33 81 -13 80 -41 33 28 -23 47 -6 94 -45 80 -44 85 -49 44 53 37 45 -7 105 -47
1151 -47 75 -4 112 -29 86 5 31 19 0 91 -25 75 -13 107 -42 63 -4 45 4 45 78 -20 94 -30 102
1176 102 -27 101 24 98 20 55 83 3 76 22 123 -19 123 20 76 0 56 45 8 72 0 101 -49 89 -15
1201 -15 61 -29 40 46 -3 41 -11 66 -56 80 -27 76 -25 61 26 9 29 10 75 -32 86 -12 80 -34 83 12
1227 12 39 35 16 65 -12 89 -8 82 -42 93 14 56 14 47 39 -4 87 -17 92 -10 84 -15 73 10 50 44 6 86 18
1256 18 94 -14 106 5 61 5 70 38 21 58 2 75 -28 109 3 83 -3 77 13 6 37 -10 42 -36 92 -34 67
1283 67 -29 55 -2 8 28 15 44 -38 75 -14 50 -28 80 3 44 47 25 56 -4 73 -7 76 -13 93 -1 46 21 37 50
1312 50 -10 83 0 73 -18 75 -12 66 6 43 41 12 67 -7 62 -11 81 -16 61 13 60 23 42 69 8 67 1 85 -12 72 -1
1343 -1 80 14 31 65 15 60 -15 86 -12 59 -7 62 3 33 24 12 46 -13 76 -28 46 -12 56 -15 31 15 -4 35 1 58
1373 58 -19 64 -22 81 0 62 33 42 42 15 73 4 80 -4 80 3 80 7 50 42 31 71 17 62 -10 86 -14 52 11 57 19
1404 19 21 61 21 60 3 61 -16 74 -1 45 17 37 33 15 61 -6 81 -13 71 4 61 0 61 30 29 46 7 69 -20 61 -1 65
1436 65 -9 36 11 11 15 -4 48 -14 65 -24 37 -24 43 0 29 21 20 41 -2 63 -9 66 -8 66 27 36 26 54 37 12 62 4 81
1469 81 -12 69 20 44 23 50 40 19 55 21 73 -5 79 -11 63 5 40 36 21 47 2 58 -7 77 3 63 19 61 37 26 60
1500 60 3 64 3 63 6 69 -6 54 20 37 39 14 63 7 75 -7 45 -15 55 10 24 16 21 39 -19 43 -8 53 4 52 5 30
1532 30 26 11 32 17 52 12 67 13 70 6 50 20 54 40 24 59 7 62 5 77 1 62 30 46 34 21 27 10 53 3 67
1563 67 -14 55 12 35 -5 26 42 13 48 -2 56 -6 46 -1 50 9 28 42 30 22 11 56 0 52 12 69 1 42 25 12 28
1594 28 16 62 3 55 -18 44 -24 38 12 21 24 15 47 -12 49 -2 57 -10 49 13 44 28 7 49 5 49 22 73 0 76 21 47
1626 47 33 48 50 20 58 25 69 -8 54 8 46 16 38 44 10 34 3 49 -10 49 10 39 -13 20 30 21 8 -2 46 0 57 13
1658 13 46 -6 52 17 37 52 35 51 1 49 -3 50 -5 47 38 40 27 29 37 -10 36 0 51 -7 35 9 18 8 12 43 2 46 3
1691 3 49 -10 50 11 42 26 52 52 19 51 13 67 10 63 24 54 26 59 44 33 57 37 50 6 61 20 53 4 38 19 19 31
1723 31 35 47 -13 52 0 26 -3 38 12 12 24 13 17 3 57 7 59 12 41 27 29 25 32 43 19 56 12 50 6 59 11 35 24
1756 24 32 39 5 42 6 42 -9 50 3 27 11 33 22 21 48 23 45 7 52 14 44 5 56 32 28 55 24 51 12 75 10 50
1788 50 21 55 22 29 40 13 44 11 54 1 44 -1 48 10 21 16 10 29 -4 46 6 44 1 40 2 34 18 34 18 10 34 -5
1820 -5 42 23 62 29 42 29 49 40 33 48 25 60 15 72 4 52 29 41 27 24 24 8 35 3 59 -10 39 7 46 19 17 36 31 31
1854 31 13 48 4 53 28 48 14 41 47 36 53 22 64 16 52 13 64 26 32 25 29 39 8 56 7 44 3 49 -5 19 24 27 20 13
1888 13 37 -10 49 17 50 3 39 9 33 45 26 35 4 38 22 66 27 55 35 46 22 35 50 27 59 31 56 23 50 29 61
1919 61 37 35 39 10 31 8 44 2 55 13 23 20 31 24 43 33 18 46 10 43 22 46 13 59 42 31 39 35 56 9 60 21 51
1952 51 5 45 20 31 26 30 43 7 36 1 36 3 37 10 21 12 23 32 8 33 14 32 3 40 12 36 29 32 39 27 49 31 52 7
1986 7 70 32 59 26 45 38 34 47 30 62 12 55 8 42 23 40 14 20 41 11 32 -13 32 4 26 0 34 17 26 8 26 40 0
2019 0 52 18 44 9 47 14 34 33 31 37 11 65 26 48 19 52 19 19 22 37 26 10 37 13 38 -9 29 20 33 11 25 20 14 40 3
2054 3 40 11 38 9 23 9 42 24 30 38 17 42 16 55 23 51 23 54 25 28 27 23 34 17 46 21 43 10 30 7 20 22 20 21 27
2089 27 47 9 28 15 27 2 34 21 23 31 11 54 22 38 21 64 28 38 32 54 45 25 37 23 44 19 46 -5 29 12 20 31 20
2122 20 36 15 26 3 34 -4 31 17 28 21 25 23 11 39 21 40 1 43 17 35 18 32 42 35 41 22 49 14 52 25 45 14 33
2155 33 36 27 31 2 48 14 31 10 25 5 33 25 4 20 14 50 11 40 11 38 3 43 9 29 23 23 24 16 38 25 45 6 41 42 46 35
2191 35 30 41 25 49 25 41 20 42 11 34 18 32 29 18 44 7 45 4 39 19 35 6 30 25 23 28 19 42 5 34 27 56 32 38
2225 38 34 46 39 32 44 18 61 21 48 22 34 19 27 23 14 34 14 45 13 22 2 39 8 27 11 21 23 10 30 5 37 18 33 12
2259 12 37 17 12 35 25 37 21 42 29 37 23 29 24 36 21 29 45 21 37 37 42 15 38 13 25 33 27 18 16 22 13 27 2 44 1 25 18
2296 18 32 24 31 42 23 49 21 52 15 44 18 44 43 41 41 35 42 17 42 -6 40 13 36 27 21 42 27 26 12 41 4 27 8 17 20 17 18
2333 18 2 29 8 26 12 36 24 39 36 34 23 31 39 23 55 39 56 25 46 30 36 22 40 38 25 38 23 47 8 38 12 17 8 22
2367 22 15 17 34 13 43 21 39 16 37 32 40 40 30 35 20 53 18 49 36 39 30 48 50 45 41 44 49 36 45 26 49 28 47 32 33 21 11 50
2405 50 28 32 9 35 14 38 20 18 20 35 36 13 32 28 54 24 36 29 49 37 38 39 21 47 43 45 36 49 24 35 22 49 44 45 36 25 46
2442 46 19 40 20 42 26 33 21 25 24 10 40 14 36 19 31 17 27 28 35 30 22 51 31 32 41 45 29 41 26 36 26 42 34 22 37 18
2478 18 31 18 33 21 9 24 11 23 25 29 12 23 15 24 13 28 25 28 29 33 34 22 46 24 54 31 36 32 46 37 26 50 31 49 43 46 23
2515 23 40 36 46 30 29 29 31 35 22 36 12 33 20 27 8 35 38 16 31 15 24 33 21 32 32 33 41 24 29 23 21 48 30 42 29 42 40 45 30
2554 30 31 27 25 49 31 47 17 29 22 34 11 16 37 31 32 13 32 9 37 7 27 16 38 22 23 48 36 39 28 51 26 41 36 42 38 44 41
2591 41 50 45 25 46 39 38 46 35 32 37 21 25 36 14 29 19 36 17 31 9 18 18 21 27 33 42 9 40 21 38 21 44 24 52 34 29 47 32
2629 32 35 18 30 30 41 36 35 26 39 47 17 36 17 33 16 27 12 23 23 24 30 13 27 28 27 9 26 14 28 24 20 34 23 28 26 51 24 45
2667 45 35 49 36 41 37 35 38 31 41 23 52 15 27 15 33 27 28 23 16 25 26 28 12 26 9 25 18 28 23 22 24 24 38 14 38 27 35 25 44
2706 44 51 33 31 27 41 25 50 22 47 44 48 16 40 37 19 26 27 31 11 30 18 25 18 14 15 12 28 25 35 9 26 17 31 25 43 23 31 26 33 43
2746 43 31 39 32 51 39 47 40 54 43 45 44 24 39 30 50 34 28 36 21 24 10 40 17 24 24 30 9 27 14 37 29 14 26 33 34 23 46 29
2784 29 41 28 34 28 35 53 29 39 45 34 29 42 39 36 36 30 32 18 27 21 28 15 31 21 30 15 38 22 22 38 19 35 7 38 25 31 23 42 31
2823 31 27 39 38 44 30 37 36 52 30 36 49 39 44 47 27 33 40 27 45 20 45 24 23 26 34 20 28 31 23 36 21 28 20 37 18 28 33 32 30 19 42
2864 42 23 54 23 39 42 39 26 29 49 38 44 40 52 44 46 36 42 31 40 26 12 39 33 31 27 41 29 31 14 26 32 20 30 23 42 13 30 13
2902 13 43 30 34 27 33 49 40 36 33 54 40 44 34 29 25 37 36 34 44 27 40 22 23 17 40 22 33 8 29 31 16 39 14 26 16 36 23
2939 23 32 31 35 27 19 42 34 44 19 49 42 41 46 42 36 33 45 33 41 24 40 18 32 27 29 20 31 14 37 28 22 24 26 33 18 28 27 24 22 19 23 17 33 32
2983 32 32 18 38 38 32 31 29 44 26 36 22 44 34 48 27 37 39 35 32 23 47 24 30 11 36 21 38 16 14 4 26 24 18 28 6 29 23
3020 23 33 25 26 27 30 38 39 38 34 35 38 51 30 44 46 36 33 38 51 23 44 33 23 32 32 27 25 22 2 27 15 24 13 27 23 21 9 18 21 23 21 17 30
3063 30 19 27 29 41 37 50 33 49 28 26 45 42 42 30 48 31 37 27 30 36 18 42 9 31 10 32 24 31 16 29 27 18 23 13 17 11 24 17 31
3102 31 18 22 20 26 40 27 42 19 38 28 38 31 33 41 31 41 34 37 31 34 27 40 27 50 13 21 27 30 19 16 18 25 10 32 29 21 40 21 25 36
3142 36 38 28 26 37 39 31 28 46 37 35 36 45 43 41 46 44 42 40 33 18 28 22 40 31 23 33 23 34 21 22 14 34 16 21 16 23 4 14 30 16 20 19 43
3185 43 28 34 31 53 39 42 53 43 60 31 38 33 48 35 39 37 28 23 40 27 19 32 19 34 20 16 11 15 14 14 28 27 23 23 11 7 23 23 24 27 26 43
3227 43 21 39 20 47 29 51 38 48 51 47 43 31 46 42 41 45 42 30 36 26 23 17 23 30 27 45 19 27 18 44 25 27 33 18 32 31 34 15 31 28
3267 28 40 33 30 39 36 43 30 56 29 52 30 51 23 35 37 33 57 35 34 25 35 10 53 18 36 36 22 28 29 26 23 26 17 28 18 24 36 30 34 25
3307 25 41 36 40 45 48 43 43 32 48 27 33 48 37 51 36 39 29 47 24 20 25 12 19 23 22 28 31 14 21 28 27 26 26 28 38 26 17 34 34 46 26 45
3349 45 24 31 36 32 39 36 32 45 58 48 49 47 41 26 42 26 20 36 22 39 27 32 34 29 18 30 36 29 40 39 23 16 39 25 37 24 34 28 40
3388 40 43 33 36 46 40 28 41 43 42 26 57 31 46 43 35 44 23 50 33 24 15 30 19 18 29 30 30 13 29 17 19 15 36 31 24 23 30 33 20 41
3428 41 22 45 38 44 31 26 31 43 39 29 51 31 39 21 46 44 50 26 32 23 27 36 39 33 8 20 22 27 12 23 17 12 28 31 21 21 30 26 28 26 27 29 34 39
3472 39 44 44 40 43 36 52 30 35 34 37 29 16 32 22 38 19 38 11 27 17 31 16 5 13 19 17 33 38 18 33 16 38 19 33 30 40 44 30
3510 30 36 30 43 40 51 27 36 34 35 33 46 42 35 29 15 29 29 20 23 20 22 12 20 19 10 7 41 22 33 34 22 33 34 39 32 34 32 34 34 44 45 35 35 39 39 33
3556 33 34 35 39 23 41 47 41 46 38 31 28 29 33 24 12 41 20 23 15 17 35 15 16 9 22 18 25 17 27 19 28 23 29 36 39 49 21 51 40 40 38 31 29 33 39 31 31
3603 31 21 41 27 39 31 41 16 33 9 10 10 8 15 13 18 8 22 24 12 17 18 37 28 33 16 36 28 39 30 38 25 36 41 22 51 32 46 34
3641 34 43 28 27 23 37 43 24 40 31 33 24 17 24 23 -4 20 19 21 15 8 31 24 24 32 36 13 25 18 35 33 26 31 29 48 27 39 40 40 43 28 46 38 38 37 44
3686 44 22 33 19 39 23 21 34 7 12 6 22 25 29 23 40 23 20 23 8 27 35 37 23 40 40 39 40 41 41 36 32 37 31 41 37 23 36 31 24 30 40 40
3728 40 21 17 26 21 29 23 13 16 18 8 8 6 22 12 28 10 33 14 31 30 32 27 34 42 31 42 28 25 34 50 40 43 27 30 25 22 20 36 33 18 32
3769 32 28 30 38 13 32 32 15 21 29 11 22 26 24 25 26 28 20 22 37 33 31 28 27 35 30 32 34 52 43 44 47 29 40 28 34 36 47 23 32 28 17 20 30 25 13
3814 13 23 18 16 9 18 14 26 24 19 29 14 37 26 51 31 32 33 35 30 33 42 25 41 26 33 27 23 38 42 33 28 27 22 24 35 36 29 30 26 14 20 22 29 24 13
3859 13 8 30 11 22 25 30 39 28 27 24 28 27 48 29 51 33 43 36 41 46 33 50 57 40 34 53 34 25 39 35 41 30 15 29 21 12 19 15 16 10 13 8
3901 8 16 17 24 15 25 29 26 44 32 34 36 31 31 41 32 40 38 39 42 37 37 30 41 27 35 39 38 40 22 35 9 35 8 28 10 22 23 16 7 16 17 15 -2 18 29
3946 29 18 30 15 41 41 21 40 40 34 35 49 42 37 32 34 44 28 33 45 29 16 26 18 13 21 26 25 20 30 25 25 7 30 24 20 11 25 31 18 19 38
3987 38 20 24 35 35 45 27 37 32 35 32 44 49 35 44 45 44 50 40 42 37 27 30 25 27 25 32 24 27 16 23 19 18 19 29 21 37 30 35 21 30 15 34 27 25 32
4032 32 17 42 36 50 33 46 35 43 43 51 39 45 51 49 30 30 28 26 29 27 24 21 26 14 25 9 21 31 15 32 6 25 14 34 43 29 22 23 27 34
4072 34 31 36 51 39 41 26 39 54 30 40 30 42 30 43 31 40 36 41 33 33 32 31 34 22 36 27 26 9 16 18 23 27 21 32 22 33 29 28 38 39 42
4113 42 36 35 45 41 48 42 36 52 44 53 54 36 39 44 30 37 26 30 41 39 35 31 17 20 42 33 20 31 20 24 20 20 25 34 31 30 44 41 15 33 22 23 41 37
4157 37 47 49 58 50 35 49 45 32 39 40 35 35 21 28 13 19 29 19 18 22 34 24 28 25 25 20 23 30 28 29 40 38 27 39 36 36 51 52 36 41 30 35 46
4200 46 44 41 31 48 41 47 21 42 34 30 28 35 33 30 25 13 9 24 31 21 29 39 27 20 31 21 28 35 29 44 34 41 37 29 42 56 36 31 45 51 41 39
4242 39 49 52 35 31 40 27 42 41 26 29 38 30 32 32 21 31 24 14 17 21 28 19 35 17 37 36 22 37 18 15 30 42 22 34 42 46 48 33 44 37
4282 37 51 41 39 48 51 35 32 26 27 29 19 30 18 31 26 28 22 27 29 30 25 14 30 23 37 26 30 29 44 36 45 24 46 42 46 50 36 48 50 37 47 41
4324 41 47 43 42 34 27 38 23 36 29 27 41 29 29 32 24 19 31 34 20 30 19 29 29 35 31 24 20 43 47 43 32 44 39 47 41 42 49 37 38 39 30 45 39 27
4368 27 37 40 29 34 22 23 29 15 25 25 29 25 10 20 26 28 20 25 22 25 30 35 33 42 32 26 31 48 22 28 35 49 47 50 54 35 45 33 43 33 28 32 32 32
4412 32 15 30 37 38 29 20 6 31 13 18 22 24 27 13 25 20 28 22 35 34 43 35 44 37 36 36 35 40 47 55 36 37 46 36 46 47 30 37 37 28 43 34 30 28 23 21 32
4459 32 25 22 38 11 33 15 31 15 20 34 29 31 30 36 27 40 40 50 38 37 43 34 44 39 45 52 42 39 45 44 37 31 24 38 31 46 26 22 20 21 23 27 33 24 28
4504 28 26 29 27 29 24 33 37 46 38 39 45 54 42 34 42 51 50 34 42 49 52 51 53 45 36 40 20 38 23 37 11 23 28 16 30 42 33 18 24 23 24 23 20 27 34 39 31 25
4552 25 21 34 15 26 49 42 43 38 39 47 44 44 57 36 40 36 49 26 37 34 29 43 13 19 16 33 29 21 26 26 8 34 23 23 22 23 40 28 50 28 46
4593 46 30 38 17 32 40 34 43 43 49 46 43 35 59 37 30 35 33 28 28 26 28 39 23 23 10 21 32 14 30 28 30 15 24 26 21 28 30 26 19 29 29 39 41 47 42
4638 42 34 39 41 44 35 39 40 47 36 41 33 34 32 41 36 21 44 25 23 34 25 18 19 13 36 20 10 22 25 24 26 28 30 32 26 38 38 40 39 41 37 34 36 43 53 45 42 41 42
4687 42 41 39 41 42 34 23 29 40 23 22 25 23 20 28 13 18 16 16 29 13 20 30 18 37 25 43 25 39 44 34 38 38 62 42 39 36 53 48 58 51 47 47
4729 47 36 41 26 36 25 30 29 32 24 16 25 23 47 21 28 17 21 8 10 27 44 32 33 38 33 48 21 52 43 56 47 44 41 38 44 45 49 33 29 42 42 32
4771 32 27 25 29 22 39 31 32 28 19 26 18 37 20 21 21 19 22 12 23 26 25 34 34 31 32 33 44 31 39 52 46 40 40 42 39 35 41 42 59 45 46 29 31 34 31 21 33
4818 33 27 15 9 17 37 17 28 24 46 26 24 34 34 37 29 42 27 33 51 53 47 43 49 43 50 53 46 51 41 43 50 44 40 36 39 45 36 33 32 33 27 17 26 31 31 40 15
4865 15 27 27 32 29 26 30 42 37 34 30 43 29 36 52 37 37 38 57 49 43 43 52 39 42 46 38 33 45 32 41 27 26 25 31 23 35 21 15 20 16 19 32 41 22 26
4910 26 32 31 32 35 34 35 37 51 50 39 42 39 53 49 47 42 31 31 44 46 45 45 28 32 36 41 19 28 26 26 24 20 15 24 24 28 15 30 23 38 35 27 19 37 25 43 45
4957 45 31 46 43 45 44 49 37 55 40 36 38 53 45 40 26 43 37 25 35 28 33 22 22 26 17 16 20 25 23 15 18 9 32 35 33 19 33 27 46 32 38 38 48
5000 48 40 38 44 49 52 41 44 43 46 50 54 31 44 39 45 37 28 23 23 20 17 18 25 38 34 27 21 24 27 24 34 31 33 42 35 35 52 34 51 60 34 39 43 46 41 50 36 49 36
5049 36 37 39 39 33 40 42 38 35 30 20 24 21 22 19 26 29 20 36 24 30 22 40 38 36 28 25 26 40 44 60 37 51 43 46 35 55 43 50 45 38 49 38 47 44 30 30
5095 30 55 30 19 27 31 11 33 21 10 22 29 27 26 20 22 36 22 26 30 32 40 39 36 39 43 30 48 39 43 40 39 42 60 51 39 42 41 44 30 42 30 16
5137 16 28 14 24 18 18 11 34 16 23 12 23 36 27 36 35 21 21 33 27 29 20 37 31 41 44 39 47 59 54 41 30 43 20 40 31 32 19 31 41
5176 41 32 36 35 28 34 31 27 12 18 22 21 26 15 34 18 29 30 18 31 26 27 30 43 32 44 40 49 36 39 28 44 40 51 33 35 47 39 27 29 31 33 31 39
5219 39 30 33 24 22 33 26 22 21 13 22 29 11 30 26 33 23 24 16 48 44 41 38 43 41 41 44 49 51 45 30 34 34 29 40 32 33 32 24 37 37 42 15 24 26 37 26 26 15
5267 15 21 32 30 22 22 25 27 29 24 41 30 29 22 24 37 51 38 49 57 47 54 45 36 38 43 26 41 37 24 34 36 14 33 27 17 21 32 31 19 25 21 17 21
5310 21 28 32 25 34 26 26 37 40 39 31 46 55 67 44 53 32 37 37 34 40 36 37 44 34 34 29 35 27 32 28 32 22 25 4 19 18 27 18 24 18 33 24 35 20 36 37 30
5357 30 34 35 48 36 42 41 41 46 36 48 41 45 31 35 40 30 49 32 43 24 41 27 25 20 32 17 15 22 20 17 27 21 11 31 32 33 33 41 34 19 37
5398 37 31 33 29 52 42 47 38 50 41 39 47 50 45 51 40 44 29 32 24 31 48 35 29 29 28 29 15 21 18 14 11 26 19 12 27 27 27 44 30 27 33 27 53 38 38 33
5444 33 41 41 48 50 50 34 28 49 29 36 20 29 36 35 33 26 36 23 32 21 31 10 19 23 18 30 15 24 20 28 40 30 41 42 38 33 36 50 43 46 49 48 44 38 50
5489 50 38 47 47 21 42 43 36 23 23 31 30 27 31 24 12 24 19 16 22 32 11 7 24 23 25 27 38 22 27 29 30 33 25 37 33 53 40 49 34 32 45 47 41 60
5533 60 42 40 30 23 42 24 23 27 21 11 17 17 22 23 18 21 27 18 21 29 31 24 16 25 39 34 23 31 28 35 30 38 52 28 45 45 45 51 37 46 25 31 34 30 26 29 30 30
5581 30 33 20 36 26 28 25 25 4 25 17 20 30 25 32 42 29 23 23 36 50 40 43 34 52 31 45 48 30 42 48 39 28 38 44 31 28 21 33 37 25
5621 25 28 27 21 18 10 9 20 12 12 24 23 8 36 19 18 27 27 37 38 25 38 37 45 27 44 38 30 38 33 46 42 39 31 30 34 37 32 32 32 12 27 30 28 22 30 21 22
5668 22 20 28 26 14 19 19 32 28 30 37 21 37 42 34 27 42 36 28 42 36 47 50 38 43 45 42 35 34 39 31 34 29 20 23 22 22 20 22 30 5 16 26 18 15 16 14 22 16 26
5717 26 22 32 8 29 33 40 27 45 53 41 47 56 60 35 47 42 41 36 39 37 29 27 19 35 25 28 30 36 10 41 26 21 21 35 23 16 26 33 30 27 18 35 32
5760 32 48 39 41 37 44 37 43 40 51 55 47 50 37 45 38 42 37 37 34 37 36 30 12 23 20 13 29 18 26 17 20 27 22 9 13 50 26 35 38 44 36 45 30 34 32 41 45 54 48
5809 48 48 27 41 35 41 39 45 43 41 46 36 34 19 22 27 37 18 22 22 24 19 2 27 26 29 29 19 39 47 44 42 20 36 29 34 31 41 30 42 39 46 45 40 47 45
5854 45 44 38 40 33 29 38 44 26 21 15 12 28 39 25 25 20 29 31 28 25 28 29 27 32 41 23 30 37 34 46 48 38 37 47 42 50 42 54 51 61 57 33 54 35 38 23
5900 23 22 18 25 27 16 20 14 29 28 34 26 17 23 22 26 31 24 29 38 52 36 28 35 39 31 38 40 31 35 42 34 49 44 47 45 42 36 31 35 31 35 27 21 26 26 30 36 20 35 32 38 27
5952 27 23 26 34 38 31 39 24 38 34 34 47 36 46 47 49 41 46 51 37 52 44 63 50 39 37 33 25 23 25 27 32 15 32 28 22 25 24 24 20 27 31 17 33 22 29
5997 29 27 35 37 50 43 45 43 34 62 39 50 44 55 38 52 52 42 54 54 47 47 42 28 37 34 25 33 31 25 28 34 19 20 23 23 20 22 31 26 22 26 40 29 50 37
6042 37 41 55 54 38 30 46 58 48 39 43 41 47 42 50 24 39 40 42 27 28 29 47 29 33 26 34 32 33 23 33 28 16 27 23 27 19 46 49 23 41 29 22
6084 22 55 45 39 62 44 53 51 42 49 35 45 51 46 36 29 44 32 30 39 23 14 6 25 13 20 16 25 19 12 20 18 24 27 25 29 43 31 30 48 33 32 31 31 36
6128 36 42 44 38 51 35 37 56 41 46 32 32 35 29 15 34 23 24 33 25 30 16 32 19 10 32 35 14 27 12 31 19 38 46 39 36 25 24 35 39 36
6168 36 44 48 26 42 35 47 43 39 40 44 39 31 27 22 25 29 31 14 23 21 27 29 16 11 18 14 6 21 17 31 25 30 40 21 37 34 44 43 53 42 44 38 48 44 53 39
6214 39 38 39 34 32 26 34 39 31 17 33 27 24 17 15 21 24 27 25 12 18 4 10 24 26 19 24 34 39 37 30 45 44 28 39 28 41 28 33 45 35 39 41 28 35 40
6259 40 32 36 27 23 26 17 40 38 15 33 16 20 18 28 41 29 30 35 21 27 34 26 28 37 28 27 35 34 32 20 43 45 47 38 37 37 41 36 38 44 43 19 23 25 22 24 26 22 17
6308 17 17 32 28 20 26 39 30 23 26 23 24 38 35 30 33 39 34 37 41 29 46 38 47 44 43 49 41 46 44 47 35 38 37 33 29 23 30 38 19 25 32 24 25 19 10 19 11 22 26 19 28 27
6360 27 36 37 32 36 28 27 34 48 34 33 43 35 44 32 30 34 41 34 44 36 25 35 19 25 15 33 19 13 15 33 6 13 28 41 31 16 17 19 21 15 18 30
6402 30 42 40 28 34 41 30 29 39 22 37 33 37 28 40 35 41 34 22 28 39 25 27 31 26 24 30 15 25 30 18 13 27 27 26 33 20 25 29 38 34 27 34 47 50
6446 50 39 27 36 31 40 47 34 47 44 42 46 31 29 34 26 35 32 27 27 16 10 25 16 6 13 9 5 29 28 8 26 28 22 18 30 39 34 21 33 25 38 31 31 33 43
6491 43 38 45 43 42 38 31 25 41 29 34 42 18 30 30 23 24 22 22 27 21 29 22 21 20 19 38 20 33 19 37 29 31 29 35 27 27 49 45 39 42 51 42 42 33 30 39 46 45 50 29
6541 29 34 36 37 43 27 25 29 14 10 34 26 19 20 23 23 23 30 22 18 19 16 37 34 37 39 23 48 36 46 47 36 47 38 38 34 45 37 40 38 35 42 24 38 38 28 33
6587 33 33 33 27 13 28 27 25 24 37 28 12 22 29 27 32 32 34 42 31 50 35 43 34 56 49 47 28 45 38 42 38 31 41 40 41 16 21 23 33 27 24 22 29 13 15
6632 15 39 14 4 29 16 21 22 34 25 25 34 29 38 24 34 39 36 47 43 37 55 57 39 34 41 54 34 36 36 26 31 26 35 25 18 18 25 23 24 23 27 25 20 17 10
6677 10 38 26 19 26 22 33 8 26 26 32 34 33 35 35 38 40 28 36 36 43 39 34 36 34 40 38 30 33 21 22 21 20 31 29 22 28 24 30 20 7 28 29 28 30 38 27 25 38
6725 38 33 23 27 33 42 42 47 41 48 43 53 43 42 34 26 37 55 34 37 33 38 43 18 25 26 31 17 12 28 32 19 35 28 21 24 29 28 39 16 27 21 38 46 34
6769 34 34 40 32 33 30 29 36 36 24 30 33 44 29 29 31 13 19 34 37 20 13 19 16 21 3 24 27 20 23 3 11 17 31 34 24 18 27 29 37 44 50 33 35 34 42 33 42 36
6817 36 38 44 45 34 29 40 46 33 21 26 19 20 17 25 14 19 26 12 25 25 11 28 31 34 20 26 22 30 36 41 30 41 46 37 38 27 39 57 51 41 44 51 37
6860 37 33 40 26 29 37 25 24 36 16 25 25 7 18 32 16 17 21 21 42 32 35 30 26 28 29 21 36 33 36 40 31 34 40 35 43 42 33 23 40 37 32 31 41 37 29 30
6906 30 37 10 33 34 18 22 20 32 39 28 23 10 14 12 20 22 23 28 26 24 24 28 41 42 40 40 29 43 38 48 49 29 37 34 32 32 23 35 31 37 41 -3 14 25 10
6951 10 12 28 12 30 22 3 9 21 30 21 23 25 25 21 22 31 34 27 30 22 29 38 29 29 18 25 33 20 13 20 38 26 31 31 36 31 21 23 26 17 32 12 7 16 11 16 24 18
6999 18 14 20 28 34 39 29 30 27 32 40 30 38 47 55 39 44 38 47 29 40 37 32 32 32 27 33 34 31 25 7 18 26 20 18 9 15 11 15 21 27 29 29 29 22 29 29 34 24 26 41 32
7050 32 31 55 31 21 41 41 46 41 28 30 25 33 43 21 38 15 23 42 29 25 38 21 21 32 9 21 21 19 12 18 12 14 34 22 17 24 30 32 44 36 31
7091 31 49 32 37 39 41 34 39 39 31 47 37 31 39 39 28 31 29 29 40 33 39 19 34 21 14 20 7 18 23 27 11 35 29 41 31 39 30 37 29 34 22 41 45
7134 45 48 37 43 28 34 40 32 18 39 30 27 32 37 36 36 28 25 27 20 23 25 18 15 16 23 16 25 25 37 29 33 32 36 34 40 27 27 35 36 37 28 41 40 41 32 39 35 36 22 27 35 38
7186 38 31 28 28 29 17 13 25 18 22 8 10 23 20 44 14 24 32 26 27 27 24 10 28 18 30 29 28 34 36 48 39 53 40 49 30 37 37 41 32 35 19 19 23 27
7230 27 22 9 19 26 21 21 13 20 22 9 18 17 19 26 19 30 31 27 25 35 38 53 42 40 34 41 48 37 32 44 35 37 26 21 37 32 26 38 24 29 21 36 20 9
7274 9 23 17 17 4 17 25 16 29 19 26 22 30 34 14 26 25 23 31 27 22 40 33 39 45 44 26 34 43 37 25 30 38 22 17 31 30 21 23 7 23 28 28 23 17 14 10 28
7321 28 21 20 18 30 27 22 46 43 20 25 32 39 37 41 28 42 23 34 36 35 37 20 26 23 32 42 36 29 30 22 17 15 14 15 20 22 20 16 21 17 24 23 38 21 27 19 43 32
7369 32 35 33 28 31 50 33 30 32 39 32 40 50 35 35 38 38 32 27 34 25 16 25 24 16 23 8 35 19 6 24 26 11 25 27 28 26 30 30 40 27 29 40 30 35 23
7414 23 31 36 28 39 54 50 37 32 44 39 36 21 35 29 24 32 24 29 30 28 28 14 18 17 14 23 17 15 20 38 28 23 22 30 25 41 49 36 29 31 36 33 35 31 39 26 40
7461 40 36 13 23 15 25 23 31 29 21 23 28 23 23 14 17 22 15 27 30 29 14 20 22 32 31 20 23 28 30 19 41 32 25 32 36 41 36 36 33 39 30 25 26 25 24 30 18 23 36
7510 36 9 23 37 27 29 20 19 26 20 21 22 31 5 32 26 13 25 29 28 38 36 38 28 25 30 32 47 35 38 38 33 31 33 27 39 32 26 27 33 28 27 28 31 24 25 22 20
7557 20 19 25 23 25 20 12 17 23 32 32 27 25 31 31 32 36 23 29 27 30 29 36 28 26 31 39 40 41 41 28 24 23 20 19 28 18 24 31 31 15 15 25 19 24 22 16 12 18 26 23 18 21 34 31
7611 31 30 38 36 24 34 22 28 45 34 36 39 29 25 34 36 43 25 30 22 22 23 18 22 16 24 24 18 17 19 17 22 17 25 13 28 13 17 31 28 34 30 32 27 34 21 36 43
7658 43 43 45 46 30 38 39 48 32 41 21 36 26 30 9 22 20 17 23 24 13 7 14 9 20 13 18 23 29 25 28 33 29 41 33 36 20 36 38 56 35 43 33 39 43 41
7703 41 39 46 40 34 33 32 37 29 26 15 37 8 24 13 7 5 19 12 16 24 18 14 24 24 33 23 11 15 22 38 30 27 29 28 39 40 38 35 27 37 28 35 37 38 38 20 30
7750 30 34 31 32 20 14 31 20 26 9 13 14 30 25 21 24 23 16 28 25 36 23 30 35 32 36 36 25 27 27 32 39 33 36 32 39 38 20 21 20 25 38 22 23 23 25 21 15 23
7798 23 26 17 23 18 11 18 8 32 26 40 23 28 24 28 35 37 43 59 40 39 47 23 42 32 46 33 45 36 44 39 42 31 28 36 31 29 26 14 27 19 18 14 21 22 24
7843 24 27 10 22 13 24 30 26 34 43 34 27 20 29 29 32 39 47 38 38 31 36 32 35 39 29 32 19 20 22 32 27 16 14 14 24 25 5 20 16 35 31 35 23 21 33 29 23
7890 23 32 37 33 26 43 37 31 39 39 26 24 43 39 28 48 33 29 30 33 27 32 23 24 20 29 26 24 25 36 34 8 29 15 30 23 24 30 25 35 24 19 19 37 23 18
7935 18 28 34 38 32 29 38 39 34 35 34 31 36 29 27 36 31 19 27 22 17 14 19 13 16 29 21 21 10 19 21 36 39 18 12 31 35 45 37 33 34 28 34 35 32 37 39 31 37 34 35 36 30
7987 30 27 36 30 26 24 14 29 25 30 20 25 35 21 17 21 26 12 28 25 21 33 36 31 37 40 37 40 22 19 51 26 42 33 29 37 28 33 33 28 43 38 46 37 25 42
8032 42 37 28 21 31 15 32 16 18 32 16 27 18 20 15 15 10 12 29 23 26 30 31 24 26 22 30 41 29 31 27 37 33 31 18 28 29 30 29 24 22 18 18 15 32 19
8077 19 19 8 5 13 15 9 11 16 19 13 21 31 22 21 15 33 26 36 27 42 31 38 44 34 31 42 33 38 30 32 37 23 26 15 38 23 20 27 34 30 28 24 16 21 34 19
8123 19 20 19 3 24 31 17 25 32 22 24 31 27 20 31 41 36 35 35 29 30 30 40 30 34 29 24 33 20 26 30 26 24 16 22 32 26 12 11 29 22 12 7 13 24 22 23
8169 23 26 23 26 13 11 9 30 38 28 37 32 53 22 32 18 36 41 23 31 31 40 28
8191B8
##END NTUPLES=NMR FID
##END=
