##TITLE=1H_TG-2254
 CDCl3, 8 sc, 
 26.9.2019
##JCAMPDX= 6.0         $$ Bruker NMR JCAMP-DX V2.0
##DATA TYPE= NMR FID
##DATA CLASS= NTUPLES
##ORIGIN= UXNMR, Bruker Analytische Messtechnik GmbH
##OWNER= root
$$ XWIN-NMR		Version 3.5
$$ Thu Sep 26 14:15:17 2019 Russian Standard Time (UT+4h)  she@DPX200
##.OBSERVE FREQUENCY= 200.1315
##.OBSERVE NUCLEUS= ^1H
##.DELAY= (6, 6)
##.ACQUISITION MODE= SIMULTANEOUS
##.ACQUISITION SCHEME= undefined
##.AVERAGES= 8
##.DIGITISER RES= 18
##SPECTROMETER/DATA SYSTEM= spect
##.PULSE SEQUENCE= zg30
##.SOLVENT NAME= CDCl3
##.SHIFT REFERENCE= (INTERNAL, CDCl3, 0, 15.7039)
##AUDIT TRAIL= $$ (NUMBER, WHEN, WHO, WHERE, WHAT)
$$ ##TITLE= Audit trail, XWIN-NMR		Version 3.5
$$ ##JCAMPDX= 5.01
$$ ##ORIGIN= Bruker BioSpin GmbH
$$ ##OWNER= she
$$ F:/spectra/data/she/nmr/H-F/1/audita.txt
$$ ##AUDIT TRAIL=  $$ (NUMBER, WHEN, WHO, WHERE, WHAT)
(   1,<2019-09-26 14:14:04.51 +0400>,<she>,<DPX200>,
      <created by zg, POWCHK disabled, PULCHK disabled
       configuration hash MD5:
       00 E9 B6 7A A2 85 ED C7 34 08 36 98 17 FE 4E 26
       data hash MD5: 16K
       DF 77 5C BA 85 95 EB 32 C7 30 0D 64 EF A9 E2 31>)
$$ ##END=
$$ 
$$ hash MD5
$$ BF D6 5D FE 7C 4D AD 88 F8 AB 3B CE F5 CF A8 A6
##$RELAX= 
##$RELAX= 
##$RELAX= 
##$RELAX= 
##$RELAX= 
##$RELAX= 
$$ Bruker specific parameters
$$ --------------------------
##$DU= <F:/spectra>
##$EXPNO= 1
##$NAME= <H-F>
##$PROCNO= 1
##$TYPE= <nmr>
##$USER= <she>
##$AMP= (0..31)
100 100 100 100 100 100 100 100 100 100 100 100 100 100 100 100 100 100 
100 100 100 100 100 100 100 100 100 100 100 100 100 100 
##$AQSEQ= 0
##$AQ_mod= 1
##$AUNM= <au_zg>
##$AUTOPOS= <>
##$BF1= 200.13
##$BF2= 200.13
##$BF3= 200.13
##$BF4= 200.13
##$BF5= 200.13
##$BF6= 200.13
##$BF7= 200.13
##$BF8= 200.13
##$BYTORDA= 1
##$CFDGTYP= 0
##$CFRGTYP= 5
##$CHEMSTR= <none>
##$CNST= (0..31)
1 1 145 1 1 1 1 1 1 1 1 1 1 1 1 1 1 1 1 1 1 1 1 1 1 1 1 1 1 1 1 1 
##$CPDPRG= <>
##$CPDPRG1= <>
##$CPDPRG2= <>
##$CPDPRG3= <>
##$CPDPRG4= <mlev>
##$CPDPRG5= <mlev>
##$CPDPRG6= <mlev>
##$CPDPRG7= <mlev>
##$CPDPRG8= <mlev>
##$CPDPRGB= <>
##$CPDPRGT= <>
##$D= (0..31)
0 1.2 0 0 0 0 0 0 0 0.06 0 0.03 0 0 0 0 0.0002 0 0 0 0 0 0 0 0 0 0 0 0 
0 0 0 
##$DATE= 1569492844
##$DBL= (0..7)
120 120 120 120 120 120 120 120 
##$DBP= (0..7)
150 150 150 150 150 150 150 150 
##$DBP07= 0
##$DBPNAM0= <>
##$DBPNAM1= <>
##$DBPNAM2= <>
##$DBPNAM3= <>
##$DBPNAM4= <>
##$DBPNAM5= <>
##$DBPNAM6= <>
##$DBPNAM7= <>
##$DBPOAL= (0..7)
0.5 0.5 0.5 0.5 0.5 0.5 0.5 0.5 
##$DBPOFFS= (0..7)
0 0 0 0 0 0 0 0 
##$DE= 6
##$DECBNUC= <off>
##$DECIM= 24
##$DECNUC= <off>
##$DECSTAT= 4
##$DIGMOD= 1
##$DIGTYP= 9
##$DL= (0..7)
0 120 120 120 120 120 120 120 
##$DP= (0..7)
150 150 150 150 150 150 150 150 
##$DP07= 0
##$DPNAME0= <>
##$DPNAME1= <>
##$DPNAME2= <>
##$DPNAME3= <>
##$DPNAME4= <>
##$DPNAME5= <>
##$DPNAME6= <>
##$DPNAME7= <>
##$DPOAL= (0..7)
0.5 0.5 0.5 0.5 0.5 0.5 0.5 0.5 
##$DPOFFS= (0..7)
0 0 0 0 0 0 0 0 
##$DQDMODE= 0
##$DR= 18
##$DS= 0
##$DSLIST= <SSSSSSSSSSSSSSS>
$$ [...]
##$SUBNAM2= <"">
##$SUBNAM3= <"">
##$SUBNAM4= <"">
##$SUBNAM5= <"">
##$SUBNAM6= <"">
##$SUBNAM7= <"">
##$SUBNAM8= <"">
##$SUBNAM9= <"">
##$SW= 24.0689530833862
##$SWIBOX= (0..15)
0 0 2 0 0 0 0 0 0 0 0 0 0 0 0 0 
##$SW_h= 4816.95568400771
##$TD= 16384
##$TD0= 1
##$TE= 0
##$TE2= 300
##$TE3= 300
##$TEG= 300
##$TL= (0..7)
0 120 120 120 120 120 120 120 
##$TP= (0..7)
150 150 150 150 150 150 150 150 
##$TP07= 0
##$TPNAME0= <>
##$TPNAME1= <>
##$TPNAME2= <>
##$TPNAME3= <>
##$TPNAME4= <>
##$TPNAME5= <>
##$TPNAME6= <>
##$TPNAME7= <>
##$TPOAL= (0..7)
0.5 0.5 0.5 0.5 0.5 0.5 0.5 0.5 
##$TPOFFS= (0..7)
0 0 0 0 0 0 0 0 
##$TUNHIN= 0
##$TUNHOUT= 0
##$TUNXOUT= 0
##$USERA1= <user>
##$USERA2= <user>
##$USERA3= <user>
##$USERA4= <user>
##$USERA5= <user>
##$V9= 5
##$VALIST= <valist>
##$VCLIST= <CCCCCCCCCCCCCCC>
##$VD= 0
##$VDLIST= <DDDDDDDDDDDDDDD>
##$VPLIST= <PPPPPPPPPPPPPPP>
##$VTLIST= <TTTTTTTTTTTTTTT>
##$WBST= 1024
##$WBSW= 4
##$XGAIN= (0..3)
0 0 0 0 
##$XL= 0
##$YL= 0
##$YMAX_a= 57822
##$YMIN_a= -80467
##$ZGOPTNS= <>
##$ZL1= 120
##$ZL2= 120
##$ZL3= 120
##$ZL4= 120
##$ABSF1= 10
##$ABSF2= 0
##$ABSG= 5
##$ABSL= 3
##$ALPHA= 0
##$AQORDER= 0
##$ASSFAC= 0
##$ASSFACI= 0
##$ASSFACX= 0
##$ASSWID= 0
##$AUNMP= <proc_1d>
##$AZFE= 0.1
##$AZFW= 0.1
##$BCFW= 1
##$BC_mod= 2
##$BYTORDP= 1
##$COROFFS= 0
##$CY= 11.3945322036743
##$DATMOD= 1
##$DC= 2
##$DFILT= <>
##$DTYPP= 0
##$F1P= 20.1720416913024
##$F2P= 0.152960286110954
##$FCOR= 0.5
##$FTSIZE= 0
##$FT_mod= 4
##$GAMMA= 1
##$GB= 0.15
##$INTBC= 1
##$INTSCL= 1
##$ISEN= 128
##$LB= 0.24
##$LEV0= 0
##$LPBIN= 0
##$MAXI= 10000
##$MC2= 0
##$MEAN= 0
##$ME_mod= 0
##$MI= 1.114404
##$NCOEF= 0
##$NC_proc= 0
##$NLEV= 6
##$NOISF1= 3.799351
##$NOISF2= 2.8
##$NSP= 1
##$NTH_PI= 0
##$NZP= 0
##$OFFSET= 15.70392
##$PC= 1
##$PHC0= -9572.918
##$PHC1= 20.80095
##$PH_mod= 1
##$PKNL= yes
##$PPARMOD= 0
##$PSCAL= 0
##$PSIGN= 0
##$REVERSE= no
##$SF= 200.130013532006
##$SI= 16384
##$SIGF1= 3
##$SIGF2= 2
##$SINO= 400
##$SIOLD= 16384
##$SREGLST= <1H.CDCl3>
##$SSB= 0
##$STSI= 0
##$STSR= 0
##$SW_p= 3612.71676300578
##$SYMM= 0
##$S_DEV= 0
##$TDeff= 0
##$TDoff= 0
##$TI= <>
##$TILT= no
##$TM1= 0
##$TM2= 0
##$TOPLEV= 0
##$USERP1= <user>
##$USERP2= <user>
##$USERP3= <user>
##$USERP4= <user>
##$USERP5= <user>
##$WDW= 1
##$XDIM= 8192
##$YMAX_p= 0
##$YMIN_p= 0
$$ End of Bruker specific parameters
$$ ---------------------------------
##NTUPLES= NMR FID
##VAR_NAME=  TIME,          FID/REAL,        FID/IMAG
##SYMBOL=    X,             R,               I
##VAR_TYPE=  INDEPENDENT,   DEPENDENT,       DEPENDENT
##VAR_FORM=  AFFN,          ASDF,            ASDF
##VAR_DIM=   8192,          8192,            8192
##UNITS=     SECONDS,       ARBITRARY UNITS, ARBITRARY UNITS
##FACTOR=    0.0002076,     1,               1
##FIRST=     0,             0,               0
##LAST=      1.7004516,     0,               0
##MIN=       0,             -80467,          0
##MAX=       1.7004516,     57822,           0
$$ Real data points
##PAGE= N=1
##DATA TABLE= (X++(R..R)), XYDATA
0@%%%%%%%%%qJ6j6J6j6K4l2L9m7N5o3P2q8J03j18J35j53J74j98K26k57K89l23
32a70L62m06M52n06N65o26O95p71Q54r47J049j161J286j425J581j761J963k194
50a160K469k796L191l681M309n147O329q141J1304j8420O3766L244o1460M7746
64D1553j4999j210K9117j3320l4613M2566M702m3372O955J5562l5534K2437L7978
77E7822m3759l2876L4340q860j4965L8748k081m1863K1209J1090l6638J7047L1373
90C0587l9067n786M6064j5206l1585J9163p723j3970M6543J0054n3355J906K2948
103A0573k4964P718L0875l2831j6382M3877m384l4337J2484o523k2232M0810K0771
116B5455n0417m564L2771k0500n490L3897k0731k6511L5313O335k7334J8248N705
$$ plain form
0 0 0 0 0 0 0 0 0 0 0 -8 8 -8 8 -8 16 -16 23 -24 31 -32 40 -48 55 -63 72 -81 93 -105 121 -136 153 -170
32 -170 192 -214 238 -268 297 -329 366 -405 449 -498 551 -610 676 -749 832 -929 1034 -1160
50 -1160 1309 -1487 1704 -1977 2332 -2815 3514 -4627 6677 -11743 52023 55267 -6193 41553
64 41553 26554 25344 54461 41141 6528 49094 53796 10424 17379 32941 -2593 19844 57822
77 57822 14063 -18813 15527 6667 -8298 30450 28369 -13494 7715 18805 -17833 -786 30587
90 30587 -8480 -14266 31798 16592 -14993 4170 -3553 -17523 29020 39074 -14281 -12375 10573
103 10573 -14391 -6673 24202 -8629 -25011 18866 14482 -19855 -7371 -13894 -36126 4684 25455
116 25455 -24962 -29526 3245 -17255 -22745 11152 -9579 -36090 -777 5558 -21776 -3528 2177
129B177l0125K3927L0274l6426j0177L0410j7008r573M0381q247l4555K3011Q729
142A2798k6759J9546J5550l9035N292M0405j9468j9763K0816j5862j6594L9614
154A6540L609l8485J3912J7605k3109J2532J8853l7693o694M3601o049k1600J9970
167A2992o995k0272L1363J0190l8089R716K5665k3863J992K9046k4184j9279L1564
180A9846j325k2731K0857L62l0385J9609K0959k8038K81J9896k6226n447L5256
193B2914j3965k8574K5338P332k0812J7992M110l7282J0905L3254j9844q696K3304
206A5976j6612j2952L0997o011l0582K1111J3555k2659J4321J4810l3675j323
218a3044L1507j5813j3556K4715j0432k1977K7060N552k9543J2314J4072k6124
$$ plain form
129 2177 -27948 -4021 26253 -10173 -20350 10060 -6948 -16521 23860 15613 -18942 4069 12798
142 12798 -13961 5585 21135 -17900 -12608 27797 8329 -11434 9382 -6480 -23074 16540
154 16540 20149 -18336 -4424 13181 -9928 2604 21457 -16236 -22930 20671 14622 -6978 12992
167 12992 5997 -14275 17088 27278 -10811 -1095 24570 707 2699 31745 7561 -11718 19846
180 19846 18521 -4210 16647 17009 -13376 6233 27192 -846 -565 19331 -6895 -12342 22914
193 22914 8949 -19625 5713 13045 -7767 10225 14335 -22947 -12042 21212 1368 -7328 15976
206 15976 -636 -13588 17409 11398 -19184 1927 15482 -7177 7144 21954 -11721 -13044
218 -13044 18463 2650 -10906 13809 3377 -18600 8460 14012 -15531 -3217 10855 -15269
230a5269P397K4151k6773j2179L1678n762j7419K1387m784k7138K1112J5087k5286
243a3798Q169J9220k3127o86K7147j9144j8712K7552J220j9019K1379L920l0341
256a6220J1240K0408k2309n36K1319j8500q071K8544r714k4278K0811M690k0915
269a3531J6064R911k8492N908K6082j8570q368K2878j2813j5898K5184k79k3627
282a5551J8252J1086k3435R591J7352k5633l377K6250j2274j1096K4509p127k2578
295a4031K0555P131k5032J0504J4123k1192M879K2680k1901j2061K5642o760j7822
308a3285K0864m3k3107J7060J4099k5168K892J9515j9087m153K3979j3727j4655
321a4816K3473l04k0550J6760O051k4763R515J8678k0568j384K1536j5157j0786
$$ plain form
230 -15269 -7872 16279 -10494 -22673 9005 3243 -14176 7211 2427 -24711 -3599 11488 -13798
243 -13798 -5629 13591 -9536 -10222 16925 -2219 -20931 6621 7841 -11178 10201 14121 -16220
256 -16220 -4980 15428 -6881 -7417 13902 -4598 -12669 15875 6161 -18117 2694 7384 -13531
269 -13531 2533 12444 -16048 -10140 15942 -2628 -10996 11882 -931 -16829 8355 8076 -15551
282 -15551 2701 13787 -9648 -57 17295 -8338 -11715 14535 2261 -8835 15674 8547 -14031
295 -14031 6524 13655 -11377 -873 13250 -7942 -3063 19617 -2284 -14345 11297 4537 -13285
308 -13285 7579 7536 -15571 1489 15588 -9580 -6688 12827 -6260 -10413 13566 -161 -14816
321 -14816 8657 8353 -12197 4563 10614 -14149 -4634 14044 -6524 -7908 13628 -1529 -12315
334a2315K3593o426k1898J8419O359j9470J2639J1474k4468K833K1724j7271r404
347a4211K1368q225j4104K2486J38k3639J2876J1268k0462N974J6654j9940k969
360a2786K3870j1137j4599K0270l870j9797J8924Q775k3436P770J5644j8289R04
373g757J9340j7745j0772K3083l219j5853J7193J388k1100J4382J3831k3365K63
386a0331J9349j4735l574K1780j1347j6407K0126K094j9039J3267P683k1244Q341
399d037J8796j8165n166J8092j2483r331K2813l502k0813J5686Q204j7458R283
412A919J0140k1796J055K2543j1704r989J7697o493j3348K0499J872k2977R420
425a162J2768j6232M783J6306j8802o126K0929p593j2857J6318k776j7274J7284
$$ plain form
334 -12315 11278 4852 -17046 1373 7732 -11738 901 12375 -12093 -9260 12464 -4807 -14211
347 -14211 7157 -1068 -15172 7314 7452 -16187 -3311 7957 -12505 -6531 10123 -9817 -12786
360 -12786 11084 -53 -14652 5618 1748 -18049 875 9650 -13786 -6016 9628 -8661 -7757
373 -7757 11583 -6162 -16934 6149 2930 -12923 4270 5658 -15442 -1060 12771 -10594 -10331
386 -10331 9018 -5717 -9291 12489 1142 -15265 4861 6955 -12084 1183 8866 -12378 -4037
399 -4037 14759 -3406 -8572 9520 -2963 -12294 10519 7017 -13796 1890 10094 -7364 1919
412 1919 12059 -9737 -8682 13861 2157 -7832 9865 3372 -9976 10523 12395 -10582 -1162
425 -1162 11606 -4626 157 16463 -2339 -8465 12464 4871 -7986 8332 5556 -11718 5566
438E566J0033k1811K976J3023j5887J196J9454j4888j2671J9986L78j5082J3393
451E666P35k0544J2671J5313j8065j501J5494j3194m073K0903r037j8023J6445
464B790M242j5212J1969P241k1197L832J8616j4091o009J4725j0816r265K1477
477H302q54k0596R955P541j5742Q940J2118k0243k806K0830p760r254J4257p315
491b627j4026J8929O037j9404O528J0498j4675M575J6316j6692r283J8688l181
504A683j0199J5033k361j8096J2684J1772j7340J217J0768j4394P31K0603j1415
517F86j4901J4812R44j2429J3384L186k0569Q122J6474j3374k599J2218j2432
530f478n450K0781l848j5814J2193L746j3369J1768Q927k0312K35J7606r106m173
$$ plain form
438 5566 15599 -6212 -3236 9787 -6100 -4904 14550 -338 -13009 6977 7355 -7727 5666
451 5666 6401 -14143 -1472 13841 -4224 -5725 9769 -3425 -7498 13405 4368 -13655 2790
464 2790 7032 -8180 3789 11030 -10167 -6335 12281 -1810 -7819 6906 -3910 -13175 8302
477 8302 7448 -13148 -3193 4348 -11394 -2454 9664 -10579 -13385 7445 -315 -9569 4688 -2627
491 -2627 -16653 2276 8313 -11091 -4563 5935 -8740 -4165 12151 -4541 -13824 4864 1683
504 1683 -8516 6517 4156 -13940 -1256 10516 -6824 -5607 5161 -9233 -8502 12101 686
517 686 -14215 597 1541 -10888 2496 5682 -14887 -6765 9709 -3665 -6264 5954 -6478
530 -6478 -11928 8853 5005 -10809 1384 5130 -8239 3529 12456 -7856 -7621 9985 879 -3294
544c294J4450j0464j2144J9417K824j7850P254N793j4935Q693J4625j8128o519
557a0278J7083o526p180J4474n774j5616J5590Q434j5492M312P741j5107L263
570e076J8424j2140r878J5398l287q892J4779k53j9242Q978J2306j2295J796J0136
584A0754j4473l338J8992o690j3486J1071l89j0806J3377N308j9391K665J3764
597G358j1574r58J2343j2249q187J8259P2j3773R359J851j4183J0255J1946j7052
611f533j659J4405p979l708J4969q623j4076J5146N048j3401P511M816j5644N306
625d422J5084j3590p266J3216n837o929J5427k932j6966J0240Q457j3397M331
638d584Q993j4999n92J7367p198r149J2336l802j0335J5065L455j6859N936J0506
$$ plain form
544 -3294 11156 692 -11452 7965 10789 -7061 193 5986 -8949 -256 14369 -3759 -10278
557 -10278 6805 279 -6901 7573 1799 -13817 1773 10207 -5285 -973 6768 -8339 -5076
570 -5076 13348 1208 -8670 6728 3441 -5451 9328 9075 -10167 -1189 11117 -1178 618 10754
584 10754 -3719 -7057 11935 5245 -8241 2830 2441 -8365 5012 10320 -9071 -6406 7358
597 7358 -4216 -5174 7169 -5080 -13267 4992 5064 -8709 650 2501 -11682 -1427 10519 -6533
611 -6533 -8192 6213 -1766 -5474 9495 872 -13204 1942 6990 -6411 1100 5916 -9728 -4422
625 -4422 10662 -2928 -10194 3022 -2815 -9744 5683 2751 -14215 -3975 4482 -8915 -4584
638 -4584 4409 -10590 -11182 6185 -1013 -10162 2174 -1628 -11963 3102 6557 -10302 -4366 6140
652F140j0643K282J1592j3357n961J6813k659j0594J1217q88j2481J0983Q080
665A0524j6354P48J1228r516j466J4180q992j0900J3713Q32j1024R061K591j4357
679i732P440J2199j2084k773J1643q631m218J5585m166j3366J1363N405j2024
692c359P359O644j5020J816J4158q892o115J2027n832q263J3996J44j5031O936
706E68O707j2272M512J0200j3142l808J4322n919q187J1683k851j1657J1733O037
720G926j4363L545Q849j1426J541J2924j0113p191J3509j692r246J0189N74j3769
734h743Q224Q521j2195O77J0370j0447k726J3619o653j0432J0982N54j0960R014
748a95M886j4155L211J0941r818k603J0853p533o033J3467j490j1460Q879L947
$$ plain form
652 6140 -4503 -2221 9371 -3986 -9947 6866 4207 -6387 4830 3942 -8539 2444 10524
665 10524 -5830 -5082 6146 -3370 -4836 9344 352 -10548 3165 3997 -7027 2034 4625 -9732
679 -9732 -2292 9907 -2177 -4950 6693 -1938 -6156 9429 5263 -8103 3260 8665 -3359
692 -3359 4000 10644 -4376 -2560 11598 2706 -3409 8618 2786 -5477 8519 8663 -6368 568
706 568 7275 -4997 -485 9715 -3427 -7235 7087 1168 -7019 4664 1813 -9844 1889 7926
720 7926 -6437 -2892 5957 -5469 -3928 8996 -1117 -8308 5201 3509 -5737 4452 5026 -8743
734 -8743 -519 8002 -4193 -3516 6854 -3593 -6319 7300 647 -9785 1197 1751 -9209 -195
748 -195 4691 -9464 -6253 4688 -5130 -7733 3120 -4413 -10446 3021 1531 -9929 -1050 2897
762B897j1793O667Q348j2591L27J2551p628m939J1829m527r723J1644K491j2537
776f984P060O582j1654K368J0984j0683l761J1815n180p302J1343j078j1395Q717
790H32N595j2206L118R317j0635p29J2710p107p126J2091j887j0072R907L165
804F973j1756N567Q677j0731K14J0300q397m385J2130m432q544J0081J167j1512
818d648P296N859j2289K415R842r544l004J1452n792p773J0902m00j1122Q123
832A317M589j1709M021Q662j0387m57J0801o934o218J1306k451r215R653J993
846D971j1118N869O997j0758Q14R459q113m155J1871m315r076R661Q08j0817P578
861c24M854j1152K390Q941q698k236J0318o029p144J1725j109j0024P988L751
$$ plain form
762 2897 -8896 -2229 6119 -6472 -6145 6406 -1222 -6161 5668 1141 -8582 3062 5553 -6984
776 -6984 76 6658 -4996 -2628 8356 -2327 -6088 5727 547 -6755 4588 3510 -7885 832
790 832 6427 -5779 -2661 6656 -3979 -4708 8002 895 -6231 5860 3973 -6099 3808 6973
804 6973 -4783 784 9461 -1270 -1056 9244 847 -3538 8592 4160 -4384 5697 6864 -4648
818 -4648 2648 8507 -3782 -1367 8475 -1069 -4073 7379 1587 -6186 4716 4316 -6806 1317
832 1317 5906 -5803 -1782 6880 -3507 -3964 6837 -97 -6315 4991 2540 -6675 2978 4971
846 4971 -6147 -278 6719 -4039 -3225 6234 -1879 -6034 5837 1522 -7554 2107 2915 -7902 -324
861 -324 4530 -6622 -4232 4709 -3989 -6225 4093 -1936 -9080 2645 1536 -8488 -500 3251
875C251j0631M993P662j0459r25J0743o174m935J0983l204r012R200K978j0551
889f081M930N980r736J683R943q468l735R851l849o856J0211o60j0484P100O137
904E966j0320K692P593r332j402J1504n595o919R793j040q439Q872L202j1625
918e050M286P779q463k05Q927p459m526J1339k271q544Q116J110r689O731O450
933H531j1024P12Q552p011k449J0121n895p127J0247R13r343N911L664j0617M406
948d09Q635r501k357R150n261m412J0266k715r857Q364M041r491M076N372j0012
963d111J230J0107o844m924R098l510p119J0348K90j0854N330N710q074J867P411
978E955r132k699J0791l608o900P995j411q140Q250M188j0558K063P222p337k05
$$ plain form
875 3251 -7380 -2387 5275 -5184 -6109 4634 -1540 -6475 4508 1304 -7708 1492 4470 -6081
889 -6081 -1151 4829 -4907 -3224 6719 -1749 -5484 4367 518 -6338 3873 3213 -7271 -171 5966
904 5966 -4354 -1662 5931 -3401 -4803 6701 1106 -5813 3980 2940 -5499 3373 6575 -5050
918 -5050 -764 7015 -1448 -1653 7274 -185 -4711 6628 4357 -4187 3929 5039 -4650 2081 8531
933 8531 -2493 -1781 6771 -240 -2689 7432 1537 -5590 4657 5570 -3773 2138 5802 -4815 -409
948 -409 8226 -1275 -3632 5518 257 -4155 6111 3396 -6461 1903 5944 -3547 529 5901 -4111
963 -4111 -2881 7226 382 -4542 4556 1046 -6073 4275 4565 -6289 -959 4751 -3323 -1456 5955
978 5955 -3177 -5876 4915 1307 -5593 2402 991 -7149 1101 5289 -5269 -3206 4016 -3321 -3526
993c526R188p106o070J0074n31p433O716J179r701N930O971r250m69P696o362
1008b694k561J0371m283p793P856K469q296N850L590j0494K643R389p394k758
1022d105Q237n209m270J0082q34r744O014L516p889M273O053r975p95J0002m858
1037D98m330P798l066p323R834K305r811L098N690p830K303Q203q329m415R863
1052D488k143n571P734p13r496P026N602q803R76O148p515K3R683n429p061Q424
1068C373j28o666O829J644r941L758P310p167p23O829o455l544J0372k151q268
1083d928O219J640p122N731M283r807N78Q555n791j999P462m908n891R162J040
1098D224q921M737L282q171M030P109q583k456Q017l736m094Q341k664q401P506
$$ plain form
993 -3526 5662 -1444 -7514 2560 2029 -5404 1312 2491 -7210 -1280 5691 -3559 -4028 3668 -2694
1008 -2694 -5255 5116 833 -6960 896 3365 -4931 919 4509 -5985 -3342 6047 -1347 -4105
1022 -4105 4132 -1077 -5347 4735 3901 -5843 171 3687 -4202 71 6124 -3851 -4646 5356 498
1037 498 -3832 3966 900 -6423 3411 5716 -4095 -997 4693 -3137 -834 7369 -960 -5375 4488
1052 4488 2345 -3226 4508 3795 -5701 1325 6927 -1876 -900 5248 -2267 -2244 7439 2010 -5051 3373
1068 3373 3245 -3421 3408 5052 -4889 -1131 6179 -988 -1711 5118 -1337 -4881 5491 3340 -4928
1083 -4928 1291 2931 -4191 1540 5823 -3984 -3406 5149 -642 -2641 4821 -87 -5978 3184 4224
1098 4224 -4697 40 3322 -4849 -819 6290 -2293 -4749 3268 -468 -4562 3779 1115 -7286 220
1113B20L706q256K768M488q265J339Q648o142m251P692k177n296P829K26r312
1128f783M790N519p048J519O148p583j458R263k937o519O714k18o600O481L474
1143D762r365J500O955o343n55P759o040m793Q946o16o902N507J610p826M558
1158h43O074q314o66P244m481k514Q080l498o734P562J954o840M504L254q324
1173c542K268P629o560k748P318l839l632Q028j095q261N135L979p340K710N143
1188E193q028k48Q617m689m420O949k080o025P142J852q601L365N378o767Q64
1203a498O995o725l307Q562k549m959O827n04q006O207M144p962J252N772o046
1218a797j166Q341m873n472P454m01o311N507J839q078L632N907p261p23O869
$$ plain form
1113 220 3926 -4330 -1562 2926 -5339 -4000 4648 -1494 -5745 1947 -230 -5526 2303 2529 -6783
1128 -6783 -1993 3526 -3522 -2003 4145 -3438 -4896 4367 1430 -5089 1625 1407 -5193 1288 4762
1143 4762 -4603 -3103 3852 -2491 -3046 4713 -1327 -6120 2826 2210 -4692 815 2425 -5401 -843
1158 -843 5231 -3083 -3749 3495 -986 -3500 4580 1082 -5652 1910 3864 -2976 1528 4782 -3542
1173 -3542 -1274 6355 -205 -2953 4365 526 -3106 4922 3827 -4434 701 4680 -2660 50 5193
1188 5193 -2835 -3083 5534 845 -3575 3374 1294 -4731 2411 4263 -4338 -973 4405 -2362 -1498
1203 -1498 5497 -1228 -4535 4027 1478 -3481 3346 2842 -5164 1043 5187 -2775 -1523 4249 -1797
1218 -1797 -2963 5378 505 -4967 2487 2086 -4225 1282 3121 -4957 -1325 4582 -2679 -3402 3467
1233C467n357l170P791k086o521O026K118o775M108M222q052O35P333n080k468
1248c809P167l365n113P574K35p305M428L343p135K524O107p072j426P474m015
1263c88m074P296j752o661O170K589p576K865M896o925M13P187n239l516P551
1278B836k202n028O505K66p208M561M549p000J420O050n718j837P697m032m688
1293c829O658m04o106N362K869p571K206N434o322p02O871m522l709P102j291
1308B046o188N875J473p264L676M790o676L4O414m508k503O880k491n409O360
1323B509Q68o415M134L587p151J734N631n613j493O619l666m324P026n00o216
1338c270M247K853p042K416M898o200p09O557m033l873O988j622n989N962J352
$$ plain form
1233 3467 -1890 -5060 2731 645 -5876 150 2268 -4507 -399 3823 -4229 -3594 3739 -1341 -3809
1248 -3809 3358 -7 -5120 2454 2689 -4616 -188 3155 -3980 -1456 4651 -2421 -3847 3627 -388
1263 -388 -4462 2834 1082 -5579 591 3180 -4396 -1531 3365 -3560 -3147 4040 -1199 -4715 2836
1278 2836 634 -4394 2111 2377 -4831 -270 4279 -2721 -1301 4749 -969 -2806 4891 859 -3829
1293 -3829 2829 2425 -3681 1681 4550 -3021 -815 4619 -1703 -2405 4466 -56 -3765 3337 2046
1308 2046 -4142 1733 3206 -4058 -382 4408 -2268 -2234 4180 -328 -2831 4049 1558 -3851 2509
1323 2509 3377 -3038 1096 4683 -2468 -734 4897 -716 -2209 4410 744 -3580 3446 2946 -3270
1338 -3270 977 3830 -3212 -796 4102 -2098 -2807 3750 -283 -4156 2832 1210 -4779 1183 2535
1353B535o722L810L898o557Q43N999m819k760O533k478m403O591N16p110M334
1368B10L176o512J633N872o417j283O891l204m465O220j048n852N170K318o734
1383d025K040N099n797k83O386m921l108O846j573n105N835P26o635L769M220
1398C474o336O93N671n089j455O759k861m981O126K33n555L944K771o758K317
1413a047N280n407j189O171m338l144O533p65n759M828J738o181L203M528o600
1428b149n26O385l934k489O094k134m836O113J072o474L092L418o166J992N660
1443E118n362k444O896k966m079O111o42n768M328L011o314K076M182n828p54
1458b435O521l496m022O206j524m827N663J019o698K682M592n638N40M942m541
$$ plain form
1353 2535 -4187 -377 3521 -3036 -2193 3806 -1013 -3773 2760 282 -4121 2470 2986 -4124 210
1368 210 3386 -3126 -1493 4379 -2038 -3321 3570 366 -4099 2121 1073 -4779 391 2709 -4025
1383 -4025 -1985 3114 -2683 -2966 3420 -1501 -4609 2237 664 -4441 1394 2120 -4515 -746 3474
1398 3474 -2862 -2169 3502 -1587 -3042 3717 856 -4125 2001 2234 -3321 623 3394 -3364 -1047
1413 -1047 4233 -1174 -2363 3808 -530 -3674 2859 2094 -3665 1163 2901 -3280 -77 4451 -2149
1428 -2149 -2675 3710 -224 -2713 3381 1247 -3589 2524 3596 -2878 214 3632 -2534 -542 5118
1443 5118 -244 -2688 4208 1242 -2837 3274 2632 -3136 1192 4203 -2111 -35 4147 -1681 -2435
1458 -2435 4086 590 -3432 2774 1250 -3577 2086 3105 -3593 -911 3681 -1957 -1417 3525 -1016
1473a016k316O727j790n300M900N23n814M653L308o758R45N506m823j355N485
1488B875l392l969O253K3n299M001J740o288K643M565n410q65N513l577k553O412
1504B672k108n301M827K156n541K681L185n939J205N527m548k527N675k198l495
1519c729N842J12n891L225L074m917J401M078n491j275P058l068l485N230j389
1534G75m950N033K490o460K087M197m969L26N103m069l160O025j228l948M403
1549A655O38n780L837L780o059O36M365m041j014N779k479m602N216L70m744L913
1565A470K002o187J968M841m546j061M665l254k712N863n91n622L938J976m900
1580b150K762L188n623l75N432l498j872M733j563m653N452Q41n717K604K293
$$ plain form
1473 -1016 -3332 3395 1605 -3695 1205 1728 -4086 567 3875 -2883 -1938 3568 -1255 -2610 2875
1488 2875 -517 -4486 1767 1790 -3509 492 2232 -4056 -1413 3152 -2258 -3123 2390 -1187 -3740 2672
1504 2672 564 -4737 90 2246 -3295 -614 2571 -3368 -2163 3364 -1184 -3711 1964 -234 -3729
1519 -3729 2113 2225 -3666 -441 2633 -2284 -883 3195 -2296 -3571 3487 419 -3066 2164 775
1534 775 -4175 858 3348 -3112 -1025 3172 -1797 -1471 3632 -437 -3597 2428 1200 -2748 1655
1549 1655 2293 -3487 350 4130 -1929 -1293 3072 -969 -1983 3796 1317 -3285 1931 2301 -2443 1470
1565 1470 3472 -2715 -747 4094 -452 -1513 3152 -102 -2814 3049 2458 -3164 774 2750 -2150
1580 -2150 612 3800 -1823 -2198 3234 -264 -2136 2597 1034 -3619 1833 2674 -3043 -439 1854
1595A854m431J705M570m796j745N164k043l245M961j152n050M481K614n153R87
1610a279L197m266r7N881l835l456N282q52l953M226J113n902K744L446m247N2
1626a946M344m105j783N723k029l814L934L72m283L807K539n519M15M688l433
1641a090j200M462k931l187N776R7n033L497J409m616J998L567m636n75M884k804
1657c82j975N014j786m446M435J658m792K451K537n180J144M954l860k275M761
1672B258k189k796N219l90n046L275K469m327R39L676m532n27N285k455l124M333
1688B068l35m310M302J421n231J737L734m279K75M251l809k448N055q04l731L796
1704A692N68n082L197L105m706j9L898l539q93M692k614l276M377K15m278L052
$$ plain form
1595 1854 -2577 -872 3698 -1098 -2843 2321 278 -2967 1994 842 -4208 273 2887 -2266 -1279
1610 -1279 1918 -2348 -2445 3436 -399 -3855 1427 575 -3378 848 1961 -3941 -1197 2249 -1998 -1946
1626 -1946 2398 -1707 -3490 2233 204 -3610 324 696 -3587 220 2759 -2760 -2345 2343 -1090
1641 -1090 -2290 2172 -759 -3946 1830 1927 -3106 391 1800 -2816 -818 2749 -1887 -2462 2422 -382
1657 -382 -2357 2657 871 -3575 860 2518 -2274 177 2714 -2466 -1322 3632 -228 -2503 2258
1672 2258 69 -2727 2492 2102 -2944 331 2800 -1527 -588 3088 -1444 -1971 3314 859 -2265 2068
1688 2068 1733 -2577 1725 3146 -2085 -348 3386 -893 -618 3633 -176 -2624 2431 1627 -2104 1692
1704 1692 2260 -2822 375 3480 -1226 -1245 2653 -886 -1779 2913 299 -2977 1400 1615 -2663 389
1720C89J580m670J942L916m217o39M164k869k217M459o87m182L422J482m309K242
1736a94L018n001J20M474k789k079M232j679l087M149M62m790K504K465m235J133
1752a297L916m010j084M425j920k934M046m14m156L453K134m467J487L219m442
1767b044j8M702k743k884M855j320l004L850M13m584K177L098l954L15L919l381
1783f03j506M568j437l390L811L9m105K898K231m183L86M128l613o23L924k356
1799A69k755M499r6l613K696J221m210K013L122l642n68L998k377k002M301j412
1815A344l298L531Q00m498K437K333m010M47L946l370j750M063j285k661L767
1830A796O4l887K426K022m366J345L149l566p12M335j950k737L806q58l189L231
$$ plain form
1720 389 1969 -2701 -759 3157 -1060 -1699 2465 -404 -2621 1838 1151 -3031 391 1873 -2436 -194
1736 -194 2824 -2177 -2057 2417 -372 -2451 1781 102 -2985 1164 1626 -3164 -660 1805 -2430 -1297
1752 -1297 2619 -1391 -2475 1950 30 -2904 1142 728 -3428 25 2159 -2308 -821 2398 -2044
1767 -2044 -2062 2640 -103 -2987 1868 548 -2456 1394 1807 -2777 -600 2498 -1456 -1141 2778 -603
1783 -603 -2109 2459 1022 -2368 1443 1482 -2623 275 2506 -1677 -1291 2837 -776 -1399 2525 169
1799 169 -2586 1913 1817 -1796 900 2121 -2089 -76 3046 -596 -1164 2834 457 -1545 2756 1344
1815 1344 -1954 1577 2377 -2121 316 2649 -1361 -914 3032 -338 -2088 1975 690 -1971 1796
1830 1796 1860 -2027 399 2421 -1945 -600 2549 -1017 -1729 2606 656 -2081 1725 867 -2322 909
1846I09J193m316K181K430l759K50L545k854j880M081j233l038L338P87m159K259
1862b66K139l478L48L079l062j013M332j852l072L391K28l629L032J584m313J462
1878a090L368l441n75L880k465k364M040o99l433L247J194l876K114K503m084
1893a681K46L339k496j309L712j297k861L269Q92m083K029K239l914J085K990
1908B160k809j174L873j788k586L977n31l639K941J731l881J621K945l946k32
1923a338L423k123j688L526q05k829L454O77l689J398K454l361O18K780k798j239
1939a540L607r27k830K936J44l416K494K014l671Q51K826k947q29L627j973k587
1955b221L715k73k828K719R62l872J595K552l267L0L153k320j571L431r95k880
$$ plain form
1846 909 2102 -2214 -33 2397 -1362 -1112 2433 -421 -2301 1780 547 -2491 847 1634 -2525 -266
1862 -266 1873 -1605 -1257 1822 -1240 -2253 2079 227 -2845 546 774 -2855 177 1761 -2552 -1090
1878 -1090 2278 -1163 -1738 2142 -323 -2687 1353 654 -2779 468 1662 -2214 -100 2403 -1681
1893 -1681 -1435 1904 -592 -1901 1811 514 -2347 922 1814 -2269 -240 1999 -1915 -830 2160
1908 2160 -649 -1823 2050 262 -2324 1653 1122 -2517 424 2155 -1726 -105 2840 -1106 -1338
1923 -1338 2085 -38 -1726 1800 995 -1834 1620 2297 -1392 6 2460 -901 -283 2497 -301 -1540
1939 -1540 2067 1140 -1690 1246 1390 -2026 468 2482 -1189 -338 2488 -459 -1288 2339 366 -2221
1955 -2221 1494 1221 -1607 1112 2074 -1798 -203 2349 -918 -888 2265 -55 -1626 1805 810 -2070
1971b070K593J229l979K243J896l368M79K958k699j074L464j588k728L363L64
1986A083l341K190J424l351Q84L214l417l87K756j253j700L338q42l359K874Q62
2002I75k828J440K030l484N26L306k579j442K938o97k714L281L62l418J841K214
2018A751l141K56K666k629r91L309r29k352K752p4k920K686J368l641J130K148
2034A389j994l23K774k076j865L288j11k817K394R67l197J670K014k869j17K851
2050A978k064j314L392j355k503K672O82k763J684J341l377Q40L160k373j169
2065a169K807j455j839L073k53k926K114J364k860J385K118l424q3K975j672j460
2081a305K546m46k557L153L13l081J424J744k877P22K436k233j598L138m05k613
$$ plain form
1971 -2070 523 1752 -2227 16 1912 -1456 -977 1981 -718 -1792 1672 84 -2644 719 1083
1986 1083 -2258 -68 1356 -1995 -1111 2103 -1314 -1701 1055 -198 -1898 1440 598 -2761 113 975
2002 975 -1853 -413 1617 -1867 -1341 1965 -614 -2056 882 185 -2529 752 1114 -2304 -463 1751
2018 1751 -1390 -1134 1532 -1097 -2088 1221 292 -2060 692 618 -2302 384 1752 -1889 -759 1389
2034 1389 -605 -928 1846 -230 -2095 1193 1082 -1735 659 1626 -1571 99 2113 -756 -873 1978
2050 1978 -86 -1400 1992 637 -1866 806 1488 -1275 409 1750 -1627 -787 2373 0 -1169
2065 -1169 1638 183 -1656 1417 1164 -1762 352 1716 -1144 241 2359 -1065 -1148 1827 155 -1305
2081 -1305 1241 795 -1762 1391 1704 -1377 47 1791 -1086 -364 2072 -161 -1759 1379 974 -1639
2097a639K583o6l168K508J682l361P38K211k519o61L533k091j863L140o34k178
2113a785K185Q18l353J504J963k097l60K760k237j268L163p81k755K324L42k526
2129b103K111J428l140L20K858k092r71K928j812j949L303m3k262J373J320k962
2145a693J092K538k769r43K940j159j791L144p95k723K290J004k784J797J286
2160A434k655L97K979j992j976K890p87j825K553L45l014J679J832k982P83K024
2176A685k246q43L334j287k072K632k00k594K339J246l214Q32K246k202l23K321
2192A654j730j328K718l65k330K145M87k700J588K158k876j85K626j911o51K347
2208A647r26k023K207O55k420J244R92k670Q00K372k152o14K241j009j883K817
$$ plain form
2097 -1639 944 878 -2290 218 1900 -1461 -723 1488 -1031 -1692 1841 -250 -2113 1027 393 -1785
2113 -1785 400 1218 -2135 -631 1332 -765 -1125 1635 -602 -1870 1293 512 -2243 81 423 -2103
2129 -2103 8 1436 -1704 -1384 1474 -618 -1589 1339 -473 -2422 881 838 -1424 -51 1269 -1693
2145 -1693 -601 1937 -832 -1775 1165 6 -1785 1359 564 -2159 131 1135 -1649 148 1434
2160 1434 -1221 -824 2155 163 -1813 1077 290 -1535 1018 1363 -1651 28 1860 -1122 -339 1685
2176 1685 -561 -1404 1930 643 -1429 1203 1003 -1591 748 1994 -1220 -388 1858 -344 -667 1654
2192 1654 -76 -1404 1314 949 -1381 764 1251 -1449 139 2297 -579 -764 1862 -49 -700 1647
2208 1647 721 -1302 905 1560 -860 384 1376 -1294 -494 1878 -274 -888 1353 344 -1539 1278
2224A278l10k749J819J160k211R43J671k478n31K748j566j532K616m51j924J972
2240D55O35k719J292J649k700K53K574k064j309K705q90j557K410j56k538J665
2256b95J364k127L17J708j932k10K325j450j538K165J03k030J867Q66k940J133
2272f74K077k250j65K309j498j280K560n48j994K163J33k391J613J554k645J96
2288h40K332j518q33K300j233j764K542K31k213J456O25k257R32K051k135m98
2304h22K329j215j250K236l25k324J928O70k240J283J375k420L08K600j990r57
2320h14K246q23j767K148L53k478J555J548k987O19J869j861r84K937j036j907
2336a382K539l57k064J850J071k713O61J502j784n7K072j548j143K395m10j941
$$ plain form
2224 1278 968 -1781 38 1198 -1013 -70 1601 -877 -1408 1340 -226 -1758 858 407 -1517 455
2240 455 1090 -1629 -337 1312 -1388 -1135 1439 -625 -1934 771 -119 -1676 734 578 -1960 -295
2256 -295 1069 -1058 -741 967 -965 -1175 1150 -300 -1838 327 430 -1600 267 1133 -1807 -674
2272 -674 1403 -847 -1012 1297 -201 -1481 1079 531 -1463 700 833 -1558 55 1609 -1036 -840
2288 -840 1492 -26 -859 1441 208 -1556 986 1217 -996 460 1085 -1172 -240 1811 -324 -822
2304 -822 1507 292 -958 1278 953 -1371 557 1227 -1013 270 1645 -775 -467 2133 143 -814
2320 -814 1432 609 -1158 990 1343 -1135 420 1968 -1019 -400 1469 -392 -1376 1561 525 -1382
2336 -1382 1157 800 -1264 586 1657 -1056 -395 1107 -677 -734 1338 -210 -1353 1042 632 -1309
2352a309J771N23k467J350J454k258J7K032j656m10J885q90j671K058M07k341
2368a505J724Q01k463O91J842j565m79K202r65j988K054J74k050J412J055k353
2384a413P56K018k166l91K381j807o28J931n38j949K284L51j777P53J138k207
2400a264P78K001j997p48K228o23k110K717j53k021J129J155k083Q36J579k103
2416f79j14K292j387j215J866r7j891J691N90j856N26J891j967l2J872j544r81
2433a035K247m27k080J897O56k317J607R25k033M08J839k168o6J968j004j423
2449a006J831K25j872J634K39j978P26J782j890j29J806j348j031K101m18j733
2465a061J626O55k497J458J138j805j38J956j294j218K335r91j539J814M07k045
$$ plain form
2352 -1309 462 985 -1482 -132 1322 -936 -919 1113 -543 -953 932 42 -1629 429 836 -1505
2368 -1505 219 1020 -1443 -752 1090 -475 -954 1248 283 -1705 349 523 -1527 -115 940 -1413
2384 -1413 -657 1361 -805 -1196 1185 -622 -1250 681 143 -1806 478 829 -948 -195 943 -1264
2400 -1264 -486 1515 -482 -1230 998 375 -1735 982 829 -1192 -63 1092 -991 -155 1424 -679
2416 -679 -793 1499 112 -1103 763 666 -1225 466 1056 -800 -274 1617 -350 -382 1490 -54 -1035
2433 -1035 1212 785 -1295 602 1258 -1059 548 1473 -560 -152 1687 -481 -547 1421 417 -1006
2449 -1006 825 1050 -822 812 1051 -927 -201 1581 -309 -438 1368 20 -1011 1090 672 -1061
2465 -1061 565 1220 -1277 181 1319 -486 -624 1332 38 -1180 1155 164 -1375 439 846 -1199
2481a199J249P07j787O17J692j756p59K351q12j250J649m41j784K009O58k464
2497a320O65J573j882j47K062j248r75K104n27j604J547N28k459J192J443j752
2513h00K90J432j474p30K275o40j688J709j8j799J240J231k262N66J753j531n33
2530i79J959j286r69K075j85k010J531O09j792Q62J551k188Q1J963j382q29K191
2547A202p16j644J727M10j665P54J292k079K45J914j413r43J950o26j138J923
2563A193m85j666J191J078k136R59R97j529j8J895j174j219J727m22j444J758
2579G05O04k341R54J246j486j32J674j506p12J927k50j374J301j43j566J287J126
2596A314k112M28J430j348k65J558p30j459J949k89j728J634N25j979N08J768
$$ plain form
2481 -1199 50 757 -1030 -413 1279 -477 -1236 1115 303 -947 702 261 -1523 486 1144 -1320
2497 -1320 -655 918 -964 -1111 951 -297 -1272 832 305 -1299 248 776 -1683 -491 952 -800
2513 -800 -510 922 -552 -1282 993 353 -1335 374 356 -1443 -203 1028 -1234 -668 1085 -446 -979
2530 -979 980 -306 -1275 800 615 -1395 136 745 -1047 -185 1366 -822 -741 1222 -160 -989 1202
2547 1202 486 -1158 569 979 -686 68 1360 -719 -474 1440 27 -916 1034 408 -730 1193
2563 1193 708 -958 233 1311 -825 134 1131 -398 -416 1479 305 -914 813 391 -1053 705
2579 705 1309 -1032 -78 1168 -318 -450 1224 -282 -994 933 683 -691 610 467 -1099 188 1314
2596 1314 -798 -370 1060 -288 -553 1005 275 -1184 765 476 -1252 382 907 -1072 -564 1204
2612A204j886k61J816j239q15K279p17j690J206N83j553J110J124k393N86J610
2628I64j081j123J976m37j796K200K6k073J190R36j982L90J534j220o28J992q84
2645a6j175J828l16j867J311J362k197P18J086j065m68J990j191r35J281K4j466
2662a096J539N57k158J032J080j533j22J820j318o69J855n48j438J591L81j804
2678h31J080R40j778L10J436j501O6J769j341r70J830k64j707J427O42j966P45
2695a13J813k108j65J516r40n44J315k38j596J457P08j604O60Q69j449n1J735
2712A265j430n59J408l38j255J717p5j723J297M60j824J124J022j471l18J611
2728I11q90j104J694j9j470J288N20j943P28J238j526l58J879j346p22J757n83
$$ plain form
2612 1204 -682 -943 873 -366 -1181 1098 381 -1309 -103 480 -1073 37 1161 -1232 -646 964
2628 964 -117 -1240 736 299 -1497 703 729 -1344 -154 782 -1200 -810 724 -496 -1124 868 -16
2645 -16 -1191 637 321 -1546 -235 1127 -1070 -352 734 -331 -799 1191 0 -935 346 370 -1096
2662 -1096 443 1000 -1158 -126 954 -579 -701 1119 -199 -868 987 439 -999 592 973 -831
2678 -831 249 1189 -589 -279 1157 -344 -278 1491 150 -820 1010 746 -961 466 1108 -858 -113
2695 -113 1700 -408 -573 943 3 -541 774 536 -1060 397 1105 -499 161 1030 -419 -470 1265
2712 1265 -165 -724 684 346 -909 808 733 -990 307 767 -1057 67 1089 -382 -700 911
2728 911 21 -1083 611 592 -878 410 930 -1013 -285 953 -573 -931 948 -398 -1120 637 54
2745E4j163J489J75k065J525J249k047J79J344j322m28J847p07j230J405K1j499
2762a173J358K84j671O25J555j483l64J821j233p42J693m08j630J459M78j614
2778a045P53J102j579J41J570j034q02J699n10j425J456L87j729J049Q72j565
2794f60P37J051j470m42J260n50p47J614k26j370J037R29j624O77Q41j439j31
2811e13J931j372j048J962o57j212J592O7j358O91R53j438K87J160j159p12J880
2828A054n79j213J493J6j757J463O33j953P01J114j132k91J439r70o50J233p8
2845E23j523J097Q84k012J038Q21r72k61R25o01p22J228m9j152Q35M56j545J062
2863C2O12j581L54J420j104l95J363n01j281J829k74j471J039N16j444M04J353
$$ plain form
2745 54 -1109 380 555 -1510 15 1264 -783 -604 740 -582 -1010 837 130 -1100 305 326 -1173
2762 -1173 185 469 -1202 -577 978 -505 -869 952 -281 -1023 670 262 -1368 91 569 -1045
2778 -1045 -292 810 -769 -628 942 -92 -894 805 295 -1130 326 713 -1016 33 905 -660
2794 -660 77 1128 -342 -784 476 -74 -821 793 567 -803 234 1163 -461 216 1057 -382 -513
2811 -513 1418 46 -1002 960 303 -909 683 750 -608 83 1036 -402 -115 1045 -114 -826 1054
2828 1054 475 -738 755 771 -986 477 1110 -843 -142 972 -160 -451 988 18 -632 601 523
2845 523 -1000 97 981 -1031 7 828 -144 -405 520 -81 -803 425 376 -776 59 515 -1030 32
2863 32 644 -937 -583 837 -267 -662 701 200 -1081 748 474 -997 42 558 -886 -482 871
2880H71j611J02J329q96r30J664l12j495J376O63j919R03R12j465K38J388j096
2897b78m07J490j26j849J598K35j803J233P43j378r0J539j392j54J404m05j085
2914g25J159J18j432J143Q09j651J94J556j414l63J722j255o61J355k69q75Q89
2931C00M94j597Q91P13j364K07J178q66n74J254m04r49J377M6j391N63Q85j462
2949f99M44J025o00o19J207p44p12J733n58j394J189M96j533N52J346j379kJ256
2967A008r67p38J305J29j592J427O0j317O28P42j127LJ238j184k89J189l20q36
2985f41J026L14j660J113J96r03j3J027q86n27J460q35p42J502k72j095J024L50
3003D38j255M12J068j036k39J269q98n39J339j75j106R06K15j049L74P93r85j7
$$ plain form
2880 871 -740 -638 691 -205 -1135 529 217 -1278 98 761 -1158 -255 657 -808 -570 818 -278
2897 -278 -685 805 679 -1170 428 663 -1140 93 836 -542 -632 907 -485 -639 765 360 -725
2914 -725 434 552 -880 263 1072 -579 -385 1171 -243 -606 1116 -139 -800 555 286 -589 300
2931 300 794 -803 88 801 -563 -356 822 -44 -618 636 232 -717 660 706 -685 -122 763 -699
2949 -699 -255 770 170 -449 758 14 -698 1035 477 -917 272 768 -765 -213 1133 -246 -248 1008
2967 1008 41 -697 608 737 -855 572 632 -685 -57 685 -442 -439 799 -385 -674 515 195 -641
2985 -641 385 699 -961 152 348 -555 -568 459 -427 -954 506 -329 -1071 431 159 -936 88 438
3003 438 -817 -405 663 -373 -612 657 -241 -780 559 384 -722 184 399 -650 -276 517 -468 -485
3021d85J340j139k71J146k51j362J452J61j328P24O97j401M65J052j378j08J225
3038E39m89q89J514m69j327J514L70j340N67R15j377j39J418q36l53J299o20j096
3056g99J272K47j566R07Q38j386J60J063p43m46J295m66q85J110j67p72O77O53
3074I92j368J40R48q88k52J379q78p95J156j11q87P34O04j527O43P98j291M55
3092a48J078j049n07J473m82j138J097K60j110N52O26j085K08R45r03n18J263
3109E62l33r24J000k5j415J128O59j239L48J292j698M3J484r30p58J086j00j145
3127i65J061L42j299O96Q73j059j16J043o17r20J527m27q88J156j6j175P31O94
3145F41j265M3J148r66k66J173n26n52J247l70r21P74J39n68j68J087j244K25
$$ plain form
3021 -485 855 -284 -555 591 340 -1022 430 591 -737 -13 684 -717 -252 800 -578 -686 539
3038 539 50 -839 675 206 -1121 393 763 -577 -10 905 -472 -611 807 -29 -382 917 297 -799
3056 -799 473 720 -846 61 899 -487 -327 736 -7 -453 842 376 -509 601 434 -338 339 992
3074 992 -376 -236 712 -176 -428 951 73 -722 434 323 -564 170 774 -753 -110 688 -603 -148
3092 -148 930 -119 -626 847 365 -773 324 584 -526 26 652 -433 -225 720 -183 -701 562
3109 562 229 -695 305 280 -1135 -7 652 -587 -239 1053 -645 -602 882 -48 -806 280 180 -965
3127 -965 96 438 -861 -165 708 -351 -467 576 -41 -961 566 139 -749 407 391 -784 -53 641
3145 641 -624 -581 567 -399 -665 508 -18 -570 677 307 -614 160 299 -269 -437 650 -594 -369
3163c69J060q48m63J050p7j282J171J96j147O76R37j441J73R46q29j51R60k81
3181B81q09P67K91q75P86L12j090L25Q46j183j82J335n78p23J201m50r31J027
3199C50J52q59L45M69p21R3R36p24p47J155k34p27J092J27j302Q54L31j177O84
3218I7O46p64l99J056o1j154P73j16p37P20K38o60NR43j096J05R51o50m27R62
3238D32r8j021J256k1j031K00R71j257R1R49m24p08J113k96p52Q09L06j119K76
3257c24N48q88N08R66r77k02N76n0r69R36n7r74R26M68j096L10P69r40Q7J122
3277G39j029k36O84j22o28O79O49j306L96R59j414L59R51p99l71J164o07n14O40
3296A94k44r20Q08P43j269N80O79q95l46J427p98l52Q13j52q82Q52L58r81L80
$$ plain form
3163 -369 691 -157 -620 430 353 -929 242 438 -709 -33 904 -537 -364 582 -247 -398 562 281
3181 281 -528 239 530 -345 441 753 -337 -12 834 -349 -531 804 226 -497 704 254 -677 350
3199 350 502 -357 -12 457 -264 -171 765 41 -706 449 215 -512 580 707 -595 259 590 -587 97
3218 97 743 -21 -420 636 575 -579 194 78 -659 61 299 -361 -356 587 -509 -404 547 -103 -530 432
3238 432 334 -687 569 548 -483 -283 688 -569 -478 471 47 -661 452 156 -596 213 519 -600 -324
3257 -324 224 -664 -156 810 -167 -369 207 157 -812 124 67 -907 19 487 -609 -299 470 -470 -383 739
3277 739 -290 -526 158 36 -592 87 736 -570 -174 785 -629 -270 681 -118 -489 675 68 -446 194
3296 194 -50 -970 -162 581 -688 -108 571 -324 -670 757 -41 -393 420 268 -614 238 596 -385 -5
3315eO83j105R3R36l95o08J085m98n09R05k28p91N54O17q07K73K40n61j27P62
3335E14j80q97J040k4j020Q27L21r43K30R04r17k80J080m83o84P22p4p92R31K14
3355D89j107M73N27j022K13Q33o41j03O00k52o45R69k4j240J113k53m43K02Q32
3374E21q41l55Q82j33l81N59J87j392J110J30q91M16M50o74j94J082l70p89N90
3393i3M23p51Q36qj138K78R20r86K01Q44p27n62R69l92l88O74j29o95P55M90j359
3414h38O46O77p63j91R86n71o27R65l0r98P47O27j064N00N53q36M9P67p04l46
3434d51P13k7r23P75J79n22L38O24r58J25N29m95j43R25n10n56Q75l26n00L13
3454a5P51r99J19Q10q67K53O20m09p59J223m58p90P98K72j199M36K00j58n5N95
$$ plain form
3315 -5 678 -427 -334 602 207 -401 684 186 -323 582 354 -437 117 734 -73 200 440 -121 -248 514
3335 514 334 -563 477 453 -567 260 581 -362 -132 772 -145 -425 655 172 -512 210 136 -656 275 489
3355 489 -618 -145 382 -640 -427 406 -235 -338 262 10 -635 334 310 -930 183 -70 -513 -311 521
3374 521 -320 -675 207 74 -307 252 439 -953 157 287 -604 -188 262 -412 -606 476 106 -683 -93
3393 -93 330 -421 415 407 -731 -453 467 -519 -318 526 -201 -763 206 -186 -574 100 -29 -724 31 521 -838
3414 -838 -192 485 -278 -469 517 -54 -681 284 254 -744 3 630 -434 66 619 -217 -168 599 -105 -451
3434 -451 262 235 -688 87 266 -256 82 706 -252 -127 402 -93 -236 689 179 -377 498 172 -328 -15
3454 -15 736 -263 -144 666 -201 52 672 263 -496 727 269 -521 277 549 -650 -214 -14 -172 -227 368
3474C68l08o81J148m05l41L68J62r59J012K91q86j34J099r30n7Q56o76l36K01
3493b08N26j070Q92K25j028M17R30q43l36J005n26k57N60k72m11K29N94p70K18
3512a25K14n82r8P91k28m53P84m66n98Q60L1p15L67N63n19j54N81j10n97R12n00
3533d2j96N40k55l52K66N92j131M27M61o33R5O67o9q84Q71l08n08O80K46p18j64
3554d15J007r32L9Q66p31j56Q62n32k82L47J41o10L34M08o32N69J42l75n56J051
3574E45m97k83O76m54l97O84P0n12L11M93p23l20J060o96j49N61j26q27M49N62
3594D27n55K2M38q12L01Q39o40m15Q20m71k43O07k94n51N96J89m00o8M68n50q3
3615c75R77n38m09P03m70k14N97K1p57N78J76p26J05P24m85m17P64j37p45J032
$$ plain form
3474 368 60 -621 527 122 -219 149 311 -648 364 655 -231 -365 734 -196 -253 603 -73 -409 -208
3493 -208 318 -752 140 365 -663 -246 684 -159 -495 510 -16 -273 287 15 -396 -167 427 -343 -125
3512 -125 89 -493 -591 200 -28 -481 303 -163 -761 99 130 -585 -218 345 -174 -328 253 143 -454 458 -42
3533 -42 -238 302 47 -305 -39 553 -578 -151 310 -323 -228 439 370 -514 357 49 -459 221 467 -251 -415
3554 -415 592 -340 -301 565 -166 -322 540 8 -274 73 214 -396 -62 346 -286 283 425 50 -506 545
3574 545 48 -235 441 -13 -410 274 344 -168 143 636 -87 -407 653 -43 -192 369 243 -584 -135 427
3594 427 -128 -106 332 -480 -179 660 20 -395 425 -46 -289 318 24 -527 69 258 -142 -210 258 -292 -375
3615 -375 602 64 -345 358 -112 -326 271 292 -465 113 289 -437 -332 392 -93 -510 254 117 -628 404
3635D04k37p79P82L53r77K59M13m73j86O38Mo93O95N1q27O90J71o38M0M26m04
3656b88J19L52j38M6K69j78o36N64L55r48M44O35r89m7R67o33k1O80o65Q9L73
3677C50k62l13O11N3m28N2M22n29k75P04k48m25M54K07p21M04L59n49R0N76p12
3698a80r1O13l70k52M06K26k96J69jn12N98K41o14q6L44k29m35Q25j84o61J072
3719E83m11m75K93K43l13k23Q23m89j31M94l01k70L20p8k66J08O19o35K37K82
3739D10n96k13J122o96l32M04Ll97M60J81p45L66N72p26P1J10k48k36O67j57m69
3760d49Q49j07n00K86K28r21M82K82m13j70N63J0p26Q05l84m01Q59j05o23J12
3780c23O65k64j54K72l39l57O47J05n10K30K1m65L82M33n48J81M21p06j47Q64
$$ plain form
3635 404 167 -612 170 523 -454 -195 218 -255 -441 197 201 -492 203 254 -573 117 288 -350 -310 116 -288
3656 -288 -169 183 45 91 360 182 -454 110 465 -483 -39 596 -393 -440 527 -106 -127 553 -112 -23 350
3677 350 88 -225 386 439 11 63 485 -44 -319 385 137 -288 166 373 -348 56 415 -134 -44 532 -180
3698 -180 -271 342 -28 -280 126 352 56 225 224 -288 310 551 -63 -149 195 -34 -469 356 172 -489 583
3719 583 172 -303 -10 233 -80 -303 520 31 -100 394 93 -177 143 65 -201 -93 526 -109 128 410
3739 410 -186 -399 723 27 -305 99 102 -295 165 346 -399 -33 539 -187 -116 -6 -254 -490 177 20 -449
3760 -449 400 293 -207 79 307 -614 -132 150 -263 -433 130 140 -586 219 -165 -566 293 188 -435 -323
3780 -323 342 78 -76 196 -143 -500 147 252 -258 -28 -7 -472 -90 343 -205 -24 397 -309 -456 408
3800D08m67J16K55j4k15n2K22o10J66M45n67j10O59m77k64P49j10n15N83pm59
3821b64K46K01m59J02L79l75l26N98m8j61O81m88k23M19P2o56MP45o06k68N74
3842A47j11l49P29O4q96L21N68o75K58K56m09mO32l53o13O55r1o61R54m21l86
3863c85N86J18m19l46P25n0p79R13l9o93O60k45m63M16J96o39K71M92m59K99K47
3884D06p16j7L92M7o26N88J00p09L52M99m46j03L83l77j04N59Op96O53K10o96
3905c95M85K48p89K21N21o54P6N44j45n19P32k72l68K94J83p03K91O86m78j75
3925b17M90K2o23O68J06r69M84N70o13o7R46j261K6P48m19Q7M41m57j54N62O1
3946D31q06K11M99n83J11O87n96n70J255k54p45O27No66N89J66l93J7K89l51l11
$$ plain form
3800 408 -59 57 312 298 83 31 253 -357 -191 254 -313 -423 236 -241 -505 244 134 -381 202 195 -264
3821 -264 -18 183 -276 -174 205 -170 -496 102 54 -107 574 86 -137 282 354 -302 -298 447 -159 -427 147
3842 147 36 -313 416 480 -416 -95 473 -202 56 312 -97 -101 531 178 -435 220 129 -532 422 1 -385
3863 -385 201 319 -100 -446 279 229 -550 363 324 -369 291 46 -417 -1 195 -444 -173 319 -140 159 406
3884 406 -310 -327 65 112 -514 74 174 -535 -183 316 -130 -233 150 -227 -331 228 234 -562 91 301 -395
3905 -395 90 338 -451 -230 291 -363 -287 257 112 -407 325 53 -315 -21 162 -541 -250 436 -42 -217
3925 -217 273 295 -328 340 446 -523 -39 531 -82 -149 797 -464 -438 310 -109 -22 419 -38 -192 370 431
3946 431 -375 -164 335 -248 -137 550 -46 -616 639 385 -360 267 272 -394 195 361 -32 -15 274 -77 -388
3967c88P23j84n26N68j03j72N9L95m31J50M14n79L7K58l55j80P21r0k70k3K99
3988C23o92L26M19n84k5P38m98m71N60k82j31M46j60m83O45J26n66M62J46l95
4008i6kO61p57j41N87l16m16Q01q6o70M00L02n06J5N50o20j01O53k88m33L02J43
4030a8l68N67K34o98K25M97p25K88J16j28k44L67k08k15M44J00l46m7N47n39l92
4051e43R10l52l83N78j15k71K42Q2n05L12J77j02j4R9k70k89N83o1n79O99J44
4072C42o26L59L70l34j7N99q49J64L40j40o78Q30l22j73K65j23l63K04P22r24
4092c54L18L99o01P8L90K04q39N53k06j54M11N0k86k33N97m36k32M65M7n63N14
4113A22L09r42L94L54o56L12L14j76m61P48n00k94N00j83l87N95K40l64P8Q0k71
$$ plain form
3967 -388 335 151 -375 193 90 -82 -23 372 -59 91 505 -74 -37 221 -134 -314 407 317 47 24 323
3988 323 -369 -43 376 -208 -233 505 7 -464 96 -186 -317 129 -31 -514 131 257 -309 153 299 -96
4008 -96 -98 563 -194 -335 252 -64 -480 321 235 -435 -35 267 -239 -224 326 -294 -395 258 -30 -463 -161 -18
4030 -18 -386 181 415 -283 -58 439 -286 2 118 -10 -254 113 -95 -310 134 234 -112 -159 388 -151 -543
4051 -543 367 15 -368 210 95 -176 66 148 -357 -45 132 30 16 115 -155 -444 139 78 -501 198 342
4072 342 -284 75 445 111 94 693 -156 8 348 208 -470 360 38 -135 130 7 -356 -152 570 -354
4092 -354 -36 363 -238 -160 230 434 -405 148 -58 -212 199 249 -37 -270 327 -109 -341 124 171 -392 122
4113 122 431 -511 -117 237 -419 -107 207 31 -430 318 -182 -476 24 -159 -546 49 289 -75 3 83 -188
4134a88j40N45m69JM48j47l95M32K32p33N68L84q60M13L94o49k19O51l49j09K91
4155A01Q3m46K27m9m9K1O84r11j8M72j51l07P17j45r61Q36J41n44Q9L03j3l91
4177c11P08o36k50N48j0m3L24K60p59O2M54n80k2O74o41k06Q56k95l36O45k73
4198A69l10L87r5n40L48L12m03q3P68l97j90N3L64q33O34k0k97J43O12p04q4L82
4220B16k93k54N69j63j15K60K01o80L26J33o31K43K61J32o12M84o8m97Q27j74
4240A65n18M20K84o18N37N6l66j03L81n86K58J25qm80O18K03p42K56L15m71J71
4261a03L53l18k55N21k52k59M13J82m46j66L41l78M98Nn57J40M24j28l00M33j39
4282In10R54qq06J70L60l09j22Q15o10l12P25m55r5M59K2n45L61L83p38L73m7
$$ plain form
4134 -188 -328 217 -252 -251 197 50 -345 87 319 -414 154 538 -322 91 485 -164 -383 268 -81 -190 101
4155 101 184 -262 -35 -84 -133 -112 572 -339 -357 115 -36 -343 374 229 -732 104 245 -299 -210 93 80 -311
4177 -311 397 -239 -489 59 49 6 330 590 -169 -107 347 -233 -255 419 -222 -428 428 133 -203 442 169
4198 169 -141 246 151 -389 -41 271 -132 -215 553 156 -34 19 383 -450 184 164 -133 10 622 -82 -166 216
4220 216 -77 -331 238 75 -40 220 421 -259 67 200 -431 -188 73 205 -407 77 9 -488 339 165
4240 165 -353 67 351 -267 270 326 -40 -143 238 -348 -90 35 27 -453 165 368 -374 -118 197 -274 -103
4261 -103 250 -68 -323 198 -54 -313 100 282 -164 -330 11 -367 131 136 -421 -281 143 15 -285 148 9
4282 9 -501 453 445 -361 -191 169 -140 -262 553 -57 -369 356 -99 -194 265 287 -258 103 486 -252 121 74
4304G4k13j75O66j60k87OJ97j40K24J40k19m90Q28k94k50O36m54k62K90j88k84
4325c55N61J80p70N40p3j74n9O40m17k92M82n05K82K7j47l18O82J06n75K06P9
4346A00p5m19N22j31n44O59M6l42L73L3m44M9L73n47n5O28l52MN51k17m18K73
4368F7J48m85K88L00m17j02M67o84L11J90k30o8Q4K93l21Q5J18k25J16K48k31
4389d8n75R13m75k02K13M56m14K30K3j51M53j16o94J46N71n34K9L34j22n38R6
4410d05J95p1K09O17q73K60L58n85r7N08j92k44Q09n31k17M98n7n82L17K26l37
4431a94J75J29m2j21M12m21k34K31L77m93J46M37n63oM97k86J3k4k1m49L95O9
4453B7r1L21r8l68K04L73l59k37N18j36o88O74n0k81K32L00l60L0K67l04J13L11
$$ plain form
4304 74 -139 -314 352 192 -95 -89 108 -32 192 332 113 -377 451 157 -93 543 89 -173 117 -71 -355
4325 -355 206 386 -384 156 83 -91 -150 490 73 -219 263 -242 40 67 -80 -398 284 390 -185 21 100
4346 100 25 -394 128 -3 -547 112 158 -184 189 222 -222 -173 200 -347 -402 226 -126 -122 429 212 -206 67
4368 67 215 -270 18 318 -99 -201 266 -418 -107 83 -147 -215 -131 162 -159 -74 44 -181 -65 183 -48
4389 -48 -623 290 -185 -387 -174 282 -132 98 121 -30 423 307 -387 -241 330 -204 -175 159 37 -501 -405
4410 -405 -210 -281 -72 545 -328 -68 290 -295 -392 116 -76 -320 489 -42 -259 239 182 -400 -83 143 -194
4431 -194 -19 110 68 -53 359 -62 -296 -65 312 -181 -35 402 -161 -167 330 44 57 33 12 -437 -42 27
4453 27 -64 257 159 -209 -5 368 9 -228 290 154 -534 140 90 -191 41 341 -19 11 278 -26 87 398
4475C98n50k20N32j73j97M8L03l79L77k3n27M55K29j45l79O76j94m60Q6K42l81
4496b82J01J29k71M78n7k50k97P64l24m72L50J17r8K15J54k01j98K98n07k48P66
4517A67k40P5O2k68J5J71r8l55O07J09l93K57n3j00j51O44n39k80O38j37m02N22
4539B51J10o43P3N39n25M8L29j02j97M39j02l87M82l02j23J23J25k99R3K08j02
4560C8j54K67km35J04L73j65k64N20n65M22k2j6l19O69l81k21K10L8j99J13L80
4582C91p41J08N98l41k03J55m3q2N15o91j26N30k56j82L69P7j56n9K31n80J32
4603c54O30Nm00N32J2o56L44J25k18L9K61l82k85N16k04k16M14k04O1k71O54n83
4625a80K9L52j54k20N18l74k02M79k24J2m6L01k65j70M39o93N52O5n30O2M81l21
$$ plain form
4475 398 -152 -372 160 -13 -210 -162 141 -238 139 116 -411 44 273 128 -251 425 231 -229 -143 99 -282
4496 -282 -181 -52 -323 155 98 -152 -449 315 -9 -481 -131 -14 -112 103 257 56 -142 156 -351 -599 167
4517 167 -73 2 64 -204 -189 -18 -116 -471 136 245 -148 109 56 -44 -195 449 -90 -370 268 131 -271 251
4539 251 361 -282 -209 330 -195 -147 182 80 -117 322 220 -167 315 13 -110 13 138 -161 -68 140 38
4560 38 -116 151 149 -286 -182 191 26 -238 282 -283 139 117 101 -218 451 70 -151 59 97 -102 11 391
4582 391 -350 -242 356 15 -188 -33 -76 -158 357 -334 -460 70 -186 -368 1 78 -78 -137 94 -486 -354
4603 -354 276 281 -119 413 425 -231 113 238 20 59 320 -62 -347 169 -35 -251 163 -41 20 -251 403 -180
4625 -180 -151 201 47 -173 345 -29 -231 248 24 36 -10 291 26 -144 295 -398 154 219 -311 -249 232 -89
4647h9j6r3K86m84L21L75m67j22M52j11k64M73l29l46Q14n9n59L86R1n12O5K89
4669A01k35r6K86%k16O20k51n20K16J49k56P1L47m47N6M40n11N3K64o7j90L89
4691B03m2L5p1L5l73J17M42n14o2N98j29o29L71N9j27L01m2k31MJ78k53J04kk84
4715c12J74J16K6l01P92j60o38L51K00n59J27M71l92L1K82k73n8L81k42j32J66
4736E0k05m0M31l40j14Q3L30l95j71O19j22k64J11K19l20K38K05m31jJ55l2j88
4758a82M67k52l28L75j14k90L09n0j61L39O5j91n32O99j59j46m2L84m54K70K46
4779B53m00o9M46l97J7O72n11rK35m6n89M37J36k77KL46k83PJ35M2l91M49m50
4802b45J73O6K07m67J70L10m44N13J90n78r8K73j0k93K47p3k75L06K25m80K77
$$ plain form
4647 -89 -105 -198 88 -396 -75 300 -167 -289 163 52 -212 261 -68 -414 400 341 -218 168 259 -253 -188 101
4669 101 -134 -230 56 56 -160 460 209 -311 -95 54 -202 -131 216 -231 -175 265 -246 -193 71 4 -186 203
4691 203 161 196 125 160 -213 -96 346 -168 -230 368 239 -390 -19 40 -87 214 172 -59 -55 123 -130 -26 -28 -312
4715 -312 -138 -22 4 -297 495 335 -303 48 248 -311 -184 287 -105 -74 208 -65 -123 258 16 -116 50
4736 50 -155 -195 236 -104 -218 -135 195 -200 -371 248 126 -138 -27 192 -128 110 315 -116 -117 38 6 -182
4758 -182 285 33 -295 80 -34 -324 -15 -65 -226 113 178 -13 -545 154 -5 -151 -193 191 -263 7 253
4779 253 -147 -216 230 -167 -150 522 11 2 237 191 -398 39 175 -102 -100 246 -37 -30 105 147 -244 205 -245
4802 -245 -72 -6 201 -266 -96 214 -230 283 473 -105 -203 70 60 -233 14 -59 -334 -28 197 -283 -6
4823fJ60j5K5J40k34k04L83k89l90L10L09o22L1M92k31L14K1j75j2J65m08L20
4845H4r8P9pJ45j0m95L08J73r7q5K78n97K44M41l56j39J66m7K07l28J34k31K82
4868E1K14n87K23K98j05l62O09m88j85M12L04p18J94Q1q3J09J78n74M9M11m6r7
4890a12PM3n78M28N93o97J70L46l52m3L65j68k91K48J14m27K78K79k12K4K10m40
4912b15L22J29J10o87N36m07k04Q59n24j9Mn4K35n8N8Ll92K54j52J73p2K83l45
4935a63J88l8j18J64K1j30J52Q7m89K74M16l98k37QJ90j49L10o0k26J49K31j57
4957B5M3K24l14j07L72p0o6J24K37p42K08L83m66j60K65J89m47J11L67k14j18
4978a56J26k81L08RJ00j86L20m42j7K63M9l98K27M37p15M28m6j5p5K77k81l47
$$ plain form
4823 -6 154 139 164 304 70 -134 249 -40 -430 -120 189 -433 -402 90 -141 173 194 19 7 172 -236 84
4845 84 -14 65 58 203 193 -302 6 179 82 -3 275 -322 -78 363 7 -132 34 -13 194 -134 0 -231 51
4868 51 265 -322 -99 199 94 -268 341 -147 -332 80 384 -334 -140 -59 -142 -33 145 -429 -380 31 -15 -112
4890 -112 -105 -62 -640 -212 381 -316 -146 200 -152 -195 170 2 -289 -41 73 -354 -76 203 -9 15 225 -215
4912 -215 107 236 346 -341 195 -212 -416 443 -81 -100 -96 -150 85 27 85 88 -304 -50 -202 -29 -101 182 -163
4935 -163 25 -13 -131 33 54 -76 76 163 -326 -52 364 -34 -271 -263 -73 -222 88 28 -198 -49 182 25
4957 25 68 292 -22 -129 243 173 107 231 468 -274 -66 317 -149 -309 -44 145 -302 -191 176 -38 -156
4978 -156 -30 -311 -3 6 106 -80 240 -202 -219 44 93 -305 -78 359 -356 72 26 11 -64 213 -68 -415
5000d15L96n5J61N9kl75K66n2J74l3k5j25j51M69k32j49J96Pj38L39L6m02p6K25
5024I8k82j89N93j66l35M41L3n70M80j52QJ12O5j21M8rO3n97N53J76n30N75k18
5047G6k18J48K52k60o6L6J24n2k9K10l38L71l26m56O72L46m79O0O5m62J5L35J33
5070A57J29m44m4K2N08j75l27L76R6j20m80L92k87Q8K2P8k10J31Rj76J54K65m30
5093b66L70K54k13m03K05N4O8k10O3n4J40L75n71J98J48j21j35K34k20k96L00
5114h0M0j58N57m33j89K97J00k99L77j67M1l60L08Q3l72M49j78l42J99J50l25
5135c02Q1J65p6l5O0L2j66N11j67j61L24j27k96p0J70K5j29K25j90o9K67n5j29
5158a12J29Q3l04J97J95l52M5L70l61N0O2J34n02N25q7j96K79j49m0m32O04j77
$$ plain form
5000 -415 -19 -74 87 146 144 -231 35 -17 157 124 99 -26 -177 292 60 -89 107 114 -24 315 351 -51 -127 98
5024 98 -184 -373 220 54 -281 160 193 -377 103 -49 -41 71 136 15 63 54 117 -480 73 249 -281 294 76
5047 76 -142 6 258 -2 -68 -32 92 40 11 221 -117 254 -72 -528 144 490 11 71 136 -326 -311 24 157
5070 157 286 -158 -202 -180 328 153 -174 202 298 178 -302 90 -197 -109 -87 -9 -219 -88 -79 -255 -101 164 -266
5093 -266 104 358 145 -258 -53 1 69 -141 -78 -132 8 383 -188 10 158 37 -98 136 -84 -380 -80
5114 -80 -40 -198 359 -74 -263 34 134 -165 212 45 86 -274 34 117 -255 194 16 -326 -127 23 -302
5135 -302 -221 -56 -132 -167 -107 -75 -241 270 103 -58 266 139 -157 -227 -57 -32 -161 64 -126 -195 72 17 -112
5158 -112 17 100 -204 -7 188 -164 -119 251 -110 -60 2 136 -366 159 72 -124 155 6 -34 -466 138 -39
5180c9P7P8k79n7O54n14k02M15j86l0mP7k40L01K65m32r7L60k24M2j32L10lj36
5204DJ72l29K87J31k06q3K62l02j69L44%j22OM3j95J37N0N6m41P36m33J91j2r0
5228C7k15J44L75l47m8l1O8kjJ6m39P25l03J5%K0j62K33k16j54M78j23Q7m54K16
5253h1mO0J75k42q5N2J29k22P2L36l18K48Lq3n32P59n62J24K67k01k32L12L31
5276C06k78p7K95k96J67j54N1k72J80Jj23N1K0K7k00N19j29k15K55j75j52M00
5298B01k11l34J80M57m71QL30l27L79j7j59J4N6J08n27L21j61j73L84M8R3p9R
5321A29l78Q7N71k65m60K62m4j09O1L7k35K26L54l26J20L19k39r6pJ06l21J56
5343e2O5k94M45J0j27M1k2p1k95P63m48m9j29K51l50K18k52K14L69k28K7k1J32
$$ plain form
5180 -39 38 116 -163 -220 434 -80 -282 133 -53 -83 -87 -10 -250 51 316 -116 -213 147 -77 -35 -167 143 140 4
5204 4 176 -153 134 265 59 -24 238 -64 -233 111 111 -11 -5 38 -157 -20 30 86 -355 381 -52 139 127 37
5228 37 -178 -34 341 -6 -54 -85 -17 -19 -20 -4 -443 282 -21 -6 -6 14 -148 85 -131 -285 193 70 157 -297 -81
5253 -81 -85 -25 150 -92 -177 -125 4 -218 -146 190 -128 120 123 40 -492 267 -295 -171 96 -105 -337 -25 306
5276 306 28 -49 246 -50 117 -37 14 -258 -78 -77 -200 -149 -129 -102 -302 217 88 -127 128 -47 -199 201
5298 201 -10 -344 -164 293 -178 -170 160 -167 212 195 36 50 106 214 -313 8 -153 -326 58 106 199 120 129
5321 129 -249 -162 409 144 -316 -54 -98 -207 -146 -109 -344 -118 236 -90 30 349 110 14 7 113 -208 -52
5343 -52 13 -281 164 174 47 88 66 -5 -300 463 15 -34 -163 88 -262 -44 -296 -82 287 59 86 65 197
5366A97l52n6L51r0k36R6Q4k12Q1P4j10O0j57L72k90N04l32N8k27l8j26K96j2
5389f5N1J2K9K78n68L36j50m05P82m21q6M81k00r8Q8K93m61M8K65l41L2L81m49
5412a68J32P1J84n39K88J92Pj42Q3r9n24M30p2J89J24m4R4j41K42k88J72J80l18
5435E3n04N06K1l64M69j78L9R4j54J80k49L65l72L24O4k04J43L8l32l51K27P4
5457a11KL02J88m68M5K13k11j5l9K3j26K82j55k73L50j02l12K73K87r6n9J51m19
5480b70P1J00q7J37RK6L3j24K8N0M8M56n11J70r8j69J07P8M29p95K43O4j41J56
5504A0j25K9Q6l7J42j74O4kk16K35O2j10OM87k87m73O26m94O6J18J06l10K33j52
5528a10l33M42J76l30K57M2m62K90K17m18L6K95k90J31J00p4j19m1L29k52PJ65
$$ plain form
5366 197 -155 -211 140 50 -186 -90 -6 -218 -137 -63 -173 -113 -270 102 -188 316 -16 42 -185 -223 -349 -53 -65
5389 -65 -14 -2 27 305 -263 73 -77 -482 300 -121 -207 274 74 -24 64 357 -104 -56 209 -132 -100 281 -168
5412 -168 -36 35 219 -320 -32 160 167 25 108 9 -515 -85 -157 32 156 112 206 65 307 19 191 371 53
5435 53 -451 55 76 -288 181 3 42 136 -18 162 -87 278 -94 230 294 90 233 271 -61 -412 -185 -111
5457 -111 -109 193 381 -87 -42 171 -40 -55 -94 -71 -197 85 -70 -343 7 -95 -407 -134 153 57 -2 149 -270
5480 -270 -199 -99 -186 -49 -40 -14 19 -105 -77 -27 21 477 -34 136 38 -131 -24 54 483 -312 -69 -5 -146 10
5504 10 -115 -86 0 -37 105 -69 -5 -7 -223 12 74 -36 -30 457 170 -303 323 -171 -105 13 119 -191 42 -110
5528 -110 -443 -1 175 -155 102 144 -318 -28 189 -229 -193 102 -188 -57 43 -31 -150 -191 138 -114 -107 58
5550E8J26m00N97m86k58N50J39j56k41j09R4r8M62j47m37M58j92j71J64K14j92
5571b5J74m00L01k15M5J08k97M26j72L23o90O38j04m1K9q7r9mj56j35N23j94j79
5594b31J61M32n99J35L61l68K66N9l23M51l76j13p9L09k39R2J76L12m63J60k04
5615h1o5j4M65k77k59M90j12k44J11J94l67L44k9j79rq5j44M76Q5m40R3L70j18
5638B05k16k7J8p1K30j83K0l7q4J46J58l6k07q6L39j13q7J4rjJ5M1j19l8M14j63
5664A23n46P05l09j16M45o57K57j28K38k87J70L58k61l5M08k90qk94L42JJ0J23
5686B49k20j39J50r1J37R4K4k64K35j00j55J60N3n20M47N7j58J61L19j99j49j25
5708c4j04K7L15l20j6J64j10J07K11j63j73J73k65j07K59J44l01J75J92j34j33
$$ plain form
5550 58 184 -216 381 -105 -363 187 326 170 -71 -180 -86 -184 278 131 -306 152 -40 -211 -47 167 -25
5571 -25 149 -251 50 -165 -120 -12 -309 117 -55 268 -422 216 112 71 100 13 -86 -90 -246 -381 142 -52 -231
5594 -231 -70 362 -237 -102 259 -109 157 216 -107 344 -32 -145 -224 85 -154 -62 114 426 -37 123 -81
5615 -81 -146 -160 305 28 -231 259 147 -97 14 208 -159 185 156 -23 -32 -117 -261 215 300 -140 -47 323 205
5638 205 -11 -38 -20 -91 139 -44 -24 -61 -145 1 159 123 -84 -170 169 56 -31 -17 -26 -27 -12 29 -90 -128 286 123
5664 123 -423 282 -27 -143 302 -355 -98 -226 12 -275 -105 253 -8 -43 365 75 67 -227 115 116 126 249
5686 249 29 -110 40 -51 86 180 204 -60 175 75 -80 80 133 -387 60 117 -41 120 439 240 91 -34
5708 -34 -138 -111 204 -116 -132 32 -78 29 240 77 -96 77 -188 -295 -36 108 -193 -18 174 40 -93
5729i3K12Q8l84L07j95p9n0J15L9j71L47K31n45J57k14J75K48j25m19J69K10k91
5751b68L22N7m8j66j17K68p4j20M6L62n53M37l03q8O58k45k47l21L97j75J03L98
5773C23l45k87L87M7l24K37O8n8m6K37l35K23r8K3L60l14j30j55L06j89j09K03
5795B4p6J49K14pl05J07Q9l30P5K42k55J70m1j83K36k52L64k87M8L14k79l4K05
5818A88k00j27K11j99O0K18l8o7O0R6o02L28K8M1j86L13k04mj4J79j23L8L29l70
5842d5j79Q43q34P4L94k46N6k18M15l39M72j70k25j68J29j61J68L03m16m0J35
5863e2Q2k92J98K12r7K36j37j89j76K64M8l23L77L1k97J93O0j65M92l88j59r0
5885a72L9K47j45K78j01j19P7k00p1K12o3j1N2o0k33O7J80k4R1Q0k0l45L17l46
$$ plain form
5729 -93 119 207 -177 130 -65 -144 -194 -79 -40 -211 136 367 -178 -21 -235 -60 188 63 -356 -187 23 -268
5751 -268 54 111 63 -103 -220 48 -26 -146 -100 262 -291 146 -157 -245 413 168 -79 -400 -3 -178 -75 323
5773 323 -22 -309 78 125 -199 38 106 48 2 239 -96 127 29 52 412 98 -32 -187 119 -70 -179 24
5795 24 -52 97 311 304 -1 106 195 -135 -60 182 -73 97 56 -127 109 -143 221 -66 -18 296 17 -17 188
5818 188 -12 -139 72 -127 -67 151 113 46 106 202 -400 -72 -44 -3 -189 124 -80 -84 -98 81 -42 -4 325 -45
5842 -45 -224 619 -215 -141 253 7 63 -155 260 -79 393 223 -2 -170 -41 -202 -34 269 -147 -187 -52
5863 -52 30 -262 -64 148 51 287 150 -39 -215 49 97 -226 151 182 -115 78 138 -27 465 77 -82 -172
5885 -172 -133 114 -31 247 146 27 104 -96 -167 45 -18 -29 23 -37 -270 -203 -23 -47 44 124 104 -241 76 -270
5909b70J54R3j1j49K51K30j47k74J90j89R0J10n7q4K24R1n51J99O3j85K67O5m48
5932c38J65K70j44J09L0O4m17J56K66k60L8M77m87L12l82J57j33J51j38j43M60
5953B13l52P8L09j15m57M55k26j9J78M4l07J0J10J54p9R8j89j57l2O75m70J09
5975C0ml5p0lJ01r5L2J37q5j56K5j76p2N54n08rM98j85j31K80nl89K3M24l85l7
6001b41M06k87J55K39l41mJ48Oj06j35O3k20K75K42n08J00O40m93j23M63k14j80
6023a15LJ48k20J30K06j43k05K64l03J41J58J0M8l3kj45RM5j40J39J44j59q5n8
6047a63L1O3J64J04j75l00M26O2q8P7l32nN37l31j38J82K2j83k4L30kn35L92k11
6071i7pK28q8m4J46kl77L90m4k33K84K7j60K02r1J35k34M9k25J42K09Q5m85J81
$$ plain form
5909 -270 -116 -23 -34 -183 68 298 151 -123 67 -122 -32 78 21 -63 161 252 -299 -100 -37 -222 45 110 -338
5932 -338 -173 97 -47 62 92 156 -261 -105 161 -99 -61 416 -71 241 -141 16 -117 34 -104 -247 213
5953 213 -139 -61 248 133 -324 131 -95 -114 64 108 -199 -189 -79 75 -4 94 -95 -252 -284 391 -79 30
5975 30 26 -9 -79 -82 19 -76 -44 93 8 -148 -123 -299 -371 183 -325 -334 164 -21 -152 128 123 -266 -243 181 -204 -241
6001 -241 165 -122 33 272 -69 -73 75 81 -25 -160 -97 -317 -42 200 -308 -208 432 -61 -184 279 65 -115
6023 -115 -112 36 -184 -54 152 9 -196 68 -235 -94 64 74 122 89 87 -58 -49 -4 -144 -5 139 -20 -105 -163
6047 -163 -132 -69 95 199 24 -276 150 212 124 201 -131 -136 401 70 -68 114 136 -47 -71 259 257 -278 114 -97
6071 -97 -104 124 36 -8 138 136 -241 149 105 -128 156 183 23 225 134 269 35 84 -141 1 210 295 -190 -9
6095iR5j35j50M54M1j96K76m5l69j1K17j34r2OJ27k82L52j82q0M7J01j64P3L14
6119B54m05K26R7j82J07J60m90J64J82j45m2K44m4r9K58k26k18P0J35k22K64k72
6141a84J92l9J39j47j02M47k23l58K06L26l78k10K37O0q6J26J61l18J10m34L16
6162a59qL99n14L04nr5J31J2j39k0J89k62L5L12l31k3J93K09l98J91J31l76J45
6185g9J24J74p8J0n8j92K84m6j89K27J27k81j74N38m16j89M76k84M4J44j09j27
6207g4N8r5m10N51Lr3q9L70j70j55K62o5M0k47Q7J90l4J03l73j95N44m62M82k52
6231b4k05J14mJ64j29M21l99k20K87K82k40k73Q0J72j82M59k92j70L15k61L8L41
6253B74m25J69j38L81l01Q2j43J65l38K37K52m80K55L1l22J09K02J61l42j6J45
$$ plain form
6095 -9 86 -49 -199 255 296 100 376 331 -38 -49 168 34 -58 -52 75 -207 145 -37 -117 -70 31 -133 -60 254
6119 254 -151 75 172 -10 97 257 -233 -69 113 -32 -74 170 126 27 285 59 -159 -89 46 -176 88 -184
6141 -184 8 -31 108 -39 -141 306 83 -275 -69 257 -121 -331 -94 -34 -120 6 167 -151 -41 -475 -159
6162 -159 -167 232 -282 22 17 -78 53 65 -74 -94 95 -167 -132 180 -151 -174 19 228 -170 21 152 -224 -79
6185 -79 45 219 141 151 93 -99 185 139 -50 177 304 23 -151 387 -29 -218 258 -26 18 162 53 -74
6207 -74 -16 -111 -521 30 33 -60 -149 221 51 -104 158 93 133 -114 -27 163 129 232 -141 -336 208 -254 228 -24
6231 -24 -229 -115 -119 45 -84 337 -62 -282 5 287 47 -226 -146 26 -156 303 11 -159 156 -105 -67 274
6253 274 -151 18 -120 261 -40 42 -101 64 -274 -37 215 -265 -10 21 -301 -192 10 171 -171 -187 -42
6274d2j31M53m16R0O8K16n71J75K33l73N09k9k34J71l61J47J56J43j67n2K5J5
6296B5K9kP3j8J4J83l93k16L72J3l12J46K75k64L35J21l49M8l3j05n5K05P3P1
6320B36k35K25j57q7K53k62l4P4j83K69j17p3j3K66j20k67M24r0j77k3J38k51
6342b04L9K62K40p08J36K21j38R6J06n14M09p7Q8j62N02k91j58J34J06j22k73
6363c08K74k50L28J00k36j36K25k07K84L21k82n12M37J29l99J69J84j13J47j78
6383b3k3l48N78j11j68J91j0p3o1J72m29K02j5K51k20J5J03p7N3K58l08J30q7
6406@j34M6L9j62L62j03r6J40J99l84j42J23K71j91J19n3l95K61K77k72j45K10
6428c0J97j72K48O0m28K87j46O9k71J22j68m5K69k67O6K13k8j62K89K7j15J48
$$ plain form
6274 -42 -173 280 -136 -46 22 238 -333 -158 75 -298 211 182 -52 119 -242 -95 61 204 37 -15 10 25
6296 25 54 52 125 107 121 304 -89 -305 67 80 -232 -86 189 -75 260 381 32 80 47 -58 -113 92 165 236
6320 236 1 226 69 -18 235 -27 -61 13 -170 99 -18 -91 -104 162 42 -225 199 109 -68 -91 47 -204
6342 -204 -165 97 337 -371 -235 -14 -152 -56 50 -464 -55 -132 -44 -206 296 5 -153 -19 87 -35 -308
6363 -308 -34 -284 44 144 -92 -228 -3 -210 74 395 113 -399 38 167 -232 -63 121 8 155 -23
6383 -23 -46 -394 184 73 -95 96 86 13 -48 124 -305 -103 -118 133 -87 -72 31 -46 7 265 -43 87 0
6406 0 -134 -88 -49 -211 151 48 -48 92 291 -93 -235 -112 159 -32 87 34 -361 -100 177 -95 -240 -30
6428 -30 167 -5 243 303 -125 162 16 85 -186 -64 -232 -277 -8 -275 -209 4 -24 -186 103 130 15 163
6450A63j87j8j46N37j81k06M7J30k82L13k06j63J12J74j74k29M78k95J02M59l45
6471H3k91J74kk31K34L38m27J19L05l74oj17J00N6O2j32k91N42M3l52K57O6k46
6494i0M51j89l46J33L20J17l88M22m68l02K58M7j2J6J16j52j14M25k68j88J28
6515h4L17k91L98Ko61J73K77m30L72jk97R5L43k0k18l13M55q2J84l18j32j91K74
6538a48R5p5K06j44p6J35N2qJ60j09k17K52P5l40j6M12k30J8J68k19p1K92N9m51
6562a80K74j03J77k46K25j93M47P6m02J20j02j08l6R2K60o11J74K16l25K51K02
6583B08m6l32L12Kq0k01L78o42O51J12n23J23j09J80j20L45j69Q3l4k45K86Ok23
6606c8L4R0j21K77k76J0R6k84M28j18k06J79J67l23K88k87q4L4pJ61m25L84L2
$$ plain form
6450 163 -24 -42 -188 349 168 -38 9 139 -143 170 -36 -199 -87 87 -87 -316 162 -133 -31 428 83
6471 83 -208 -34 -36 -267 -33 305 -122 -3 302 -72 -78 -195 -95 -39 23 -109 -400 142 185 -167 90 156 -90
6494 -90 361 172 -174 -41 279 396 8 430 -38 -340 -82 -35 -47 -31 85 -67 -181 244 -24 -212 -84
6515 -84 233 -58 340 342 -319 -146 131 -299 73 72 -225 -130 213 193 -25 -338 117 35 219 -99 -231 -422 -148
6538 -148 -53 -128 78 -66 -142 -7 45 37 197 88 -129 123 198 -142 -158 254 24 42 210 -9 -80 212 271 -180
6562 -180 94 -9 168 -78 147 -46 401 477 75 195 93 -15 -51 41 301 -310 -136 80 -245 6 208
6583 208 162 -170 142 144 64 -137 241 -401 250 362 -161 -38 -147 33 -87 258 89 172 138 -107 179 185 -38
6606 -38 -4 86 -35 242 -34 -24 72 -212 216 98 -108 71 238 -85 203 -84 -168 -134 -141 20 -405 -21 11
6629A1j94J50M4k58p5L31q8m5M58q5l36P8N6j83J88o1j17j07L13q9l35O72k70
6652E8n20M83K92n28N05p2n25L22J79l28L30N5k27j04o1m2J10L38k76m00L88K8
6674El57M01K53l13n5O7k43P11k06k97K00k36L6Q3j07K38k92Q4K45l50M8N03m62
6697d4l24N59Mq9J11k70l2j77J65j48K00P2JL08j91N7k35J76j26l36L69j0j47
6720a07l6L26j55l6J26p3j75K45l4j86m6Q1j79J68M88n68J02J80N2l24L93m00
6742a58k68M11J18k45J19n2K95k50%l67K88k8J84j54K72k33K05l56j05j84L56
6763a52L53j98J02Ml16m6L90n3j24J34Q2m50K98P7j83N8M7k23K62j57M0R2K80
6786C17o6l21J96k3k53K64N9k23j39K5K80r1J6p6j13L13qJ4j52K03m84M83J53
$$ plain form
6629 11 -183 -33 11 -247 -322 9 -79 -124 334 249 -87 -9 47 -136 52 -9 -126 -233 80 -9 -344 328 58
6652 58 -462 21 313 -215 290 218 -307 15 194 -134 196 251 24 -80 -141 -183 -73 265 -11 -411 -23 5
6674 5 -352 49 302 -11 -66 1 -242 469 263 -34 166 -70 -34 49 -58 180 -112 -28 217 -133 -85 418 -44
6697 -44 -368 191 195 106 217 -53 -85 -262 -97 -245 -45 27 28 336 145 202 -33 143 17 -319 50 40 -107
6720 -107 -143 183 28 -8 118 45 -130 115 81 -105 -151 -70 -249 -81 407 -161 -59 121 173 -151 242 -158
6742 -158 -426 -15 103 -142 -23 -75 220 -30 -30 -397 -109 -137 47 -107 165 -68 137 -219 -324 -508 -152
6763 -152 201 3 105 109 -207 -253 137 84 -40 94 176 -274 24 101 -82 -24 23 -200 62 -95 -55 37 317
6786 317 251 -70 126 103 -150 114 173 -50 -189 -164 116 25 41 -35 -148 165 157 171 19 222 -262 221 374
6809C74n43j29K08K37k59L1o3k05J71Jj37O00j96K6O4k1o2k35N7K49l10K87q4
6832F1l85K02K87n7k06N15o13j58N40K5l05L61j08l92M49k68R7j58L21l96M35
6853B47k7k49J11O0K19p56L49K54j46m1p6j35j50L19m7j90j2J68K03j33P0M7l45
6876b60L46j65p5M81o27L87o7J28o90M80O0l27J4N07n13L35J27N5l22O4O7j54
6898a49M07k04k62L83K18n71K53o8j10k44N93k36kJ15J51n23R8K30j43J98O7n42
6920c41K50lK15l06M42P1k11L6r7j30l5M26m99J75J24J54l82Q6K66l03J51o3j80
6943a54M25k31l33J20M22J7l56K97l72l4J94K13l83L12k90J48J87L4m60O5L27
6964A48j55n3J41r1J9L35l60k72L83M48m27j97k2Q1j03L04m56K15O6J84j99L63
$$ plain form
6809 374 -169 -298 -90 147 -112 -81 -144 -349 -178 -177 -314 286 90 116 180 159 97 -138 -81 168 -142 145 61
6832 61 -324 -122 165 108 -98 417 -196 -354 186 211 -94 267 159 -233 216 -52 45 -113 208 -188 247
6853 247 220 -29 82 142 361 -395 -46 208 62 21 -55 -190 -340 -21 -68 -258 -270 -102 101 -32 38 85 -260
6876 -260 86 -79 -154 327 -300 87 20 148 -542 -62 -2 -329 -315 192 -321 14 141 196 -126 -62 5 -149
6898 -149 258 54 -208 175 393 -178 75 7 -103 -347 246 10 8 123 274 -249 -151 79 -64 134 201 -341
6920 -341 -91 -94 121 -185 257 328 117 153 56 -74 -109 317 -182 -7 117 271 -111 -25 241 -62 89 26 -154
6943 -154 271 40 -293 -173 249 266 -90 207 -165 -199 -5 208 -175 137 -153 -5 182 216 -244 -179 148
6964 148 -7 -60 81 -10 9 344 -16 -288 95 543 116 -81 -103 -22 -125 179 -277 -62 4 188 -11 352
6986C52k64k70J78M08m28j45M63k72oJ27q0k90L32j16j51J68j47P6J06K79o19
7007b99K33K87j1l58K55L66n63J32q2l54K35N91k71m31K30k8k14K44J96k93k13
7028c48K68k35N84n03j20L07O3j04J87k53J79p5K55K4m49K21K46k67o9M47o23
7049b65K18M05l66J54k81J93k16K30p6j83L80n3l86M39L5j31j02K15j05l64L36
7070G7k11P4K57O9j28j05M6l52O9M07k45j27J05L63o14L55J28n31M64J90k15l09
7092b33M44j95j99M27m84l3M89k53K2k02K39j6L08j49j97N7j97j6K46R0j05m40
7114c97L96J38l3r9O8J15n01N25k58k75L44R4k89M07k52j72M5N92n92K54p5j5
7136B0j01M29k23j17j90m1R5K29M00o44p3K59k87L36lk99QK36l29O11k22j96m9
$$ plain form
6986 352 88 -182 -4 404 -24 -169 294 22 16 143 63 -227 105 -11 -162 6 -141 -65 41 320 -299
7007 -299 -66 221 210 -148 107 473 -90 42 -40 -394 -159 432 161 -270 -40 -68 -282 -38 158 -135 -348
7028 -348 -80 -315 269 -234 -354 -47 16 -88 99 -154 25 -50 205 229 -220 1 247 -20 -89 358 -265
7049 -265 -47 358 -8 146 -135 58 -158 72 -4 -187 193 140 -246 193 228 97 -5 210 105 -259 77
7070 77 -134 -60 197 266 138 33 79 -273 -204 203 -42 -169 -64 299 -315 40 168 -363 101 291 76 -233
7092 -233 211 16 -183 244 -240 -273 216 -37 -15 -217 22 6 314 165 -32 25 -172 -188 58 148 43 -397
7114 -397 -1 137 104 5 73 188 -313 212 -46 -321 23 117 -172 235 -17 -189 -144 448 -144 110 35 20
7136 20 -81 348 125 8 -182 -223 -128 101 501 -143 -216 43 -244 92 89 -210 -202 34 -295 316 94 -102 -151
7159a51l7J14J31l28L52N5m04K60L33k87K0L99p72K23K95m21L68j26n68M71K50
7180A77No12K36L15J0l17L46l56O8L60j29n2j68NJ0M71l29K39l35L26l70RK85
7203A94l24J05K08k22l1K04o4k36K54k63O5o4K31k71J33J03J0j96J78J47l57J48
7225d8K1l98K89J64J72l82K90K4l68N36k27Q8J91k68k86j2O3J05P0L1j40l02Q63
7248D76k96j70r7R0j13K12J81l36pL11J4n91L63j38k38K41J44m60N55N3k03l24
7270c33L52j04q8J33l50N1N46l65Q3J51k62R1J48n2m3n3N1k24L11k01K81m50L63
7293C6N3n7K79k70j80K37K48n10J0L90j70k21K56R1j61j70Q4j7L26Q4o06K34L9
7316Eo3J64J80j72r7q4J39j20o2K51k79K08K80k14RR6j90J57k39J30j09KM41m51
$$ plain form
7159 -151 -188 -74 57 -271 81 136 -268 -8 325 38 58 457 -315 -92 203 -218 150 24 -544 -73 177
7180 177 182 -430 -194 121 131 -186 160 -196 -128 232 103 51 -117 -112 -102 369 40 279 -56 270 -100 -91 194
7203 194 -130 -25 183 -39 -70 134 70 -166 88 -175 -110 -174 57 -214 -81 22 32 -164 14 161 -196 -48
7225 -48 -27 -425 -136 28 200 -182 108 132 -236 300 73 161 352 84 -202 -214 -151 -46 24 55 -85 -387 476
7248 476 180 10 -87 3 -110 102 283 -53 -60 251 265 -326 37 -101 -339 -98 46 -414 141 194 -9 -333
7270 -333 19 -85 -173 -40 -390 -339 207 -158 -75 76 -186 -95 53 1 -42 -95 -44 -268 43 -158 123 -327 36
7293 36 89 32 311 41 -139 98 346 -164 -154 236 66 -155 101 192 31 -139 -55 -72 254 338 -268 -34 5
7316 5 -58 106 286 114 17 -67 72 -48 -110 141 -138 70 350 136 145 241 51 208 -31 99 -10 -8 433 -18
7340a8l0J03K0lN7j38p6K99l61R5J42n1j63K27m6J7m98N78r4r9j2J34o0J13l47
7365b11k1M27j53q0R8J77j49r0O5k08j51J88k8O6n1K88l92J41k6k1L06Qn72j35
7389e24N84O2m02L33j10k78K87O7k21J13L10j99k80Q56l87l96J5K55p7J11k23
7410a04Q4j31M08J7j03P7l83n9L80j85j26K56n7Q0k0l05oj33K44L1J12J21Q9m11
7434a24R7K09m50L62j16j13j54M55m44J97K06j06J50l1l5k03P2K31M0p3R3j24
7456A39n5j84k00K52J00J73j88j62L15p7Q0j01j56j37N15m40j08n6J86R3K24k72
7478e9M6j23L23m22L36j82k7LL07l97j6K88rm92O69j67k97O7K84n38M96L83o20
7501a47k9J71j31k2K33o3J72j28K36l32K68m4k92j13L76k32mJ87J9jp4R5k17j81
$$ plain form
7340 -18 -48 55 75 72 129 -9 -85 214 -147 -52 90 39 -124 103 57 74 -424 154 60 -39 -51 83 23 136 -211
7365 -211 -232 195 42 -38 60 237 88 -2 63 -145 -296 -108 -136 -70 -121 167 -225 -84 -110 -131 175 183 -389 -524
7389 -524 60 122 -280 53 -57 -335 -48 19 -202 -89 221 22 -258 598 211 -185 -170 85 8 119 -104
7410 -104 -20 -151 257 274 171 248 -135 -194 186 1 -125 131 74 154 134 -171 -177 -310 -66 -35 77 198 287 -124
7434 -124 -27 182 -268 94 -22 -135 -289 166 -278 -81 125 19 169 138 103 -100 -28 203 243 170 263 139
7456 139 84 -100 -300 -48 52 225 37 -125 190 113 193 92 -64 -201 314 -126 -234 -290 -104 -11 213 -59
7478 -59 -13 -136 187 -235 101 -81 -108 -105 202 -195 -211 77 68 -424 245 78 -219 -152 132 -406 90 473 -147
7501 -147 -176 -5 -136 -158 75 12 184 56 292 -40 228 184 -108 -221 155 -77 -81 106 125 124 50 145 -72 -253
7525b53K98n34L18L58n44K49O45l64l12K1P1r2N2K30l37o3L63l5m7K36k77k03
7547b20L10J10j52J69K5j47N2n1l24K60J65r4l02O19n06j42J71K27k53P6p3n4
7569a34J84J31o6l35L51j8k14N5K63m15P3K56r1N4J09j37q8o7j25K19N6k24K8
7592a35l5L83j39N6R8j98J68kj34m7kK43l76k35M41LO6J8j94J04L96l87j34l3
7616g5J10O6n1k57L6L45O5l24K1J90j14k25L08j75J54q0n5K13j83K4k74K24l3
7639i0P4N7P4J05n01L12M0k30J92K06m69M0J9J29j99L68k98k90L89k17K75K71
7661B57j71k62J30J08r3K9L95m58K09Mm29J3N12l63J65J70k46J45M3p3j47k5l1
7684a18O2rL48l38J22P5L45n72j01J76J5K72k05J5k66L16j21j47K42MR4k61j14
$$ plain form
7525 -253 45 -489 -171 187 -357 -108 537 173 -139 -118 -47 -139 -87 143 -194 -257 106 71 24 260 -17 -220
7547 -220 90 200 48 217 242 95 147 96 -228 32 197 103 -199 420 -86 -228 -57 170 -83 -7 -80 -134
7569 -134 50 181 115 -220 131 113 -101 -46 217 -198 -125 131 40 94 203 66 -22 -89 -214 5 61 -163 -135
7592 -135 -170 213 74 130 228 30 198 196 62 15 13 256 -120 -355 86 89 155 173 -21 83 479 92 -42 -75
7616 -75 35 101 50 -207 -171 174 239 -85 -64 126 12 -213 95 -80 74 -6 -61 152 -31 -7 -281 -57 -90
7639 -90 -16 41 115 220 -281 31 71 -159 33 239 -230 -190 -171 -42 -241 127 -171 -461 -72 -289 -14 257
7661 257 86 -176 -46 62 -31 -2 393 -65 144 148 -281 -268 244 -119 46 216 -30 115 158 85 -62 -87 -118
7684 -118 -56 -65 283 -55 67 142 487 -85 -186 -10 5 277 72 87 -179 137 16 -131 111 115 209 -52 -166
7707a66J33N5K54k37j22J38j31j10M85l25j9j06K50k52M10j35km6j19J12j17J32
7729H2j41K80k42k9j19K43j72j93J02K47JJ28r3j96J78K79m22MK0j45L83k34J17
7752G8n46N87p9K16k09j07q7j34L22P5l94R5R3J98k38R9m2m7M01l74l7J42O4j54
7776g8J7L23m62L70q4J71o5k52l7MP7q0J66NK70m18J27n7o5M6L3Q2R5o0P3q93
7802f92O47K25k73j8J28j32k6M23o2l00K52j47J15r9r8q1R7J39j84R6J98l66J9
7825a39L91K3k54K57l08l45M05j10m6j6K13n1N7J6k46M5K32Lk33P3Q2p3J44J29
7849B49m24j20N84k91k13N25m02K77k10k08R8j52M70n75N23k22r7R8M0MN2L0N9
7872I5m36L06j14Q5K09q4p8j57L48m02jM52k34o3j42L06k42J56K30k83j90M66
$$ plain form
7707 -166 -33 22 276 39 -83 55 -76 -186 299 -26 -45 -151 99 -153 257 122 120 74 -45 67 -50 82
7729 82 -59 221 -21 -50 -169 74 -98 -291 -189 58 59 187 94 -102 76 355 -67 -63 -43 -188 195 -39 78
7752 78 -468 119 40 256 47 -60 -147 -281 41 116 -278 -183 -90 108 -130 -31 -73 -120 281 -93 -130 12 76 -78
7776 -78 -61 262 -200 170 86 257 192 -60 -97 -93 -16 -96 70 75 345 -73 54 -3 -68 -22 11 93 188 128 201 -692
7802 -692 -45 180 -93 -111 17 -115 -141 282 220 -80 172 25 140 41 -57 -138 -41 98 -86 10 208 -158 -139
7825 -139 252 275 21 278 -30 -375 30 -80 -126 -142 71 20 77 93 -153 -108 124 127 -106 -33 49 -24 120 249
7849 249 -175 -295 289 -2 -215 310 -92 185 -25 -233 -135 -287 183 -392 131 -91 -188 -90 -50 -46 6 36 95
7872 95 -341 -35 -149 -64 145 61 -17 -174 174 -228 -229 223 -11 -74 -216 90 -152 4 234 -49 -239 227
7894B27j97p0L63l81m2N4J76j81J8J82m56K59j03j77K76K81n89K27L61P1m10R5
7916a6K62j59k6Q9j96k6J87n18L83J36K54p48N27l21m3K91n5o2j35O06n37L5L22
7939B50k89O8M08l66M8k0k17L9K07j47j50J21K8N0k50L80k50k14K55J69j48M1
7961A3J1j89K40R5j22k91K81Q0m44L43j02P2pn1j38P6J93q5q3K28J78l73M12k93
7985D4m16L40K06n11J99K81j41j65J51j67p8L56n8o3k5K53k11J29Jl08L59q9j
8008H6r2j26r5L46j26j24l51P02j32j47o5J58l44J22K20k37K28j4j02j44J30J51
8030D4m61O50k39k98K74Mj48L21p3k27R5q5L39O1k89Q1n3p6J87l1j94M27n95J95
8054i1K50k5m56L23J39j17R8J6p0k27J3O5M2P9K6k33P9J05q1M36N7o39p3K81j00
$$ plain form
7894 227 30 -40 323 -58 -100 -46 130 -51 -33 149 -307 -48 -151 -328 -52 229 -360 -133 228 299 -111 -16
7916 -16 246 87 61 150 -46 -72 115 -403 -20 116 370 -378 149 -172 -215 76 21 -41 -176 430 -107 -72 250
7939 250 -39 29 437 71 119 99 -118 -79 128 -19 -169 -48 -20 30 -220 160 -90 -304 -49 120 -28 13
7961 13 24 -165 75 170 48 -243 38 118 -326 17 -85 -13 -20 -71 -209 -133 60 -25 -108 120 298 -75 337 44
7985 44 -372 -32 174 -337 -138 143 2 -163 -12 -179 -257 99 41 -22 -47 206 -5 124 125 -183 176 87 86
8008 86 -6 -132 -227 119 -7 -131 -482 220 88 -59 -124 34 -310 -188 32 -205 23 9 -93 -237 -107 44
8030 44 -417 233 -6 -304 -30 -26 -174 147 74 -153 -58 -143 196 257 -32 49 -4 -80 107 76 -118 309 -286 -91
8054 -91 159 134 -322 1 140 23 121 137 67 -160 -147 -82 -40 39 65 -168 -89 16 -65 371 428 -211 -284 -3 -103
8079a03Q0n1Q6j20J35J57o38P11J50m35J85j13k6J16k50Nm6J26M04l66j83O4k16
8102c28L08K42n76K26L46k26R0Qj81j10K43q3o6J3M28j88j20l5j50J23M6J22J79
8125C11p4k92J8R6J15m74K37L62j04l10M82p13K70j66L55j64J74k98r1M58r7m1
8147E4j21k4Q6N0j39L81k79J59j94J01P5k15r5Q7J61K4J2K9n5j86J45Q8k08J13
8171D9J38k47p1M53m15j1M39n87K0M18l03J41j97J52k31Q4K21o5j7o
$$ plain form
8079 -103 -23 -74 12 -108 27 184 -454 257 407 -28 157 44 18 134 -116 -111 -157 -31 373 7 -176 -112 -328
8102 -328 -20 222 -354 -128 218 -8 82 90 -91 -201 42 -41 -107 -94 334 146 26 -9 -159 -36 10 132 311
8125 311 237 -55 -37 59 174 -300 -63 299 195 -115 367 -346 -76 -242 113 -51 123 -175 -266 192 95 54
8147 54 -67 -91 -5 45 -94 287 8 167 -27 74 149 -66 -161 -74 87 111 123 152 97 -89 56 144 -64 49
8171 49 187 -60 -131 322 -93 -104 335 -252 -232 186 -117 24 -173 -21 -252 -168 53 -12 -29 -35
8191c5
$$ Imaginary data points
##PAGE= N=2
##DATA TABLE= (X++(I..I)), XYDATA
0@%%%%%%%%%%%%%Kj0J6j6J6j6J6k2K9l1L4m0M6n3O0o8P7q6R8j09J21j36J51j67
37h8J87k07K29k55K82l11L45l82M23m71N25n89O62p47Q51r79J141j354J649k084
57a173K785m100P368k7234n8113O1615J8542j7334K4988k237l6615L0683J8534
70A7709m6054l78L3071k3425L661L7265l6853m0490M1051J2330k5387K5086M768
83B354m6536J0347K6420l1262L054L6723k9964j9995M4604n912m2361J9810J5429
96a7289j6158L0580J3038n3947m605M1630j1663n633L2585k0055k4673M1056O063
109A0929m2011R850J6214j7209K6599K3335m9378j4871M3548q587j9955K8928
121G392q415l2987K9907J7575l3556O365J8350k5595R412L3461l2605k1606L6884
$$ plain form
0 0 0 0 0 0 0 0 0 0 0 0 0 0 0 2 -8 8 -8 8 -8 8 -14 15 -16 18 -22 24 -29 31 -37 40 -46 52 -57 64 -72 79 -88
37 -88 99 -108 121 -134 148 -163 182 -200 223 -248 277 -312 350 -397 454 -525 616 -738 911 -1173
57 -1173 1612 -2488 4880 -22354 -80467 -18852 -310 -17644 7344 5107 -31508 -825 17709
70 17709 -28345 -28723 4348 -19077 -15416 21849 -15004 -55494 -14443 -2113 -27500 -2414 2354
83 2354 -44182 -33835 -7415 -38677 -35623 1100 -28864 -48859 -4255 -10167 -52528 -32718 -17289
96 -17289 -33447 -2867 10171 -43776 -48381 -6751 -18414 -24047 8538 -11517 -36190 4866 10929
109 10929 -31082 -21232 -5018 -22227 4372 27707 -21671 -36542 7006 -1581 -21536 7392
121 7392 -1023 -34010 -4103 13472 -20084 -13719 4631 -20964 -11552 21909 -10696 -32302 4582
134D582k032j9405L2003J381l9737J6839K4433k5477O780K4398l0284m458M3052
147C2075j4086l3058K1623K029j9657L0578J0447m2590M549K8483k0779l663K1429
160A7380k7426j4362M3099K62l5689J2711P031k2583K0704J6069l7100L9L4556
173A4691j7878j2024K8644j4372k5828L0755R939k8660J2454J2277k6821J0357
185f466K8187k6190j1591K5107j4743j3572L2892m844l4419K0601J8537k6081
197a2582M424J2352l0096L582L7825j6015k2724K2394n114j9815K5290L655l2364
210b9188J5293K4498k3140R81K0019k5407q372L5790p011k3328K2541J792k4944
223b0476K1034J4762l0491L963K3249k0497l635K7134j8928j9120L1212L124k6753
$$ plain form
134 4582 2550 -16855 15148 16529 -23208 -6369 18064 -7413 -633 23765 -6519 -10977 32075
147 32075 17989 -15069 6554 8583 -11074 19504 29951 -12639 -8090 20393 -386 -4049 17380
160 17380 -10046 -24408 18691 18953 -16736 -4025 3006 -19577 1127 17196 -19904 -19865 14691
173 14691 -3187 -15211 13433 -939 -26767 3988 13927 -14733 -2279 9998 -16823 -6466
185 -6466 21721 -4469 -16060 9047 -5696 -19268 13624 8780 -25639 -5038 13499 -12582
197 -12582 -8158 4194 -25902 -22320 15505 -510 -23234 -840 -5954 -25769 -479 3176 -29188
210 -29188 -13895 10603 -12537 -11556 8463 -16944 -25316 10474 3463 -19865 2676 4468 -20476
223 -20476 558 15320 -15171 -11208 12041 -8456 -12091 15043 -3885 -23005 8207 11331 -15422
236a5422J3556N952k6503J4696K2866k4764l676K3722j6801j1449K6724j0091
248a190k3698K6761J1077k4567J1135J1965k7746M631K7770j7583j0592K4030
260A1993r165j6016K5536j094k8079J5715J5807k2314N926J6619k4322k277K9091
273A7420j3487j8609K1640l111k1235K0713Q688k6128R424J8269k2287j192K1537
286A1642j8748j0829K7961l925j9778J9690K181k5691J4823J5911k4038K220K1756
299A3175j7109m798K3423j4938j8750K5097K746k2676J4460R398k3772Q832J9846
312A4934k3058n955K3072j1720j2837K2825m731k0833K0105P638k4240Q966J4523
325H689k2562J954K4044j5606j0614K2531p526j7758K0999J962k3656J3382J5493
$$ plain form
236 -15422 -1866 4086 -22417 -7721 15145 -9619 -13295 10427 -6374 -17823 8901 -1190
248 -1190 -24888 1873 12950 -11617 -482 11483 -16263 -11632 16138 -1445 -12037 11993
260 11993 2828 -13188 12348 11254 -16825 -1110 14697 -7617 -1691 14928 -9394 -11671 17420
273 17420 3933 -14676 6964 3853 -17382 3331 12019 -14109 -4685 13584 -8703 -9895 11642
286 11642 -7106 -17935 10026 6101 -13677 6013 8194 -17497 -2674 13237 -10801 -8581 13175
299 13175 -3934 -8732 14691 -247 -18997 6100 8846 -13830 630 10028 -13744 -4912 14934
312 14934 -8124 -14079 8993 -2727 -15564 7261 2530 -18303 1802 9440 -14800 -5834 8689
325 8689 -13873 -11919 12125 -3481 -14095 8436 910 -16848 4151 6113 -17543 -4161 11332
338A1332j9909L547J6250j9585n140K4727j0732j6597K0904R23j9098J6396P672
351A0690k5061O932J8561j7661k799K0105j3529j0555K3616m434k0546J6757N596
364G672k1072J2769J5311k2549k11K0966j3939p953K0231r946j6791K2653N127
377A2268k1208J0765R457k0463O896J8485k0510o741K3404p567j1968J9165l967
390H016k1154J6734J0194k0853O255J4310j8452P90K1466j4725j3049J9707l951
403E288j5039J9190L053k3102J0036J5162j7836J44J4774j6881m894K3697o898
416F694j7020J5976Q14j6364J4093P835k3082M071J9624j3908l861J7069j2844
429i03j1864K0885l04j8552J2689N883j8064J1101J3977k1230m020J8515j0336
$$ plain form
338 11332 -8577 -5030 11220 -8365 -13505 11222 490 -16107 4797 5720 -13378 3018 10690
351 10690 -14371 -7439 11122 -6539 -9338 10767 -2762 -13317 10299 5865 -14681 2076 7672
364 7672 -13400 -631 14680 -7869 -8080 12886 -1053 -9006 11225 1279 -15512 7141 12268
377 12268 -8940 1825 11282 -9181 -2285 16200 -4310 -11051 12353 4786 -7182 11983 8016
390 8016 -13138 3596 13790 -7063 -808 13502 -4950 -4160 17306 2581 -10468 9239 5288
403 5288 -9751 9439 12492 -10610 -574 14588 -3248 -3104 11670 -5211 -10105 13592 6694
416 6694 -10326 5650 6464 -9900 4193 12028 -11054 -6983 12641 -1267 -5128 11941 -903
429 -903 -12767 8118 7814 -10738 1951 7834 -10230 871 14848 -6382 -10402 8113 -2223
442b223o769J9263q326j8018J8834O693j9154O768Q036j8059N946J9699j6544
455c854r487J8141n931j0769J7808k791k0735J3871J2916j6760M026J2247j7871
468i189j590K1499r635j3041J5838k352j2931J7958M097k3163O008J4720j3382
481e163J110J4484j5653p758K2065l193j6522J1833M68j5109J4545J1004k0941
494h830M2J6339j0847l460J6605j1143j3335J9540L339j5045J0013M402j7523
507i903Q352J6283j5843n497J5340p828n462J8664o445j8905J3509Q242j4294
520c787O532Q286j8281K582J9379j1856j0569J3609n649r805J8031J263j9944
533a0209Q537J0960j3976M002J2231j7187m458K0551m352j1444J2526k993j4075
$$ plain form
442 -2223 -8992 10271 1945 -16073 2761 9454 -9700 -2932 5104 -12955 -7009 12690 -3854
455 -3854 -13341 4800 -1131 -11900 5908 3117 -17618 -3747 9169 -7591 -3565 8682 -9189
468 -9189 -10779 10720 1085 -11956 3882 1530 -11401 6557 10654 -12509 -6501 8219 -5163
481 -5163 -4053 10431 -5222 -12980 9085 5892 -10630 1203 1671 -13438 1107 12111 -8830
494 -8830 -8788 7551 -3296 -6756 9849 -1294 -14629 4911 8250 -6795 3218 7620 -9903
507 -9903 -1551 14732 -1111 -6608 8732 904 -4558 14106 7661 -11244 2265 10507 -3787
520 -3787 2745 11031 -7250 -4668 14711 2855 -7714 5895 246 -9559 8472 9735 -10209
533 -10209 -1672 9288 -4688 -686 11545 -5642 -10100 10451 6099 -5345 7181 4188 -9887
546i887J6149Q072j9713K436J2993j1626J982J5066j4468j1578J8008J82j3330
559e714J0967Q65j6577J0937J3259j7347l113J2062j0339k592J7783q326j4850
572a2985J4203L841j3010R380N365j8737N136J7605j1215n734J2462q688p023
585i400J8009j423j8044J0104P540j1885P453Q717j7908j837J7017p293q034J2301
599E317n862j1336J5888M221j7618N093P404j2338M503J4034j4402p723J6709
612C890l075r691J2660k771j5094J3150J0617j4154R10J0092j2145Q03J6525r848
626A869j2016J4544J216j0426J1727J915j7610O823J3121j2559j973J1545j0555
639b379n004J7062m152j4167J0157K674j1902J0273P482j7151Q95J5015q122m358
$$ plain form
546 -9887 6262 14334 -5379 -2943 10050 -1576 406 15472 1004 -10574 7434 7616 -5714
559 -5714 5253 6118 -10459 478 13737 -3610 -6723 5339 -5000 -7592 10191 1865 -12985
572 -12985 1218 5059 -7951 1429 6794 -11943 -6807 10798 -417 -6151 6311 -2377 -9400
585 -9400 8609 7186 -10858 -754 6786 -5099 2354 11071 -6837 -8674 8343 1050 -6984 5317
599 5317 -545 -11881 4007 8228 -9390 -4297 3107 -9231 -4728 9306 -5096 -12819 3890
612 3890 815 -8876 3784 1013 -14081 -931 9686 -4468 -3558 6534 -5611 -4808 11717 1869
626 1869 -10147 4397 5613 -4813 6914 8829 -8781 -1958 11163 -1396 -3369 8176 -2379
639 -2379 -7383 9679 5527 -8640 1517 4191 -7711 2562 10044 -7107 -6212 8803 681 -3677
653c677J1830q325r145J6510K399j4392P325N906j2270O121J1643j4532l882J4490
667A0001n171o362J2587m784j3535J2075O231j3786M146P480j3048K002J4372
680A2208j0858q228J2467l649q467J2658l34j5517Q488R937j2322J015R608j1759
694d753k280J5892n449j0598J1252J00j0868J0598M739j5536L594J1582r687j379
708b793J1695j0134p577J4905j822j2243R035K516j2931Q243Q892j4645j315J1950
722C776q116l764J2996o121j1041J2857L130j2612P106N310j2478M313J2064j0599
736c179m026J2326n254o650J2641j623j3076R616O505j2052M431Q801j2428q14
750d782J3190p341p385J1153k424r420J1155K670j3836N196Q286j0649J043J0898
$$ plain form
653 -3677 8153 -172 -9317 7193 9592 -4800 2525 8431 -3839 2282 13925 -607 -4489 10001
667 10001 4830 -1532 11055 6271 -7264 4811 11042 -2744 1402 8882 -4166 -2164 12208
680 12208 1350 -6878 5589 1940 -6527 6131 5797 -9720 -1232 8705 -3617 -2602 7006 -4753
694 -4753 -7033 8859 3410 -7188 4064 4164 -6704 3894 8633 -6903 -3309 8273 -1414 -2793
708 -2793 8902 -1232 -8809 6096 4274 -7969 1066 3582 -9349 -1106 7786 -6859 -8174 3776
722 3776 -4340 -8104 4892 -1229 -12270 587 3717 -8895 -1789 3521 -8957 -4644 7420 -3179
736 -3179 -7205 5121 -133 -6783 5858 4235 -8841 775 7280 -4772 -341 8460 -3968 -4782
750 -4782 8408 1067 -6318 4835 2411 -7009 4146 6816 -7020 -1824 6462 -4187 -3144 7754
764G754r950m319J3693l976r400J0380Q17j1446R198O613j2257K094J0365r502
778F4k096J2195o894q179J2497j95j0731Q607L725j2949N233R287j1954r62J1124
793H772p942n106J2095l841j0372R956K268j1609O101O899j1857J633J1273r275
807a005m427J1782m909q371J1269O94j1215P638N091j1506L385R347j0436k260
821d923J1911o507o982J1090j354j0727R019L450j2152M583Q012j0621j39J0661
835E321p961n047J0934l650q935R807K002j1059O547O227j1047K318R607q650
849c586l246J1179m590p260J0941l03j0570P501N619j1170L552Q789j0098j513
863d755J1316o045o610J0560j971r511R359L198j1380M516P240r478N22J0240
$$ plain form
764 7754 -2196 -6515 7178 3202 -6198 4182 4999 -6447 2751 9364 -2893 -799 9566 64
778 64 -2032 10163 3269 -4910 7587 7392 -3339 5268 8993 -3956 1277 10564 -1390 -2352 8772
793 8772 830 -4276 7819 3978 -6394 3562 5830 -5779 322 7221 -4636 -3003 8270 -1005
807 -1005 -5432 6350 1441 -6930 4339 5033 -6182 1456 6547 -4959 -1574 7773 -2663 -4923
821 -4923 6988 481 -6501 4589 3235 -7492 1527 4977 -7175 -2592 5420 -5201 -5340 5321
835 5321 -2640 -7687 3247 -403 -9338 469 2471 -8588 -2041 4186 -6861 -4543 5064 -3586
849 -3586 -6832 4347 -243 -7503 3438 3135 -7435 66 5685 -5485 -1933 6856 -3242 -4755
863 -4755 6561 516 -6094 4466 2495 -7016 2343 5541 -5839 -1323 5917 -3561 -3039 7201
877G201q895m757J2074l396q096R142J256j0486P213O427j1075J338R313q231
891i72j838J0958n500p457J0312k32r083P221L835j1144L897Q878r106j887R333
906G215o464m880J0986k089r935P747L181r816N537N423j0362O32J0131o939m287
921c920R632m483o897J0154J317j1163N527N428r233L046Q158r399l356J0777
935E588m142o004Q451j643r218Q364M678j0508K557O660r058N37J0198p455n858
950f853R636j810p100Q347R78j1025N845P564r531J72P647p804k257J1131l987
965I53q744Q718O80q091P487L763j1159K439Q665p088k030Q724o622m874J0666
980C487n65r286O145K989q757N453O562r977j524R830n336l347Q635l729q044
$$ plain form
877 7201 -1694 -6451 5623 2227 -5869 3273 4529 -5957 1256 7683 -3392 -2054 7259 -972
891 -972 -2810 8148 2648 -4809 5503 5271 -3812 3409 7244 -3900 -3 8875 -231 -2118 7215
906 7215 751 -4129 6857 4768 -5167 2580 5761 -4055 1482 6905 -3457 -2825 7306 367 -3920
921 -3920 5712 1229 -5668 4486 5803 -5360 167 5595 -3638 -592 7566 -1833 -5189 5588
935 5588 1446 -4558 3893 2250 -6968 1396 6074 -4434 -1877 4783 -4275 -3738 6460 -995 -6853
950 -6853 2783 973 -6127 2220 3198 -7827 -1982 5582 -3949 -3777 3870 -3934 -6191 4940 953
965 953 -7791 927 1607 -6484 1003 4766 -6393 -3954 4711 -2377 -4407 4317 -2305 -7179 3487
980 3487 2922 -6364 -219 2770 -5987 -534 6028 -3949 -5473 4357 -979 -4326 4309 580 -7464
995g464R520K868r276L588M714q759K791R184q053m604R488l238n220R129j295
1010C373j0078P112N517q757K050O232q622k74J0639n436o492Q066j008o840Q448
1025C930J813j0762L749P176p098J00P520p608l683J0735k234p461O550M59q041
1040d855P038N033j0611O32P878o196j529Q679o011o685R605J230q245M868K666
1055C497q977M537P315p946k652Q186m827l459R292k967q868P434L592q389M220
1070a2M368r304J252R348o312m289P791l421n332Q926L85r801M346N302p361J978
1086b136O291q353k170R888l149n816O873j149p474P848L478r752K610O366o641
1101c286N16Q072o883n158R579r88o416O415P48q650N449O268q767l12O892n848
$$ plain form
995 -7464 2056 4924 -4352 -764 3950 -4809 -2018 7166 -887 -5491 3997 759 -4461 4668 3373
1010 3373 -6705 407 5924 -2833 -783 5449 -3173 -3447 7192 1756 -4736 3330 2322 -4518 3930
1025 3930 5743 -5019 -1270 5906 -1192 -1092 6428 -1180 -4863 5872 3638 -3823 2727 3186 -4855
1040 -4855 2183 7216 -3395 -2763 5115 -1081 -2610 6069 58 -6627 2978 4208 -4037 831 3497
1055 3497 -5480 -943 6372 -1574 -4226 3960 -867 -4326 4966 1999 -6869 565 4157 -4232 -12
1070 -12 4356 -4948 -3696 5652 -660 -4949 2842 -579 -5911 3015 3400 -6401 -2055 3247 -4114 -2136
1086 -2136 4155 -4198 -6368 3520 371 -5445 1428 279 -7195 653 4131 -5621 -3011 3355 -3286
1101 -3286 -2770 5302 -1581 -6739 2840 1852 -4564 1851 2599 -6051 -602 5666 -3101 -3413 3479 -2369
1117b369j503Q954m161p234P566J547p275N267L120r425K601Q351o488k005O788
1132C734m706m180R339p98q635N722L432p181L935N400q725o44Q973m132m171
1147b637P088k727o507Q224K175q759L218M638p336J948P300p475l365Q266k309
1162A742n073O960j148p923O093M866q050J107N843p061j57Q304m708n679P813
1177B929n93o271O604J806r215L694O378o843l89O487n719k998R104k626o991
1192d643N761J044o744N065M001q458Q69O979n624j910P178m326n439Q471P1p352
1208e057M809K813p618L538O201p380j805P231l334l567P498k173o669O350K938
1223C775p161K833M424p354Q51P611n776l567P102k231n421P201K20p857M562
$$ plain form
1117 -2369 -3872 5082 921 -6313 1253 2800 -4475 792 3912 -5513 -2912 5439 -1049 -3054 3734
1132 3734 -972 -5152 4187 3389 -5246 476 3908 -3273 662 6062 -2663 -3307 5666 1534 -2637
1147 -2637 4451 1724 -4783 3441 5616 -3143 75 4713 -2623 -675 6625 -850 -4215 4051 1742
1162 1742 -3331 3629 2481 -5442 651 5517 -2533 -1426 4417 -2644 -2801 5503 795 -4884 2929
1177 2929 2336 -3935 2669 4475 -4740 -1046 5332 -1511 -1900 4587 -1132 -4130 4974 2348 -4643
1192 -4643 1118 2162 -4582 483 4484 -3974 -3105 3874 -1750 -3660 3518 -808 -6247 2224 2295 -5057
1208 -5057 -248 2565 -5053 -1515 4686 -2694 -4499 2732 -602 -4169 3329 1156 -5513 837 3775
1223 3775 -3386 -553 3871 -3483 -2632 4979 -797 -4364 2738 507 -4914 2287 2507 -5350 -788
1238g88M522o779J487N613o849j622Q257l082n565O999r25n858N580L013q004
1253d001K555O078o493mP025m795m501Q228j386n952N444J555o989L875M925p443
1269a879K34O295n554k061P734l062n682O641O52o958M506L279p826K073O398
1284D790n817j620O925l599m648P386o01o537N349K805p331L228M835o975k89
1299b099P192m586l413P135k043n705O076J700p701L453M291o840R83O328n767
1314i96k526O996k556n634O658O6o805M841L266p020J955N643o263o72O404l484
1330a27m125O940r09n949N470K255p287K831M870o273K28O149m758l308P398k023
1346A382n671N493R01o622M160L513o620J191N995n723j949O797l001m779O443
$$ plain form
1238 -788 3734 -3045 -1558 4055 -2794 -4416 3841 759 -4806 2193 1268 -4590 990 4003 -4001
1253 -4001 -1446 4632 -1861 -1865 5160 365 -4136 4092 2706 -3246 2198 3753 -3236 639 5564 -1879
1269 -1879 -1645 4650 -904 -2965 4769 1707 -3975 2666 3318 -3640 866 4145 -3681 -1608 4790
1284 4790 -1027 -2647 4278 679 -3969 3417 2816 -3721 1628 4433 -2898 330 5165 -1810 -2099
1299 -2099 5093 507 -2906 4229 2186 -3519 2557 4257 -3444 9 4300 -2540 -1557 4771 -996
1314 -996 -3522 3474 918 -4716 1942 2008 -4797 44 3310 -3710 -1755 3888 -2375 -3047 3357 -127
1330 -127 -4252 2688 1779 -4170 1300 3555 -3732 -901 3969 -2304 -2076 4073 -685 -3993 3405 1382
1346 1382 -4289 1204 2105 -4517 -357 3156 -3464 -2273 3722 -2001 -3950 2847 -154 -4933 1510
1361A510p5o457N260K634o714K159N168n700p39O443m071l375O938j090o044N062
1377I09K085o588L469M422o266l4O321m638k478O596k496n703O667N94o150L647
1393C57L207o778J572O096n843j375N945k594l887O443o72o210M766K710o126
1408b389K023M738n724p6O401m171l554O368j390n394N724J114o635L369M197
1423D601o285M53O046n473k558P048k359m659N405j94n809M293L500o881J022
1438a850N292m705j366O607l964m243O645n37n475M626J762o650L315M578n814
1453a779o37N489m265k354O666j592n990N474J373n927L389L242o556N10O345
1468C388m283k272N387k805m119O319k24o013L623L212n575J951M718o006j085
$$ plain form
1361 1510 1435 -5022 238 2872 -3842 -1683 3485 -2215 -2954 3489 -582 -3957 2981 1891 -4153 909
1377 909 2994 -3594 -125 4297 -1969 -2003 4318 -320 -2798 3798 1302 -4401 2266 2860 -3290 357
1393 357 3564 -3214 -1642 4454 -1389 -2764 3181 587 -3300 3143 2471 -3739 1027 3737 -2389
1408 -2389 -366 4372 -1352 -1428 4973 802 -2752 3616 2226 -3168 2556 3670 -2965 404 4601
1423 4601 -1684 -1231 4815 -658 -3216 3832 1473 -3186 2219 2025 -3784 509 4009 -2872 -1850
1438 -1850 3442 -1263 -2629 3978 14 -4229 2416 1879 -3596 1030 2792 -3858 -543 4035 -1779
1453 -1779 -2416 3073 -1192 -3546 3120 1528 -4462 1012 2385 -3542 -153 3089 -3467 -2957 3388
1468 3388 -895 -3167 2220 -585 -4704 1615 1391 -4622 -999 2213 -3362 -1411 3307 -2699 -3784
1483c784O312k923l312N791j217n320N022K574o189K073L645n511P43N965m562
1498f93k950O047j637m034N019J22o304M392L565n782Q82M606m765j521O643k824
1514G66m655N476J98m773M380K022o278J948M797m591r22N197l705k776O366q39
1530B611n252L970J495n392L152L865n949k51N524l559k119N309k410m355N347
1545A986J331n618K784K691n456J620M797n027k201N728j976l284N433q39n576
1560c607L853K874n502J860L641n397o6O006l503l335M942j392l670N118P23n889
1576c344K407M006m875M13L969m210j913N750j718l841M445k1m708L556K849n784
1592c019Q49M407m016n02N241l515l519N348J83m889M059P73n097K788M215n187
$$ plain form
1483 -3784 2528 -395 -3707 2084 867 -4453 569 3143 -3046 -973 2672 -2839 -2096 3869 -693
1498 -693 -3643 2404 767 -3267 1752 1874 -4430 -38 3527 -2255 -1373 3233 -1532 -3053 3590 766
1514 766 -3889 1587 1785 -2988 1392 3414 -2864 -916 3881 -710 -1632 3565 -140 -2916 3450 2611
1530 2611 -2641 1329 2824 -2568 584 4449 -1500 -1751 3773 214 -1905 3404 994 -3361 1986
1545 1986 3317 -2301 483 3174 -2282 -662 4135 -892 -3093 2635 659 -2625 2808 1969 -3607
1560 -3607 246 3120 -2382 -522 3119 -2278 -2344 3662 159 -3176 1766 374 -3296 1822 2545 -3344
1576 -3344 -937 3069 -1806 -1393 2576 -1634 -3547 2203 485 -3356 1089 1068 -3640 -84 2765 -3019
1592 -3019 -2170 2237 -1779 -2281 2960 -555 -4074 1274 1457 -3432 627 1400 -3697 -909 3306 -1881
1608a881p97M749l403j590N558j821m656M947J093m646K530K341n328P68N368
1623C232l848j757M846k202l364N301J89n755L624K113m292J906L839n186j123
1638b477N571k399l032M750j263l972M716J608n367J347L487m796Q75M569l633
1653a6k307N167j252l558M031N17n370L550L049m982P96L656m100r29N437k626
1669A063m137M810N19m380L530J564n647J782M263l986r19M155l224k124N490
1684B759r46m649L689J245m814K789L224n272K71M610l704j069M148k175l442
1699c336M957N16m583K688J717m321J610L825m594j088M581k078k218M062p60
1714I78m583L605K130m760J804K937m296L23M408k852k829M647j312l760M376
$$ plain form
1608 -1881 -2678 2071 -1332 -2922 2636 815 -3841 1106 2199 -2447 83 2424 -2904 -2136 3232
1623 3232 -616 -2373 2473 271 -3093 2208 2397 -3358 266 2379 -1913 -7 3832 -1354 -2477
1638 -2477 3094 695 -2337 2413 1150 -2822 1894 3502 -1865 -518 2969 -1827 -952 3617 -16
1653 -16 -2323 2844 1592 -1966 2065 2582 -2788 762 3811 -1171 -375 3281 -819 -1748 3689 1063
1669 1063 -3074 1736 2255 -2125 1405 2969 -2678 -896 3367 -619 -1538 2617 -607 -2731 2759
1684 2759 1813 -2836 853 2098 -2716 73 3297 -1975 -1704 2906 -798 -1867 2281 106 -3336
1699 -3336 1621 2137 -2446 242 1959 -2362 -752 3073 -1521 -2609 1972 -106 -2324 1738 978
1714 978 -3605 0 2130 -2630 -826 2111 -2185 -1862 2546 -306 -3135 1512 200 -3560 816
1729H16P98m991K809K934m195M70L641l729j314N171j798l419L930M67m350L101
1745C41J845m584J285L712l511q34M342k147l285M530k68m096L796Q97m336J899
1761d14L808m362k61L691l170j087M538j817l641M185Q72m280K509J956m346R90
1777h29M216l561j519M354j908k740M242k19m344K979K011m078J285L285l937
1792g63p82M458k420k505L915m63l832L422J623m532J745K861m208J40M245l130
1808b26k065M803j241l412L355K06l928K688K025l665P98L067l320j128M596k063
1824D90l241M032j65l810L354J300m081J129L398l712p90L975k745j736M315j127
1840E86l359L278P48m036J832K727l826M67L793l142j348M316k294k649L599K49
$$ plain form
1729 816 1614 -3377 -568 2366 -1829 -1359 2282 -1447 -2761 2410 612 -2807 1123 1590 -2760 341
1745 341 2186 -2398 -1113 2599 -912 -1746 2596 449 -2836 1694 1426 -2670 1126 2023 -2313 -414
1761 -414 3394 -968 -1229 2462 -708 -1795 2743 926 -2715 1470 2342 -1938 571 2527 -1819 -829
1777 -829 3387 -174 -1693 2661 753 -1987 2255 2036 -2308 671 2682 -1396 -111 3174 -763
1792 -763 -1545 2913 493 -2012 1903 1440 -2392 1030 2653 -1879 -134 2727 -1481 -1341 2904 -226
1808 -226 -2291 2512 1271 -2141 1214 1420 -2508 180 2205 -1460 -662 2405 -915 -2043 2553 490
1824 490 -2751 1281 1116 -2694 660 1960 -2121 -992 2406 -1306 -2096 1879 -866 -2602 1713 586
1840 586 -2773 505 1253 -2783 -951 1776 -2050 -1583 2210 -932 -2280 2036 -258 -2907 692 941
1856I41l506K704J809l595L92L634l022j125L607k000k474M015j91l638K676J437
1872A664l535J232K624l541l49M408k499k133L724j195k791L546O16l862K071
1887b0K587l934O79L321k987j578L930j216k459L797l70l587K110J926l209N05
1903e05K767k761o55M047k364k314L220k86k922K788J103l802J426L073l465p4
1919g24K826k323j739L890q11k777K798P30l844K180K337m110N13L373k679j002
1935a362L547j950k151L093K37l562K544J522l973J657K714l333n77L109j846
1950c31j770L442o02l440L002J151l464J403K237l741L91L700k351j594L135j117
1966E1k416L236K83l699J971K334l426N77K974k904q85L631j586k366K965m28
$$ plain form
1856 941 -2565 139 1948 -1647 -1255 2379 -643 -1768 1839 -161 -2635 1380 1189 -2449 227 1664
1872 1664 -1871 -639 1985 -1556 -1905 2503 4 -2129 1595 400 -2391 1155 1771 -2091 -20
1887 -20 2567 -1367 -688 2633 -354 -1932 1998 782 -1677 2120 1750 -1837 273 2199 -1010 -505
1903 -505 2262 -499 -1154 2893 529 -1785 1435 1149 -1773 1015 2118 -1684 -258 2815 -650 -724
1919 -724 2102 -221 -1960 1930 1119 -1658 1140 1870 -1974 206 2543 -1567 -1054 2319 -360 -1362
1935 -1362 2185 235 -1916 1177 1414 -2148 396 1918 -2055 -398 2316 -1017 -1594 1515 -331
1950 -331 -2101 1341 739 -2701 301 1452 -2012 -609 1628 -2113 -1722 1978 -373 -1967 1168 51
1966 51 -2365 871 1154 -2545 -574 1760 -1666 -1089 1885 -1019 -1904 1727 141 -2225 740 312
1982C12k861K719J477l627J428J724k486k16L277k350j695L208j13k565K372L39
1998I43l243J818K590l072k06K880k206q45L396j433k850L117K81k812K177J589
2014B124l475Q91K534k435q03L272k071j551L224k46l204J966J464l219J457K358
2030B286l342m61L709j921j522L097j172k743K801P17k938J644J496k440N46K593
2046B350k894j083L207r07j988K973j98l268J867J895k780M91K263k737k79L302
2062B214j966j877K838n05k423K140R94l411J382K570k741l35K785k314j464L552
2078A439j016k525K506P01l002K134J326l095J33K846k133q65L243j748k170L118
2094H92j11l091K274J044k739J110K784k954n86K623j601j393K827q99k491K616
$$ plain form
1982 312 -2549 170 1647 -1980 -552 1172 -1314 -1530 1747 -603 -2298 910 797 -1768 604 943
1998 943 -2300 -482 2108 -964 -1170 1710 -496 -1341 2055 622 -2228 889 1170 -1642 535 2124
2014 2124 -1351 -460 2074 -361 -1164 2108 37 -1514 1710 1464 -1740 226 1690 -1529 -72 2286
2030 2286 -1056 -1517 2192 271 -1251 1846 674 -2069 732 1449 -1489 155 1651 -789 -243 2350
2046 2350 -544 -1627 1580 673 -1315 1658 1460 -1808 59 1954 -826 -335 1928 -809 -1088 2214
2062 2214 248 -1629 1209 704 -1719 421 1415 -1996 -614 1956 -785 -1120 1665 -649 -2113 1439
2078 1439 423 -2102 404 1105 -1897 237 1563 -1532 -1399 1447 -686 -1551 1692 -56 -2226 892
2094 892 781 -2310 -36 1008 -1731 -621 2163 -791 -1377 1246 -355 -1748 1079 180 -2311 305
2110C05J001k734J072J773l166L88K863j936r61K389r08j925L051J4l085J359
$$ plain form
2110 305 1306 -1428 -356 1417 -1749 -1361 1502 -434 -1395 994 86 -1839 1212 1226 -1859 -500
$$ [...]
8191b90
##END NTUPLES=NMR FID
##END=
