##TITLE=1H_TG-2254-1
 DMSO, 8 sc, 
 27.9.2019
##JCAMPDX= 6.0         $$ Bruker NMR JCAMP-DX V2.0
##DATA TYPE= NMR FID
##DATA CLASS= NTUPLES
##ORIGIN= UXNMR, Bruker Analytische Messtechnik GmbH
##OWNER= root
$$ XWIN-NMR		Version 3.5
$$ Fri Sep 27 14:33:38 2019 Russian Standard Time (UT+4h)  she@DPX200
##.OBSERVE FREQUENCY= 200.1315
##.OBSERVE NUCLEUS= ^1H
##.DELAY= (6, 6)
##.ACQUISITION MODE= SIMULTANEOUS
##.ACQUISITION SCHEME= undefined
##.AVERAGES= 8
##.DIGITISER RES= 18
##SPECTROMETER/DATA SYSTEM= spect
##.PULSE SEQUENCE= zg30
##.SOLVENT NAME= Acetone
##.SHIFT REFERENCE= (INTERNAL, Acetone, 0, 15.7039)
##AUDIT TRAIL= $$ (NUMBER, WHEN, WHO, WHERE, WHAT)
$$ ##TITLE= Audit trail, XWIN-NMR		Version 3.5
$$ ##JCAMPDX= 5.01
$$ ##ORIGIN= Bruker BioSpin GmbH
$$ ##OWNER= she
$$ F:/spectra/data/she/nmr/H-F/1/audita.txt
$$ ##AUDIT TRAIL=  $$ (NUMBER, WHEN, WHO, WHERE, WHAT)
(   1,<2019-09-27 14:32:21.28 +0400>,<she>,<DPX200>,
      <created by zg, POWCHK disabled, PULCHK disabled
       configuration hash MD5:
       00 E9 B6 7A A2 85 ED C7 34 08 36 98 17 FE 4E 26
       data hash MD5: 16K
       CC ED C6 EF FA 37 11 6B 4B ED 0A 42 13 2B 4E 90>)
$$ ##END=
$$ 
$$ hash MD5
$$ 1D 18 3A 8A E6 34 C3 1B C3 26 A9 C3 19 45 43 63
##$RELAX= 
##$RELAX= 
##$RELAX= 
##$RELAX= 
##$RELAX= 
##$RELAX= 
$$ Bruker specific parameters
$$ --------------------------
##$DU= <F:/spectra>
##$EXPNO= 1
##$NAME= <H-F>
##$PROCNO= 1
##$TYPE= <nmr>
##$USER= <she>
##$AMP= (0..31)
100 100 100 100 100 100 100 100 100 100 100 100 100 100 100 100 100 100 
100 100 100 100 100 100 100 100 100 100 100 100 100 100 
##$AQSEQ= 0
##$AQ_mod= 1
##$AUNM= <au_zg>
##$AUTOPOS= <>
##$BF1= 200.13
##$BF2= 200.13
##$BF3= 200.13
##$BF4= 200.13
##$BF5= 200.13
##$BF6= 200.13
##$BF7= 200.13
##$BF8= 200.13
##$BYTORDA= 1
##$CFDGTYP= 0
##$CFRGTYP= 5
##$CHEMSTR= <none>
##$CNST= (0..31)
1 1 145 1 1 1 1 1 1 1 1 1 1 1 1 1 1 1 1 1 1 1 1 1 1 1 1 1 1 1 1 1 
##$CPDPRG= <>
##$CPDPRG1= <>
##$CPDPRG2= <>
##$CPDPRG3= <>
##$CPDPRG4= <mlev>
##$CPDPRG5= <mlev>
##$CPDPRG6= <mlev>
##$CPDPRG7= <mlev>
##$CPDPRG8= <mlev>
##$CPDPRGB= <>
##$CPDPRGT= <>
##$D= (0..31)
0 1.2 0 0 0 0 0 0 0 0.06 0 0.03 0 0 0 0 0.0002 0 0 0 0 0 0 0 0 0 0 0 0 
0 0 0 
##$DATE= 1569580340
##$DBL= (0..7)
120 120 120 120 120 120 120 120 
##$DBP= (0..7)
150 150 150 150 150 150 150 150 
##$DBP07= 0
##$DBPNAM0= <>
##$DBPNAM1= <>
##$DBPNAM2= <>
##$DBPNAM3= <>
##$DBPNAM4= <>
##$DBPNAM5= <>
##$DBPNAM6= <>
##$DBPNAM7= <>
##$DBPOAL= (0..7)
0.5 0.5 0.5 0.5 0.5 0.5 0.5 0.5 
##$DBPOFFS= (0..7)
0 0 0 0 0 0 0 0 
##$DE= 6
##$DECBNUC= <off>
##$DECIM= 24
##$DECNUC= <off>
##$DECSTAT= 4
##$DIGMOD= 1
##$DIGTYP= 9
##$DL= (0..7)
0 120 120 120 120 120 120 120 
##$DP= (0..7)
150 150 150 150 150 150 150 150 
##$DP07= 0
##$DPNAME0= <>
##$DPNAME1= <>
##$DPNAME2= <>
##$DPNAME3= <>
##$DPNAME4= <>
##$DPNAME5= <>
##$DPNAME6= <>
##$DPNAME7= <>
##$DPOAL= (0..7)
0.5 0.5 0.5 0.5 0.5 0.5 0.5 0.5 
##$DPOFFS= (0..7)
0 0 0 0 0 0 0 0 
##$DQDMODE= 0
##$DR= 18
##$DS= 0
##$DSLIST= <SSSSSSSSSSSSSSS>
$$ [...]
##$SUBNAM2= <"">
##$SUBNAM3= <"">
##$SUBNAM4= <"">
##$SUBNAM5= <"">
##$SUBNAM6= <"">
##$SUBNAM7= <"">
##$SUBNAM8= <"">
##$SUBNAM9= <"">
##$SW= 24.0689530833862
##$SWIBOX= (0..15)
0 0 2 0 0 0 0 0 0 0 0 0 0 0 0 0 
##$SW_h= 4816.95568400771
##$TD= 16384
##$TD0= 1
##$TE= 0
##$TE2= 300
##$TE3= 300
##$TEG= 300
##$TL= (0..7)
0 120 120 120 120 120 120 120 
##$TP= (0..7)
150 150 150 150 150 150 150 150 
##$TP07= 0
##$TPNAME0= <>
##$TPNAME1= <>
##$TPNAME2= <>
##$TPNAME3= <>
##$TPNAME4= <>
##$TPNAME5= <>
##$TPNAME6= <>
##$TPNAME7= <>
##$TPOAL= (0..7)
0.5 0.5 0.5 0.5 0.5 0.5 0.5 0.5 
##$TPOFFS= (0..7)
0 0 0 0 0 0 0 0 
##$TUNHIN= 0
##$TUNHOUT= 0
##$TUNXOUT= 0
##$USERA1= <user>
##$USERA2= <user>
##$USERA3= <user>
##$USERA4= <user>
##$USERA5= <user>
##$V9= 5
##$VALIST= <valist>
##$VCLIST= <CCCCCCCCCCCCCCC>
##$VD= 0
##$VDLIST= <DDDDDDDDDDDDDDD>
##$VPLIST= <PPPPPPPPPPPPPPP>
##$VTLIST= <TTTTTTTTTTTTTTT>
##$WBST= 1024
##$WBSW= 4
##$XGAIN= (0..3)
0 0 0 0 
##$XL= 0
##$YL= 0
##$YMAX_a= 43283
##$YMIN_a= -68477
##$ZGOPTNS= <>
##$ZL1= 120
##$ZL2= 120
##$ZL3= 120
##$ZL4= 120
##$ABSF1= 10
##$ABSF2= 0
##$ABSG= 5
##$ABSL= 3
##$ALPHA= 0
##$AQORDER= 0
##$ASSFAC= 0
##$ASSFACI= 0
##$ASSFACX= 0
##$ASSWID= 0
##$AUNMP= <proc_1d>
##$AZFE= 0.1
##$AZFW= 0.1
##$BCFW= 1
##$BC_mod= 2
##$BYTORDP= 1
##$COROFFS= 0
##$CY= 11.3945322036743
##$DATMOD= 1
##$DC= 2
##$DFILT= <>
##$DTYPP= 0
##$F1P= 20.1720416913024
##$F2P= 0.152960286110954
##$FCOR= 0.5
##$FTSIZE= 0
##$FT_mod= 4
##$GAMMA= 1
##$GB= 0.15
##$INTBC= 1
##$INTSCL= 1
##$ISEN= 128
##$LB= 0.24
##$LEV0= 0
##$LPBIN= 0
##$MAXI= 10000
##$MC2= 0
##$MEAN= 0
##$ME_mod= 0
##$MI= 1.114404
##$NCOEF= 0
##$NC_proc= 0
##$NLEV= 6
##$NOISF1= 3.799351
##$NOISF2= 2.8
##$NSP= 1
##$NTH_PI= 0
##$NZP= 0
##$OFFSET= 15.70392
##$PC= 1
##$PHC0= -9587.34
##$PHC1= 48.00095
##$PH_mod= 1
##$PKNL= yes
##$PPARMOD= 0
##$PSCAL= 0
##$PSIGN= 0
##$REVERSE= no
##$SF= 200.130013532006
##$SI= 16384
##$SIGF1= 3
##$SIGF2= 2
##$SINO= 400
##$SIOLD= 16384
##$SREGLST= <1H.CDCl3>
##$SSB= 0
##$STSI= 0
##$STSR= 0
##$SW_p= 3612.71676300578
##$SYMM= 0
##$S_DEV= 0
##$TDeff= 0
##$TDoff= 0
##$TI= <>
##$TILT= no
##$TM1= 0
##$TM2= 0
##$TOPLEV= 0
##$USERP1= <user>
##$USERP2= <user>
##$USERP3= <user>
##$USERP4= <user>
##$USERP5= <user>
##$WDW= 1
##$XDIM= 8192
##$YMAX_p= 0
##$YMIN_p= 0
$$ End of Bruker specific parameters
$$ ---------------------------------
##NTUPLES= NMR FID
##VAR_NAME=  TIME,          FID/REAL,        FID/IMAG
##SYMBOL=    X,             R,               I
##VAR_TYPE=  INDEPENDENT,   DEPENDENT,       DEPENDENT
##VAR_FORM=  AFFN,          ASDF,            ASDF
##VAR_DIM=   8192,          8192,            8192
##UNITS=     SECONDS,       ARBITRARY UNITS, ARBITRARY UNITS
##FACTOR=    0.0002076,     1,               1
##FIRST=     0,             0,               0
##LAST=      1.7004516,     0,               0
##MIN=       0,             -68477,          0
##MAX=       1.7004516,     43283,           0
$$ Real data points
##PAGE= N=1
##DATA TABLE= (X++(R..R)), XYDATA
0@%%%%%%%%%%Qj6J6j6J6k3L1l2L9m7N5o4P2q6J00j14J30j49J68j86K10k39K70
33A43l03L37l74M16m62N14n71O33p01P75q59R52j054J170j301J450j623J827k069
52a100K362k727L195l820M706o068Q461j3930N1307Q97o3907J6520K4093K3012
66D3001j1521k4466j3610K5404J1730j4514j6323J003J890N197j087o916l11M932
80D409j1756n269J6647J5149p251j4071j1653L942K0358Q144j8266j0511J2748
93B620J1874j545r704j1214N559J9561J939j7299o406N101J542r65k306k833R280
108E204J1392j0803j6512J241R444N428l64r770o949J1168J0545o400p222K689
122i09L468M835J223r540o373P095M166j801N779N857l906o313n147j854J0279
$$ plain form
0 0 0 0 0 0 0 0 0 0 0 0 8 -8 8 -8 8 -15 16 -16 23 -24 31 -33 39 -47 53 -61 69 -80 88 -98 112 -127 143
33 143 -160 177 -197 219 -243 271 -300 333 -368 407 -452 500 -554 616 -685 765 -858 969 -1100
52 -1100 1262 -1465 1730 -2090 2616 -3452 5009 -8921 42386 43283 -20624 -4104 19989 43001
66 43001 31480 7014 -6596 18808 30538 16024 -299 704 2594 7791 6704 -212 -523 4409
80 4409 -7347 -12616 4031 19180 11929 -2142 -13795 -9853 10505 18649 383 -10128 2620
93 2620 14494 12949 3245 -7969 -2410 17151 19090 1791 -4615 486 2028 1063 -1243 -4076 5204
108 5204 16596 5793 -10719 -9478 -34 5394 5030 -4740 -11689 -521 10024 3624 -3598 -909
122 -909 2559 7394 8617 -923 -7296 -201 3965 2164 7943 13800 9894 3581 -1566 -3420 6859
137F859R714r597j2730M137J1220M548n399j3881m518J7082J3646j1996j7128
150h043l119P748J1994L243j2071q539Q688O180n058l224R36N30K780j374n552
165d881K507O770n153n715O369P928O85n502j2012m419J3428J0397q162r565K795
180d530O870M391l207j1301k108J1565L891q673l985L533L979L294l377n839N527
195C0Q901n560j1596K9P516P058J852r016p731P743R324m723p136m99K205M692
211C089K122p661l644N666J512l416K839M475j259l202m216k960P714Q991n873
226D177j1010J212Q947O332l44j1361p350R169J0402m682r761l502K976R017N258
241I480p558o782L594K338l610O9J021k52J793n58l262L722O165l995o853J093
$$ plain form
137 6859 16573 6976 -5754 -1617 9603 14151 8752 -5129 -9647 7435 21081 9085 -8043
150 -8043 -11162 -3414 8580 11823 -248 -8787 -99 6081 1023 -2201 -1265 -735 2045 671 -4881
165 -4881 -2374 4396 -757 -6472 -103 7825 8510 3008 -9004 -13423 5 10402 2240 -7325 -4530
180 -4530 2340 6731 3524 -7777 -9885 1680 5571 -3102 -7087 -3554 425 3719 342 -5497 30
195 30 8931 3371 -8225 -8196 -680 6378 8230 -786 -8517 -774 8550 3827 -3309 -3808 -1603 3089
211 3089 5211 -2450 -6094 -428 1084 -2332 507 4982 3723 521 -3695 -6655 1059 10050 4177
226 4177 -6833 -5621 3326 9658 9314 -2047 -9397 -228 10174 5492 -4269 -7771 -4795 4222 9480
241 9480 1922 -4860 -1266 1072 -2538 -2469 -1448 -1700 93 -465 -3727 -5 6160 2165 -4688 -3595
257c595M762L197M39p403n580Q118Q600m027o117p87J502M529O98o520k675O935
273B076K348n671k106J860L246K998k628p198K894Q628j487p843k740K058O635
288C070N392n272q270L298O579j324l586k001j670L269L441l505j412M876O8n300
304b347N50K502J119K51l907n085N565R394j654q247k012K368N708L339o896p797
320g149M293Q236m86m005l548r10M867L724m714l865K853J631k902L60R31k03
336h87J827q55m309K817O374j933n045j554J516L245L244m575n471M557O660j482
352D129l435j888r14L146K060m619k567N155J857k246r41K20Q15K330k155n964
368e017J230O494L51l991j695Q1L841L921l469o804K015M622k49r99j135j968
$$ plain form
257 -3595 1167 4364 4803 -2600 -8180 -62 8538 4511 -1606 -2393 -891 3638 4336 -2184 -4859 2076
273 2076 4424 -1247 -3353 -1493 1753 4751 2123 -5075 -2181 6447 4960 -2883 -5623 -3565 3070
288 3070 8462 3190 -5080 -1782 4797 3473 -113 -2114 -3784 -515 2926 -579 -1991 2885 2953 -2347
304 -2347 -1797 705 1824 2075 -1832 -6917 -1352 8042 6388 -1859 -3871 -1503 4205 7544 648 -7149
320 -7149 -2856 5380 4894 889 -2659 -3569 1298 5022 308 -3557 -704 927 -1975 -1615 -684 -887
336 -887 940 85 -4224 -1407 4967 3034 -2011 -3565 -2049 1196 4440 -135 -5606 -1049 5611 4129
352 4129 694 -1194 -2108 1038 3098 -1521 -4088 1067 2924 678 -263 -43 772 3102 947 -5017
368 -5017 -3787 2707 3058 -933 -2628 -2547 1294 5215 1746 -5058 -3043 1579 1330 331 -804 -2772
384b772K908K841l114j531L498N64k634K4O50L77K739k091n296K235O223J89m193
401F17k159q84L166L593l623o290J906M660J78o31j424j818K596K209l801k211
417c916L351J158k032R9N49J027L434j082n480K25M572R30k021j639j759K395
433a89M414j800m794R89K176m05k09r9k012J344J733k801m14L780M40k945o90
450a482N32J227L108j169o064N36N657Q89k089j913j819K532M489j975n252j34
466b927K511L48P85p35k254J848K785k392j594J770L52j879P97j41RK840q7l938
484a902J068L649j303j730p85j101J933K633j983l865K073K749j157j279j066
499b066j030K722J990l592k244L103J535j22r32j338k79L907J425l750j284J642
$$ plain form
384 -2772 136 2977 -137 -1668 1830 2394 -240 -216 434 811 3550 1459 -3837 -1602 4621 4810 617
401 617 -1542 -2426 740 4333 710 -5580 -3674 986 1164 533 -891 -2709 -113 2096 -1705 -3916
417 -3916 -565 593 -1439 -1340 -791 236 3670 2588 -2892 -2667 1905 2835 814 -825 -2584 -189
433 -189 4225 2425 -2369 -1380 796 391 182 83 -1929 -585 1148 -1653 -2067 1713 2153 -792 -1482
450 -1482 -950 277 3385 2216 -3848 -3312 2345 3234 1145 -768 -2587 -55 4434 2459 -2793 -2927
466 -2927 -416 -68 717 -18 -2272 -424 2361 -31 -1625 145 497 -1382 -585 -726 -717 2123 2036 -1902
484 -1902 -834 2815 1512 -218 -1003 -2104 -171 2462 479 -3386 -1313 1436 279 -1000 -2066
499 -2066 -3096 -374 1616 -1976 -4220 -1117 418 296 -636 -1974 -2253 1654 3079 -671 -1955 -313
515c13N45P00M77k081k29K977m28k094J200J16k241J80R11j163J491O83k829l76
533b474L509L96k188j048j452J128L767j88m151j55L339J105j84j295k676N36
549b031L724J0k960J4J219p0J520m64k621Q52J744j591m87J514r18j219J029J13
567f22o33J668l0k745O67K487r90j014n50n76J487K078j191k520K020J631k63
584I04m04j520j160K440K229k126j946J754J322M1M09k332j902K596R21j418m47
601f39j29p12J138J750j736j245R11m22r13K047L96k276M32J032m9J758J48k643
619a152q39L067P56m20k68k276m12L703P34k884j177J242J55J095k09k957o73
636b515K411K2r46J51k81k23J328q7j345K02J488j169j33J138l80q4K017n47r66
$$ plain form
515 -313 232 932 1409 -672 -901 2076 1648 -446 754 870 -1371 -1191 -280 -1443 48 731 -2098 -2474
533 -2474 1035 1431 -757 -1805 -3257 -2129 1638 1450 -2701 -2856 483 1588 1404 109 -2567 -2031
549 -2031 1693 1703 -1257 -1243 -24 -94 1426 962 -1659 -807 937 -654 -1141 373 -545 -1764 -735 -622
567 -622 -1255 413 383 -2362 -1695 792 -198 -1212 -1762 -2338 -851 1227 36 -2484 -464 1167 904
584 904 500 -1020 -2180 260 2489 363 -1583 171 1493 1534 1943 -389 -2291 305 1226 -192 -639
601 -639 -768 -1480 -342 1408 -328 -1573 -662 -1084 -1997 50 446 -1830 -1398 -366 -415 1343 1491 -1152
619 -1152 -1991 1076 1832 1412 1144 -1132 -1544 2159 2893 9 -1168 74 229 1324 1115 -1842 -2515
636 -2515 -104 -82 -1028 -877 -1158 -1381 -53 -140 -1485 -1283 205 -964 -1097 41 -339 -423 1594 1047 81
655H1J400k82j788R57J219j290j97M01p13O74J556k081k473J193J444k02m10j615
673b126j262K330K372j781k050O10N47J140J807k246k104J689J501l72Q54n66
689C43k164J033J970k88m95J59k016l15K438P31j936m68L34k19K214J89k686j190
707b366J563O87K41n1j350o37K175Q78j807J33n2n01J163R91k133l04J653J79
725D62o03P19j86r78J053N1j430K89J187p30N05J58j597q1J585K69j180P60r88
744g35j406J495Q32j349k60L04m54J089J473j899j957J187O43O70Q65k036j578
761c116J780K400o62m47q48j492J238K448o90k545K53P16Q24J295n28k531k41
778b146J647L1M31j70k089k67K352Q21n68p15p50n29K448J318j961j046N5P07
$$ plain form
655 81 1481 1199 -589 368 1587 297 100 501 -212 462 2018 -63 -2536 -1343 101 -101 -511 -2126
673 -2126 -3388 -1058 1314 -467 -2517 -1907 -1360 -220 1587 -659 -2763 -1074 427 55 909 343
689 343 -1821 -788 1182 894 399 558 -1458 -1773 665 1396 -540 -1008 -674 -893 1321 1510 -1176 -2366
707 -2366 -803 -116 125 74 -1276 -1913 262 1140 -667 -534 -586 -1087 76 1067 -1066 -1370 283 462
725 462 -141 578 392 -586 467 518 -912 -623 564 -166 339 497 -1100 -1181 404 673 -507 253 -735
744 -735 -2141 -646 186 -1163 -1423 -1119 -1573 -484 989 -910 -2867 -1680 -1037 -367 498 -1538 -3116
761 -3116 -1336 1064 402 -45 -893 -2385 -1147 1301 611 -1934 -1681 -965 -141 1154 626 -1905 -2146
778 -2146 -499 -468 -37 -207 -2296 -2563 -211 610 42 -673 -1423 -1952 496 1814 -147 -1193 -1138 -431
796d31Q43J442j721k080J633Q22n65N81o20j061R15J150j212k80J062q62K67P32
814F15k85r84N76k50m73N22O32n55M30M96j158l68R83k94l88Q09r76j153J394
833d27Q86p96j0k48j193J263J665j493j392J29P95R81J150j110k035N44J709L34
851G52j09o14j627n4K788Pj334l23q79J82K301N45k447j007L35N63J345R23j962
870f15j258J025Q94M41N14j186j499J441J567o51o81L1n58M93J963p54j529K02
888a60n33K55J257M5j527J08N17l09N14Q90j292n34M15K66l87R05n1j235O16Q35
908E95m63N50K13j340k61J317j45k90N10q21q36J331O99o18p30N2r06J027J301
927A185j263p46J02K86P3J545o09j715M0J108qM81L82k129q7J853J95k97J01j170
$$ plain form
796 -431 412 1854 133 -1947 -314 508 -57 524 -96 -1157 -242 908 -304 -584 478 -384 -117 615
814 615 330 -654 -78 -328 -801 -279 353 -202 228 724 -434 -802 181 -113 -501 308 -668 -1821 -427
833 -427 459 -337 -347 -595 -1788 -525 1140 -353 -1745 -1616 -821 160 1310 200 -1835 -1291 418 752
851 752 643 29 -1598 -1652 1136 1143 -191 -514 -1393 -1211 1090 1635 -812 -1819 -1484 -921 424 1347 -615
870 -615 -1873 -848 46 487 1001 -185 -1684 -243 1324 673 -8 23 -535 -42 1921 1167 -362 -160
888 -160 -693 -438 819 864 -663 -555 -38 -347 167 1057 -235 -769 -354 -88 -475 430 379 -856 -240 595
908 595 132 682 895 -445 -706 611 466 176 686 -135 -971 360 1059 441 -289 -237 -1143 -116 1185
927 1185 -78 -824 -722 -436 -363 1182 573 -1142 -1102 6 -2 479 861 -1268 -1355 498 693 396 497 -673
947f73n43J703R91j610l32j37j40J023Q67j123r23M24J88L57J105r62j536P01
965f20P88k85N36j90r87J5J176j78m57N40r05p02J408P06p62j45R6q42R17J053
985A162q82o12L21l61K7J700j30j090n74N20k71P25P04j578n09P00J11L66M90
1004H19r52j145Q00J024j71r4p04j419J263J898p81n86j58n82M69J819m47j728
1022f75n4L31L85R23J50j463p22J170J57L47R2j381q51J447P94q98M23l09j213
1041a347J007J386n13r05J77l83L50J247Mj269P4L87l11J206oj367m05Q32k53
1060h9M54K59o98p70N31L15k64J57N7r22J91J400l86l36K84q56K1J519K10j003
1080G4j93k11k60J161L15j128m13M03j06L92J119j453j055P59N56j23N41o73j233
$$ plain form
947 -673 -1216 487 1478 -132 -464 -601 -741 282 1149 26 -897 -473 -285 72 1177 215 -1321 -620
965 -620 168 -117 419 229 -758 -743 433 255 -202 338 -567 -1269 139 845 83 -62 34 -808 109 1162
985 1162 280 -332 -11 -372 -345 1355 1225 135 -439 81 -190 535 1239 -339 -848 -148 -37 329 819
1004 819 -133 -1278 -478 546 375 281 -423 -1842 -579 1319 538 -48 -206 -788 -319 1500 1053 -675
1022 -675 -729 -398 -13 910 1060 -403 -1125 45 202 549 641 -740 -1591 -144 650 -248 175 -134 -1347
1041 -1347 -340 1046 533 -372 -195 -578 -228 1019 1023 -246 -172 215 -96 1110 1104 -263 -668 164 -89
1060 -89 365 624 -74 -844 -313 2 -262 -105 -48 -970 -779 621 235 -101 183 -673 -652 867 1077 74
1080 74 -119 -330 -590 571 886 -242 -655 -252 -358 34 1153 -300 -1355 -596 -40 -163 378 -295 -1528
1099a528P25J158q6k02l5r30K4J649J13q76k58l6j71J098N03j267JL39k27K40
1119B34P87q14q44L32J52M22N41l09j202K36P82j92j82N29j002l77J464m4m38
1138G5J16o32m07J098Q47o78r39L01o23P64J344n66j088MJ92n0J275m24j257o40
1158a288J206L18K77P7j305n25J296M73l10n25o95k20J234Q78r68p29q1n9R06
1177d0J042r11r70L52N85J76O68n21j191J97J350j61j37L48j491p5J188J78n47
1196D0O3j21m67O37P44r41k79M38n65K53P85m74n98O02Q1k22L14L09m42r8N12
1217E71l54j17P66p94N3K97j47O8N41m01j268O94L92m53N29j36j201Q8J083j3
1237A98k10M1j239K81J324N51j229k56L41MQ94N84j390o98P15O07N0J27o49j144
$$ plain form
1099 -1528 -803 355 269 67 32 -898 -874 775 888 12 -246 -282 -453 645 1148 -119 -118 221 -6 234
1119 234 1021 207 -637 -305 -153 269 810 501 -701 -465 317 125 -57 472 -530 -907 557 513 75
1138 75 191 -441 -848 250 1097 419 -520 -219 -842 -78 1266 700 -388 -384 -192 -242 1033 609 -648 -1288
1158 -1288 -82 236 513 590 -715 -1240 56 529 219 -306 -1001 -1221 13 891 -77 -806 -887 -946 -40
1177 -40 1002 91 -879 -527 58 234 902 381 -810 -613 737 576 439 787 -704 -779 409 587 40
1196 40 103 -18 -485 152 896 -45 -324 114 -451 -198 587 113 -485 117 198 -24 290 599 157 59 571
1217 571 217 100 866 72 125 422 275 343 884 483 -785 -91 301 -152 377 241 -960 -872 211 198
1237 198 -12 29 -1210 -929 395 946 -283 -539 -198 -194 700 1284 -106 -804 -89 518 568 695 46 -1098
1257a098R20Q75l10j92l36q18M78J156k22p10j22k46l2J324j22j027k11O07K00
1276A14N06J7j112l64J229m8j71K53l46o72J006J2n90J71l7m22J41P08k9n98M93
1297B61j71j40NL77m44J25K98p12L93P04o65m35N43l83J25M04K49j015K84K21
1317B4l38O65J22r15k42N84p7O62q3r89m37J179M41p75O5k63m78J183R17j303
1337e8p96P17k03N92J97l46p61J48L80l6L45l6j097J48R56O6o6l78l86j61J261
1358D86M23j174J22k46J25N00O26j047j24M31k71K0O49q33l97J182o8q39R2N10
1378A67p48J72J055m28l02P92n59p27J64M64nJ86p6m28mO49j94k25Q7l46m02R99
1400B91k31j58k22L3k83P30N92r26p74Q23q5Q20J55o53r82Q88J87J64J67n95q97
$$ plain form
1257 -1098 -178 697 387 195 -141 -959 -481 675 453 -257 -379 -625 -657 667 545 -482 -693 -86 114
1276 114 620 637 -475 -839 390 342 171 424 78 -594 412 424 -166 5 -32 -454 -313 395 366 -232 261
1297 261 90 -50 -45 332 -112 13 311 -401 -8 696 31 -404 139 -244 -119 285 534 -481 -197 24
1317 24 -314 351 473 -442 -684 -100 -177 485 402 -587 -1024 155 596 -179 -114 -377 -855 328 1245 -58
1337 -58 -854 -137 -340 252 449 103 -658 -510 -130 -166 179 143 -954 -806 150 216 150 -228 -614 -775 486
1358 486 909 -265 -143 -389 -264 236 862 -185 -309 122 -149 -129 520 -313 -710 472 404 -435 -343 167
1378 167 -581 -409 646 218 -84 708 149 -578 -414 50 45 231 155 -273 -277 372 178 -47 40 -306 -708 291
1400 291 60 -98 -320 -287 -570 160 752 -174 -948 -125 -210 610 765 112 -870 18 205 369 536 -59 -956
1421i56P37P72l19m73n5n72L29J390o08p26j03J69J58O24j42o71k34P93j78L40
1441B75k9m89K55M28K4o4j99m31J04M40J89l82j13L29m93J35L7j64k17L64J13
1462A12m82J97K63j35j15J42p3j88P53k28n45N33k03l33O43K52o72J3L43k92Q4
1483F9N72q69j77L84j6M9J97k76n58M94M85k10n84J32k97K34R52k36p39J31L23
1504F0j43M20P2q04L77L69n19O04j44p33j6J183j05q67L76k28l25N42M56r48m7
1525d20L49J02K11L63o45n20N69L47o03M03j28m47O32Q1l19j75L28l36J55N99
1545E46m51l35K20K99n88N26P6m47J55M73p01n0M05k24k10M97n89K06M56L09n17
1566E6Q9k78k00J64N27n45q3R8K72l85N65j71o80L69L66J08L39j72r27L89O09
$$ plain form
1421 -956 -219 553 234 -239 -294 -866 -537 853 245 -481 -584 -415 -257 367 225 -446 -680 113 -65 275
1441 275 246 -243 12 440 464 400 201 -230 -126 314 503 121 8 337 -156 -21 16 -148 -365 -1 112
1462 112 -370 -173 90 -45 -160 -18 -91 -279 474 246 -299 234 31 -302 341 593 -79 -66 277 -15 69
1483 69 641 -228 -405 -21 -37 12 209 -67 -625 -131 354 144 -440 -308 -605 -371 581 345 -394 -263 60
1504 60 -83 337 409 -395 -18 351 -168 436 292 -441 -457 726 621 -246 130 -98 -423 119 575 -373 -420
1525 -420 -71 31 242 605 -40 -560 9 356 -247 156 28 -419 213 294 -25 -200 128 -208 -53 546
1545 546 95 -240 -20 279 -309 217 293 -154 1 474 -227 -277 128 -96 -306 191 -398 -192 264 573 56
1566 56 145 -133 -333 -169 358 -187 -270 -172 100 -285 280 109 -571 -202 164 272 611 439 -488 -99 510
1587E10p9n62K72o3l68N81K11o65l24L11J38P1N54p55k06L27K11l22K48j04o06
1608f20M77M06k82R0l6O0l50R52q59L10L01m13J59J41J09o95L61j41m20K73K03
1629B6m09L23N21n66N2M98m09l99J73J81M1L9L7k44j84O86r8R4K69m26m61K98
1651D2L05k80K09l09l64M15O18m29l75J66k27J05L42L3l83j68k0J78L44K58n71
1672a11P3M88l89Q7j27N8m03O92l2l99J86M1m58K30L06k28o79N31p1j96N50j06
1694D3k15J6L35n87K02L79n27L03N5J71l44O56r1q08P34j71r8O4J2n34K92L76
1716B63j14j06M7m24j33O60J97p70L70Q6l90O09J74o99kK42j26K51J80q6m02J86
1738A3K7k66N16J6o47M43L15l40m21N19m29J2L34M39o56k7L64l08L58J12n79L09
$$ plain form
1587 510 431 -131 141 78 -290 291 502 -163 -487 -176 -38 33 587 -168 -374 -47 164 -158 90 -14 -620
1608 -620 -143 263 -19 71 35 95 -255 697 -162 148 449 36 195 336 445 -250 111 -30 -450 -177 26
1629 26 -383 -60 461 -105 -53 445 36 -363 -190 -9 32 71 108 -136 -320 366 268 362 631 205 -256 42
1651 42 347 67 276 -33 -397 18 636 207 -168 -2 -229 -124 218 251 -132 -300 -320 -142 202 460 -111
1672 -111 -38 450 61 148 21 79 -324 368 336 -63 123 164 -294 -64 242 14 -665 -134 -205 -401 149 43
1694 43 -172 -156 179 -408 -206 173 -354 -51 4 175 -169 487 396 -412 322 151 53 117 129 -405 -113 263
1716 263 149 43 90 -334 -467 193 390 -380 -10 76 -314 295 469 -230 -232 10 -116 135 315 229 -173 13
1738 13 40 -226 290 306 -341 102 417 77 -344 175 -254 -242 92 531 -125 -152 212 -96 262 374 -205 104
1760A04J75l75J21M01k84j72l40J80K23J15Km60J08N28k65K74L20q48j47M83L10
1781D53m94O61k92n36L48p3O0j20j54j79L11O29p53j53J13K44l05M93M0o96J61
1802b42K09o9J23n5k36k72Q22j0q2J9l80l3L79J18p7l56p3j27M09M41m44l40K71
1825ej26M7L82n3n88j45N17j20M2L40m82j92O66k79k09P15m14k78J90M69o70N27
1847C34K7m95J04N8Kj89J8P4k82M22J72n22P6L09l36K70q4k6pJ92J10m33L86J05
1871B85o75J60N59j53J98j97p22L14N35ml87J26l55J00N04K74q29j86P6J99J88
1892A0K68n80l49N41N7Q7P8l20k56O05M16k86k77mJ9q5M25l83k22L74j81k09L42
1915G0J28l27QL85n30L95P1k90J9K47k6j75M33l0n91J40J58j70K15j33l38K44
$$ plain form
1760 104 279 -96 25 426 142 -30 -370 -190 33 148 150 -310 -202 326 61 335 655 -193 -340 143 453
1781 453 -41 620 328 -208 140 67 127 7 -147 -326 -15 614 -139 -292 -179 65 -240 253 293 -403 -242
1802 -242 -33 -102 21 -34 -270 -542 280 270 188 207 -173 -206 173 291 214 -142 -215 -342 67 508 64 -276 -5
1825 -5 -131 -84 298 245 -343 -488 29 -91 -49 291 -191 -383 283 4 -205 510 96 -182 8 477 -193 334
1847 334 361 -134 -30 28 30 -159 -141 -67 -349 73 245 -277 -201 108 -228 42 -42 -68 -75 117 227 -206 180 285
1871 285 -390 -230 329 176 374 177 -545 -231 304 300 -87 39 -316 -216 288 562 -267 -453 -377 -178 10
1892 10 278 -302 -651 -110 -53 34 112 -208 -464 141 557 271 -6 -10 9 -76 349 -34 -256 118 -63 -272 70
1915 70 198 -129 -121 264 -266 129 200 -90 -71 176 150 -25 408 378 -213 -73 85 -85 130 -3 -341 -97
1937i7Q0J0j0K05l96l52L82M25J84l35l71K09L7M86m02o7k34L90m2M29m46m15
1959c30P2J69J32M04j29n70J9L51J61n6k33o37%R92K65l90n32L22m39J011o9o79
1981a66j98L44L57r0M36m88o27K59K84m81N04j21o12J30P04m00j52L05m22J54
2001b80K47M39n89J18l14L60L21L0l18p3J02jJ68r8N4j43J31m3l37m9M83j17L4
2024A25k35j13J99L09k42k84L8K69K01n1l00l78J91P53k69l81L1K8j03L10M33
2045E31p01L6lJ82N95r0p51l68J96M55O9K63o92m07N07M60m45K18j30j89K54O42
2067F32m35j96K29k67K1N05m49k68K37J25p7k77L21m05K15J66j58K5L9j46j72
2088c35M45R8k73N4j07k48L00K78l32K88J19j78j80K9n5J67q7j88J05Q8O20o37
$$ plain form
1937 -97 -17 -7 -17 188 -208 -560 -178 247 431 96 -275 -66 -29 457 55 -12 -246 144 102 531 85 -330
1959 -330 -258 -89 43 447 318 -252 -233 118 279 223 -10 -647 -647 345 610 220 -312 10 -429 582 513 -166
1981 -166 -364 -20 337 247 683 195 -432 -173 111 -370 134 13 -599 -469 235 -165 -317 -12 -434 -280
2001 -280 -33 406 -183 -65 -379 -19 302 332 14 -59 43 42 210 112 166 23 154 111 -226 -275 208 91 125
2024 125 -110 -223 -24 285 43 -241 -203 66 267 216 -84 -462 -271 482 213 -168 -137 -109 -212 98 531
2045 531 -170 -134 -137 45 640 550 -201 -569 -373 82 151 414 -278 -685 -178 282 -163 55 -75 -264 -10 632
2067 632 197 1 230 -37 -16 489 40 -228 9 134 57 -220 101 -304 -89 77 -81 -56 -17 -163 -335
2088 -335 110 208 -65 -11 -118 -366 -66 212 -120 168 287 109 -71 -42 -97 70 -17 -205 -100 -12 608 -29
2110b9M2k19M5k10M99Mn25J89M36n4J35j98m76J16N72n8k19J81m13j99N11N1j95
2133a4J66n70R1N10L37l52n02K50l95P41L81m72m31L37J17o7J21m03m80M89L98
2154B52j38j23j75M6K0O38m77k42J24j62k41O23Q3o16mL70l25L02M14m30j69K89
2176E9J48L4J29k40k82PP33p08l1N12n08L51j6k44k77N40q2m81K27J44q1N38o59
2199a87k49K38P09k20j38l38j37L02M59N2n87m2q7R9K62k1l47l6K57R0l8K95m52
2222a16n86O77K4K2l54m7R4K62O35j1q33K63j07P4M83j62o76M23K36m24L28L1
2244B36k65j17K85K7k07L12j89o11P08j49o3L3k85J56R0M57n48j60L43lJ51O5
2266B66n5l32M87j15k64l1K55l45J61J26l55J14L24r8l55J23K70k07K04j11q37
$$ plain form
2110 -29 13 -206 -161 -371 128 132 -393 -204 232 178 313 115 -361 -245 327 269 50 231 -182 -381 130 181 -14
2133 -14 152 -418 -327 183 520 168 -334 -84 -479 262 643 171 -260 77 194 127 248 -155 -635 -146 252
2154 252 114 -9 -184 -138 -118 520 43 -199 -75 -237 -478 145 228 -388 -392 -22 -347 -45 369 -61 -230 59
2176 59 207 241 370 130 -152 -145 588 -120 -151 361 -147 204 188 -56 -333 207 125 -356 -129 15 -66 472 -187
2199 -187 -436 -198 511 291 153 -185 -322 -20 439 491 -96 -138 -225 -126 136 115 -232 -268 -11 79 41 336 -116
2222 -116 -702 -25 -1 21 -333 -380 -286 -24 611 600 -233 30 -77 -3 480 318 -358 65 301 -123 205 236
2244 236 -29 -146 139 166 -41 271 82 -529 179 30 -33 0 -285 -129 -39 418 -130 -290 53 50 201 266
2266 266 211 -121 366 251 -13 -44 211 -134 27 153 -202 -88 236 138 -217 -94 176 -31 173 62 -775
2287g75O27J23J04j54J92l50K25K35Mk61Q9K52k86J00J3r6j68L10o38J55N05L0
2309B36n49L08J47O9J8l94J7M7K98j67p9r0J23o0K45k06p9J30k20K88J0L77m12
2332E7j09J2j99Q7L59j87J36m16N1M54M1m52k53M36K92j22k38P0l0n3N50l88k8
2355G0J93j24k74J37P5j83K77l5l22r8M27k12J20m97L65K74J60m3o70p2O74k5
2377B17l59J7r2L29J33k68o5PJ31j11p2K91n9m35M51n04J60K67K6l37R2k06L66
2400b1l9rO1n64O45NJ96j85m37M56J16k13k92M81J01k35j43J84l15J59L08l95
2422a36j67M72rm25J82P8l0L13l3l48k13O24m10K73J11l05p6M37j70j57K39j18
2444A32k97k7J21M06l21J88n77L2N73J42n37O1k49K23K53J65p53J31K73L77q6
$$ plain form
2287 -775 -148 -25 79 -75 117 -233 -8 227 231 -30 59 311 25 125 138 42 -126 184 -454 -299 206 236
2309 236 -313 -5 142 211 229 -165 -148 -101 197 30 -49 -139 -16 -76 169 -37 -116 14 -206 82 92 469 57
2332 57 -52 -40 -239 -152 207 20 156 -260 -209 245 286 -166 -419 17 309 187 -51 19 -11 -64 486 98 70
2355 70 263 139 -135 2 77 -106 171 136 -186 -284 143 -69 51 -446 -81 193 353 310 -360 -432 242 217
2377 217 -142 -125 -217 112 245 -23 -88 -81 50 -61 -133 158 99 -336 115 -389 -229 38 64 -273 -181 -387 -21
2400 -21 -60 -69 -8 -572 73 78 274 89 -348 108 224 11 -281 200 301 66 -77 107 -208 -49 259 -136
2422 -136 -303 169 160 -265 -83 -5 -35 278 245 -103 -316 308 -102 171 282 -23 -99 338 168 11 250 132
2444 132 -165 -192 -71 335 14 202 -375 -343 230 372 -165 -104 -353 -130 123 288 -465 -334 -61 316 230
2465B30k06k39K0N38J73m81K5O1k15l4N6m8K83o5j98j57N52j63k15Q5k71N24m8
2488B07j52l1m06N93m7k86j06L59k6R8J31q09M66J52k61j3j72J06M04J41o85k31
2510e68O82J09j58j02q0k10M88J21n38L05O8n05M23M50l94k95L86q3n36O55j28
2531I0k62K8J15j68L52K33n17k87L59L71j96k4l54j95Q17j26n68J24K90j51K02
2552A33J08l65Q9J83l13j53O04k92r2R0k17m9L61L57p02o6N96r7j33j09L4k7K80
2575B20K10o53K83J45j91k81O05k75O3K13k57m39L66L55j97k80o5J20J37K28o79
2596c72o1J95K89L9L03o10j16N58K58m70P1k23K61nk19L41l93K93l49o2K29L07
2618B64l14j77n8j4O72n06O7l24K08M49k79L9m24nO37l3m15R8L58j61QJ55m51
$$ plain form
2465 230 24 -215 -195 343 516 35 60 121 -94 -128 -72 -120 163 98 -100 -257 295 132 -83 2 -269 255 207
2488 207 55 24 -382 211 164 -122 -228 131 105 203 334 -475 -9 143 -118 -131 -303 -197 207 348 -337 -568
2510 -568 114 223 65 -37 -117 -327 161 282 -256 49 117 -388 35 485 91 -204 182 99 -437 218 90
2531 90 -172 -144 -29 -197 155 388 -129 -416 -57 314 118 94 -260 -455 362 236 -332 -208 82 -69 133
2552 133 241 -124 -35 148 -165 -318 286 -6 -98 -8 -225 -274 87 444 -258 -324 272 175 42 -67 -33 -60 220
2575 220 430 -223 60 205 14 -267 338 63 126 339 82 -357 9 364 167 -113 -178 -58 79 307 -372
2596 -372 -433 -238 51 90 393 -217 -333 225 483 13 84 -139 122 117 -102 239 -154 139 -210 -272 -43 264
2618 264 -50 -227 -285 -299 373 -133 -66 -390 -182 267 -12 27 -397 -402 235 202 -213 -115 243 82 90 245 -206
2641b06L10K8l3l45K12j32P2J62k36k91N84J32l79Oj08O9K49j3J9k73J70j8K27
2664B06n8J52n30K24J76k78L9P65p72l94L84J54J72mm64l06K96O11q20L48r8K42
2686D5K32j37m67J13K01R6j71K17q5r4j47K04O3j51K67l56m70Q84k50J70o4k67
2708a67PR7K12j46k63K26n4L9L34n96J23K81M43m68j07J09l28L56J15m49K06K76
2730B46j26m28L87l7k34L33K34m78J41M12m48k67K51k65K77K15l38O0R8Q8m77
2751c56K56J69k03J21j15R9j89L52j57L5o20K24N54K75k23m57N01l03N2M6p6o1
2773g6j48K68J46k37j14K48k66K99Q4n54K75J09P7k30N34l55n38J68J68K65j46
2794b3k58k97P15L46n14J95j87J85l3R8j96j50L27N2j89k63K71k41K27j3k48M8
$$ plain form
2641 -206 104 132 99 -246 -34 -166 -94 68 -168 -459 125 257 -122 -116 -224 -155 94 81 100 -173 -3 -21 206
2664 206 148 300 -230 -6 170 -108 -69 696 -76 -470 -86 68 240 236 -228 -534 -238 373 -447 -99 -197 45
2686 45 277 140 -327 -214 -13 83 -88 129 44 -50 -197 7 70 -81 186 -170 -640 244 -6 164 100 -167
2708 -167 -160 -63 149 3 -260 -34 -88 -49 285 -311 -188 93 536 68 -39 70 -258 98 213 -236 -30 246
2730 246 120 -308 79 42 -192 141 375 -103 38 450 2 -265 -14 -279 -2 213 -125 -65 33 121 -356
2751 -356 -100 69 -134 -13 -128 -29 -218 134 -23 12 -608 -384 170 445 222 -235 266 -37 15 61 -15 -76
2773 -76 -224 44 190 -47 -161 87 -179 120 204 -350 -75 34 111 -119 415 60 -478 -310 -142 123 -23
2794 -23 -281 -578 137 483 -31 164 -23 162 129 227 31 -119 208 260 71 -192 79 -162 65 52 -196 -148
2816a48K35J39n72K76L5P8M2j20q1L27N1j32j79J12M3m4K40k17l01L99j77m69
2838d63M59o2J14R8k74l48J98M40L17m28n9n9L64P3k95n13M37L01k34n4J48o44
2860d84J68N71M4n66M10K00m76K00J21k97K95o5l18O8N54l67k51p6K45Q9K80n71
2882b26k74K45M50l48J08J08J78k71K16j90l62K64M72n89K67j2j36K99p2l11m2
2903b26L35k82J59J35l60n8L65J95o04K17R4M7PK01k78N1J12m0r4N78k49j29r5
2926H1K62k42o3j79j02j7M78k73L33m21J54k38M28l0l92j26N57k0r2K78k44k58
2948a26K58q9r9J23j98J33q9J63J7p4J82k88l18M03p5n7J3l6J0M11L3k18j00P5
2972E4l74M28j6k91K53L0j50n5M90k02n12J29M3L28j23K82n25j55N27k64K5O0
$$ plain form
2816 -148 87 226 -346 -70 -35 43 85 -35 -116 211 262 130 -49 63 106 62 302 85 -216 183 6 -463
2838 -463 -4 -66 48 146 -128 -476 -278 162 479 51 -8 -67 297 370 75 -438 -1 300 66 12 160 -484
2860 -484 -316 255 299 -267 143 343 -133 67 188 -109 186 121 -197 -129 425 58 -193 -269 -24 65 345 -226
2882 -226 -500 -255 195 -153 -45 63 241 -30 186 -4 -366 -102 370 -219 48 36 -100 199 127 -184 -226
2903 -226 109 -173 -14 121 -239 -297 68 263 -341 -124 -30 17 24 225 -53 -2 110 70 -24 554 305 176 81
2926 81 343 101 38 -141 -243 -260 218 -55 278 -143 11 -227 201 171 -221 -347 210 190 98 376 132 -126
2948 -126 132 43 -56 67 -131 2 -87 76 93 19 201 -87 -405 -2 -77 -134 -121 -157 -147 264 297 79 -21 54
2972 54 -320 108 92 -199 54 84 -66 -121 369 167 -345 -216 -173 155 32 314 -211 -366 161 -103 -78 -18
2994a8k84L30R3j57J19J17k7k85j94N02k79k75N05l16R9K24l10q5J3K37n6K52
3016B05l50j56m0L64m7L1j2j34J84K69l83Q5K5j2O2j6p7pK2J28l44N7L26k39j68
3041b27Q0q5L53j3j4nm59M73J73k75J86l91j96M86J2l41L7K64k65L07j21j80j
3064b02K04k31K84l7O0K0j50j17K48J6j4O7l65R2K1q3J05j13J94J43p3R5o8J58
3088B54m11J38K8o0k27M99k30j23K84j22m02K16J70m1K08j44k43O4L13l30J65
3109FK07m07J98K86k54O4J28j59j5k83N3m9O01o35J7J03M55l30r4N01n96L2J90
3132A9l42K40j60M76l37M45l65n8J03j53L4J81K71m39m9L04j8k86M1J1j1j90K69
3155a4k2L5J90k51j09K47J14l32P8MJ62N8j00r9L8j62L37k89K05K8j60nM2J87
$$ plain form
2994 -18 -302 28 121 -36 83 200 173 -112 -306 196 -83 -358 147 -169 -70 154 -156 -241 -228 9 -47 205
3016 205 -145 -301 -341 23 -24 7 -5 -139 45 314 -69 16 41 29 91 75 -2 -9 13 141 -203 -146 180 -59 -227
3041 -227 -147 -232 121 108 94 89 -370 103 276 1 187 -204 -400 86 98 -243 -206 58 -207 100 -21 -201 -202
3064 -202 2 -229 55 18 78 98 -52 -169 79 95 81 148 -217 -125 -104 -187 -82 -195 -1 142 69 164 96 254
3088 254 -157 -19 9 -51 -278 221 -9 -132 152 30 -372 -156 14 -27 181 37 -206 -142 171 -159 6
3109 6 213 -194 4 290 36 100 228 69 54 -229 -176 -225 376 -259 -242 -139 316 -14 -108 393 -203 -171 19
3132 19 -323 -83 -243 233 -104 341 -24 -82 21 -132 -98 83 354 -85 -134 170 152 -134 -93 -82 -93 -283 -14
3155 -14 -36 -1 189 -62 -171 76 190 -142 -64 -60 102 160 60 -39 -1 -163 174 -115 90 118 -42 -47 -5 182
3179A82j91J60l07M2K51k47j71L8Q2pK09J45m89N4J35K1L20l07K8k65L92P5k02
3202e2K53M9k93K33oj63N3m9K50k38j55J64j16J79q9nN3n9M1k04K29l19K2L64
3226A42m3j73n7j01R6L95j0k84p2O6j08P4L52k97r3J27J43j23L9N5l49J66J18
3249F3p4j08O4j09L69K77n47j20J10J65j37J34r1k3j03j81j3M60k6j47k71L32
3271B4R6k43M39m38J01r0K54m09K09J08k04L00K15k68q4K87j48J0L7J72l55nQ3
3294I1r2P1Q1k69P3K12m79L21J52l46J9J22o9J52J4L7n33K49J54J83j6k62J57
3317B2qJ44r2k58J80O4K06j04n7k65J99j3J19k08J44k31k44P77k41j63N2O9j87
3340i5Q0J04O7j55q5p7J49j03J6K77j06l37K24Q2p1J98j03j98J32J24j23l38K54
$$ plain form
3179 182 -9 151 -156 -114 137 -110 -281 -243 -161 -168 41 186 -303 -249 -114 -93 227 -80 -52 -317 75 150 -52
3202 -52 201 250 -43 190 184 21 74 25 275 37 -118 46 -70 109 20 15 68 9 50 -154 75 -244 -222 142
3226 142 99 -74 -131 -232 -136 259 249 -35 -107 -41 -149 -75 277 -20 -113 14 157 34 73 128 -221 -55 63
3249 63 -11 -119 -55 -164 205 482 -65 -185 -75 90 -47 87 -4 -27 -130 -311 -324 136 110 -37 -308 24
3271 24 120 -123 316 -122 -21 -111 143 -266 -57 51 -153 147 362 94 10 297 149 159 196 368 13 8 91
3294 91 -1 70 151 -118 -45 167 -312 9 161 -185 -166 -44 -113 39 53 90 -443 -194 -40 143 127 -135 22
3317 22 14 158 66 -192 -12 52 258 154 97 -168 31 18 137 -71 73 -158 -402 375 134 -29 23 92 -95
3340 -95 -15 89 156 1 -84 -161 -12 -115 -99 178 72 -265 -41 41 -30 168 65 -133 -1 123 0 -338 -84
3363h4R1J36R1j93j63K85Qk67MJ50K60k71k27M76l56J2J72K4k53Qo4J54J62j42
3387A3k21q1L54L9k45R9n0k4N64k47j47J59j65q2J68m5j7k52J47j21J32j0j62
3410a94L01k02J12J72j87J16n60L39K92Qk58j0J65k70Q0K25k46O3K70j44l32M52
3432A92k87j43L08qK6m7o1lR0K50j03k59O1jl6J01j60MK01mj14K06pl38pj5K21
3459F7k25K26O1l47K97k0l39J53J17J21j56o8M4K75j9m16K84q5N2K3n0l19K09
3482a15Q3M5O5j04J44l99K19L18l00p5K83k73NJ75n0l9j05L32l02P6j27J37qJ01
3506H6Qj99J70P0j99K28n5L54n61L69k31J8q1Q5j46r4K31l5j23j22J75k0K25l26
3530a73K63J06r4k10O1Q8k8L32j31l02J73j84m4O3N8j03j25L59j75J40L01j35
$$ plain form
3363 -84 7 143 234 41 -122 163 171 -96 -92 58 318 47 -180 296 -60 -48 124 148 -105 -97 -161 -7 155 13
3387 13 -208 -289 65 104 -141 -42 -92 -116 448 201 54 213 48 -34 134 89 72 -180 -33 -154 -22 -32 -194
3410 -194 107 -95 17 189 2 118 -442 -103 189 197 -61 -71 94 -176 -96 129 -117 -54 216 72 -260 192
3432 192 -95 -238 70 62 88 41 -20 -23 67 317 214 -45 16 15 -21 80 -80 -76 125 121 7 213 206 -132 -139 -154 67
3459 67 -158 68 129 -218 79 59 -280 -127 -10 111 -45 -113 -69 206 187 -229 55 -30 22 45 -5 -324 -115
3482 -115 -32 13 78 -26 118 -281 -62 256 -44 -119 164 -109 -104 71 21 -18 -123 209 -93 -17 -144 -7 -15 86
3506 86 94 -105 65 135 -64 164 109 463 -98 271 40 58 -23 62 -84 -178 53 18 -105 -227 -52 -72 153 -173
3530 -173 90 196 102 -108 -47 41 13 345 214 -88 85 -99 -143 -80 -22 -125 -250 109 -66 74 375 240
3552B40l23J3K33j95J29k10m1L03O2m38K07j27R5J66k12p4J75p8J33j99J02P4
3574C5j84N0L74o8l28n5K48q6P2q5Qo9L25l97J20k0J88j16K10J1q4k55o3J68l7
3599c8rJ18K44l15L6q5K26J27m46R3N7K7J73k53r6O5J63r9J85J10n73L83j10m4
3623f1K13N7j85m03L43J05j86J93L9l21K8K80j48m12M57p5J4j9n5J49k4j95R9
3646a07j90L49J93m16J60n5r3N8K5rL5K28j94K3j31q5L05K6Qj17k03K90m38N05
3670A67k24j6k08O33o28J94N88o31J72j42L52l24J10O5l67J27K45j17L5J11k47
3691a05j57R3J96J29j62j72m4M17k30RJ4k23M6p5K55Lr8J31N8k67L30l72L71k9
3715A18k33%K05n3j48J05M2k32J89N9l04R3L80j80o9M42o56R9J81J72j54o3J33
$$ plain form
3552 240 -83 -70 163 -32 97 -113 -154 149 211 -227 -20 -147 -52 114 -98 -172 3 -75 58 -141 -39 35
3574 35 -149 -99 275 207 -121 -176 72 -14 58 -27 -19 -88 237 -160 -40 -60 128 12 222 233 149 -106 -169 -1 -38
3599 -38 -47 71 315 0 36 -49 177 304 -142 -49 8 35 208 -45 -141 -76 87 -12 173 283 -290 93 -17 -61
3623 -61 152 209 24 -379 -36 69 -117 76 115 -206 -178 102 -46 -458 -1 -76 -62 -81 -136 13 -11 -206 -107
3646 -107 -297 52 245 -171 -11 -66 -159 -101 -76 -85 -50 178 -16 7 -124 -209 96 122 130 13 -190 100 -338 167
3670 167 -57 -73 -281 352 -276 -82 506 -125 47 -95 257 -67 43 108 -259 -132 113 -4 31 142 -105
3691 -105 -262 -169 27 156 -6 -178 -222 195 -35 -26 -12 -235 -189 -264 -9 -6 -104 27 85 -182 148 -224 147 118
3715 118 -115 -115 90 37 -111 -6 36 -196 -7 52 -252 -159 221 41 -28 414 -242 -143 38 210 56 -7 126
3738A26J80j72q8N7K27m30j15J93q5M28m01k4K6K30m5R2k27j38L32j68K4J36r5
3761F3m07L82j6k14K42L99l04j64J70l35J8K4K75k87J14J47k01j47J90l11L02
3782f0j81L07J57j52p0k5J22l26o9K81l3P9R8k02l3q2J69J37j9O2l98P0N26m64
3806a06m3K02j32l9K9RK09n05L81N0l83J88K24K4r1k05J66q7M98l08J58k11k0
3829Hl2N3J65k55K3L03o05N21n3k36kK45l23R0J18O7l18R9J76j3J11o8j70K46
3853A50k23L1l3L41k70m4L68k27l59K53K50k16kK09l06j31M65k58l50K76L46m21
3875a51J06K81l75J12Q8m8J30k04L11k83Q8K03N1k48j64K28j72N7k3N4j12j82
3897b53N14nl21J72j8N2j95J43j41l0j37M37k38J31J7j44j26J78J65k98m9K51
$$ plain form
3738 126 306 134 46 103 330 -100 -215 -22 -107 321 -80 -104 -78 152 107 199 -28 -166 166 -2 22 158 63
3761 63 -344 38 22 -192 50 449 145 -19 151 -184 -166 -142 133 -154 -40 107 -94 -241 -51 -362 -60
3782 -60 -241 66 223 71 1 -24 98 -228 -297 -16 -49 30 128 -74 -107 -189 -20 117 98 160 -238 -168 358 -106
3806 -106 -149 53 -79 -118 -89 -80 129 -376 5 55 -328 -140 84 108 17 -188 -22 -109 389 81 239 28 8
3829 8 -24 29 194 -61 -38 265 -340 181 128 -108 -110 135 -188 -98 20 87 -231 -132 44 31 142 74 -96 150
3853 150 -73 -42 -75 266 -4 -48 320 93 -266 -13 237 21 19 228 -78 -209 256 -2 -352 -76 270 -151
3875 -151 -45 236 -139 -27 61 13 143 -61 250 -33 55 258 309 61 -103 125 -47 10 -13 41 -71 -253
3897 -253 261 256 -65 107 89 141 -54 89 -52 -82 -219 218 -20 111 128 -16 -142 36 201 -97 -146 105
3919A05k15o0j04J29J58M5l0k54K26j8L5J77j92j90P8K29p3J22k25M1O1l44L93
3942I4N1k35J21j48O8L7j46J84M4j5l2q6o7R9J82J96m35l2J28r3K81k96J06m50
3966d44L83O4Q2L4J4j90j51J40m3M17q5m04K04J61j73O3p6R6j14K08k21k08K94
3989E1j60k2L47k36k62Q3K63o2k3Q1k21J65j31J85k47L95k99l5J52j19R7k7K58
4012B33m57L70k00l1J35J62j80J22Qp3j46R5J13j20j61K25J99j47m3N9j97R8J16
4035A80l58J58J81j04J64j2j95j16M37l44j93K21r3j27K47q3J20l68M8K97j60
4056a00J26q0j80L17m26J10L32J32n15J31M51l39O0kj02J09L1p6k5L11n11J13
4078a33L8L09k13M2J34l20M90l52j72L42J21m51L0J64K4j34K32p1J4q9Q6p0R8
$$ plain form
3919 105 -110 -170 -274 -145 13 58 28 -226 0 -18 17 194 2 -188 -110 119 46 168 -57 -16 45 -299 94
3942 94 145 -90 31 -117 -49 -12 -158 26 70 55 23 -63 -130 -31 151 347 -88 -120 8 -85 196 -100 6 -444
3966 -444 -61 3 85 119 133 -57 -208 -68 -111 306 221 -183 21 182 9 72 -4 92 -22 186 -35 -243 51
3989 51 -109 -131 216 -20 -282 -199 64 2 -21 60 -161 4 -127 58 -189 206 -93 -128 24 -95 2 -25 233
4012 233 -224 146 -54 -85 50 212 32 154 162 89 -57 38 151 31 -130 95 294 147 104 163 -34 64 180
4035 180 -178 -20 161 57 221 209 14 -102 335 -9 -202 19 -74 -201 46 -37 83 -285 -237 60 -100
4056 -100 26 -54 -234 83 -343 -233 99 231 -284 -153 298 -41 19 17 -85 24 55 -21 -46 265 -246 -133
4078 -133 -95 214 1 43 177 -143 347 -5 -177 165 286 -165 -135 29 53 -81 151 80 94 5 91 21 119
4101A19j26j01J1M74m39J05j57P4P0j35K15n23K28K87l21J51l93L31k45M26q0
4122b9p2J59l25K27j03K18k1K03j10j60j57L35k46q1L31p8J07j66ll9M2L7l8n7
4146b6r7R2n8J51n6r1J91j96J61k55M56m92J61K1J24j32O2Q1j49J60J62l58K7
4169f1J6n3P4Q8m1k21L71l57MP1L70m66J50J85j59j0q0R9P7j65Q9q2q7M58k41
4194B9Q3k7J05j88L76n93K7J76P5J12j76m31J58K87l33N90k97j2k08K62Q1j10
4216a4k32K57j95J23K69j67n5M2j66JJ02k0l15L22j28P0M7q7l2R8P9N6j51k56
4240c52K32j1K75j9l38J78P9j05J5n5R1m9OJ79j41pK88l47k90L39o7J45J56k99
4264i7k1n0J68k08M03l80K34J78k18K28k42m5J48k02J59k79M8r5K02m4J18j83
$$ plain form
4101 119 -7 -108 -97 377 -62 43 -114 -40 30 -105 110 -413 -185 102 -219 -68 -461 -130 -375 51 -29
4122 -29 -101 58 -267 -40 -143 75 54 257 147 -13 -170 165 -81 -162 169 91 198 32 29 -10 32 69 31 -26
4146 -26 -123 -31 -89 62 6 -85 106 -90 71 -184 272 -220 -59 -38 86 -46 16 97 -52 108 270 -88 -61
4169 -61 -45 -98 -24 64 23 -198 173 -184 -180 -109 261 -205 -55 130 -29 -39 -119 -20 57 -108 -19 -101 -188 270 29
4194 29 112 85 190 2 378 -215 -188 -12 63 175 -1 -432 -274 13 -320 270 -27 -39 -247 15 96 -14
4216 -14 -246 11 -184 -61 208 41 -14 28 -138 -137 -35 -55 -370 -48 -176 -106 -59 -146 -178 -80 -1 55 -96 -352
4240 -352 -120 -131 144 125 -213 -35 44 -61 -46 -101 -10 -59 -53 126 -15 -22 266 -81 -371 -32 -99 46 202 -97
4264 -97 -118 -168 0 -208 195 -185 49 227 9 237 -5 -50 98 -104 55 -224 -176 -271 -69 -113 5 -178
4286a78M98k27j88q9J80j07K05l88J41K39m9j08j04L7P7O1q4L19r8m78J72Q1J84
4309I6j38J53k16k7J60J34n15K26L7J65J21j28J5K03k77R8k27j6L04l16o9J91
4331b6J9O1J96l04P0J92Lm19Q2K14k88M93k12k83J17Q1o7l5K65j19M0J6k22J02
4355b4L1mj42K84j18j30L89j7j46L9nl22N0J03j07J05o7K44l10P3J44j82K99k03
4379a6K47j60n4J28o4LNLJ37l15N9J90q0p8P6j05R4N9K11k62k79P6j93L36m1j17
4405a40PK80j33j78K32K84n51M47k26K27l25O1Q4J14l6M2j52J42j6k11O0J12j30
4428fk26L24j55oJ28k0p6q9K29k1k39M16j12j90N8J25k24J26K9k82L86L8m70O2
4452a95R2L57l86J27l4K51j68j79K89k73K99n99N08L2l83J47j42K52l8j35J79
$$ plain form
4286 -178 320 93 -95 -184 -4 -111 94 -294 -153 86 37 -71 -175 -138 -61 0 -84 235 137 -341 -169 -88 96
4309 96 -42 111 -105 -132 28 162 -353 -127 -90 75 196 68 83 286 9 107 -120 -136 168 -148 -217 -26
4331 -26 -7 54 250 -54 16 208 211 -208 -126 88 -200 293 81 -202 -85 -4 -71 -106 159 40 80 96 -126 -24
4355 -24 7 3 -139 145 27 -103 286 269 123 162 157 -165 -115 -12 -119 -14 -81 163 -147 -74 70 -112 187 -16
4379 -16 231 71 17 145 81 84 89 92 229 -86 -27 163 83 5 81 -24 70 129 340 78 -201 -125 -318 18 -23 -140
4405 -140 -133 147 14 -164 68 352 -199 248 22 249 -76 -15 69 183 147 189 37 179 163 -48 12 124 -6
4428 -6 -232 92 -63 -69 59 39 -37 -126 103 82 -157 259 147 -43 15 140 -84 42 71 -211 175 213 -257 -195
4452 -195 -103 254 -132 -5 -39 212 44 -135 154 -119 180 -419 89 121 -262 -115 -257 -5 -43 -178 1
4473Aj42L28k53M4K95l03JO4k2k18K85j5m1j04K49j53o3J07P9k63J47P3m6K20
4497B70m7l45N9P3J39J7k2l78L91j32rm81N29k14OL56m01j55K94j17R5r0O6K12
4521A16k28J19o2J70k00J36J91l13kK87l20K0K54k42p4J62J9np7j16K01p3J08
4544G1J13m7j14k98L60j09j87K49p0K7K80n30J69J03Rq5l6j61M82k83P6r4K03
4567A28l0j54Q6j71L45j88n0O5l1j84K61j13kJ53j37k93N28j28j19k72L92J15
4589B01m40K62Q1j32Q7j85O7N3Q0n31N41N4k93K11Qq3k58N10o2p8j6j29o0J08
4613dJ72l54R0o7J78j92P54m16l47J63R8l06K09J5k25J13L15n77L03K12j24J96
4635B06k47N7o5K4j00NK26l05J57J13J42l03p9J14Q4r2l3L0L04J7Nk28j7j13k4
$$ plain form
4473 1 -141 187 -66 -22 273 -30 -29 35 13 -205 80 65 24 -80 169 16 -47 60 139 -124 23 96 50 270
4497 270 223 -122 -63 10 149 166 144 -234 157 25 16 -465 64 -150 -144 212 -189 -344 -50 -167 -72 -162 -96 116
4521 116 -112 7 -55 115 -85 51 242 -71 -73 214 -106 -86 168 -74 -148 14 33 28 -49 -165 36 -37 71
4544 71 184 137 23 -275 85 -24 -211 38 -32 -5 275 -255 -86 17 26 -59 -95 -256 226 -57 19 -75 128
4567 128 98 -56 30 -141 204 16 -34 31 0 -184 77 -36 -38 115 -22 -315 213 85 -34 -306 86 201
4589 201 -239 23 104 -28 59 -126 -59 -6 74 -457 84 138 -155 56 64 -19 -277 233 171 93 77 -52 -112 -4
4613 -4 168 -186 -96 -163 15 -177 577 161 -186 -23 75 -231 -22 -7 -232 -119 196 -381 -78 134 10 206
4635 206 -41 16 -49 -25 -125 -120 106 -199 -42 71 213 -90 -169 -55 29 -63 -96 -66 238 255 260 32 15 -98 -122
4660a22K66j99J40j48k01K49K35j11q9k86J94L53l22j39K79k1j79K25j32J87r7
4681H2P2j84jJ35J4r8P4p4m3j62J01k33N00Q6l90L2L84k75j67L07j51q5N6j08
4705a28J77j31K82l83J14J88l17L92j43Q1k70K97j09L13q0j19l60K78M7j83lo4
4727a21J35K25j05j21j15K99p8n40M86J21j00l03R5j39K07K02o8l8J89m33J32
4748g0po3k4J22j27Q0m6K42Kj49k10L74j63J03N9k91P7Q3Q3k45K65qJ5J9P9k27
4774b7j16J17J45m2J65k11r7R7J28k22J8J84l7n3j93L93j94l8j1J92k30k0k6J1
4798f7j25j19K86l1p8J10p2M9o1K27k45K15k54K02O3K66j89rj86j88J27K69J30
4821C20m52L36j98p8J74j49Q6Q9k92K17j53J35j13J66j87K39J2ok06L2J56j07
$$ plain form
4660 -122 144 -55 85 -63 -264 -15 220 109 20 -266 -72 281 -41 -180 99 78 -101 124 -8 179 82
4681 82 154 -30 -31 104 118 20 94 20 -23 -185 -84 -317 183 269 -121 -89 295 20 -147 160 9 -76 -20 -128
4705 -128 49 -82 200 -183 -69 119 -198 194 51 132 -138 159 50 363 283 164 -196 82 129 -54 -57 -121
4727 -121 14 239 134 13 -102 197 119 -421 65 186 86 -217 -122 -261 -54 148 80 42 231 -202 -70
4748 -70 -77 -140 -164 -42 -169 -89 -135 107 109 -40 -250 124 -39 64 123 -168 -91 -8 75 -170 95 87 102 121 200 -27
4774 -27 -143 -26 119 77 242 31 -66 31 159 -63 -45 139 102 49 -144 249 55 17 6 198 -32 -52 -78 -67
4798 -67 -192 -311 -25 -56 -134 -24 -96 -47 -108 119 -126 89 -165 37 100 366 177 168 -18 -206 -79 190 320
4821 320 -132 204 6 -72 102 -47 39 128 -164 53 -100 35 -78 88 -99 140 152 146 -60 -28 128 21
4843B1K39j41j4R2k76M00n46L6J2J01j2R8ok97L25q8M3J08n5j11N3K68k67J43
4867A26j01k35K65J03j06P2j50j59K57J5k17Q8J44j18O7Jr7J86k63K91k68L1l0
4890i8J63n9j3J58J1QJ93l68j5K13m91K08K41n2J83k38J70j86k3R7M0j96j60J60
4914e4Q4r0K19k04N0PJ60j3o5q1Q7p0j99l61P37j99j59J82j82J05j65K63k40J52
4938c6J14P5j38J04j44j5K76Ll79o3O9lR6J82j52M9r3j13j69O04om35J06J18j36
4963h6M93m67k17n5N16l48n5M40l92J90M7j09j2O9K31k75m8Q1j25o6L47k92O6
4986f7K11j69j33M0P6k1J05O9n9J51l04j81K3L10k14K06J78o08O17K4m07K65q7
5009B5k44K02J35j98J05l85K85Q3m5K01l28J36J64l5l20J64P8k78M27j75p2P1
$$ plain form
4843 21 260 119 105 197 -79 321 -225 -189 -177 -76 -88 10 4 -293 32 -56 -13 95 40 -71 -18 250 -17 126
4867 126 25 -210 55 158 52 124 -26 -185 72 87 -130 -42 102 -16 51 52 -45 141 -122 169 -99 -68 -98
4890 -98 65 6 -7 151 162 170 363 -5 -20 193 -298 -90 151 99 282 44 214 28 5 102 142 -54 -214 -54
4914 -54 30 -60 159 -45 5 12 172 159 94 13 100 30 -169 -530 207 8 -151 31 -151 -46 -211 52 -188 -36
4938 -36 78 153 15 119 -25 -40 236 239 -140 -203 -134 -137 -41 141 -11 38 -55 -168 -337 267 261 -174 -68 50 -86
4963 -86 407 -60 -277 -332 184 -164 -219 221 -171 19 66 -43 -55 14 245 -30 -78 3 -122 -188 159 -133 -67
4986 -67 144 -25 -158 -118 -42 -63 42 111 52 203 -101 -282 -259 51 -163 43 221 -387 230 254 -153 112 25
5009 25 -219 -17 118 -80 25 -360 -75 8 -37 164 -164 -28 136 101 -219 -55 23 -255 172 -3 -75 -4
5031dQ3k3r8J36J23j9j49k6Q8q8M0Q0l72O6Oj29K61L3j6r8L73l03q8o2J80J35
5057A29k35L27Rk79J04k30J80L98l39m2j40k6K26J52l45QK00p0J63k62j05K11
5079C4J11r9m3L3k40K15l2m6Nj48K97k27K05l9p4j87K66J89m42L16o7j4rj7L5
5104B2J25k06J40k37K78j25o6k0M52l04k41L53k12K28k4N8n38M32j56K49j06j58
5126e6K2J6P2k12o0K69k29J46J06m0qJ27l18K76k73L11M1L9l72K43k23R0j50m9
5150b32J52J76j12K60k64k06K41K4j96J20K22k19L08m73Q0J55J97j79l58J77N2
5171g5lJ87p9J81q2l9P9k56L2o6Q6J74j35J2L9N1j33j76M6K9K04M9q5J16j83l01
5197c28J12J76J6K57l62J1J87j35j26l0K02K60l09K09K17l02J5l1R8L7j56l08
$$ plain form
5031 -4 79 56 -42 94 217 198 49 23 111 23 63 143 -229 -163 -157 -286 -25 8 -8 -106 267 -36 -124 -186 -6 129
5057 129 -106 221 230 -49 55 -175 5 403 64 22 -118 -144 82 234 -111 -103 97 27 190 -72 -177 34
5079 34 145 46 3 36 -204 11 -21 -67 -62 -210 87 -140 65 26 -48 -235 31 220 -222 94 27 13 4 -13 22
5104 22 147 -59 81 -156 122 -3 -69 -89 363 59 -182 171 -41 187 163 221 -317 115 -41 208 102 -56
5126 -56 -34 -18 54 -158 -218 51 -178 -32 74 34 26 153 -165 111 -162 149 190 229 -143 100 -123 -33 -183 -232
5150 -232 -80 96 -16 244 -20 -226 15 39 -157 -37 185 -34 274 -199 -119 36 233 54 -304 -127 -75
5171 -75 -78 109 30 211 129 90 169 -87 -55 -121 -35 139 4 16 55 106 -27 -203 -157 -128 76 125 40 156 -27 -328
5197 -328 -216 -40 -24 233 -129 -118 69 -66 -192 -222 -20 240 -69 140 357 55 70 39 137 174 18 -290
5219b90P2J48K52k58o0j32J53rJ13K37l33L36k48J30j80j22M28o9n04L45j04K36
5241A41l36Q0K73j36J0n3p7K6J33J88l91K1L0L44j53J21L7k90L2M0k2j18L34l98
5265a64M1L90l20p5J01n3J50Qm28L9L58k14L08l08R4J41r7J64k86L53kp6j87J06
5289D3j00K4J86K0m80L90n6j27K30L3Q0k21o7J58l49N7k15L11p2J58P6j07oL3
5313aNK1n0J92j4k81J43l8p8J91L7m9k61K09N8J4L14o26L15q0j40K6J37L3k41
5338a64J42J00r6J20n8N1M1m30J84Q7k11L78k60K51p1k40K57j14r0n9J17K54k88
5361i9K91k94K52m58J79K52j30J27j36Q1m2j09K8K22O5k53n0K58Rj03j98jJ56
5384D7J7J90j15k00r5K40j64M2J17k23J93j72nlK56j87J88j02K20q3k18o5J33
$$ plain form
5219 -290 -218 -70 182 -76 -136 -268 -115 -124 -11 226 -107 229 -19 111 -69 -191 237 168 -336 9 -95 141
5241 141 -195 -115 158 22 32 -21 -98 -72 61 249 -142 -121 -91 253 100 221 258 -32 0 40 18 -100 234 -164
5265 -164 -123 267 -53 -128 -27 -80 70 78 -350 -311 47 -167 141 -167 -73 68 -29 135 -151 202 200 124 -63 43
5289 43 -57 -33 153 173 -307 83 27 -100 130 163 243 22 -45 113 -236 -179 -394 -83 -155 3 79 -28 -34 -1
5313 -1 4 25 -25 167 153 -128 15 -23 -101 90 127 78 -183 26 84 98 412 -214 101 21 -119 -93 44 77 -164
5338 -164 -22 78 -18 102 44 95 136 -294 -110 -23 -234 144 -116 135 64 -176 81 -33 -123 -182 -65 189 -99
5361 -99 192 -102 150 -308 -129 123 -7 120 -16 65 23 -86 -58 164 229 -24 -74 184 193 90 -108 -109 47
5384 47 64 254 139 -61 -156 84 -80 -38 79 -144 49 -123 -128 -131 125 -62 126 24 244 161 -57 -122 11
5407A1J2k19J78P2q6j58M4O0K03j28J43k21o3K17m9O9j19N3R0Q7j25K5k60K55
5431I1K49l11m0Q7k5j43N6L9M5o6L7j6L8l1l14K23K18k66NK02l50M44j01N2p4
5456D9k94J80j19N08m88p0o9K75m6J61q5k4N3Lq1J63K4M9j38j71%k5L33k75J50
5481F3l61M75J18k5j63k11J86j94M7K14j65J22k05j66K64Q0j07M3q6O4LK4k91
5504b71K81P0r3Kj54K71k09j3J54k0M19j18k73j73N73l26M3J7k49l3K3m1nK6L8
5529f1q9J76r2J56lK4J29k63L20m71M08l25K20k8k10j7J40O5k27L20j01J04l84
5552b09J59K59O9l73j24L00k72J58nJ23j50O4J10K7j03J0p7o7j29M56p7q3n6j9
5576iK95k79k4J84j18P7j4k30J12o6o5K86j46o2L72j95k05J12j02J1K81k76J31
$$ plain form
5407 11 23 -196 -18 54 -32 -190 -146 -86 117 -11 132 -89 -152 65 16 85 -34 19 109 196 71 96 -164 91
5431 91 340 29 -11 76 51 -92 -36 3 48 -18 19 3 41 10 -304 -81 137 -129 -124 78 -272 172 71 123 49
5456 49 -245 -65 -184 324 -164 -234 -303 -28 -74 87 2 -22 31 34 -47 116 140 189 51 -120 -120 -145 188 -87 63
5481 63 -298 177 295 270 107 -104 82 -112 -65 149 -16 106 -99 -265 -1 79 -28 15 -71 -7 -4 20 -271
5504 -271 10 80 -13 -11 -165 106 -103 -116 38 18 437 319 46 -127 446 120 163 180 -69 -102 -79 -120 -125 -99 -61
5529 -61 -150 26 -66 90 87 111 240 -23 297 -174 234 -91 129 101 -109 -126 14 79 -148 172 71 175 -209
5552 -209 -50 209 278 -95 -219 81 -191 -33 -38 85 -65 -1 109 136 33 43 -34 -101 -230 226 149 66 10 -9
5576 -9 286 7 -17 167 49 126 112 -118 -6 -72 -137 149 3 -59 313 118 -87 25 -77 -66 215 -61 70
5599G0j77k15N03q7k37P2l0j24K41o1j07J24j6J10k58K94j87r2R5K44l05o8O9
5622a42K54k43M50n68L69k24j3J70j1K14l46L03l47j32M35L1l52K54j06j78J06
5643g6J50p1m46N06m8j55J04K89j44j91k6L26m82K44j78J80K33M6m85P9K72pK4
5666A44p7k92J54J04l5k00J63k7ko7j51L73q8q9J45p5j78N20o6p3q3j63KL87j55
5691A71k21L45k32j26K81o3k67R8m52Q49l19l4P5j96J00l26L19J60j93J57j37
5712a1k30J55J50k45L08k85L29j14L3k8j18K53Q9l13q4K90k71J8n4J52Oj9P8j24
5736c5M4J7J1k08L92k81O3K84j82k8j18o2J80p3P4p9q0J63J0p7p4K64j74J71k17
5761a5j4p9J03q6J25J26j17l4k53M9m8L57p1J85j03k05J08K07j64M8m0o8K18q5
$$ plain form
5599 70 -107 -322 181 94 -143 -71 -101 -225 16 -45 -152 -28 -44 66 -192 102 -85 -177 -82 162 -143 -211 -142
5622 -142 112 -131 319 -249 120 -104 -117 53 42 256 -90 213 -134 -266 169 200 -152 102 -4 -182 -76
5643 -76 74 3 -443 63 15 -140 -36 253 109 -82 -108 218 -264 -20 -198 -18 215 261 -224 -145 127 120 144
5666 144 67 -225 -71 33 -2 -202 -39 -66 -68 -135 -286 87 -1 -90 55 -20 -198 322 256 183 100 -63 -61 326 171
5691 171 -50 295 63 -63 218 155 -112 -14 -466 383 64 30 105 -91 9 -317 2 162 -31 126 -11
5712 -11 -241 -86 64 -181 127 -158 171 57 90 62 -56 197 286 -27 -111 179 -92 -74 -128 24 30 11 89 -35
5736 -35 9 26 37 -171 221 -60 3 287 105 77 -41 -103 77 4 78 -1 -81 82 92 15 -59 205 31 202 -15
5761 -15 -29 -108 -5 -91 34 160 43 9 -244 -195 -243 114 43 228 125 -80 28 235 71 119 79 11 229 144
5785A44k35k16K27J89l07K64r7j50R2J44J44j12m40Q6N91k97r8J0p3P8K65j15
5807I4p8r1J16J90j20L7l02K61j44J59n2j87N2J73P2n71L48j15m3J88q9p3L79
5830B04q6j34o7J43J42k74j1O0p9m9Q3K11j49J27q6l1p2k1J37j70M4L5J18r4N4
5855C5l43L09O1l1K60m41m0K27k92J54M23j66l35L84l30K0m8K0MQ7P5j62l25N42
5879H8k85J01N1Q0k8M7J69k27J37k05n1r9N81l16j2M4k08J25K7K2p5j02K48k29
5903a17K17m0k2J49k78J98l15M12r8j59L4L6o4K03j50k32K18kJ43j51qK99l12
5926c9k57K81O8J1J2k47L26Nl08O2K15q5j5O7J53k86L71k82l00M22l36R3J82K7
5950A40k91r1L14K6k51J19j50J60q7O2P8j89M43l11K53m9k31j03J98N6ml33P3
$$ plain form
5785 144 -91 -307 -80 109 -198 66 -31 -181 -89 55 199 87 -353 -267 324 27 -71 -61 -134 -56 209 94
5807 94 16 -75 41 231 111 148 -154 107 -37 122 70 -117 -65 108 180 -391 -43 -158 -201 -13 -102 -175 204
5830 204 118 -16 -83 60 202 -72 -83 -23 -102 -151 -68 143 -6 121 35 4 -68 -89 48 -122 -78 -43 75 -19 35
5855 35 -308 1 62 31 291 -150 -190 37 -255 -101 322 156 -179 205 -125 -105 -153 -133 -129 -42 33 -129 -454 88
5879 88 -197 -96 -45 35 7 54 223 -4 133 -72 -123 -222 359 43 31 75 -133 -8 19 41 -34 -136 112 -117
5903 -117 100 60 38 187 -91 107 -208 204 106 -53 -19 17 -47 156 6 -226 -8 -10 133 -18 -26 273 -39
5926 -39 -296 -15 53 64 76 -171 155 160 -148 -86 129 44 29 96 249 -37 334 52 -248 174 -162 -69 113 140
5950 140 -151 -242 72 98 -153 -34 -184 -24 -111 -49 29 -160 283 -28 225 176 -55 -158 40 96 92 -241 -168
5973a68P5P3k06j15L25J88j41j77K05j43J43j22J6N6J92m03J50j54J65j2J48J26
5995B21l67n7J96j3k3K30j99k36J15R9K27m32K67pJ1k62K68j19J46L9r1Nj63r4
6019b39J32O6j5K4K71l58L2j27L10l4k42K56j27J19J44j09l5Q1P3k85p5J54O1
6042G7Nq1J7J30k39k06J59L73k61o6J67j4r3K21j54j52q7K52r2l5J26M7j3J33
6066B14l37J00L8K26j24M0o6m29L98J23Qk26M6N0r5J64j28K25j15o5j1n0k07L49
6090A28o3j66j22M94k09p2J11k09J30k12J05P1M4j22J01N5j68O1O2K9l5j14R0
6113a1k2j81K28k3L7J7j41J6l8L98m04J33k90L02j06j10L8J60j47J59k74K36K04
6136A81j83m6N2Qr6rM03r0l31M09k69J6k14J76R2J93l57J20m27M75k27m3N4P0
$$ plain form
5973 -168 -93 -20 -226 -341 -16 172 31 -146 59 -84 59 -63 -47 9 201 -202 -52 -206 -41 -53 95 221
5995 221 -146 -203 -7 -20 -43 187 -12 -248 -133 -34 193 -239 28 21 32 -230 38 -81 65 104 13 18 -145 -239
6019 -239 -107 -41 -56 -32 239 -119 -87 -214 96 62 -180 76 -51 68 212 103 68 149 222 -63 -138 16 77
6042 77 82 1 18 148 -91 -297 -138 235 -26 -92 75 61 -32 189 35 -117 -204 48 -44 -79 47 94 81 214
6066 214 -123 -23 15 241 117 157 91 -338 60 183 191 -35 11 61 -34 130 2 227 112 47 36 -14 -221 128
6090 128 65 -101 -223 271 62 -10 101 -108 22 -190 -85 -14 30 -92 9 64 -104 -43 19 48 13 -101 -11
6113 -11 -33 -214 14 -9 28 45 -96 -80 -118 280 -124 9 -281 21 -85 -195 -157 3 -144 15 -259 -23 181
6136 181 -2 -48 4 12 -84 -93 310 220 -111 298 29 45 -169 7 99 292 -65 55 -372 103 -124 -167 -113 -43
6160d3K48L1j6j67n7J83k78J82RJ06j3j60K03l19J53k89L56l71J41m6L09k4k47
6183a09k48K54K98k86P2j14J6j19K55M0l07K47J44j09k10J06M6L24m43K20j77
6204a00P0j92K22J96k60O1R9j55O3j55jL53R2k99O5k0L9k13K99n4l87N19m81L35
6228I6j75Q7j50K51L7m39J63J84o8K01k66N22m45M7k01N2R8j52q0n3L87l8K06
6251B64j64Q1j29J6j04J83l33O00m70j61O43m46K8L3k10J52N2L20n79L76j82L06
6273B76Lk50M5k03j28K10k57K15L57m76J47J06m5OJ2j75m7K38L6j91J18j63K38
6296G2K8N4j77j7r4L17l20P9r8L56n1J98r8r0q7m31M15K3m08N91q8l25J44q4o8
6321a59O0K16L6L0k94J65J54k69K97k76o3K55r4j39L8j38J67M8j00m6j50L95k22
$$ plain form
6160 -43 205 236 220 53 -4 179 -99 83 92 198 185 25 228 -91 62 -227 129 -242 -101 -147 162 138 -109
6183 -109 -357 -103 195 -91 -19 -133 -117 -236 19 59 -248 -1 143 34 -176 -70 -24 300 -143 77 -100
6204 -100 -30 -222 0 196 -64 -3 96 -59 4 -151 -152 201 293 -6 59 39 78 -135 164 110 -277 242 -239 96
6228 96 -79 8 -142 109 146 -293 -130 54 -14 187 -79 443 -2 45 -156 -104 -6 -158 -238 -291 96 58 264
6251 264 100 181 52 68 -36 147 -186 414 -56 -217 426 -20 8 41 -169 -17 35 355 -224 152 -30 276
6273 276 279 29 74 -129 -257 -47 -304 -89 268 -208 -61 45 0 6 18 -157 -204 34 70 -121 -3 -166 72
6296 72 100 154 -23 -40 -134 183 -137 -58 -156 200 149 347 249 159 72 -359 56 79 -329 262 174 -151 -7 -91 -159
6321 -159 -99 117 153 183 -111 54 208 -61 236 -40 -103 152 58 -81 -43 -181 -14 34 -66 -112 -262 133 -89
6344h9J32o0j52R5K15r8oM2K45o71K57J03N0k12J7N3J79j8O3r7k7k06M15j06l81
6369b57J78N1J31k59j92L99m9j74K97j10J2N5j62K01j83J47K6j46R3l22L06Q2
6391A24j92M6q2L3L73J40k53j96N0j66J19j56L03k93M2k96L83K8p8J89m7j95j79
6414c03O8K63K5J58l91K04m59K83K74j3J28l26J70j56L77k94o7K43n06M75K1k56
6436h2M1P1K54l67K22r6N8m5j0j04O7M8P2Q1m20K41J2P8j85L05j65N9J48k87p8
6461h2J30K30k07n2k14K50j70Q4J09L7l10K13j74K14J26k31K11k23K88j98r3M0
6483b2L13j5l96j70K59K12k64j77K31L5J19m27K48R0N5l8M4J17q7j28L30k92l36
6506b99K41j7J87k16K26k63K17J68o2k71J17q9k8M5O20m79L4k04J0j60M66l60
$$ plain form
6344 -89 43 -17 -169 -74 141 43 37 79 324 -347 -90 13 63 -149 -132 -79 100 82 145 48 21 -185 230 124 -257
6369 -257 -79 -28 103 -156 -348 51 2 -172 125 15 27 82 -80 121 -62 85 111 -35 58 -264 42 124
6391 124 -68 -22 -104 -71 302 442 189 -7 43 -123 -4 -160 143 -150 -108 -404 -21 7 -71 118 71 -124 -303
6414 -303 -235 28 53 211 -180 24 -435 -152 122 109 237 -89 81 -75 302 8 -59 184 -322 153 174 -82
6436 -82 -41 30 284 -83 139 43 101 56 46 -58 9 57 129 210 -210 31 43 121 -64 241 76 135 283 -4 -82
6461 -82 48 278 71 19 -195 55 -115 -31 78 115 -195 18 -156 58 184 -47 164 -59 229 31 -62 -22
6483 -22 291 276 -120 -290 -31 181 -83 -260 -29 6 125 -302 -54 36 91 53 97 214 127 -1 329 37 -299
6506 -299 -58 -75 112 -104 122 -141 76 244 182 -89 28 -61 -89 -44 576 97 131 -73 -63 -223 243 -117
6528a17K21L2r4J79l60L5M2L25l12N9N2m9O7k89K79k00K49L3J11m32K24J49k57
6551e3n8J75j25l6M27l31Pk09J72L13l4k21J33j3j77L69k26o0r3m2kJ28r2L09
6575B61l47N1K08k52R6l0k12K0L51r6P4J19k49R6J3k80K44j05p9k1M7J50k43J18
6599f6P1K72k88L07l73j0p1K15m2j5J24j48R1M3j00k50K36N0o9o9J59K07l40L57
6623B91m49N0J55J32k23k7K01j68L4J11k60N6L31k56m9k11K84J62m16J49J20j36
6645a19n3N4J11N9L1j99J42j26j88K78J37j82o0m6Q8L57M9l32j51L44l78J26O5
6668GL5J20k62k5J56jm10L92R0k27J00r6Q7J04j00O8J43j97j28J52j34K03k46
6691a69K63l62K13L13o55P22l34k88M53k54L20o8k60J5m5K93k55J93k59P9P9r5
$$ plain form
6528 -117 104 136 42 221 -139 -104 -62 263 -49 10 62 13 80 -209 70 -130 119 152 263 -169 55 204 -53
6551 -53 -111 64 -61 -97 330 -1 6 -203 -31 282 248 27 160 147 -30 339 113 53 -40 -82 -84 44 -48 261
6575 261 -86 -35 173 -79 17 -13 -225 -205 146 50 124 243 -6 90 103 -177 67 -38 -117 -138 -91 59 -184 -66
6599 -66 5 277 -11 296 -77 -87 -158 57 15 0 124 -24 67 110 10 -240 -4 46 -23 -92 67 274 -66 291
6623 291 -158 -108 47 179 -44 -71 130 -38 -4 107 -153 -97 234 -22 -71 -282 2 164 -252 -103 17 -119
6645 -119 -172 -118 -7 52 83 -116 26 -100 -288 -10 127 -55 -115 -161 -73 284 333 1 -150 194 -184 -58 7
6668 7 42 162 -100 -125 31 30 -380 12 102 -125 -25 -121 -34 70 -30 38 181 -16 -144 8 -126 77 -169
6691 -169 94 -268 -55 258 -397 325 -9 -297 156 -98 222 154 -106 -91 -136 157 -98 95 -164 -85 -6 -101
6713a01J86k45L9P6O3J44l24M03k94K5k30M18m7k65J77L42m83k57L10K6j5j43
6735a95K56j49M8N0k43K08J60j1j35o4K83K1q4j27k02J86K41l33j12L54k92J94
6757E4k00J9Q5M7p7K63l6k88K9J88k63J22j38KP3L2L87l00P1j8J05j21l90M36
6781H2r9J31J32k32O3J16j47l5J14j00J42k20L8P5k13P9L35l89PK05j36L66m22
6804a08J19mj0j44J52Q4l18P6K69k11K85k18j66K08j7K05j45M6Lm1j86O3k15J50
6828a23J18o5k4J28p0k18Q7p8J76J32j97K65%L4r0j12l6k94P42o54L60j13K42
6851B10k09P6k00K68j94j28K20K50m65K10O8k45K72o5k32q3M54k96J88Ok53l6
6873a84R5K45j23j89j84J14lJ84k98M43J42j60j26L3L1m56M51K68k13Q5j50M0
$$ plain form
6713 -101 85 -160 -121 -45 18 162 -162 241 -53 -28 -258 160 113 -152 25 367 -116 -373 -63 -37 -52 -195
6735 -195 61 -88 -40 10 -233 -25 135 124 -11 -75 208 229 145 18 -184 2 243 -90 -202 152 -140 54
6757 54 -146 -127 -42 5 -72 191 155 -133 -104 84 -179 -57 -195 -193 -120 -88 299 -1 70 52 157 36 -354 82
6781 82 -17 114 246 14 77 193 46 11 125 25 167 -53 -15 60 -153 -74 261 -128 -121 84 -52 314 -108
6804 -108 11 7 -3 -147 5 89 -229 -153 116 -95 190 -28 -194 14 -3 202 57 103 106 65 -121 -58 -273 -123
6828 -123 -5 -70 -94 34 -36 -254 -167 -245 -69 63 -134 131 131 165 75 -37 -73 -367 375 -279 81 -32 210
6851 210 1 77 -123 145 -49 -177 43 293 -172 38 106 -139 133 68 -164 -247 207 -89 99 105 -148 -184
6873 -184 -89 156 33 -156 -340 -226 -229 -45 -343 100 242 82 -44 -11 20 -436 15 283 70 155 5 45
6895D5J67l31Q7j15J59MK06j58J38L7K15o41M38m12J13J25Q1L2k77Q2J1J63j63
6918Fj12l5K71j5k18k6J69J38k07j37J45j19K9j5m7J66J35J24k00m6J5r7K56j17
6942F3l24K37Np4J61j98K24k90O6L80l92J46J14o2Ln2J5p3j68L34j60J20qp5l2
6967d0J69k29R4J66j19j28j11J27J39j89l4j8k44M53N5kj35PK13L7j80k7r0J59
6991G3K3j71P8j26K19l04K09l01L37K14k31P1K52j01k85nJ03J4j07J23Llk99l3
7015b47J78O8k19L41k05K93n62M06k44L22l73K69j42r4M17k82L33k59J1J4J12
7036A37l82L20K97m56J06j55n9M19l18j55J93J87L4q9N3j48j99L04j82j78J70
7057a01L53k90j22J70q6J36m8j36j3M15j62p0j36K54k06M6j42q2M04L5j50j6n3
$$ plain form
6895 45 212 -119 -32 -147 12 16 222 64 202 239 454 -187 251 -161 -48 77 158 190 -87 -5 6 169 6
6918 6 -106 -141 130 115 -103 -129 40 178 -29 -166 -21 -140 -111 -126 -173 -7 128 252 52 6 21 -76 180 63
6942 63 -261 -24 -19 -93 68 -130 94 -196 -130 250 -142 4 118 56 59 7 22 -51 -219 115 -45 75 67 -8 -40
6967 -40 129 -100 -6 160 41 -87 -198 -71 68 -121 -155 -173 -417 36 91 89 -46 -39 174 211 31 4 -86 73
6991 73 96 -75 3 -123 96 -208 1 -300 37 251 20 91 343 242 -43 -48 55 69 -38 85 88 85 -214 -247
7015 -247 -69 -1 -220 121 -84 209 -353 53 -191 131 -242 27 -115 -209 208 -74 259 0 11 25 137
7036 137 -245 75 372 -84 22 -133 -192 227 -91 -246 -53 134 168 79 132 -16 -215 89 -93 -271 -101
7057 -101 252 -38 -160 10 -76 60 12 -124 -137 278 116 46 -90 164 -42 4 -138 -220 184 219 69 53 0
7080@Q0m34K96J20k23L38k27l8K2j50QQ1P8L00m13J06l1oJ88k07k88K51K66k14
7104i7Q8J1O7kk3l90K99Jj60K73k35J44J95k11K8j82J46O4m4k0P0j48o6K68k7
7129D9J10j5j01j73J43k9j42L00n0j54j06J95L02l26k49L00l52L76p1Q9j37K46
7151B05k84k60M99k41Q2J2J6l5M6k90K38P6O0j03K1j45K04P1k14Q1l96L41L4J17
7175A35k40J50l47L87j63J23Kr0k48J88J86j94j6k05N58k54K46j25j4m18K11K41
7197A13l02K90j68K90L7j78r4K12K3j1k19L4j90K0K82j40J76k16J37l0K02m11
7219a43J66j27J70k59J72m4L2m9N5L17l85K84l61L96j93j86K77l53N41k38l42
7240b70J33K42R2k88K38l11J8K84O9m21P6K29k85L07k44j43M02k55J58m5k26J57
$$ plain form
7080 0 80 -354 -58 62 -161 177 -50 -88 -66 -216 -208 -127 -49 251 -162 -56 -87 -93 95 -112 -400 -149 117 -97
7104 -97 -9 2 69 67 44 -346 -47 -46 -206 67 -168 -24 171 -40 -12 -194 -48 16 -28 -48 22 -126 -192 76 49
7129 49 159 144 43 -130 13 -16 -158 142 92 -62 -168 27 329 3 -246 54 -298 78 7 96 -41 205
7151 205 -79 -339 160 -81 1 13 29 -6 40 -250 -12 64 124 21 42 -103 101 172 -42 39 -357 -16 18 135
7175 135 -105 45 -302 85 -78 45 47 -43 -291 -103 83 -111 -127 -332 226 -28 218 93 79 -339 -128 113
7197 113 -189 101 -67 223 260 82 -12 200 223 212 -7 27 -163 -143 139 -1 175 -41 96 66 268 -143
7219 -143 23 -104 66 -193 -21 -65 -33 -82 -27 290 -95 189 -172 224 31 -155 122 -231 310 72 -270
7240 -270 -137 105 197 -91 147 -164 -146 138 207 -214 -138 91 -194 113 -131 -274 128 -127 31 -14 -240 -83
7262h3J44n4k75J80J52Q2J62l29r8L09j85q8j05L71Rk32P1r7R1O0k96M22j63N6
7286A04L1M6j63R1J73l61L37l20R1K90k37lJ89l52Q6o3o8J50k80J54J57ok15O8
7310a01K18j50M2J1l58M23k4l09K95N0j10O2l23M8J52J59j2J16k22j0K20l19K32
7333I0j47M7Q6k22J31l7Q3k27J94k33J80n5o9J35r9J89M2m2j97J73j64K79o1K09
7357B85k05k46N30n0m90L19n3k37M7k1J40j9N0j52r8K07j49L53k87M07m69K49
7379A11R0k88K07k79K58q0lJ05j27L00k63J71K53l50j71p2J38J7J53k26L31J0
7401B85k88P6j1k14J88m16L35J41J67o8k83J33k30L13j71k35L71j68J64J79l40
7422g2L86m89L21l68M90k74Q1l21K51O9K34m56o6M14j52Lk49J87l06Q2R7K41l41
$$ plain form
7262 -83 61 7 -268 -88 64 146 308 -21 -119 190 5 -83 -188 183 192 -40 31 -66 25 85 -211 211 48 104
7286 104 135 181 18 109 282 -79 258 -62 29 319 82 79 268 -84 2 -61 -129 21 -259 -105 52 46 -169 -101
7310 -101 117 -33 9 20 -338 85 61 -248 47 97 -13 49 -274 -226 -74 85 73 189 -33 -43 177 -142 90
7333 90 -57 -10 76 -146 -15 -52 31 -196 -2 -235 -55 -110 -179 -44 -143 46 88 46 -151 22 -142 137 76 285
7357 285 80 -166 364 314 -176 143 90 -147 -100 -121 19 0 50 -102 -200 7 -142 211 -76 331 -138 111
7379 111 201 -87 120 -159 99 19 16 121 -6 294 31 202 455 105 -66 -138 0 17 170 -56 275 285
7401 285 -3 73 62 -152 36 -380 -45 96 263 195 -88 45 -185 128 -43 -278 93 -75 89 268 -72
7422 -72 314 -175 146 -222 268 -6 75 -246 5 74 308 -148 -214 200 48 51 -198 -11 -317 -235 -138 103 -238
7445b38K19P3m5L5q1j29Q4J51o0r1q7K77j8L6M0j45j93K52j09J29p3L6k06m8J88
7470co9l9K63k0N6q3J08j15m23J97j58r4K68j09ML33om68L13M6k74J39K87J8m7
7495A24pq7r6j78L03Q3j06M0j29n2L1j45q4L55Rj54P8j83K19j09K5o4n3P8K3j74
7521b53K61M8J1j4M3P7J20n25L45j9k82K42Q4k00Q3l18M09M3k84R7p0j04K43O3
7545A00J72q5K24n11L54k92J50l94M40k9j68k79L85q3j05J82j65L31m59K6J70
7566c6J20L1j01P4M4n19M61Q4r1J13Jj0j87J17J79k08j53J75L2l5J04j99P9k09
7590a34r0K15K77N9l07r2m7K13N1m08L22L5j97K4j60M17l08L2o8K86l6j5K9j01
7614cLJ29k70K22m6k70K39n0j4k81K01m4K63P6j72k6K66l47M7J74r2k02K93j66
$$ plain form
7445 -238 -19 54 9 44 -37 -166 -82 69 9 -82 -169 108 90 126 166 21 -172 80 -29 100 27 63 -143 -191 -3
7470 -3 -72 -111 152 132 188 105 213 98 -325 -128 -286 -380 -112 -221 -217 116 110 -358 -45 1 -273 -134 153 171 124
7495 124 117 30 -66 -244 59 142 36 76 -53 -105 -74 -219 -303 52 61 -93 -15 -198 21 -88 -63 -127 -180 -102 -79 -253
7521 -253 8 56 67 53 96 173 293 -232 113 94 -188 54 138 -62 21 -297 112 155 -129 -32 -102 -206 37 100
7545 100 272 187 411 -100 254 -38 112 -282 158 129 -39 -318 67 -16 -121 61 -104 227 -232 -206 -36
7566 -36 84 115 14 88 132 -387 74 158 67 180 181 171 -16 101 280 72 -81 94 126 91 195 -4 75 -134
7590 -134 -224 -9 268 327 20 -72 -119 94 145 -263 59 94 -103 -79 -239 178 -130 -98 -166 120 84 69 98 -3
7614 -3 0 129 -141 81 35 -235 4 -46 -60 -341 -140 -184 79 155 -17 -43 223 -124 -77 97 5 -197 96 -70
7638g0k3L13l02Q1l7J26J6l21K40M9J8j48J84j23J26q7j63k60L52j31L9J4K73
7661A66m5j5Mj25q6R6Q0q8o3J16J08rl09K09j48p4K77Ro3q2m0Q3K73l3j81j81
7687a21j16J78j23K9j43M64R8l01R8NJ50j84J88l80K3K12o6q3K81p6J44m32J8
7710a37L40k10j86qJ29K48P1l36m92P51k73J70q9J0M0l0k4k6P5J20J53r9l3m06
7734b42L13o4k18M23Rn34j8K79J66P5k16O5j68N8J28J26k3k35K62j42j02K91m93
7757b60K91q1J73J00m1m4j82Q4K68l34k4L12n54K48qj12L09k09r3R1J48O9q4K0
7781H7K2Nl18J18K48l73K73K04l49p3P8n7K22L19m22O6J92m38K68Q8q5k32M16
7804B59k25J87j85j78J49R8Lk58J46M64k36j14j02K11l61J86O4m05M75m4M8k79
$$ plain form
7638 -70 -93 220 -82 -1 -38 88 104 -217 23 72 90 -58 126 3 129 42 -121 -381 -29 -160 -121 -107 166
7661 166 121 106 110 -15 -101 -5 75 -13 -76 40 148 139 -170 39 -109 -183 94 103 40 -42 -82 1 274 241 60 -121
7687 -121 -237 -59 -182 -153 -296 168 266 -35 63 68 218 34 222 -158 -135 77 11 -72 209 133 277 -155 -137
7710 -137 203 -7 -193 -201 -72 176 247 -89 -581 170 -103 67 -22 -12 28 -2 -26 -52 23 143 296 197 164 -242
7734 -242 71 7 -211 212 221 -313 -331 -52 114 189 -27 38 -130 -72 56 182 159 -76 186 44 -58 233 -260
7757 -260 31 -50 123 223 182 138 -44 40 308 -26 -50 262 -292 -44 -52 -164 145 -64 -157 -66 82 151 67 87
7781 87 109 114 -204 -86 162 -211 62 266 -83 -156 -78 -135 87 406 -16 50 242 -196 72 160 75 -157 259
7804 259 34 221 36 -142 7 105 108 -150 -4 460 224 110 8 219 -142 44 108 -297 178 134 182 -97
7826i7j3K64j97n1J11J19k73K91k44LJ18Nk01K87l34j28M68L7r2k09J66r2P0N2
7850F0M3L4l43J48n1J3L41l16L40k35Ql0L1Q8j96K42l61J38n9j20l7J56Q0JP3
7875D8N8k26K82n4r9m5K9q7J43O3K2K10n99Q6J19n9K21J95k93lq7P4Q0k5N6o1
7901D8Lj56K72k9j63K32j78o8LJ74n6l98O47n41K71p8J73l29M38l53K62n45M84
7924A13m4J19j4k34m5j68J47J11n6J38j17M10j95n1n7r3J08K52j00k45j49M0K77
7947A47Q3j26k34J81M7L5j15J23j00N7j28jo2J32l17K38N4L21m16M3k28K03J98
7970A35k03J30l19J58K42L3j46Q9k17j80L69j89l3M08n92K46J85j53P5J53j71
7991B0J44l36K17j6k69J19J38K06l44J20l1j27M25l54J29O2j09K3J63j64r0L1
$$ plain form
7826 -97 -110 154 -43 -94 17 136 -137 154 -90 -87 31 36 -165 122 -212 -340 128 165 73 -136 30 -62 8 60
7850 60 103 137 -206 -58 -109 -96 245 -71 269 34 42 12 43 131 -65 177 -184 -46 -105 -225 -262 -106 -26 -25 48
7875 48 106 -120 162 108 9 -36 -7 -94 49 112 134 344 -255 -169 -50 -109 112 307 14 11 -76 -2 78 53 109 48
7901 48 51 -105 167 138 -25 207 29 -39 -36 138 82 -316 331 -210 61 -17 156 -173 265 -88 174 -371 113
7924 113 69 188 174 -60 -105 -273 -126 -15 -71 67 -50 360 165 114 57 -36 72 324 224 -21 -170 -130 147
7947 147 230 104 -130 51 98 133 18 141 41 98 -30 -31 -93 39 -278 -40 14 335 -81 -38 -266 -63 135
7970 135 -68 62 -257 -99 143 176 30 119 -98 -278 91 -98 -131 277 -315 -69 116 -37 38 191 20
7991 20 164 -172 45 29 -240 -121 17 223 -121 -1 -32 -159 266 -88 41 103 -6 17 180 16 -74 -43
8013d3l9jJ79k72L58k73L27k02j29R4K22l60Q0K44ml86J99o0J09j13J03Ol6j72
8037a69k5K14j52M50l68k4m2l4J69p3j87K63L1j89r0K34p5K03k34J66R3j26K13
8060B48O7j85k04r4k9K3K23p2M7j35N4q5J59K2R4j67m3k2l9J74k77J73K00j46
8084a4j87o7M05n3p0j07j83M46j46J3o1o0K32k08M3l4K56Pj16Q5k28M2J00n2O2
8109A05l52M66j87J00qn0k40o7K04o7m0J9j19K02J6M0r2K30j66j12q2M41j46K6
8133A21k72J15L21j95k45J64J4L7j24k4L21m0k73R6J07K17j28j30j42m0J29K16
8155B45q0o8q8R1n6l79L77R0j82J47M30n70J23R0K6q5r8l8qR8j0J9N2R6j59M9
8181A12J53m45K33k45M82k75L42p13L54J47
$$ plain form
8013 -43 -82 -83 96 -176 182 -91 236 34 -95 -1 221 -139 -59 185 181 -205 -6 -66 43 -70 33 39 3 -169
8037 -169 -194 20 -132 318 -50 -74 -116 -150 19 -54 -241 22 53 -136 -226 8 -67 136 -98 68 161 35 248
8060 248 315 130 -74 -168 -197 -174 49 -23 24 -111 -57 -142 17 39 133 -34 -77 -99 -138 36 -241 -68 132 -14
8084 -14 -201 -268 137 84 14 -93 -276 170 24 37 -24 -84 148 -60 -17 -51 205 212 96 181 -47 -5 95 43 105
8109 105 -247 219 32 132 124 74 -166 -233 -29 -96 -136 -117 -236 -34 -18 22 -70 160 -6 -118 -200 241 95 121
8133 121 -151 -36 285 90 -155 9 23 60 -64 -88 233 193 -80 16 123 340 212 82 -60 -100 29 245
8155 245 165 97 9 100 44 -335 42 132 -50 97 527 -43 80 170 196 111 13 -25 -33 65 55 74 126 222 63 112
8181 112 265 -180 53 -192 290 15 357 -356 -2 145
8191A45
$$ Imaginary data points
##PAGE= N=2
##DATA TABLE= (X++(I..I)), XYDATA
0@%%%%%%%%%%%%%%mJ2j6J6j6J6j9K5l0L2l6M2m8N6o4P2q2R1j01J12j24J40j56
37h2J73j95K17k37K63k92L24l59L97m41M92n50O15o95P91r07J054j244J505j885
57a056K490l613O372k3966m8704L8877M3357J3526j6471k1386k470K8556J2472
70B7984k0527j6981P622P083K113j949q128k140N450o207m541J4557R629j5296
84a331j6793l702R819J7020L204k0260r427J6737J1602o529j0257m201Q911J7313
98A2106j184j9113m377J1910M341j569j65n68O470O021j1736j5731O033J3688
112F126K158n070q498l477J0892R014r662r909M432M737J73j728p695m597R676
127c428O916l663J641L419o458p900K08K993Q670O620r886j1750P646J2710m8
$$ plain form
0 0 0 0 0 0 0 0 0 0 0 0 0 0 0 0 -4 8 -8 8 -8 8 -11 14 -16 16 -20 22 -26 30 -34 38 -44 47 -54 58 -66 74 -82
37 -82 91 -104 113 -124 139 -153 171 -188 209 -232 260 -290 325 -370 421 -486 568 -676 829 -1056
57 -1056 1434 -2179 4193 -19773 -68477 -29600 13757 27283 10812 -10574 -13044 15512 27984
70 27984 7457 -9524 -1902 5181 7294 5345 -2783 -4923 527 -5680 -10221 4336 13965 -1331
84 -1331 -18124 -21826 -12007 5013 8217 -12043 -21470 -4733 6869 340 -9917 -14118 -5207 12106
98 12106 10922 -8191 -12568 -658 3683 2114 1949 1381 7851 13872 2136 -13595 -7562 6126
112 6126 8284 3214 -5284 -8761 2131 11145 1483 -8426 -3994 743 916 -812 -8507 -13104 -3428
127 -3428 3488 -175 1466 4885 -1573 -9473 -9265 -6272 2398 9018 -868 -12618 -4972 7738 7690
142G690q703q918Q53J6313R270j5842j6557M126J3769Q744j401j3283p494J0513
156i20P214p056m585K329J216N51k21m331J901O317l677n875O497O935l682q040
172e427o712J379J4435Q854j0977r955N566Q082N66n379q294N57J1697L206j0219
187b621m140O586L997K39m019m681L713P679o427j0797M230J0760M297k813q520
202b517n389Q772R232o202q656K060M811K834n1o313l798O534L231m222N58L114
218C998l004m422j610K0O684O817p875j0242M372J0731K459m943r022l681J0576
233H58R679p399j0619J080P036P074J976r315p053M208N142l698j272K200l21
248d24M72K02l219J598N126m776o975L171O114J301k079n484k828Q337Q312o102
$$ plain form
142 7690 -1013 -9931 -9078 7235 16505 663 -15894 -11768 2001 10745 9344 -3939 -11433 -920
156 -920 6294 -762 -5347 -3018 -1802 -1251 -1472 -5803 -3902 2415 -1262 -7137 -640 6295 2613 -5427
172 -5427 -12139 -10760 3675 12529 1552 -8403 -2837 5245 5811 432 -7862 -7305 4392 7598 -2621
187 -2621 -6761 -175 3822 4061 42 -4639 -926 6753 326 -10471 -6241 4519 8816 6003 -2517
202 -2517 -7906 866 10098 3896 -4760 -2700 2111 4945 4894 -1419 -5217 1317 4548 326 884 3998
218 3998 994 -3428 -5038 -5018 1666 8483 608 -9634 -5262 5469 7928 2985 -6037 -9718 858
233 858 10537 3138 -7481 -6401 635 7709 9685 370 -6683 -2475 2667 -1031 -2303 -103 -424
248 -424 48 250 -2969 -1371 3755 -1021 -7996 -4825 1289 2590 511 -4973 -7801 536 8848 2746
264B746p834J292M017K939Q2o001j949P031K801o420k404M346K649J27l414n242
280e234K868P950k477q626J18N390N532J696o302p181M145P517k241n443k44J185
296a347K597L179l163k731L464P86n257k93L452O1j221k151k751N318P774m097
312C620r675k91N837L847J094o775n683O204R017k199o641j482J586M249K657
327E365m981m558L955K584l157m65J775m90O54n01l306J772N449l196o430L22
343e208L955K680Q61m167m222N290O307l471n002o39J013K777K212l830k349N277
359A484K408l943j622J297P19Q13j463m486K262O801q49n252j284K209K528K251
375C873l868o451L357N650o51l250q76k22J708L060l034k596L160J064l215k24
$$ plain form
264 2746 -5088 -3796 221 3160 3242 -2759 -4708 2323 5124 -1296 -3700 646 3295 3422 8 -5234
280 -5234 -2366 5584 3107 -5519 -5401 -11 5521 7217 915 -6266 -2121 5396 3155 -2288 -2532 -1347
296 -1347 1250 4429 1266 -1465 1999 2785 -2472 -2765 687 748 -473 -2624 -5375 -57 7717 3620
312 3620 -6055 -6346 -509 3338 4432 -2343 -8026 -1822 7195 4996 -1645 -3127 -1541 2708 5365
327 5365 384 -4174 -219 2365 -792 -1257 518 28 682 181 -3125 -1353 4096 900 -5530 -5208
343 -5208 -1253 1427 2288 -1879 -6101 -811 5496 2025 -2977 -3616 -2603 174 2386 -1444 -3793 1484
359 1484 3892 -51 -1673 -376 343 1156 -307 -4793 -2531 4270 3421 -1831 -3115 -906 1622 3873
375 3873 5 -6446 -3089 2561 1910 -1340 -2216 -2438 -730 2330 -704 -3300 -140 924 -2291 -2515
391b515K015K53J010j267l355K445O248r29n730q93J616K862K348l872m836K983
407a617N888p10l237r11r81J554J932l346k560L763J553k587l69J209N59J085
423A225j322m623N40N764L51l527o25L93K256L027j671n089J010L925q41j051
439b58J43r43O24J573j880j304L336M24l958l21J398J264J345j412m880J213O234
456B598Q59l894j785K69K238L478k380n687J135M480L57r01k80j972J316K426
472B257k455k792K157O67k042Q89J255m30J542p2l243L80L648m96k884J67O10
489h42J201K637j716l347J728L271j635k083j02k60J912J619l287k646L103K325
505A878j892r23j323J24L068N60l669j015K856R99l46N01j039n28K633M48k538
$$ plain form
391 -2515 -500 -247 763 -504 -3859 -1414 4834 3905 -1825 -2718 -1102 1760 4108 236 -4600 -1617
407 -1617 4271 3561 324 -587 -1568 -14 1918 -1428 -3988 -225 1328 -1259 -1628 -419 140 1225
423 1225 -97 -4720 -4180 1584 1935 -1592 -2217 -1824 432 3459 1788 -3301 -2291 1634 793 -258
439 -258 -115 -1058 -434 1139 -741 -2045 1291 1715 -2243 -2564 -1166 98 1443 31 -4849 -3636 2598
456 2598 3457 -437 -2222 -1953 285 3763 1383 -4304 -3169 1311 1668 767 487 -1485 -169 2257
472 2257 -198 -2990 -833 -166 -2208 -1319 -64 -494 1048 976 -2267 -1887 1761 1265 -1619 -1452 -842
489 -842 359 2996 1280 -2067 -339 2932 1297 -786 -888 -1148 764 2383 -904 -3550 -447 1878
505 1878 -14 -937 -2260 -2136 932 1492 -2177 -3192 -336 663 317 818 -221 -749 1884 2332 -206
522b06N27J157j250l5J402k67L52R71k412m30K826M29l696q56L99Q53L080l72
540B472m361k14L914P45j909j417j545P77L918m42l108j62J960M52K06r7k446
557a257M68K549j274j438J976m09j497J113K80r54J216j94k015J81K166j103j561
574a753N48j15Q00J751j602k260J688K030j533j467k92j42K129J850k151k030
590b549K324J669n23l53j555j080K989J633k177q11R82N0Q95J415j871j959J141
607B20n5j84J246K00k518L2J694r7N5K42k718l45K923Q55j570o43p47P60K666
626B016Q90l306j146K559K45R3J84k295o58K747K70j980J31J85m51N84l1k360
644b323K59J268j072p92J197j27o41J340l41j517J131K78j216O73J520o82o98
$$ plain form
522 -206 321 1478 228 193 1595 1328 1680 2651 239 -191 2635 3064 -632 -1488 -1089 -236 2844 2472
540 2472 -1889 -2103 1811 2556 647 -770 -2315 -1538 2380 1938 -1170 -1332 628 1080 1286 1189 -1257
557 -1257 -789 1760 486 -952 1024 615 -882 231 511 -443 773 579 -1436 -1255 911 -192 -1753
574 -1753 -1205 -1320 -520 1231 -371 -2631 -943 1087 -446 -1913 -2205 -2347 -218 1632 -519 -2549
590 -2549 -225 1444 921 568 -987 -2067 922 2555 378 -433 549 599 1494 2909 1038 -921 220
607 220 165 -19 1227 1427 -1091 -1059 635 538 593 835 -1883 -2228 695 1550 -20 -663 -1410 -650 2016
626 2016 2906 -400 -1546 1013 1258 1351 1535 -760 -1418 1329 1599 -381 -250 -65 -516 68 37 -2323
644 -2323 -2064 -796 -1868 -2660 -1463 -1590 -2231 -891 -1232 -2749 -1618 -1340 -2556 -1883 -363 -1045 -1743
661a743J268k8L99J234j860j827J898J829q72q61q34p71K260J911k432k410Q88
678a951J215M89M29j753j843J813K046m21p45J44j610J292K112p23j188M16p24
695a002O8K204O49k319n35J082K55R73l0k592r92K226J145q51l9j103o50K005
713D94N47j778q24R37o65O92N28j055p73J926J42j603P14k10p96P80P87j488n0
732a695J565m61n4O14r70n22J918K4j385M52K96j037R95J460j567o58P01L4M07
751A17M95j165k124J493J908k41m51j451j016J626K439r64j713m94j34J375K105
768A805j117k567P44J662P19K54p00k265J62K003P13q14J40j754j49K361Q82j808
786B71r90M9k41J637J213k391j840J740J127J27O70j785j459J622J403q39n5l52
$$ plain form
661 -1743 -475 -503 -104 1130 -730 -2557 -659 1170 298 -563 -1397 -2168 92 2003 -429 -2839 -1951
678 -1951 -736 -247 182 -1571 -3414 -1601 445 24 -721 -577 -2187 -895 1217 494 -694 -278 -1002
695 -1002 -934 1270 1919 -400 -935 147 402 1375 1345 -1247 -2239 -13 1132 281 242 -861 -1511 494
713 494 1041 -737 -1561 -624 -1289 -597 -69 -1124 -1897 29 171 -1432 -718 -928 -1724 -944 -157 -1645 -1695
732 -1695 -130 -591 -645 -31 -1001 -1523 395 419 -966 -514 -218 -1255 -260 1200 -367 -1025 -324 -290 117
751 117 612 -553 -2677 -1184 724 483 32 -1419 -2435 -809 1630 666 -1047 -1541 -1675 -300 1805
768 1805 688 -1879 -1135 527 1246 1500 800 -1465 -1303 700 1413 599 739 -1015 -1164 1197 2079 271
786 271 -719 -670 -911 726 1939 -452 -2292 -552 575 702 1372 -413 -1872 -250 1153 314 259 -93
804i3j086J236J015r93q44J087l42k28P15j62j667P57R28j285P27P37r00j10J371
823H63j191p06J436P4n62L87n63r04J776J047j235r41J19q1N37J449j414j679
841a588O45J212K75L27r60j592M91K124K22r66j70j261M32K733j46k029j65J62
859b54O75J388J0k278r87J528Q55O02M6j937j502J913J076o34l85q72j135J293
877e98J972r95r54J99j42L02J929j161j486M87L95K2J361o3j653k74J295r6l7
896E03L33j153o05R43p0k21M68j65j288N70J013m91j00L55j075j64J352N33q78
915a40L83p76j97J350P72q65o80k9l12O59J406r98j131K56Q98k3L32k62j950M45
935h62J461J97l18k09j397N11J761K69j615N2k79l54J493O62j707p16Q61Q5P03
$$ plain form
804 -93 -1179 57 1072 79 -765 322 -20 -248 467 305 -1362 -605 323 -962 -235 502 -398 -508 863
823 863 -328 -1034 402 476 -86 301 -262 -1166 610 1657 422 -519 -400 -481 56 1505 91 -1588
841 -1588 -943 269 544 871 -89 -1681 -1190 934 1156 190 20 -1241 -809 1924 1778 -251 -416 -254
859 -254 421 1809 1819 -459 -1446 82 937 1539 1585 -352 -1854 59 1135 501 116 -756 -1891 -598
877 -598 1374 379 -575 -376 -518 -216 1713 552 -934 -447 -52 -30 1331 1268 -385 -659 636 540 503
896 503 836 -317 -922 21 -49 -270 198 33 -1255 -685 328 -163 -263 92 -983 -1147 205 738 -140
915 -140 243 -533 -730 620 1392 527 -153 -182 -494 165 1571 573 -558 -302 596 573 905 643 -1307 -862
935 -862 599 796 478 269 -1128 -617 1144 1413 -202 -150 -429 -783 710 1372 -335 -1051 -190 -105 598
954E98R52j530j146Q53N89M7L83l52j491P72J382n72j84K27j336j06J684l3q04
973f7j1Q7o83R64M86q07m51M86q16M27J077m20j199L13M57k06J398l93j259J04
993e13O09L39K95K26j193p47J569M72n09L62j150p14R35J293q03o74k27p25J220
1012F5J303n97j300k55J76M03J029q6j857qJ332KN54j31j254j73J401L37o12K49
1032E78j020p50J797P55j003o44k75k13P05J432j130j053J04O24L8P07j95j238
1050g81J69P03K79L27K75j099j88O29L00r3N72q64p15J032M56r34J93j6j005J85
1070e75J343j35j105o9P4K4J228j83j131q4L21j6J196K11j203m36N85O44J42K62
1090A093q36j105P82P74l09n6l83q53P62J123m33r53l51kj6J441J55j566r0Q09
$$ plain form
954 598 1550 20 -1126 -273 316 363 746 394 -1097 -325 1057 485 301 528 -808 -914 770 737 -67
973 -67 -78 9 -674 290 776 -31 -482 4 -812 -385 692 272 -927 -614 -157 -363 1035 642 -617 -513
993 -513 96 435 730 956 -237 -984 585 1057 548 910 -240 -954 -19 1274 471 -203 -430 -1155 65
1012 65 1368 771 -529 -784 -608 -205 824 738 -1119 -1127 205 207 761 630 -624 -797 604 941 329 578
1032 578 -442 -1192 605 1360 357 -287 -562 -775 -70 1362 232 -821 -717 -93 -55 652 457 -781
1050 -781 -612 91 370 697 972 -127 -315 314 614 521 1093 229 -486 546 1002 68 261 245 -760 -575
1070 -575 768 633 -472 -541 -467 -443 785 602 -529 -613 -292 -308 888 1099 -104 -540 45 689 831 1093
1090 1093 257 -848 -66 708 399 343 -40 -893 -131 992 559 -394 -745 -747 -763 678 833 -733 -823 -14
1110a4m12Q16L24j069m03Q66J03o4L70o67o38Q84M66l92L15q0j164O21Q91k91
1130D62m44J18j54n92J347L16j033k09J50l51Q18P84q35j066O49m7M72Q76m30
1149H31j410L62P51o5M42l48j107K21J227J04o55J59j101j48J528O34j273o71
1167e19K63l68J312O61j052j049M36K44K30O73q77j170O67J087k58k33p6j070
1185a099N04J306m3o27j74l98J4J332K77j392K11L07j10P78Q2q99q13J120k15
1204A61l41O80k26p41N87j38l31M93L19j029J71N93n42L21M09j4q10P77L06n28
1224A17M68j08q98M51Q41k79j57j78m36o5J267l95p55k21m0o9Q72M52j523l21
1244i77N42J55L21L70q38q36P19J219J2l50m78p87Q39J222m86n16k04j54K11J111
$$ plain form
1110 -14 -426 390 714 -355 -758 108 211 147 517 -150 -788 96 562 170 485 405 -759 -138 753 462
1130 462 18 136 -18 -610 737 1053 20 -189 -39 -390 428 1212 377 -689 -40 -87 385 1261 831
1149 831 -579 -217 534 469 911 563 -544 -323 904 1008 353 512 -589 -737 791 1425 152 -519
1167 -519 -256 -624 688 1349 297 -752 -316 -72 158 831 -46 -1216 -549 538 280 47 -29 -1099
1185 -1099 -595 711 668 41 -133 -531 -517 815 1092 -300 -89 218 108 886 968 69 -744 376 161
1204 161 -180 500 274 -467 120 -18 -349 144 463 -566 -395 198 -344 -23 386 372 -438 339 645 117
1224 117 585 477 -421 30 871 592 435 257 -179 -244 1023 628 -127 -348 -388 -457 415 867 -656 -977
1244 -977 -435 -280 41 411 -427 -1263 -544 675 687 337 -141 -928 -89 1133 647 131 -73 -227 -16 1095
1264A095m25j273K38K19L21P27o65j175J77P68N59j64k70p99j64J043L85m77M
1283A24j24m22O17O02q58l68O37o5j45O62n4j012O34J9m11M45L84o16j42o8l02
1304d63N82M23p20j94K09L00k89N34l62m51j3N86k67K56L56r85m13Q01N60m44
1324FQp23j29R83O32r28k26K84j66M82Q38j067o49N70K54L50K71m55j115L99J166
1345G85k72n1k74p46K60R53p6o55K33o34J6Q84O29j307o08J035J32kL71q31l32
1366d90J001j05m27K72L7n66N96K93p53J8O39m05j52N10l9o71O55k40m95K75M27
1387C80o36M43J96m67j38P64j85p36Q23q28Q0R40k51m12j43K09m39O99L95q13
1407a19q21M85O28K04J59p41q39J051O16k59l65j89l75O57Q83m26o92k44L40q0
$$ plain form
1264 1095 670 -603 -365 -146 175 902 237 -938 -761 7 566 402 132 -667 -831 212 597 120 124
1283 124 0 -422 195 797 -61 -429 208 143 -2 660 606 -406 228 247 -164 281 665 49 -93 -161 -463
1304 -463 119 542 -178 -372 -163 137 -152 382 20 -431 -444 142 -125 131 487 -498 -911 -110 450 6
1324 6 14 -709 -838 145 777 -151 -377 -93 -259 223 1061 -6 -655 -85 169 519 790 335 -780 -381 785
1345 785 513 462 188 -558 -298 655 579 -76 157 -477 -461 423 1052 -255 -863 172 304 302 673 -158 -490
1366 -490 511 406 -21 251 288 -278 318 611 -142 -124 515 110 -42 468 429 -242 413 173 -322 -47 380
1387 380 -256 187 383 -84 -222 542 357 -379 444 -384 -304 636 385 -27 -170 39 -400 299 694 -119
1407 -119 -940 -455 173 377 536 -205 -1044 7 623 364 -1 -190 -565 92 975 549 -143 -387 -47 -127
1427a27J082n16q62Q7P29k5K4l59p87l27J601L9m69n0j72l29P62M65r56J56J84
1448A50r2K77L62r40Q2P32l19o4K0N4l03K44K66n76J71J90k19j9J62m71k94P50
1470A63M9m77J18P1j18L88L07q03J2L75L29l61O09m77m78M72L41m77N50o90m19
1491e16N40P22q92o11P55m49rJ044k65q92L20K01K33j06j23p70N43O78j24k81
1511bL42n63K6N53J4m90k61L63k32M01O50o78p07Q18j24P3K17p26j14P00K66m41
1533H5l5p6k73K06O57p00J5J87j00J30J42l10j18LN16m70K18L66m55j6K66n09
1555b71j68O94j81l34M75k42l0L54M07q08j67M07l28M5O23m97m54J08O38M4k3
1576B92k22o99M63O32l75m31K41k70rQ86k09m62j7K06r0N85j95m49N5P16m43j08
$$ plain form
1427 -127 955 439 -423 -336 393 368 392 33 -754 -1081 520 559 90 40 -132 -461 301 766 -190 -34 150
1448 150 58 335 697 -243 -161 571 252 188 208 262 -41 203 469 -107 64 254 35 16 178 -293 -587 163
1470 163 212 -265 -147 -76 -194 194 501 -302 -290 85 414 53 662 185 -293 179 520 43 593 -97 -516
1491 -516 24 746 -146 -757 -2 -451 -460 584 319 -573 -253 -52 181 75 -48 -818 -275 403 279 -2
1511 -2 340 -223 -197 356 370 -120 -381 -18 -250 151 801 123 -584 234 110 183 400 -326 -440 260 526 85
1533 85 50 -26 -299 -93 564 -136 -121 66 -34 96 238 -72 -190 -187 329 -141 77 443 -12 -28 238 -271
1555 -271 -439 255 74 -260 215 -27 -57 297 704 -104 -271 136 -192 -147 476 -21 -475 -367 271 315 292
1576 292 70 -629 -166 466 91 -340 -99 -369 -378 508 299 -163 -180 26 -64 521 326 -123 -68 648 205 97
1598I7L44q60K0K08M02j76J76k61n69L90O94o16p2K79k70k0L31J2n31L84L02l76
1620a12L22J91l84k8M35o01j73O33m33j0K88n7l27M35l9q62K51N13l50oL66j79
1642a27k26L13J30l86O35l96k06M03L62m84j77K75k53J11N00m05k33O2J28l63
1662c37Q09l81o97L29M74k78J78R2p02n2R31k71p3J21j67l17Q51Q6m84P4j17r6
1684b7K35K43l02o6%Q6k20M85k63l58O8K95m79L00J86j06m82J38K67k70L27o9
1706a2l89N05j00o6j52N03n07Q0L99k12O9r1l53M0P26j62q83K21K72MN4M99m46
1729aj81K24o1K36l7j63n71L35O00k62j00J37n74L58O26n45l34M01Km39O40j33
1751A58k63K6J80n1l1J19m52L5N99J46p35M09J18o59M28J49J23n9j26l04k3N51
$$ plain form
1598 97 441 -419 -399 -191 211 35 211 -50 -619 -229 465 -151 -223 56 -214 -234 97 109 -422 -38 264 -112
1620 -112 210 401 17 -11 424 -177 -350 283 -150 -160 128 71 -256 179 140 -722 -471 42 -308 -314 52 -127
1642 -127 -353 -40 90 -296 339 -57 -263 140 502 18 -159 116 -137 -26 474 69 -164 -102 26 -337
1662 -337 472 91 -606 -277 197 -81 97 189 -513 -565 366 95 22 143 -24 -341 510 596 112 186 69 -27
1684 -27 208 451 149 83 83 169 -51 434 171 -187 -119 176 -303 -3 183 77 -405 -267 0 -270 57 -12
1706 -12 -401 104 4 -62 -214 289 -218 -138 261 49 118 27 -326 -286 440 278 -605 -384 -112 -108 -54 445 -1
1729 -1 -182 42 -19 217 180 17 -554 -219 381 119 19 156 -418 -60 566 21 -313 88 90 -349 291 158
1751 158 -105 -79 101 50 19 138 -314 -279 320 466 -269 140 258 -401 27 176 299 240 114 -190 -213 338
1773C38k66j28P8j38m85M98P38m28k18p7m7K52J48k22n57N82Jk39O10k36j69n1
1795a6Q2oJ74j93n96L19L99J41m39J19m34J33M88J7n48Km6j25N44M43m29l99J93
1818a77m9J33M48q5n59J79M59k61J70M7m30j69N34q0q1J36l77r7M16mm08M26k61
1841i0k53L19N03m93l02J96j99rM37p1j0k3L7j48M44L5l66l52O64l79L3L78l98
1864d7o33O36K1j6J03k29j60J28N72n77J70o3p0J13Q89l55o05L7J04l24P39J82
1886F15p35m3L86NJ59j83k64m51O25J20o9j93Pm13M64L05o88L71k7j55P3M53k24
1909A38n58N9M07L5J53K13q85K38J83K9k38K73j13MJ99L38p47J45L65o04L68J57
1931A59l36J83P7j99j31P45j8m35J39m91%M28J51p1k32k95j43M02N11k70n67K06
$$ plain form
1773 338 72 -56 22 -116 -601 -103 635 207 -11 -88 -135 117 265 43 -514 68 69 -170 440 204 35 -16
1795 -16 66 60 234 41 -555 -236 163 304 -135 -16 -450 -317 171 188 -360 -358 -404 -529 15 458 29 -370 -177
1818 -177 -226 -93 355 270 -289 -110 349 88 258 305 -125 -294 240 160 79 215 -162 -259 157 153 -255 171 -90
1841 -90 -343 -24 479 -14 -316 -120 -319 -328 109 38 28 5 42 -106 338 373 7 -345 319 -60 -27 351 -47
1864 -47 -680 -44 -23 -39 64 -165 -325 -197 375 -202 -32 -95 -165 -52 837 482 -123 -86 18 -306 433 615
1886 615 -120 -163 223 228 387 204 -60 -511 114 234 165 -28 -21 -434 30 335 -353 18 -9 -164 -91 362 138
1909 138 -420 -361 46 81 234 447 -438 -200 -17 12 -226 47 -66 -62 137 475 -272 -127 238 -366 2 159
1931 159 -177 6 83 -116 -247 498 480 45 184 -307 -307 121 272 201 -31 -326 -469 -67 444 174 -393 -187
1953a87L3J17M41l38o37K62L09K39j4q5l66l1O30j85M6p7o76J66P49k0m65l53
1975d42J61J20N01p7l88l97K99N39k84L48m10k62J18N58k47l18N28l77o0P03k11
1996D02n43K8J81m63N37j25k52K87np5J01M25n37q1M98j53l15P5j1j97J33N42
2018D52n54J31O19n59j85K31j19r0L0k26j48K88N74k80J9k39m51R5P90l69j74
2039a65K31k50K51j11J57l30j03K52q1O39j71l17n35N11J66q3nj00q26P25J81
2060C6j07j89Q5j00M40K80k31l18M5mJ89K35k71j35O9K38m8r0M05n58k63N10j17
2083A01k26L81j46n66O30K8p7L7k53k70J99K05P0m97N16j35l92O69k58j19P2m
2105c5r4J87M47m13j04J2j93J54L37l79l59L71k24lJ33L77q33M35M31J62n94L77
$$ plain form
1953 -187 -154 -37 404 66 -571 -309 0 239 225 140 -226 -257 373 188 234 157 -519 -353 396 376 -89 -442
1975 -442 -281 -161 340 263 -125 -522 -223 316 32 380 -30 -292 -174 384 137 -181 347 -30 -90 613 402
1996 402 -141 -113 68 -395 142 17 -235 52 47 -28 73 498 -39 -120 378 225 -90 -15 -26 -223 -90 452
2018 452 -102 29 648 89 -96 135 16 -74 -44 -270 -418 -130 444 164 183 -56 -507 -412 378 9 -165
2039 -165 66 -184 67 -44 113 -217 -320 -68 -149 490 319 2 -533 -22 144 61 56 -44 -870 -145 36
2060 36 -71 -260 -175 -275 165 445 214 -104 -59 -63 126 361 90 -45 24 262 214 124 529 -29 -292 218 101
2083 101 -125 256 110 -456 174 202 125 162 -91 -361 -162 43 113 -384 132 -3 -395 274 16 -103 -31 -35
2105 -35 -129 58 505 92 -12 0 -193 -39 298 -81 -440 -69 -293 -296 -163 214 -619 -184 247 409 -185 192
2127A92k61J14J56n0k18l45N28k44O64J02l88n06R4O4J42L24l89l13O5N05j35
2148A01M8l65j67J87P71k96m82j51L14m8K36P7n05J03K81k83K20L07l43k71K76
2169A0L6J91k84j04m37O47M85o03J9j77Q5J65j59L63p3kN1l67M7J26o5K66j76
2192D4q1m8K80oj28j53o6k28P99l49m1j44K5m4L88j76o08K51N23K15o07M54n5
2215B45k95M8L51j89J25j99k06K94M12l17l68j9k99L40N16l18m05j80L43K8J13
2236B0k51p6p3N07nk06M50l68k37K08M30n53K36O6L3m27P09n49K57n05J94OK63
2259A29l55k85M28K46k69M48p5o35L11J66P0o16O30m3k98J30j91p2O42l64M3p6
2281c6L87j14j23j56m16M54K74p9j51k30o5L33JJ58q48M11O33l89K00n3j74j79
$$ plain form
2127 192 -69 45 201 151 -67 -412 116 -128 536 638 250 -256 -162 -98 44 368 -21 -334 -269 236 101
2148 101 149 -216 -383 -196 575 279 -203 -354 -40 -88 148 225 -280 -177 104 -179 41 348 5 -266 10
2169 10 46 237 -47 -151 -588 59 544 -59 -40 -217 -132 33 -126 237 164 162 213 -154 -107 19 -46 220 44
2192 44 -37 -85 195 189 61 -92 -158 -386 413 64 23 -121 -96 -140 248 72 -536 -285 238 453 -154 300 245
2215 245 -50 -2 349 160 285 86 -120 174 586 269 -99 -118 -417 -77 439 121 -284 -464 -121 -93 20
2236 20 -231 -307 -380 127 122 -84 366 -2 -239 -31 399 -154 82 148 181 -246 463 -86 171 -334 -140 -134 129
2259 129 -226 -511 -83 163 -106 342 267 -368 -57 109 179 -437 193 150 -148 -18 -209 -281 361 -3 40 -36
2281 -36 351 237 114 -42 -458 -4 270 191 40 -190 -255 78 79 237 -611 -200 433 44 244 191 17 -162
2303a62N5K45j53K95l57j37J55K53M8k05j70j22j5O48k71m00K37m6j10L13L58
2324D59j020M24J93o7m80N38j39o7K60j5j18L64p0m85k9M10l87K91Q0l74K03K40
2346B11P6n17J10Q2k44M75j40j67K82l6R0m40K95J0J31k41K06l83P45k93n86J51
2368a83j02N63j61m0l20k02R07N7n25n4K44l05L20k01J3M5k7j72j2N91n08j35
2390b07J41j39j17N21P5n25k07M98j97M59k72k95J09P04n17j3J42k89n3M51m03
2411a34m5pL96l35N0L98k13j45K08l36k01O52R8m25n9r9K96K75m52LMP45o19k74
2435b19L18k27J03L68k1m71O3L90k26k66L01N8j41J97J7l32N63j28p41Q4j77L64
2457a23M41o7m95J28K57q8j82J62J43k29L22l05j93L39J37j58k12J11P1K90m36
$$ plain form
2303 -162 -107 138 -15 280 -77 -214 -59 194 242 37 -133 -255 -270 378 107 -293 -56 -102 -212 101 459
2324 459 -561 -137 56 -11 -491 47 -92 -159 101 86 -32 332 262 -223 -252 158 -229 62 142 -232 -29 211
2346 211 287 -230 -120 -38 -282 193 53 -114 168 132 222 -218 77 87 218 -23 183 -200 545 252 -334 -183
2368 -183 -285 278 117 77 -243 -445 462 519 -6 -60 184 -121 199 -2 11 56 29 -143 -155 436 -72 -207
2390 -207 -66 -205 -322 199 274 -251 -458 40 -157 302 30 -265 -156 548 31 18 160 -129 -182 269 -134
2411 -134 -179 -186 210 -125 -75 323 110 -35 173 -163 -364 288 386 -39 -98 -197 99 374 -78 -75 -71 674 55 -219
2435 -219 99 -128 -25 343 322 -149 -86 304 78 -188 113 171 30 227 244 -88 475 347 -394 -310 -487 -123
2457 -123 318 251 -244 -116 141 53 -129 33 176 -53 269 -36 -229 110 247 89 -123 -12 59 349 -87
2478h7n0l19L65L69n65O5J90J2K90j68l48J87L81l39J46j7K4l74M92q4k04l5R6
2501B7k99K03N4R2M35k94k25m47Q38l07k4r1j33K49M1K83o59j7K95j42K07K1l38
2524b31p0P34om52J35J29k02j75K32J20l7j06q02M56N75J9k15l72J36k3M13J08
2546C66p94J06O68m26K36j35j77J39pJ21k04lM53m48J97j26Rr3M31m04j3K76q7
2569H5r7K63l73l46N77K29n15j82L87K18l20J74J9n5J09j86k65M89K89m17Q1k69
2591a05k9M97k32j34n29N05M6J1J39m53n4K35K89l91RK23o37O60j84l5K98J04
2613B33k49m6K84J04m07p9K96n89O97k2n58k13N56R8M7L0m56k6Q16j20m66j95
2635b65L94J49K2o4l11K1L18j13n22O74J9j83l3k37J75k6K26m09m0K57o9k13R0
$$ plain form
2478 -87 -137 -456 -91 278 -287 -222 -32 -20 270 102 -246 -59 322 -17 129 112 136 -238 254 170 -34 -69 27
2501 27 -272 -69 -15 77 512 218 -7 -454 384 77 53 -38 -171 78 119 402 -257 -274 21 -121 86 107 -231
2524 -231 -301 433 427 -25 110 239 37 -138 94 214 177 71 -731 -275 300 319 104 -268 -132 -155 258 366
2546 366 -428 -322 346 -80 156 21 -156 -17 -24 97 -107 -110 343 -105 92 -34 -25 -118 313 -91 -104 172 85
2569 85 -12 251 -122 -468 109 338 -177 -359 28 246 -74 100 119 64 173 -13 -278 211 500 83 164 -105
2591 -105 -134 363 131 -3 -532 -27 19 30 169 -284 -338 -103 186 -205 -196 27 -610 50 -134 -169 129 233
2613 233 -16 -62 222 326 -81 -160 136 -453 244 222 -336 -549 7 105 152 182 -274 -300 516 396 -70 -265
2635 -265 129 278 300 236 -75 -54 264 151 -371 303 322 139 106 -131 44 18 244 -165 -205 52 -17 -230 -140
2658a40J88m74M80K4Q0j27J65o7l5j4j78J76J82l16j32N12o2j22l93J61j04L49
2680A53L22o91k26J70M19q2k51J3k78L10M40m03j06Q8J11j18M73k15l53K55PQ
2702D6J63L6k53j4k48o4M48K44k39m29M25j53n2l0j61k6K44K85k27j50K75p1k39
2725a90J52j22M0L45R2n26J75K9K0N6j2k17M44J59l97l78N24k3k24J13k15J02
2747e3K88k56k86J96K11j9l9r1k48K92L0l82p2M20J84q2l7l50J27K56K76j89k87
2770a11n3N6R1L71k88k57j0N8k1J80K59l01k5L9R4j04K25n73J42L23J08rp1j42
2794a9j89K33L42m42j79M7K05o8J80Rn69N49O9l30jK97k56J71J58j80l8M08l65
2817C2k77J04K16O4k02K55n14L44J06k64J35j58l9n8K20J06j45L75Q4n72j18M61
$$ plain form
2658 -140 48 -426 54 78 158 31 196 129 94 80 -98 78 260 -56 -188 324 262 140 -253 -92 -196 153
2680 153 475 -216 -442 -272 147 65 -186 -173 -451 -141 299 -104 -210 -122 -11 -129 344 129 -224 31 38 46
2702 46 209 245 -8 -22 -270 -334 114 358 119 -310 115 -38 -90 -120 -281 -307 -63 222 -5 -155 120 49 -190
2725 -190 -38 -160 -120 225 317 -209 -34 -5 15 71 59 -158 286 445 48 -330 194 171 -53 60 -155 -53
2747 -53 235 -21 -307 -111 100 81 42 -49 -297 -5 25 -357 -429 -9 175 93 56 -294 -167 89 365 176 -111
2770 -111 -164 -108 -17 354 66 -191 -201 -143 -164 16 275 -26 -51 -12 82 -22 203 -370 -228 95 203 194 123 -19
2794 -19 -208 25 367 -75 -254 -207 -2 -70 110 119 -450 99 168 -162 -163 134 -122 49 207 27 -11 397 32
2817 32 -245 -141 75 139 -63 192 -322 22 128 -136 -1 -159 -198 -256 -36 70 -75 300 384 -188 -306 155
2839A55qo4j60Q1L4L83l98m26L71Q6P5k10j09O9n4L33j31m2K87k11r5K46N2j10
2863A54l54K91j22K48J22Q9n82J37q7J82J48l32J8J3k3L30m9l66j71K41O25n39
2885b7Q7j66k45K01N12j95m13J39L86n23K90P4j86l60M76j51J09L54l3m76k34
2906c81M44n6K0O6o34M71kJ63n7m2K7j92L05o8j79N76m40m3L9j83J81K79l5o65
2930d06N57O1j41k46J90k35K38J19qk53l2L40k43L65k14N0k49q0K48j55J56n4
2952Hj06M9K66k49R7j22l9l3K34j97J30l71L11m00O54m7o35K08K43J25l37K68
2974E7j15J38k29p6J71J27L00n14J47R8j45R1J85l95jL96k63k74J28K17r1J15
2996F7J97n86M60o7J4l15L74l29J40K34n45K84L95l13L80m38K10m1r1J24k38j23
$$ plain form
2839 155 147 83 -77 4 38 421 23 -403 -32 54 129 -81 -190 -121 -175 158 27 -15 272 61 -34 212 264 154
2863 154 -200 91 -31 217 339 428 -154 -17 -104 78 226 -106 -88 -75 -98 232 183 -183 -354 -113 512 -27
2885 -27 60 -106 -351 -150 362 167 -246 -107 279 -244 46 120 -66 -426 50 -101 8 362 329 -147 -381
2906 -381 63 7 27 93 -541 -70 -72 91 34 -8 19 -173 132 64 -115 461 21 -22 17 -166 15 294 259 -406
2930 -406 151 212 71 -175 15 -220 18 137 129 -124 -156 184 -59 306 92 142 -107 -187 61 -94 62 8
2952 8 -98 -49 217 -32 65 -57 -96 -129 105 -92 38 -333 -22 -422 232 185 -450 -242 1 126 -211 57
2974 57 -58 80 -149 -225 -54 73 373 -141 6 104 -41 50 235 -160 -161 235 -28 -302 -174 43 -48 67
2996 67 264 -322 138 71 85 -230 144 -185 -45 189 -356 -72 323 10 390 -48 162 121 30 154 -84 -207
3018b07L61M4k87k7J07k00J05j04q4L83M7o02M02N12l11j49J90j88j64K07K07
3039B42k73j89K95j30L79j33n55J81K75M4j18k68J42j82K94k9j9k64L50k14J49
3060b3j50o3K40J77l05K64J68j35j08r7N3N6J11M03o70k00N63l0k05m09L79j29
3082a10K73J12m73K26j45r2J63J88qk52L53k32j5M8J06k90K04k6R8L6J24k66q8
3105f6J61j80k29N93o38k9N61J78l35lK61m24K25R5l78L87P4l90P3Q8n4j41n6
3128b27J06O8j05M07k67l50M27o3j5K51j27k78L07r0k76K18pK38l31M24N9k40
3150A29R8j81j93K86K65m97j4j51MJ70L04j70k23JL18l31K49l55r2L89r2M8J35
3173I7N9l04J60J85l48J55K97p44K83M49j60j35o7j08n9K20O7rp8p6K97k61J23
$$ plain form
3018 -207 154 198 -89 -116 -9 -209 -104 -208 -292 91 138 -464 -62 450 139 -10 180 -8 -172 35 242
3039 242 -31 -220 75 -55 324 191 -364 -183 92 136 18 -250 -108 -290 4 -25 -44 -308 42 -172 -23
3060 -23 -173 -236 4 181 -124 140 308 173 65 -32 21 77 188 591 -79 -279 284 254 49 -360 19 -110
3082 -110 163 275 -198 28 -117 -209 -46 142 134 -118 235 3 -12 36 142 -148 56 30 128 164 288 22 -66
3105 -66 95 -85 -314 279 -359 -388 173 351 16 13 274 -150 75 170 -208 179 253 -137 -64 24 -30 -171 -227
3128 -227 -121 -53 -158 249 -18 -368 59 -4 -19 232 105 -173 134 44 -232 -14 -21 217 -114 310 369 129
3150 129 227 46 -147 139 404 -93 -107 -258 -254 -84 220 50 -173 -172 146 -185 64 -291 -383 6 -86 -38 97
3173 97 156 -148 12 197 -151 4 301 -443 -160 289 129 -6 -73 -181 -240 -20 47 38 -40 -116 181 -80 43
3196D3O0m71L55m4n0j91L82J1J44m7k20J16L10k72k82K17o5J12K90k23k15O6K15
3219B41k13Q8j47MJ71p7o7l06M73j66M4K44l10o2m2L92p7J78m11j51j03L04J26
3242A33m6kj12k64J86N22p93K71J53k03J98mL8l30L92j61J68J5M0m16J6K62L7
3265A00j85K43l27N6M81l71p1K38l8j58O1K02k26p9K03m48N35k15m3j8K32L6k71
3288f3J37K45m61Q2L42m03K34k07j73p0L44j91K55K07m71L35m16K35Oj99K08j35
3310a59k0J68J62n36M63j1k4j24L17l77K7J21K42q6J50k37l40L62m5J0m7j42J41
3333A5j82L93j43l29J32r8K30J90j51lp5l3nK04N8m80K33K79J09k83l0j65P8J95
3357A39k85j6L20j06k17L19q4pn38L65K6K37j05m5O0P7nm25M36j32m55M72P6l1
$$ plain form
3196 43 103 -368 -13 -57 -107 -298 84 95 239 192 -28 88 398 126 -156 61 -4 108 398 175 -40 26 241
3219 241 28 116 -31 -27 144 67 0 -306 167 1 45 289 -21 -83 -125 267 190 368 -43 -194 -297 7 133
3242 133 87 85 -27 -291 -105 417 -376 -105 48 -155 43 39 77 -253 139 -22 146 161 201 -215 -199 63 100
3265 100 -85 158 -169 -113 368 -3 -74 164 126 -32 29 231 5 -74 129 -319 216 1 -42 -60 172 208 -63
3288 -63 74 319 -142 -60 282 -121 113 -94 -267 -337 7 -184 71 278 -193 142 -274 -39 -33 -232 -24 -159
3310 -159 -179 -11 151 -385 78 67 43 -81 236 -141 -114 7 249 163 313 76 -264 98 53 63 16 -126 15
3333 15 -167 226 83 -246 -114 -212 18 208 57 54 -21 -54 -59 145 203 -277 -44 235 344 61 31 -134 -56 139
3357 139 -146 -162 158 52 -165 154 70 63 -475 -110 -84 153 48 3 63 140 135 -290 146 14 -441 31 107 76
3381G6o2J28J21l79j0%m2L42j40J03k32l5P1M7K25l28k21N42P8m21J50r1J4J16
3405E2P0j01J05k80m6K6K04m6j59J31k0k9L06j81n66L33l8K83P1K4j97j1O09p86
3429b46K90Mm5j83L24no2K26k22J17k54q2n6K13J77l56m4J18J66k69J74m5p4n
3453a39K59j76N9L63m81K5J79k03L95k2j30j70J0O5K5k32L22j41J71k42K49k46
3475f0K85j47k0J70l78K48p6K31l83j17J82nK70j53m8j47m8K38M5l8L5j31J98
3498A51k47L44j26j47j95K51q3L32m91R8l2p5L13R6k16o9n0J98K17J00m90l3M48
3521B94m08M7K0M4q3M7P4j63l5Q7k34K86J72j33j90l5K85o1J53Q2l64J82k57J02
3545h8k27K23J85k08J92k9Nj10J15l86K27K20m55M6N39l12J1j96J79l0J25j2k1
$$ plain form
3381 76 14 142 263 -116 -126 -126 -168 174 34 137 -95 -130 -59 -12 213 -115 -336 206 284 -137 13 -78 -64 52
3405 52 122 21 126 -154 -200 -174 30 -16 -175 -44 -64 -93 213 32 -534 -201 -239 44 115 139 -58 -69 540 -246
3429 -246 44 48 3 -180 144 139 77 303 81 198 -56 -138 -194 19 196 -160 -204 -86 80 -189 -15 -60 -134 -139
3453 -139 120 -56 3 366 -115 -90 89 -114 281 259 129 -41 -31 34 59 -173 149 8 179 -63 186 -60
3475 -60 225 78 58 228 -150 98 22 253 -130 -247 -65 -70 200 47 -1 -148 -196 42 87 49 84 -47 151
3498 151 -96 248 122 -25 -220 31 -52 280 -211 -113 -145 -220 93 189 -27 -96 -146 52 269 369 -121 -154 294
3521 294 -114 -67 -47 -3 -86 -39 35 -128 -163 -76 -310 -24 148 15 -175 -210 75 14 167 249 -115 67 -190 -88
3545 -88 -315 -92 93 -115 77 48 53 -57 58 -328 -101 119 -336 -290 249 -63 -52 -248 -69 -99 26 14 -7
3568gK57j80j39Q7j39K01l72N22ok05Q6m6l05J71K99o31L59J37j58k21K90j56
3590a56J55k39K57o9J37J2r2J26j2k95k9J99l13N13j00J30m29J28K71j23J14k32
3612d7l74M61o1J2j13Q3J8r7J22K29l49J85J65o04M58k55J19P0K27m10K37nj96
3635a25K34Kl51m1N02P1n44J97R9j76J5K80j45Mk5J61J2l26K18K7q7J17Rj64j14
3660a50L18k30l51P50m06L5J52j66M50m07n0j20K01j58j74K84l30L04K80j36j88
3681i2K51j22j66M18k04l93L39l0J48j36l90L28l8L12j26j89K01k74J18k08L85
3702A32j47oJ13J51m93K40l5j24P5L5R2k7K52k19o1M09l83j58nL02l51K21j10
3725i7k2J36J35k73L9K25k2l02J52j74J12L68l26r4J16R8j66J2P1p7N9o5j0N2
$$ plain form
3568 -7 250 70 -69 18 -121 80 -292 230 224 19 105 59 -246 -75 224 -407 -48 89 -69 -290 0 -156
3590 -156 -1 -240 17 -52 85 97 5 131 119 -176 -205 -6 -319 194 94 224 -205 -77 194 71 185 -47
3612 -47 -421 40 -21 -9 -122 -39 -21 -118 4 233 -116 69 234 -370 88 -167 -48 22 249 -161 76 71 -125
3635 -125 109 111 -240 -281 221 292 -252 -55 44 -132 -117 163 18 22 -3 158 170 -156 62 89 2 119 128 -36 -150
3660 -150 168 -62 -413 337 -69 -34 118 -48 402 -5 -55 -175 26 -132 -306 -22 -352 -48 232 96 -92
3681 -92 159 37 -129 289 85 -308 31 1 149 13 -377 -49 -87 225 99 -90 111 -163 -45 -253 132
3702 132 -15 -21 92 243 -250 -10 -45 -169 -94 -59 33 6 258 39 -22 387 4 -154 -159 143 -208 13 -97
3725 -97 -119 17 152 -121 -82 143 121 -181 -29 -203 -91 277 -49 -143 -27 71 -95 -83 -12 -89 -30 -95 -105 -53
3749e3L27n81N96k70q2k31M47m5r7m1k07j2J40M93n62RK04k59K05L40l7m54O2
3772a08K7o8M46j54j96J62j22K18l1n1q6Jj56L29l33K29l17J48K82K3k09l58K03
3795a21o1K60K17J05m97N2K77l59l3K43k03O7k02J21K69k4l59L04O9l85L94m34
$$ plain form
3749 -53 274 -307 289 19 -63 -294 153 108 11 -30 -237 -249 -109 384 -178 -169 35 -224 -19 321 284 -170 -108
3772 -108 -81 -149 297 143 -53 109 -13 205 174 123 37 38 -118 211 -122 107 -210 -62 220 243 34 -324 -121
3795 -121 -182 78 295 400 -97 -45 232 -127 -160 83 -120 -53 -255 -134 135 111 -248 56 125 -260 134 -300
$$ [...]
8191A03
##END NTUPLES=NMR FID
##END=
