##TITLE=1H_TG-2253-p
 CDCl3, 8 sc, 
 25.9.2019
##JCAMPDX= 6.0         $$ Bruker NMR JCAMP-DX V2.0
##DATA TYPE= NMR FID
##DATA CLASS= NTUPLES
##ORIGIN= UXNMR, Bruker Analytische Messtechnik GmbH
##OWNER= root
$$ XWIN-NMR		Version 3.5
$$ Wed Sep 25 14:08:09 2019 Russian Standard Time (UT+4h)  she@DPX200
##.OBSERVE FREQUENCY= 200.1315
##.OBSERVE NUCLEUS= ^1H
##.DELAY= (6, 6)
##.ACQUISITION MODE= SIMULTANEOUS
##.ACQUISITION SCHEME= undefined
##.AVERAGES= 8
##.DIGITISER RES= 18
##SPECTROMETER/DATA SYSTEM= spect
##.PULSE SEQUENCE= zg30
##.SOLVENT NAME= CDCl3
##.SHIFT REFERENCE= (INTERNAL, CDCl3, 0, 15.7039)
##AUDIT TRAIL= $$ (NUMBER, WHEN, WHO, WHERE, WHAT)
$$ ##TITLE= Audit trail, XWIN-NMR		Version 3.5
$$ ##JCAMPDX= 5.01
$$ ##ORIGIN= Bruker BioSpin GmbH
$$ ##OWNER= she
$$ F:/spectra/data/she/nmr/H-F/1/audita.txt
$$ ##AUDIT TRAIL=  $$ (NUMBER, WHEN, WHO, WHERE, WHAT)
(   1,<2019-09-25 14:06:51.01 +0400>,<she>,<DPX200>,
      <created by zg, POWCHK disabled, PULCHK disabled
       configuration hash MD5:
       00 E9 B6 7A A2 85 ED C7 34 08 36 98 17 FE 4E 26
       data hash MD5: 16K
       CE 9F BB 7F 0A 2E 30 2C 9D 26 A5 E8 20 36 A4 33>)
$$ ##END=
$$ 
$$ hash MD5
$$ 4C 54 22 F8 81 3F 32 D9 5C 70 34 39 F4 68 46 15
##$RELAX= 
##$RELAX= 
##$RELAX= 
##$RELAX= 
##$RELAX= 
##$RELAX= 
$$ Bruker specific parameters
$$ --------------------------
##$DU= <F:/spectra>
##$EXPNO= 1
##$NAME= <H-F>
##$PROCNO= 1
##$TYPE= <nmr>
##$USER= <she>
##$AMP= (0..31)
100 100 100 100 100 100 100 100 100 100 100 100 100 100 100 100 100 100 
100 100 100 100 100 100 100 100 100 100 100 100 100 100 
##$AQSEQ= 0
##$AQ_mod= 1
##$AUNM= <au_zg>
##$AUTOPOS= <>
##$BF1= 200.13
##$BF2= 200.13
##$BF3= 200.13
##$BF4= 200.13
##$BF5= 200.13
##$BF6= 200.13
##$BF7= 200.13
##$BF8= 200.13
##$BYTORDA= 1
##$CFDGTYP= 0
##$CFRGTYP= 5
##$CHEMSTR= <none>
##$CNST= (0..31)
1 1 145 1 1 1 1 1 1 1 1 1 1 1 1 1 1 1 1 1 1 1 1 1 1 1 1 1 1 1 1 1 
##$CPDPRG= <>
##$CPDPRG1= <>
##$CPDPRG2= <>
##$CPDPRG3= <>
##$CPDPRG4= <mlev>
##$CPDPRG5= <mlev>
##$CPDPRG6= <mlev>
##$CPDPRG7= <mlev>
##$CPDPRG8= <mlev>
##$CPDPRGB= <>
##$CPDPRGT= <>
##$D= (0..31)
0 1.2 0 0 0 0 0 0 0 0.06 0 0.03 0 0 0 0 0.0002 0 0 0 0 0 0 0 0 0 0 0 0 
0 0 0 
##$DATE= 1569406010
##$DBL= (0..7)
120 120 120 120 120 120 120 120 
##$DBP= (0..7)
150 150 150 150 150 150 150 150 
##$DBP07= 0
##$DBPNAM0= <>
##$DBPNAM1= <>
##$DBPNAM2= <>
##$DBPNAM3= <>
##$DBPNAM4= <>
##$DBPNAM5= <>
##$DBPNAM6= <>
##$DBPNAM7= <>
##$DBPOAL= (0..7)
0.5 0.5 0.5 0.5 0.5 0.5 0.5 0.5 
##$DBPOFFS= (0..7)
0 0 0 0 0 0 0 0 
##$DE= 6
##$DECBNUC= <off>
##$DECIM= 24
##$DECNUC= <off>
##$DECSTAT= 4
##$DIGMOD= 1
##$DIGTYP= 9
##$DL= (0..7)
0 120 120 120 120 120 120 120 
##$DP= (0..7)
150 150 150 150 150 150 150 150 
##$DP07= 0
##$DPNAME0= <>
##$DPNAME1= <>
##$DPNAME2= <>
##$DPNAME3= <>
##$DPNAME4= <>
##$DPNAME5= <>
##$DPNAME6= <>
##$DPNAME7= <>
##$DPOAL= (0..7)
0.5 0.5 0.5 0.5 0.5 0.5 0.5 0.5 
##$DPOFFS= (0..7)
0 0 0 0 0 0 0 0 
##$DQDMODE= 0
##$DR= 18
##$DS= 0
##$DSLIST= <SSSSSSSSSSSSSSS>
$$ [...]
##$SUBNAM2= <"">
##$SUBNAM3= <"">
##$SUBNAM4= <"">
##$SUBNAM5= <"">
##$SUBNAM6= <"">
##$SUBNAM7= <"">
##$SUBNAM8= <"">
##$SUBNAM9= <"">
##$SW= 24.0689530833862
##$SWIBOX= (0..15)
0 0 2 0 0 0 0 0 0 0 0 0 0 0 0 0 
##$SW_h= 4816.95568400771
##$TD= 16384
##$TD0= 1
##$TE= 0
##$TE2= 300
##$TE3= 300
##$TEG= 300
##$TL= (0..7)
0 120 120 120 120 120 120 120 
##$TP= (0..7)
150 150 150 150 150 150 150 150 
##$TP07= 0
##$TPNAME0= <>
##$TPNAME1= <>
##$TPNAME2= <>
##$TPNAME3= <>
##$TPNAME4= <>
##$TPNAME5= <>
##$TPNAME6= <>
##$TPNAME7= <>
##$TPOAL= (0..7)
0.5 0.5 0.5 0.5 0.5 0.5 0.5 0.5 
##$TPOFFS= (0..7)
0 0 0 0 0 0 0 0 
##$TUNHIN= 0
##$TUNHOUT= 0
##$TUNXOUT= 0
##$USERA1= <user>
##$USERA2= <user>
##$USERA3= <user>
##$USERA4= <user>
##$USERA5= <user>
##$V9= 5
##$VALIST= <valist>
##$VCLIST= <CCCCCCCCCCCCCCC>
##$VD= 0
##$VDLIST= <DDDDDDDDDDDDDDD>
##$VPLIST= <PPPPPPPPPPPPPPP>
##$VTLIST= <TTTTTTTTTTTTTTT>
##$WBST= 1024
##$WBSW= 4
##$XGAIN= (0..3)
0 0 0 0 
##$XL= 0
##$YL= 0
##$YMAX_a= 229224
##$YMIN_a= -448168
##$ZGOPTNS= <>
##$ZL1= 120
##$ZL2= 120
##$ZL3= 120
##$ZL4= 120
##$ABSF1= 10
##$ABSF2= 0
##$ABSG= 5
##$ABSL= 3
##$ALPHA= 0
##$AQORDER= 0
##$ASSFAC= 0
##$ASSFACI= 0
##$ASSFACX= 0
##$ASSWID= 0
##$AUNMP= <proc_1d>
##$AZFE= 0.1
##$AZFW= 0.1
##$BCFW= 1
##$BC_mod= 2
##$BYTORDP= 1
##$COROFFS= 0
##$CY= 11.3945322036743
##$DATMOD= 1
##$DC= 2
##$DFILT= <>
##$DTYPP= 0
##$F1P= 20.1720416913024
##$F2P= 0.152960286110954
##$FCOR= 0.5
##$FTSIZE= 0
##$FT_mod= 4
##$GAMMA= 1
##$GB= 0.15
##$INTBC= 1
##$INTSCL= 1
##$ISEN= 128
##$LB= 0.24
##$LEV0= 0
##$LPBIN= 0
##$MAXI= 10000
##$MC2= 0
##$MEAN= 0
##$ME_mod= 0
##$MI= 1.114404
##$NCOEF= 0
##$NC_proc= 0
##$NLEV= 6
##$NOISF1= 3.799351
##$NOISF2= 2.8
##$NSP= 1
##$NTH_PI= 0
##$NZP= 0
##$OFFSET= 15.70392
##$PC= 1
##$PHC0= -9583.573
##$PHC1= 31.60095
##$PH_mod= 1
##$PKNL= yes
##$PPARMOD= 0
##$PSCAL= 0
##$PSIGN= 0
##$REVERSE= no
##$SF= 200.130013532006
##$SI= 16384
##$SIGF1= 3
##$SIGF2= 2
##$SINO= 400
##$SIOLD= 16384
##$SREGLST= <1H.CDCl3>
##$SSB= 0
##$STSI= 0
##$STSR= 0
##$SW_p= 3612.71676300578
##$SYMM= 0
##$S_DEV= 0
##$TDeff= 0
##$TDoff= 0
##$TI= <>
##$TILT= no
##$TM1= 0
##$TM2= 0
##$TOPLEV= 0
##$USERP1= <user>
##$USERP2= <user>
##$USERP3= <user>
##$USERP4= <user>
##$USERP5= <user>
##$WDW= 1
##$XDIM= 8192
##$YMAX_p= 0
##$YMIN_p= 0
$$ End of Bruker specific parameters
$$ ---------------------------------
##NTUPLES= NMR FID
##VAR_NAME=  TIME,          FID/REAL,        FID/IMAG
##SYMBOL=    X,             R,               I
##VAR_TYPE=  INDEPENDENT,   DEPENDENT,       DEPENDENT
##VAR_FORM=  AFFN,          ASDF,            ASDF
##VAR_DIM=   8192,          8192,            8192
##UNITS=     SECONDS,       ARBITRARY UNITS, ARBITRARY UNITS
##FACTOR=    0.0002076,     1,               1
##FIRST=     0,             0,               0
##LAST=      1.7004516,     0,               0
##MIN=       0,             -448168,         0
##MAX=       1.7004516,     229224,          0
$$ Real data points
##PAGE= N=1
##DATA TABLE= (X++(R..R)), XYDATA
0@%%%%Qj6J6j6K4l2M0n6P2q8J04j21J45j76K09k46K87l39L95m52N23o03O89p83
28d16Q88j006J136j276J432j608J796k000K229k479K751l051L380l743M144m587
44b410N081n634O254o955P756q683R767j1054J2615j4554J7039k0353K5028l2177
58a8280M4586p2132K35227q8185m07137L17319K17826j37745j70818J13000M0099
69G3760m0121J9398N7312j07650q5178Q7340J02405j01731p4406J02616N4700
80H8445j35733k4679J48709K0211j65222l7789J37553Q9199o7755j09980j7245
91g4286R5139N2398o9853o1985L1265K5238M2L0458K165o6345k0276N8134K1549
104B3643m3977j6836K2747j3273l4097N0534Q5777o3888j40185O4678J83936m4071
$$ plain form
0 0 0 0 0 0 8 -8 8 -8 16 -16 24 -32 40 -48 56 -65 80 -96 113 -133 154 -185 210 -242 281 -322 367 -416
28 -416 472 -534 602 -674 758 -850 946 -1054 1175 -1304 1447 -1604 1776 -1967 2177 -2410
44 -2410 2671 -2963 3291 -3664 4092 -4591 5176 -5878 6737 -7817 9222 -11131 13897 -18280
58 -18280 26306 -45826 189401 101216 -305921 11398 229224 91479 -79339 33661 73760
69 73760 33639 53037 110349 2699 -82479 4861 107266 5535 -68871 33745 88445
80 88445 -47288 -71967 76742 96953 -68269 -106058 31495 120694 52939 -57041 -74286
91 -74286 20853 73251 3398 -58587 -27322 -2084 -2042 28416 30581 -35764 -56040 2094 23643
104 23643 -20334 -37170 -14423 -27696 -61793 -11259 74518 10630 -129555 -64877 119059 74988
116G4988j79921L1594J36863l9162q1776N7916L7470p2112j1881P8561R907o3742
128b1295n301M2546j5499l6035M5796L8697r4175o8037J26227J07395j18211j19719
140a17611Q8788J12725l4323p3385j0582K2337K2256L825j4073J065J0139p035
152D126P833K5665n707k3329r350j4526L318N5868K1469p8044o1140O3145R5870
165H5198k0944j15789k7883J18889O8865r7205p4073O4430L7293n1528R58M6391
177C4602j9511k7400L6920J8592l1691l838J6713k8395k9500M9552O8892m6819
189C8117j14477K0186J39485Q927j35264k5866J05781K8842o0382k0334O653j0854
201a9186J0891K5578n882j5849K148M429j874o63P549R096k6323l9956L8443P8750
$$ plain form
116 74988 -104933 -73339 63524 24362 -57414 502 37972 -34140 -46021 32540 42447 -21295
128 -21295 -26596 15950 451 -35584 10212 48909 -45266 -113303 12924 120319 2108 -117611
140 -117611 -28823 83902 49579 -23806 -34388 -12051 10205 14030 -43 1022 11161 4126
152 4126 11959 37624 31917 8588 -762 -15288 -11970 43898 65367 -12677 -73817 -10672 85198
165 85198 64254 -51535 -79418 39471 108336 11131 -62942 1488 38781 -12747 -11789 34602
177 34602 15091 -12309 24611 43203 11512 7674 24387 -4008 -33508 16044 84936 38117
189 38117 -76360 -56174 83311 92238 -43026 -68892 36889 65731 5349 -14985 -8332 -19186
201 -19186 -8295 17283 11401 -4448 -2300 2129 255 -408 7141 16237 -10086 -50042 -11599 67151
215F7151l1776j04599K617R6343K6246o6711m5330L7486N9496j0243n6445l672
227b9437L0199j7690j7998L5965J6270k6635K884J4939j7581N909L0779l3215
239e611o2897K8660Q8145O495q9737m2821Q0667P0694o2407p8599M1494O0651
251C4734k5960k6359K0660m770k0003J5683J0251j2955J0876J5298k2802j8819
263b4166L0029L6073k2806o7137q457Q5811M4042q0088o0515O2148O0848l4892
275B0890m7379N216K5660J4140q210j5963L770O323j5307l777J9094P583k98j461
289A0281k3345j357N2086O372q0974k8967Q0310N2329n1860n9212K1539N9153
301C6355J110n4870j3928M0715O280k7530J0035J7638j9193r794J0201r643M001
$$ plain form
215 67151 35375 -69224 -66607 29736 55982 -10729 -56059 -18573 40923 30680 -25765 -29437
227 -29437 762 -16928 -34926 1039 17309 -9326 -6442 8497 -9084 -3175 27604 -5611
239 -5611 -68508 -39848 48297 54792 -34945 -77766 2901 73595 11188 -67411 -25917 34734
251 34734 8774 -17585 3075 -1695 -21698 -6015 4236 -8719 2157 17455 -5347 -24166
263 -24166 5863 41936 19130 -48007 -56464 29347 73389 -6699 -67214 -5066 55782 20890
275 20890 -26489 -21273 4387 18527 10317 -5646 -1876 4447 -10860 -14637 4457 12040 11742 10281
289 10281 -13064 -14421 37665 44037 -36937 -65904 14406 66735 14875 -44337 -22798 36355
301 36355 37465 -17405 -31333 9382 15662 -11868 -1833 15805 -3388 -13182 -2981 -12624 -8623
314h623L5166j0439n3400P632O5457J3839o4255m7884M3684P1223k0330p6529
326d4459O285O9177M844m2593m368J3010m669j127N0o968R363J1592j7387j3658
340b0908K0891K4363r573m2499k2352N0366N5752m6538p6048L4244Q0641j0817
352C7522o4806j3419L5259K5889r400k3773L459J9621n301j5327N387L614n192
365f467K993p750q667L4118K5107n1539m4500M7465N2176l3543n8129P252N9805
378A8321K5887m5463m0680K8497L2967j9844j7203J3256K736j098J2991n290j4862
391i785J2349M862k8264m380L7607J7791k8910l0900J7153M8585m295o8311j6671
404e3169O5360K8691m4332k1551K6313J6391o170j3441j3310Q245J9689n638j5450
$$ plain form
314 -8623 26543 16104 -37296 -29664 35793 49632 -14623 -62507 -18823 52400 32070 -44459
326 -44459 -38174 31003 35847 -6746 -11114 1896 -2773 -3900 -3850 -10818 -1455 10137 -7250 -20908
340 -20908 -17 24346 14773 -27726 -50078 288 56040 9502 -66546 -32302 48339 37522
352 37522 -27284 -40703 -5444 20445 11045 -12728 -9269 10352 5051 -10276 -4889 -1275 -6467
365 -6467 -3474 -11224 -19891 14227 39334 -12205 -56705 -9240 42936 9393 -48736 -41484 18321
378 18321 44208 -1255 -41935 -13438 19529 -315 -17518 -4262 -1526 -2624 10367 5077 -9785
391 -9785 2564 7426 -20838 -25218 12389 30180 1270 -29630 -12477 36108 31813 -36498 -53169
404 -53169 12191 40882 -3450 -25001 1312 17703 11533 -1908 -15218 -6973 12716 7078 -8372
417h372Q113J6897K213j6467k1732J2440L9757j1740n5476R505O4872K064n7276
430a5202j5908L7135K6024j8074l5061J821L6580P104k9253o932J6964N253k156
443H295q111j6256J2189L1463j6581m0558J8211M5274j1098m5075n993L8266K4440
456C4466l0547l8168K3996M3096j8083l7653J0175K1634m192o968n627n214J7423
469D338J4297k3373j8055K2471J9508j7758k7730K378L5687J5408m1039k8822
481d2690M4595L7793l7562l8391K0723K9022l904k0123j1310J4507K4464p588
493I536k5602K413J8838K359j0512j2404J557K8616P473m1026j4480M7139J8708
506C2615m6410k6640L4092L6788j1341l9630p387L9730J8212l6581k5439K0922
$$ plain form
417 -8372 -259 16638 18851 2384 -19348 -6908 32849 21109 -34367 -24862 40010 42074 -15202
430 -15202 -31110 6025 32049 13975 -21086 -19265 17315 24419 -4834 -11766 5198 10451 8295
443 8295 184 -16072 -3883 27580 10999 -29559 -11348 33926 22828 -22247 -28240 10026 34466
456 34466 3919 -34249 -10253 32843 14760 -22893 -12718 8916 4724 -2244 -7871 -13085 4338
469 4338 18635 -4738 -22793 -322 19186 1428 -26302 -23924 11763 27171 -13868 -42690
481 -42690 1905 39698 2136 -36255 -15532 13490 9586 -10537 -21847 -7340 17124 9536
493 9536 -16066 -13653 5185 7544 -2968 -15372 -13815 14801 22274 -18752 -33232 13907 32615
506 32615 -13795 -40435 -6343 30445 19104 -20526 -27913 11817 30029 -6552 -31991 -11069
518a1069K1248J82q484j5544K847K9319R91l8079l925L7230N348l2572j0973K6870
532C389K4358j8954l9452Q959M8989K37m7312p979L5876J5637j5440k2923j0820
545b5435K1547K6850j4279k7979J0501K6205Q85j8518j3824Q406K0571j0164k9129
558b4363J5967L7738j5110l7553J1651L3689m62k7550j7328J5032K9760l327l2638
571a4494o176K2842J1688o449j3127r975J5916K2508j8194k6836K1454K4559k4411
584f95k4366K0265K5701q044k7136o160L1610K2220k9345l2068J7782K8254m457
597A3561j9673j3695M975K7410Q513l0363j1905L0020J2361k5127j4387J4484
609c826J7826n899k7967l312L8667J3017m1899j9923L7113K7236j8402k8872o589
$$ plain form
518 -11069 10179 10361 1877 -13667 -10820 18499 19490 -18589 -22514 14716 20064 -12508 -23481 3389
532 3389 27747 8793 -30659 -21700 27289 27526 -19786 -27765 8111 23748 8308 -14615 -25435
545 -25435 -3888 22962 8683 -19296 -8795 17410 18295 -223 -14047 -5641 14930 4766 -24363
558 -24363 -8396 29342 14232 -23321 -11670 22019 21557 -5993 -23321 -8289 21471 18144 -14494
571 -14494 -20670 2172 13860 7411 -5716 -15691 225 22733 4539 -22297 -843 23716 -695
584 -695 -25061 -4796 20905 12861 -14275 -20435 11175 33395 4050 -28018 -10236 18018 13561
597 13561 -6112 -19807 -14832 12578 21091 -9272 -21177 8843 21204 -3923 -18310 -3826
609 -3826 14000 8101 -19866 -23178 15489 28506 -13393 -33316 3797 31033 12631 -16241 -22830
622b2830K1624K2807j4966l0902N106K8223O757j3458j3126L294J9883L28l0468
635a7728k189L6926j8m0826j011L9982J0862k8152k2832J2218L2595O840l2404
648e737j9194J9881J8149o057j6419j2789R936K7163k068k6291N803K4508j3057
661C828k6387R532K2689k380k0516r750K3792L0902j5932m1955L363L8766Q681
674B4633k3458j8146M251K3327J2233k2105k0842J4538J6852p179p054N574P704
687A0328O46j5836j2993K1506J9756l1115k9457L2177M0728j2105l4855q756K3266
700C290K5384r136l2980n624K5905J2737j0175j3385l442J3363J1148j4995r544
713g454K2218M137l3248p038L3947J1065k8500k3362J0781L4252J5312l0701l0727
$$ plain form
622 -22830 -1206 21601 6635 -24267 -19161 9062 15819 2361 -10765 -7471 12412 12740 -17728
635 -17728 -19917 17009 16991 -23835 -24846 15136 25998 -2154 -24986 -12768 19827 26667 -5737
648 -5737 -24931 -5050 13099 7042 -9377 -22166 -12230 14933 12865 -13426 -7623 16885 3828
661 3828 -22559 -13027 9662 7282 -13234 -22984 808 31710 15778 -26177 -22814 15952 24633
674 24633 1175 -16971 -12720 10607 22840 735 -20107 -5569 11283 4104 -2950 2624 10328
687 10328 10974 -4862 -17855 3651 23407 -7708 -37165 -4988 35740 23635 -11220 -19976 3290
700 3290 28674 19538 -13442 -19066 6839 19576 9401 -3984 -7426 5937 17085 2090 -7454
713 -7454 14764 18901 -14347 -21385 12562 23627 -4873 -28235 -17454 16798 32110 1409 -29318
726b9318J9127L4438k781k6662j6548J0034K5647L461k4658m700K2171J803j5348
739c334N431J3564o809j7813r796J3122K6187o640m1212m970M4660J9843k9619
752B614k8663M504K5930J6448j7491k6887O438K4198K518j1688n039M619Q248
765E749j424r387J1214J8625k2169l2234K0542L6818j2874l5851m679K5996K5753
778B6079m620l3349j4705K4810J9582j3416k0424l437J5263J4682r373j4428J4189
791H53J3819j9065j0379K5461J4728k1754k2907L738K7485J9291k4359l6406J4759
804a4736M3645K753l2803j6996J0968K0997M061k1302j5077J4068J1826p444k390
817b430Q886J740p258q451N792K3947K118m0008j7995M1634L1137k6227l2073
$$ plain form
726 -29318 -10191 24247 21466 -5196 -21744 -11710 13937 17398 -7260 -11960 10211 12014 -3334
739 -3334 2097 15661 8852 -8961 -18757 -5635 20552 13912 -27300 -32270 12390 32233 2614
752 2614 -26049 -21545 4385 20833 3342 -23545 -17107 7091 9609 -2079 -7118 -2499 5749
765 5749 4325 -5062 6152 24777 2608 -29626 -9084 27734 14860 -20991 -25670 326 26079
778 26079 21459 -11890 -26595 -1785 17797 4381 -16043 -19480 -4217 10465 1092 -13336 853
791 853 14672 -4393 -14772 10689 25417 3663 -19244 -15506 11979 31270 6911 -29495 -14736
804 -14736 28909 31662 -1141 -18137 -7169 13828 17889 -3413 -18490 -4422 7404 -40 -2430
817 -2430 6456 8196 938 -7513 -1721 22226 24344 -15664 -33659 7975 39112 12885 -19188
830a9188N882K8117J9046j3316l2895n200K6157J1365j4092j2693P75P886L318
843E162o292J129J2054r667k3351J2718L3297o139l4748j1816K0267K7355K450
856B2419l3001k0698L0302L4151j2811k9851o211J3543J3365l336j6055j770J2629
869B676k648p474J1534R154j4031j6651K354K0196J6607j9913l7940Q978M5916
882A8758O141l6819j6381J8597K4104O383j9870k1566R872K0961m378j4700K286
895f612P880o16n626J022J5082N646k6598j8024K8350K6889k2110l1180L356K4822
909B281J7736q736k9307n148L1420J5058k0386j6040N901R375J853n744k934R213
923D542J962j5338P92K4589M573k5009j5450J2854K3948N071k8995k4315K4048
$$ plain form
830 -19188 -13306 14811 33857 20541 -12354 -17554 8603 19968 5876 -6817 -6042 1844 5162
843 5162 -1130 -1 12053 2386 -20965 -8247 25050 18911 -15837 -27653 -7386 19969 22419
856 22419 -10582 -31280 -978 33173 20362 -9489 -15700 -2157 11208 7872 -8183 -9953 2676
869 2676 28 -7446 4088 13242 -789 -17440 -15086 5110 21717 1804 -36136 -27158 18758
882 18758 24899 -11920 -28301 -9704 14400 20783 913 -20653 -10781 10180 5802 -8898 -6612
895 -6612 1268 652 -4974 -3952 11130 16776 -9822 -27846 504 27393 5283 -25897 -22541 2281
909 2281 20017 11281 -18026 -23174 8246 23304 2918 -13122 -7221 2154 4007 -1737 -4671 4542
923 4542 6504 -8834 -8042 16547 21120 -3889 -19339 -6485 17463 22534 -6461 -30776 -6728
936f728L4234j0504k8649p73J5332R684m11j2905p958R760M718j0122K019J3541
950A1238l515j5979k334J7781J8482j2690l5012n58M0498J2778l4030k2503J4631
963a1213K3327Q765j5233k2222O144K5140q15j8604r72Q295k890n787J941R960
977E836O728j5664j8011J7757K9805j0496l4487p106K4211K2298p388l2996j1090
990c0603L2092K2605j9708k0599N906J1566L849l284q521j55P057n198o758J4790
1004C039J1258j6699j7030R301K3352O696k4441k5862J5934L4926m374l1948o864
1017b2712J7501J4144R64j3647j2100J0544J3343q577p540R497J309j2048j323
1030a0645J2993J1591o085k2196l977L0321J7582k6439k5969J0568K4647P333
$$ plain form
936 -6728 27506 17002 -11647 -12420 2912 12596 12185 -720 -8678 1082 5800 -4322 -2303 11238
950 11238 7723 -8256 -10590 7191 25673 12983 -22029 -22587 17911 30689 -3341 -25844 -11213
963 -11213 12114 20879 5646 -16576 -10432 14708 13893 -4711 -5683 2612 -278 -6065 -4124 5836
977 5836 12564 -3100 -21111 -3354 26451 15955 -18532 -25638 -1427 20871 13483 -19513 -30603
990 -30603 1489 24094 4386 -16213 -10307 1259 5108 1824 -6697 -6852 205 -4993 -11751 3039
1004 3039 14297 -2402 -19432 -10131 13221 19917 -4524 -30386 -14452 20474 16100 -15848 -22712
1017 -22712 -5211 8933 9897 -3750 -15850 -5306 8037 -540 -8080 1417 2726 -9322 -10645
1030 -10645 2348 13939 7854 -14342 -18319 12002 29584 3145 -22824 -12256 12391 19724
1042A9724j5869k1284N149K6336K827k0781m053J1256O33n104J35L219M063n045
1056A206j3838O508K5544k67k9148q923K3246K1064p529k8501j0949K6500K2417
1069B7330j7966k3433P263J5491L414n730r225r02J0013k220j2542O458J5146
1082A3097r554j9215M918K0598Q343j7646k3683Q172L3823M361l1559j4080J8935
1095c490J7776j814j5923j1800J1703J7233p602j4702P105Q100r114o782O306
1108c004Q583J87j4586j1422J8408K3117j5126k9152L501K5515J0363j3729k1058
1121a8403J027K4991Q609k0046j0119J2161O628l634k625o6L463K430r376l743
1135h703J7636O905k2385j3711J7024J9576l472k2185j2334J9582K4444j2021
$$ plain form
1042 19724 3855 -17429 -12280 14056 16883 -3898 -7951 3305 3938 -1166 -1031 2188 6251 1206
1056 1206 -12632 -6124 19420 19153 -9995 -18918 4328 25392 17863 -10638 -21587 4913 27330
1069 27330 9364 -14069 -6806 8685 12099 6369 -2856 -3758 6255 4035 -8507 -2049 13097
1082 13097 3543 -15672 -10754 9844 18187 541 -23142 -14970 18853 23214 -8345 -22425 -3490
1095 -3490 14286 12472 -3451 -15251 -3548 13685 6083 -8619 -1514 6586 -2528 -9310 -3004
1108 -3004 5579 5766 -8820 -20242 -1834 21283 6157 -22995 -19494 6021 16384 2655 -18403
1121 -18403 -17376 7615 16224 -3822 -13941 -1780 4848 1214 -1411 -1477 1986 4416 -4960 -8703
1135 -8703 8933 15838 -6547 -20258 -3234 16342 12870 -9315 -21649 -2067 22377 10356
1147A0356k6696J640J8983O356o794q959j491J1663N207j2052k808J3446j608
1160G243j5278J413J5897O966j0816j7967J367K5576Q362k7002j7181J8139K0763
1173A7482k847j7160j1156J0138J8249n636j9042K688J4279j683q050J773N475
1186D510K407o888j0637Q066K0694o054k5397M89K3094Q127j4923j7827J621K2391
1200I673R331k0175j3856J4042J2561o586r563k074N206P421n498j0407J0400
1213D75J3755j2729j5697R731J6606k006j6061j0069J2690K0634o538k4957P08
1226a3458K0729N592j1642r300J168J1882N753j3930q856J4246P886j4362p116
1239a1408J1271R454m033j3754m696J7789J3929j8253k0431J2596K0506k823j5969
$$ plain form
1147 10356 -16340 -14700 4283 10639 3845 -5114 -6605 5058 10265 -1787 -4595 8851 7243
1160 7243 -8035 -6622 9275 16241 5425 -12542 -11175 14401 22763 -4239 -21420 -3281 17482
1173 17482 14635 -2525 -13681 -3543 14706 9070 -9972 -7284 6995 5312 -2738 -965 4510
1186 4510 6917 29 -10608 -2542 18152 12098 -13299 -12810 10284 18411 3488 -14339 -12718 9673
1200 9673 19004 -1171 -15027 -985 11576 4990 -4573 -6647 -1441 5980 482 -9925 475
1213 475 14230 1501 -14196 -4465 12141 10135 -5926 -15995 -3305 17329 10791 -14166 -13458
1226 -13458 7271 12863 1221 -8079 -6911 4971 10724 -3206 -12062 2184 10070 -4292 -11408
1239 -11408 -137 9317 5284 -8470 -13166 4623 18552 299 -20132 -7536 12970 10147 -5822
1252e822p614R959J6946l385j9516j34J6837R81j2139k938O215N565j309j1238
1266g592j054J8597M772k1974q613J9522J2073j1283j6671q47J7858J1926j6191
1279E23j7235J1798J7158l996j1502k975N142Q649k549j3361K279J5374l735j6017
1293a0447L892J5645J588j1759q853O023J7293j286k2936n915K0506J0845j1932
1306B664j1767K025J3016Q206j2482j3801J0492J2841q969j0949N887Q100l87
1319D876o910n662Q580J3407r011j8780P397J9451k234j7275o580R877J4532k239
1333I429j9404l094J9949P390j4026r026N175Q778J391j0747q188J2922J1716
1346A2265j4189j1779J3865J2793q712j2183j15J1775Q202j2181j7330R052J9623
$$ plain form
1252 -5822 -13436 -3477 13469 10084 -9432 -9566 7271 8252 -3887 -6825 -610 4955 3646 -7592
1266 -7592 -8646 9951 14723 -7251 -15864 3658 15731 4448 -12223 -13070 4788 16714 523
1279 523 -16712 -4914 12244 8248 -3254 -6229 -1087 7562 5013 -8348 -6069 9305 5570 -10447
1293 -10447 -6555 9090 10678 -1081 -9934 -3911 13382 12096 -10840 -16755 3751 14596 2664
1306 2664 -9103 -7078 5938 14144 1662 -12139 -1647 11194 2225 -8724 -2837 5263 4876
1319 4876 -2034 -7696 884 14291 5280 -13500 -6103 13348 11114 -6161 -12741 -2864 11668 9429
1333 9429 -9975 -13069 6880 14270 244 -8782 -3607 5171 6562 -4185 -12373 549 12265
1346 12265 -1924 -13703 162 12955 4243 -7940 -8055 3720 11922 -259 -17589 -8537 11086
1359A1086k571j5470l217R209J1053k373j6969l637J8135M629j7218n085J2554
1372A26O220o156p809R46J2237N255j6026q801J6270J1342j2784j3411L650J2358
1386C417O518r298j2833Q218J7222m644j5535j033R240L733m661r391J818J5009
1400G780M79j7572O47J8953J490j6245o133R056J0891j515j5631n306J7490J1105
1414A5489j2833j1883N586J1075L227r003j1217P298J4300p580j5523O486J2813
1427H235m282r813n6Q938R259o604j6916L442J9306r51j9880n464J3215J3119
1441A1548r30j4101n476J5007R324j4408j2218P716Q772j164n859l083O998P812
1455I938j0892j2686J2087J4560r907j4723M398J2852M092j0272j5428L536J9886
$$ plain form
1359 11086 8515 -6955 -10172 -963 10090 7717 -9252 -12889 5246 9875 -7343 -12428 126
1372 126 6346 190 -7619 -6673 5564 10819 -5207 -14008 2262 13604 820 -12591 -8941 3417
1386 3417 9935 637 -12196 -3978 13244 8600 -6935 -7968 1272 5005 344 -9047 -7229 7780
1400 7780 8259 -9313 -8666 10287 11777 -4468 -10601 -1545 9346 7831 -7800 -13106 4384 15489
1414 15489 2656 -9227 -3641 7434 10661 1658 -9559 -2261 12039 4459 -11064 -4578 8235
1427 8235 3953 -5860 -5916 3022 12281 5677 -11239 -7797 11509 10558 -9322 -14786 -1571 11548
1441 11548 10618 -3483 -8959 6048 15372 964 -11254 -3538 5234 4070 -1789 -4872 2126 9938
1455 9938 -954 -13640 -1553 13007 3100 -11623 -7225 5627 9719 -553 -15981 -12445 7441
1468G441L267j5642m440J1728Q599l270j2447n860J0557O245j1373l477J5079
1481F407M581j2510m990P196O618k134j2536o972J4719J4178j1759j7546M236
1494a0512J4908N244r045j2317M641J7272N71j6089j840J1021J53p301j130N047
1508F23P129k075j1715J490J8105P21k0734o992J3934J0558m892j4281o534J4489
1522a74J5920r277j6846L437J3337J310q856p753L903J1050l033j1307O707J4585
1536A3003p332j4741L920J3120L211q888j2050K312J7931M048j9867j1112J2516
1549c929J3748j306j1599o507J0339J0858j0123j3388O483Q889o486n263O217
1562b067Q435J764r221r474R602J5016q749j9066L133J7627N777r112j3314k25
$$ plain form
1468 7441 10708 -4934 -9374 2354 10953 7683 -4764 -10624 -67 6178 -5195 -8672 6407
1481 6407 10988 -1522 -6512 684 7302 5168 -7368 -14340 379 14557 2798 -14748 -10512
1494 -10512 4396 9640 595 -11722 -7081 10191 10762 -5327 -7167 3854 4007 -3294 -4424 623
1508 623 7752 5677 -6038 -4548 13557 14278 -6456 -13448 486 11044 6152 -8129 -14663 -174
1522 -174 15746 6469 -10377 -6940 6397 7707 -1149 -8902 -4999 6051 3018 -8289 -1582 13003
1536 13003 5671 -9070 -5150 7970 11181 2293 -9757 -7445 10486 14534 -5333 -16445 -3929
1549 -3929 9819 8513 -3086 -9593 746 11604 1481 -11907 -5424 3465 -3021 -8284 -2067
1562 -2067 6368 8132 -1089 -10563 -961 14055 5306 -13760 -10627 7000 12777 3665 -9649 -9874
1576i874J5734P265j4000q521R910O983n392o026m13M698J727q080k744J5137
1590F404O606j5835r304J1924J1495l949j2117q045R652J7185m306j9022j143
1603a0455J4981O307o371p473M7Q147P13j0782q76J0587k062j1632K979J3046
1617G156L433q396j1436p36J6104P973j7115j3788J1863J6187j407j2757q960
1630a1879O340J4196j251j2351R88R961k986p683J615M355n84n910m772R561J5440
1645A5040o210k0907l36J7457N701j1116j2822K17J6765J1634j3308j5560P161
1658f284J2600j965p256j031M163L669m801n818P289O372j1929q921J2566J3748
1672A2402l658j2895q013Q033J6104k788k0648m231J8254J0592q036j0914j763
$$ plain form
1576 -9874 5860 13125 -875 -9396 514 7497 2105 -3921 -4334 364 2091 -5989 -8733 6404
1590 6404 13010 -2825 -12129 -205 11290 7341 -4776 -12821 -3169 14016 9710 -9312 -10455
1603 -10455 4526 10833 4462 -3011 -2964 5183 5896 -4886 -5762 4825 2763 -8869 -5890 7156
1617 7156 10589 2193 -9243 -9979 6125 14098 -3017 -16805 -4942 11245 9838 -2919 -11879
1630 -11879 -5539 8657 7406 -4945 -3957 6004 3018 -4665 -3050 1305 721 -5189 -9961 -400 15040
1645 15040 8830 -12077 -12413 5044 10745 -371 -13193 -12976 3789 15423 2115 -13445 -6284
1658 -6284 6316 4351 -2905 -3936 227 3896 -905 -6723 566 6938 -4991 -13912 -1346 12402
1672 12402 8744 -4151 -12164 -4131 11973 9185 -11463 -15694 2560 13152 5116 -5798 -7561
1685g561R000O649p778o474Q507M364r432l273Q759L014o390q003P40J4783R931
1700A6836j4621j6854Q704J6361j336j3415p838O670J5603K377j4817n604J0788
1713B854L885p376j731M671J878l171n719K589J0971j900j7044k392J7189R007
1727A3711r378j2734k643J1892J1631r870j7520M412J6321J527q362l732K910
1740a835M602j004n447L087O882o782j0389P146J2626k472j1684n899P541J4826
1754A1198J26j9918q994J5271J1821o868j0966j555Q406Q594n136j0380L108P449
1768B156m599l741Q458N392o407q463m91J0381Q262j1219j5061R172K0073Q30
1782A4743j5645j0732L592J3392L620j4371q340J3080J0706o603o907J678J595
$$ plain form
1685 -7561 1439 8088 310 -6164 2343 6707 -2725 -5998 2761 5775 -615 -8618 -7878 6905 16836
1700 16836 2215 -14639 -5935 10426 9090 -4325 -12163 -5493 10110 12487 -2330 -7934 2854
1713 2854 6739 -637 -2368 2303 4181 1010 -4709 -2120 8851 6951 -10093 -12485 4704 13711
1727 13711 4333 -8401 -11044 848 12479 2609 -14911 -10499 5822 7349 -1013 -4745 -1835
1740 -1835 2767 1763 -3684 -597 6285 -497 -10886 -3740 8886 6414 -5270 -11169 -3628 11198
1754 11198 11324 -8594 -17588 -2317 9504 2636 -8330 -9885 -1479 7115 1979 -8401 -5293 2156
1768 2156 -2443 -6184 2274 7666 1259 -7204 -7695 2686 10948 -271 -15332 -6160 13913 14743
1782 14743 -902 -11634 -8042 5350 8970 -5401 -13741 -661 10045 3442 -3465 -1787 -192
1795a92k181l354J800J0018K774j2794n681J3610R117j0120j3179j25J3861J3503
1809A7057o982j8918L69J6982K709j2606p205M440Q356K947o569l358O359p61
1823B820r962P01J1459J029r419m938N847J2012J939j5988j0116J3948J4505o051
1837G786j2995k549Q118R847k980j2828l28J0924j18p821J522N169l164n303n27
1852e247O466P194o267j4284K490J6368K598j3601p493O052J2983M840j2789j1747
1866a2437Q474J2061n200q453K861N539O29k860k644L681K979q975p758J0796
1880a307J2440o429j2447j657R868R040o169j6531n79J7902P410j1156p813L664
1894c764O624J488o574m752O764N827o958k810R454L162r673p155L841J0431L948
$$ plain form
1795 -192 -2373 -5727 -3927 6091 8865 -3929 -9610 4000 13117 2997 -10182 -10307 3554 17057
1809 17057 10075 -8843 -8474 8508 11217 -1389 -8594 -4154 4202 7149 580 -2778 3581 2820
1823 2820 -7142 -6441 5018 6047 -3372 -8310 -2463 9549 11488 -4500 -14616 -668 13837 7786
1837 7786 -5209 -7758 360 10207 7227 -5601 -5929 4995 4877 -2944 -1422 3747 583 -4720 -5247
1852 -5247 1219 8413 2146 -12138 -9648 6720 9318 -4283 -11776 -5724 7259 12099 -690 -12437
1866 -12437 -3963 8098 2898 -5555 -2694 2845 3474 614 -2030 1651 4630 -4345 -12103 -1307
1880 -1307 11133 4704 -7743 -9400 468 9508 3339 -13192 -13771 4131 11541 385 -7428 -3764
1894 -3764 2860 4348 -2226 -6978 -214 5613 -1345 -4155 5299 8461 -1212 -8367 -4526 5905 9853
1909I853j1354j1131J0339J5028m633j5399l678Q526R890q67j1941l024J1712
1922C321M151q870k257N976k0m498j291M162O268j608j1621o56J4607N523j2329
1937H58j0322M021J1213N622j0244j2555O681J5165k306j1693j426N554J954j855
1951F67k419J619N240l287q094M906J0460m357j2258m22J0839Q984l752j4497
1965f371l948J4550P955j1926j0351M556J0217M189o248q001L493P729n367p344
1979f867N980O418n399o169L388P770K475r257j0334P274J5197j959j4513l655
1993i651R223Q517k536j2549m588J2307Q519q704o880N979M161l920m296M77N408
2008A467J923p870m436J0989P948r822j0651L826J1094M414q603j1316M079J4464
$$ plain form
1909 9853 -1501 -12632 -2293 12735 8102 -7297 -10975 -2449 7441 6574 -5367 -8391 3321
1922 3321 7472 -1398 -3655 2321 2301 -2197 -3488 674 6942 5334 -6287 -6943 7664 13187 858
1937 858 -9464 -5443 5770 11392 1148 -11407 -4726 10439 8133 -3560 -4986 568 2522 667
1951 667 -1752 -133 5107 1820 -6274 -1368 9092 4735 -7523 -7945 2894 11878 8126 -6371
1965 -6371 -10319 4231 12186 260 -10091 -5535 4682 8871 2623 -5378 -1885 5844 477 -6867
1979 -6867 -887 5531 132 -6037 -2649 5121 7596 -1661 -11995 -4721 10476 8517 -5996 -9651
1993 -9651 -428 8089 5553 -6996 -11584 723 9242 538 -6342 -363 3798 -122 -4418 -3941 1467
2008 1467 3390 -4480 -8916 2073 10021 199 -10452 -6626 4468 8882 279 -11037 -6958 7506
2022G506j52j3213k913Q288M822j537m918j307O355J371q806j705R867J345r632
2037d629k570P944P230j588j1097n123J1357J0170r114j1499L621R823K900o121
2051A304p606K331R854o80q752J971P471k707o270N40N186K546m830q321L518
2066d445J3632J119j3249m822Q966Q388l067j1366n305J0518J0112p471r274M883
2080a381P251k180m532j206L218L178m863n853O607Q762o832j0677L181J0115
2094D788L205p358r269K688J4564J980j4820o468Q614P283k895p163j428P979
2108A700N870p337o107O913L846q151m834N602O084o48p031m074Q562R701p169
2123B927j2749K000J1319K937o978q374K273J1848J535j2150l115R634L481n688
$$ plain form
2022 7506 7354 -5859 -8772 -484 4338 2801 -2117 -3424 2931 4302 -4504 -6209 3658 5003 -4629
2037 -4629 -7199 745 7975 6387 -4710 -9833 1524 11694 2580 -8919 -5298 4525 7425 1304
2051 1304 -6302 -3971 5883 5203 -3549 -1578 5893 3186 -3084 -2544 2642 5188 358 -7963 -4445
2066 -4445 9187 10306 -2943 -7765 1201 9589 6522 -4844 -10149 369 10481 3010 -6264 -1381
2080 -1381 5870 3690 -842 -2048 1170 4348 -515 -6368 239 9001 2169 -8508 -5327 4788
2094 4788 7993 635 -8634 -5946 8618 10598 -4222 -10690 -2076 5207 2312 -4851 -6279 1700
2108 1700 7570 233 -5874 1039 4885 -3266 -8100 -2498 3586 2938 -4093 -8167 395 10096 2927
2123 2927 -9822 -7822 3497 6434 -544 -8918 -6645 5203 6738 -5412 -8527 1107 4588 -1100
2137a100k701K891M050j133p229j791R247L641j0321m638R016Q203k527q518m267
2152g177P422Q907p005j1888L469J0934R53o058k858L335O061k311q649O56R579
2167E370j289r419O07Q743K283n290p135J249J0766L645j1464o021R519P570m573
2182D561q709k155O881O817n610p941O412Q677m201p358J649M385r3n065n036
2197f786M631J0039k835j1358J124J0892K692q008p316J870J0051K533j0957n399
2211h827R946O081n681n448K392M751J407n478m348O812N912p789p819N683P901
2226E495k233p492l306O773J0126l920j2823m3J1190J714q997n362M190Q149J914
2241E375p729k184Q781K168r484l276O639L282l175m795L77Q087M388r771q892
$$ plain form
2137 -1100 -3801 -910 3140 2007 -5222 -7013 2234 5875 -4446 -9084 -68 8135 5608 -2910 -7177
2152 -7177 245 9152 2147 -9741 -6272 4662 5615 -443 -3301 34 6095 3784 -4865 -4209 5370
2167 5370 4081 -5338 -4731 4012 6295 1005 -6130 -4881 5885 9530 -1934 -7955 1564 9134 4561
2182 4561 -4148 -6303 578 7395 1785 -6156 256 8933 4732 -2626 -977 3408 3315 -1750 -6786
2197 -6786 -2155 7884 5049 -6309 -5185 5707 8399 391 -6925 -5055 4996 7529 -3428 -8827
2211 -8827 1119 7200 1519 -3929 -1537 3214 4621 -857 -5205 1607 7519 -270 -8089 -2406 5495
2226 5495 3262 -4230 -7536 -763 9363 5443 -7380 -7423 3767 5481 -3516 -8878 -4688 3461 5375
2241 5375 -2354 -4538 4243 6411 -3073 -6349 290 3572 397 -4398 -4021 4066 8454 -1317 -10209
2256a0209P664J0363l033r088k786P300P541n000j1847J133J1097Q13p095R0N533
2271B476K357k871n355k28P140n18r412j82J1321M140p265o525J699Q537L404
2286H718j0077q368Q019J0343m553q856m14N788L955l166o011L225P697l203q080
2301d983K852O941k064o347j915N096Q110j564j1173j299J2242M478r923p179
2315f728L309P943K193q343n980P521P415n563n517M146M103k186m822j527M472
2330D36N180n940q182O396J1180k744j0398k643P154P579k579j1560j417J1652
2344D114L907r041m836M241M674J43m269j546N717K809q533m124P765M406o580
2359a153n812K634Q442M432p792j0047N381J1946k036j1039k278O703N792k395
$$ plain form
2256 -10209 -2545 7818 4785 -4303 -7089 211 7752 2752 -9095 -7962 3135 3948 -3147 -3057 2476
2271 2476 4833 1962 -3393 -3621 3519 3001 -6411 -6593 4728 8868 1603 -4922 -3223 5314 8718
2286 8718 -1359 -9727 -1708 8635 4082 -4774 -5188 600 4555 1389 -4622 -1397 6300 3097 -4983
2301 -4983 -2131 4810 2746 -3601 -5516 -420 7690 6126 -5047 -6346 5896 10374 451 -6728
2315 -6728 -3419 4524 6717 -1626 -7606 -85 7330 1767 -3750 396 4499 2313 -2509 -4036 436
2330 436 5616 -324 -8506 -2110 9070 6326 -4072 -6715 439 8018 5439 -6121 -7538 4114
2344 4114 8021 -1020 -5856 -1615 3059 3202 -1067 -2613 3104 5913 -2620 -6744 1021 5427 -1153
2359 -1153 -6965 -4331 4111 8543 751 -9296 -3915 8031 5995 -5044 -7322 -619 5173 2778
2373B778p734l29P897J433p077K60O506k04n894k639K632N909or542k651J2015
2389C354P011r046r189K639Q567L647p020q310M342J0132k257q430Q56M675K16
2404A187k056r77K626M179l727q441K973J0066j933r987j668Q287Q459j833j1470
2419d315m455J0739P748q449q330L688P043J694m422m120K338N047l966m782N757
2434A215N021n800n824K173O289K924o370r236M761J4033M9j2657m666P891P469
2449G272j795r013l533Q466N796n778m844M560K334l164j636J861L150K25p250
2464c349m510Q743P389q084r272L844R903L849p274j0057K206J1979J105j0426
2478c954k440O894L617j858l403m51L437P31n786M40Q482N48r600l116N923N728
$$ plain form
2373 2778 -4956 -5285 2612 4045 -3032 -2772 3734 3530 -2364 -5003 -2371 3538 3532 -6010 -8661 3354
2389 3354 10365 1319 -7870 -5231 3336 6983 -37 -8347 -4005 6127 3870 -4560 -3704 971 1187
2404 1187 -869 -1846 780 4959 1232 -7209 -4236 5830 3897 -6090 -7758 529 8988 7155 -4315
2419 -4315 -8770 1969 9717 1268 -7062 -3374 3669 5363 941 -3179 -841 4206 240 -4542 1215
2434 1215 6236 436 -5388 -3215 3074 5998 -372 -9608 -4847 9186 9235 -3422 -8088 -197 7272
2449 7272 5477 -3536 -7069 1397 7193 1415 -3429 1131 3465 301 -1335 526 3676 3901 -3349
2464 -3349 -7859 884 8273 189 -9083 -5239 4664 8513 1239 -8818 -6612 5367 6472 -3954
2478 -3954 -6394 500 4117 2259 -1144 -1595 1842 2573 -3213 -2773 5709 6257 -3343 -6459 -536 5192
2494E192j497r130m344J0254J0071p227j1492K008Q095J743m856n165K160P442
2508C254j86o267J603N606k836n427J583N373L090m043p736J463J1753J286j2781
2523d265n635Q429Q401j516q354m983O628P560n122p704K972N452j794k656J252
2538a335K680J381m145m670O250Q261n391j0588K009J0015M037n801r531J116
2552e712J2181L752j1551o565O504N713j695m349j417L396K564m312k798O033
2566A744K466p050l435O315O290r27p875n853P506J0756m430j2330Q77J0926M013
2581H993n256p033p43O924K296o774j923O090Q99n216j03L398J583l158o023K43
2597e803J0331M136j0636p007P348Q535j382q151n446O301J0197k246j0253M33
$$ plain form
2494 5192 3695 -5435 -9779 475 10546 3319 -8173 -6165 1930 3673 -1183 -6348 -4188 3254
2508 3254 3068 -3199 -1596 4010 1174 -4253 -2670 2703 5793 1750 -5986 -4523 7230 8516 -4265
2523 -4265 -9900 -1471 6930 5414 -2940 -7923 -1295 6265 1143 -6561 -3589 1863 69 -2587 -1335
2538 -1335 1345 2726 -1419 -6089 161 8422 3031 -7557 -5548 4467 8504 2703 -6828 -5712
2552 -5712 6469 10221 -1330 -7895 -1391 4322 2627 -1722 -3139 257 2821 -1491 -4289 1744
2566 1744 4210 -2840 -6275 40 6330 5403 -2472 -8325 -819 9937 5507 -6823 -5946 4980 8993
2581 8993 3737 -3296 -4039 2885 5181 -1593 -3516 2574 3473 -1743 -1846 1552 3135 -23 -6046 -5803
2597 -5803 4528 8664 -1972 -8979 -1631 6904 5522 -2629 -8075 -1774 8423 6177 -4076 -3643
2611c643P170J58m375q20J858K012j686m032K209P311l231r910L59R086L911n433
2627I44p964j25J0695N180j0063q416O355Q319j315n162k323K883M568k283m868
2642c575L215M797m514n301M005N905q48o505m876N230J0569k358j2819j875J0476
2657A526M990n190p037n78P270M932o135n010N116L384l898j941L309J985j198
2672A525m316j514P187N339q198q863O002J0051j1q335o043M353R735q97j0780
2687d765j981Q411L017m249j762J323J941j8l508L5N851J17q485j556Q612M640
2703G623m796p574j226R254P397p871j1036M154J0235k14o853l790K757N724j33
2718C651n368K77N324k065n693K388N616q27n021m038L498R027l27j1446l825
$$ plain form
2611 -3643 3527 3685 -690 -1510 348 2360 674 -3358 -1149 6162 2931 -6979 -6620 2466 6377 944
2627 944 -7020 -7145 3550 8730 -1333 -9749 -3394 4925 3610 -1552 -3875 -992 3576 1293 -3575
2642 -3575 -360 4437 -77 -5378 -1373 4532 3684 -2821 -7697 -2467 8102 5744 -7075 -8950 1526
2657 1526 6516 1326 -5711 -6289 981 5913 -222 -5232 -116 3268 -630 -2571 738 2723 1525
2672 1525 -2791 -4305 2882 8221 23 -8840 -2838 7213 7202 -1133 -7176 -2823 6912 6015 -4765
2687 -4765 -6746 1665 4682 433 -1329 -6 1935 1917 -1591 -1556 4295 4412 -4073 -5629 2983 7623
2703 7623 2827 -4747 -5973 3281 10678 2807 -8229 -4075 6160 5946 -907 -4697 -1940 3784 3651
2718 3651 -1717 -1440 3884 1819 -3874 -1486 4130 3303 -1718 -5756 -2258 6769 6442 -5004 -8829
2733h829J0530P166n307q509j762O999O517n196q364L348O916j859l884J744K025
2748A535n62k676j695L966M994n690q213M360R836m0q138n320L907R600J267j1019
2764c888n247Q758O259n250n184O71L697K635k596k984L910L031o054l428O428
2779G58M410m327o158o43P136O922n577j0759L098J1404N58q298m497K998O050
2794C075J140o192l215O301K712n262q38M509R65l445l372R68O276K008q625n293
2810h288R042P723m733q277p71O858O089m109r346J316Q566k9o224m41L410J408
2826B194j165k462P88M776j173p957K16Q757J405p028m886L312Q344K739r015
2841a155o754P766Q081m863p143M68M171K796k024m568J846N388k596n029L369
$$ plain form
2733 -8829 1701 8867 3560 -4949 -6711 288 6805 1609 -6755 -3407 3509 1650 -2234 -490 1535
2748 1535 973 -1703 -3398 568 5562 -128 -8341 -3981 5855 5815 -2323 -7643 -3736 5864 7131 -3888
2764 -3888 -9135 -377 5882 632 -4552 -3881 -184 2451 -145 -3129 781 3812 -2242 -5670 758
2779 758 5168 841 -5317 -5960 1176 8098 2521 -8238 -5140 6264 6822 -1476 -5973 -2975 3075
2794 3075 4215 -1977 -5192 1109 3821 -1441 -2279 2230 3195 -250 -3622 -2654 3622 5630 -2995 -8288
2810 -8288 754 8477 3744 -4533 -5304 1554 7643 3534 -5812 -4496 4070 4041 -2183 -2624 786 2194
2826 2194 1029 -1433 -645 4131 2958 -4999 -4783 3974 5379 -1649 -6535 -3223 5121 7860 -1155
2841 -1155 -7909 -143 7938 3075 -4068 -3600 571 3367 1343 -3225 -1379 4009 1413 -3616 -247
2856b47N123k628n422j612M303N831k672r669Q8J1381L098q167n552L105O846
2871C806J430o727n133N376N732m436m006L825K848k116k534j13L844K886n804
2886a122o348N537P974l421q031j020O568O390k732r193j027R729K318p658l420
2901e456L818L013l95k729j387M451K657o253k069O619K933o197m764K262O182
2916B685K609o483p008O000R586l048q425j84N184L359k211o032k91O556R50o219
2932b972K32N854L49m416j704K703M274o68p901k439R191M532p422n532L861O292
2948D234K027o143n847M461P462l409p033J873M761j71k737j384K402M238k220
2963B514o836K358P983j547p972k003N327N329j478p671j769R194M715p747n416
$$ plain form
2856 -247 4876 2248 -3174 -4786 -483 5348 2676 -6993 -6905 4476 7574 -593 -6145 -3040 3806
2871 3806 5236 -1491 -6624 -1248 4484 48 -3958 -133 2715 599 -1935 -2048 1796 4682 -1122
2886 -1122 -7470 -1933 6041 2620 -5411 -6431 137 6527 3795 -5398 -6425 3304 5622 -2036 -5456
2901 -5456 -1638 1375 980 -1749 -3136 1315 3972 -2281 -4350 2269 5202 -995 -5759 -3497 2685
2916 2685 5294 -1189 -8197 -2197 7389 4341 -4084 -4268 916 4275 2064 -3968 -4259 2297 3247 -2972
2932 -2972 -2740 3114 3463 -953 -2657 46 4320 3652 -4249 -6688 2503 7035 -387 -5919 -2058 4234
2948 4234 6261 118 -5729 -1268 6194 2785 -4248 -2375 2386 2215 -522 -1906 496 4734 2514
2963 2514 -4322 -1964 6019 4472 -3500 -5503 -176 5153 3675 -3996 -5765 3429 8144 397 -5019
2978e019M137M145j026l625k486L745M347m027m643M964M994m111m991J106M794
2993B304K682m737p188L070R655r69r123j256O298M223k338n778j504O009K721
3008D069o337k983N175K349l438k069K163L740P11n365l854O679N414o114p318
3023g178K849O910K349m996o300L251Q669j086q470o43N499J240k678k247O91
3038b140L832M06n377m25P412Q54o992k355N145M469j696o989l140P893O811o363
3054A345p270L877O457L83m402m218J825N657j296n967J741N708j622m606R48
3069a440L941J832l125n504J307Q740L36r561k773O816N325k305o283j906O574
3084A974N321n630o600L679M606k096l010K97K301J937k326m043L661N953m228
$$ plain form
2978 -5019 -882 3263 2237 -1388 -3874 -129 4218 191 -4452 512 5506 1395 -3596 -2490 2304
2993 2304 4986 249 -6939 -3869 5786 4817 -4306 -5562 736 4959 2621 -3157 -4661 1348 4069
3008 4069 -2268 -5251 -76 2273 -1165 -3234 -1071 2669 3380 -1985 -5839 840 6254 140 -7178
3023 -7178 -4329 2581 4930 -66 -6366 -3115 5554 4468 -4002 -4645 854 2094 -584 -2831 -2140
3038 -2140 1692 2098 -3279 -3704 3708 4562 -2430 -4785 360 4829 3133 -3856 -6996 897 7708 1345
3054 1345 -5925 -2048 4409 4792 390 -3828 -2003 3654 2358 -3609 -1868 3840 2218 -2388 -1440
3069 -1440 2501 4333 1208 -4296 -2989 5751 6087 -3474 -6247 569 5894 3589 -2694 -4600 1974
3084 1974 7295 1665 -4935 -1256 3350 1254 -1756 -1459 842 2779 453 -3590 71 6024 1796
3099A796p040K221O621J353n406n904K457Q907J022r180k587O852L975l368m292
3114b573j096L649K780m170l161M984L709n305l024M221L534j228n156k860N748
3129E2O546m922q729K451Q186J000n196m121K150O515K77p083j989N882J177m332
3145b136p83K831J913j010l788o42O834K005q049l903O554N581l075o138j975
3160e781O058O572m281p754K619O893p04m495j870J648K986o52l968J022N910
3175D203j764o895R33O116J513m563m684J902P815J874r059m999P212O208k929
3190B883n075o01M310L820l171n670J961M657k696l444K866L668q71l371k634
3205c368K997N530l257q683J393R203K073o278n089J802O632K182o939l986O202
$$ plain form
3099 1796 -5244 -3023 3598 4951 -455 -6359 -3902 5005 6027 -3153 -5740 1112 5087 1719 -2573
3114 -2573 -3669 -20 2760 -1410 -4571 413 4122 -1183 -4207 14 3548 2320 -2836 -5696 52
3129 52 6598 1676 -7053 -4602 3584 4584 -612 -4733 -2583 3932 4209 -2874 -4863 1019 2196 -2136
3145 -2136 -2919 -88 1825 815 -2973 -3615 3219 5224 -2825 -6728 -174 5407 2332 -3806 -5781
3160 -5781 277 6849 2568 -5186 -2567 4326 3622 -873 -2743 -1095 1891 1239 -2729 -1707 4203
3175 4203 2439 -4456 -3523 2593 4106 -457 -5141 -3239 4576 6450 -2609 -7608 -396 5812 2883
3190 2883 -2192 -2793 1517 5337 2166 -3504 -1543 3114 418 -3026 -160 3508 2637 -734 -3368
3205 -3368 -371 5159 1902 -6781 -5388 3815 5888 -390 -5479 -3677 2955 5137 -1802 -5788 414
3220D14M569l469l219J224J618M48k363j693M143L584n387m779N151N494l167
3235B568o660j586N404O168l363q639M59Q385J935n804l114J966M147J001m453
3250a586k000M927J692n027q27N404J630l755l710N22N892K725p122n820O205
3265h50P326l275p173j366M324M802j980o344R51O505l59n419%L193K32k030j750
3282c213K405N470m22p748j254P813K625o511m578K386P019K728o591o120M333
3297a658N884k884m907P47L300J632j805l041J681L951l246n514L542O792j177
3312C297n463j975L879O037j644q636j283Q754L877n790m289J778M018J295l712
3327A43l630L448L588l532k995L601K528l057l180L35M554L467n295p081M451
$$ plain form
3220 414 4983 1514 -1705 -481 1137 1585 -778 -2471 1672 5256 -131 -4910 241 5735 2568
3235 2568 -4092 -5678 -274 5894 2531 -6108 -5649 2736 4671 -1133 -4247 -2281 1866 2867 -1586
3250 -1586 -3586 1341 3033 -1994 -2821 2583 4213 458 -3252 -2730 3162 5887 -1235 -7055 -850
3265 -850 6476 3201 -3972 -5338 -1014 3788 1808 -4536 -3585 2920 2561 -2858 -2858 335 567 -1463 -3213
3282 -3213 -808 4662 4240 -3508 -4762 3051 5676 -835 -5413 -3027 3992 6720 129 -5991 -1658
3297 -1658 4226 1342 -3565 -2818 482 2114 309 -2732 -1051 2900 -346 -5860 -2318 4474 3297
3312 3297 -2166 -4141 -262 5775 4131 -4505 -5788 2966 6843 1053 -3236 -1458 2560 3855 143
3327 143 -3487 -39 3549 17 -2978 623 3151 94 -3086 -2751 1803 5270 -25 -7106 -2655
3342b655Q543j260p106k136M649N411q93p216j703O385K433m651j573L142J269
3357B639j887k145J60L434L95n971k014P587M091n709n840J345N859K872n119
3372c03o580L734Q365m65o710j588K901K148r44k536M02M380j47n131Q96N080
3388C502j124n763j739M181N422l75p886k815P694N187o159o178K031N302L012
3403D292l090n198J431N155j437m243J758L670j237k416j99K843K738l622o810
3418f365K865Q595K43p928k689M920M920q61o328l166O189N233m193m708J910
3433a363K473k32j700o34K429K600l614l592M910M458m691o120J393O043L356
3448E716l933p111J824Q614O95p931k484M136L585j59l435j905L276J865m092
$$ plain form
3342 -2655 5888 4628 -2478 -4614 35 5446 4553 -2663 -4366 2019 4452 -199 -1772 1370 2639
3357 2639 752 -1393 -1233 2201 2596 -3375 -5389 2198 6289 580 -5260 -3915 1944 4816 -303
3372 -303 -6883 -3149 5216 4751 -1959 -3547 -646 1502 558 -1978 -1576 2804 2657 -2474 -1578 3502
3388 3502 2378 -3385 -5124 -943 4479 4104 -3782 -6597 1097 6284 125 -6053 -4022 1280 4292
3403 4292 1202 -3996 -2565 2590 1153 -3090 -1332 2338 1101 -1315 -1514 1329 4067 445 -6365
3418 -6365 -3500 5095 5338 -2590 -5279 -359 4561 3700 -2628 -5794 395 5628 1435 -3273 -1363
3433 -1363 1110 878 -822 -1456 973 3573 -41 -3633 1277 5735 1044 -5076 -3683 2360 5716
3448 5716 1783 -5328 -3504 5110 5805 -2126 -4610 -474 3111 2952 -483 -2388 888 2753 -1339
3463a339j181M738J453m340j933K678L835j90o407m071O440P256m520p346J079
3478c848N926K630l367n451P44O072N47n171o55L644k07k371q5K439K608j759
3494A696n309L29P281R96p891l420M840N920m2o191m209N007O469l568o525J103
3510c514M830R16k180k046P14K269j165l689K829N426j959n647M81M979K241m020
3526D65o276Q42Q380L171p053m612M416M435o29m619l072L093M418k159l675K597
3542b78K824k935k746J868L436P11l649l648M384O547l663q235M91O496L217k897
3558A923m839j8O078K636o115l380L540K031j770j789O70K238N99l375j529N123
3574B023L026n947m245L695N152l85n178l722M547O978j948p193k10N487J520
$$ plain form
3463 -1339 -2520 2218 3671 -669 -2602 76 3911 3721 -2686 -6757 -317 6939 2419 -4927 -3848
3478 -3848 2078 4708 1341 -4110 -3366 2706 3253 -1918 -2573 1071 864 -1507 -1592 847 3455 1696
3494 1696 -3613 -3284 3997 4993 -2898 -6318 -1478 4442 4400 -1791 -6000 -993 5476 1908 -4617 -3514
3510 -3514 1316 2232 52 -1994 -1280 989 -176 -3865 -1036 4390 2431 -3216 -2735 2244 4485 465
3526 465 -5811 -4969 3411 6582 -471 -5083 -667 3768 3139 -1480 -4552 -1459 2959 800 -2875 -278
3542 -278 2546 -389 -3135 -1267 2169 2880 -769 -4417 -33 6514 2851 -5384 -4893 1603 4820 1923
3558 1923 -2916 -2934 3144 5780 -335 -3715 -175 1856 86 -1703 -1033 1205 1804 -1571 -3100 2023
3574 2023 5049 -898 -5143 -1448 3704 3319 -1859 -5581 -1034 5944 3996 -3197 -3407 2080 3600
3589C600k940k576N40L435N51m245n39M373rn146k04M377L055k013n430j107O308
3606B030L204o813n518M793O150o3l863k692K416M231j783n531P43M801o42l026
3622a563O90K869Q99l037l920J899O267m42p451j124O441L265l502n598q54N685
3638E24M217m714m611M123M241k059l052n86J542J364k125k148L402M604l658
3653A064m882K525M779q7m681m143K756O883l1p471j861O174K910k933l419k39
3669b656L271K032k977k650L582K060l845k227L506K791j379l814q63N154M300
3684F285n025o713K512O360k43m599k734K099N820M39n673j435M537P24l716q47
3700b209K207J424n60k576J12M765J054o556k271N719L886k959m953q04M930M321
$$ plain form
3589 3600 660 -1916 -1376 2059 2610 -1635 -2174 2199 2190 -2956 -3160 1217 4272 2259 -3171 -4278 2030
3606 2030 5234 -1579 -7097 -2304 3846 3783 -80 -2772 -356 3875 2092 -3439 -2696 2105 1463 -1563
3622 -1563 -873 1996 2895 -142 -4062 -2163 4104 3662 -3789 -4913 1528 4793 1291 -4307 -5161 524
3638 524 4741 27 -4584 -461 3780 1721 -1331 -1917 -375 989 -1136 -3284 118 4722 1064
3653 1064 -3818 -1293 3486 3399 -1282 -5425 -2669 4214 4183 -3288 -5149 1025 3935 1002 -2417 -2656
3669 -2656 615 2647 -330 -2980 602 2662 -1183 -3410 96 2887 1508 -2306 -3169 1985 6285
3684 6285 1260 -5453 -2941 3419 3176 -1423 -4157 -2058 3762 4201 -1472 -2907 1630 2354 -1362 -2209
3700 -2209 -2 1422 862 -1714 -1602 3163 4217 -2339 -4610 1109 4995 2036 -2917 -3721 1209 5530
3716E530m542o124K477N975k70l615j025J906K312j213l928O01M299j202m626
3731c445J381N046Q56l713l492J642N676K34p165k856O085M469l184m271k0L271
3747E14L196k711m375K364L934k130l439J712K816o62k814j503K743M738k496
3762A887o101J337O353P85n290l421J723N266J013n335k786N104L424l417k580
3777b038J420J725k38k228j157L040K478l900l488M320M529k528m557q14L951
3792E15M301l157o706J141O695O53m411j885K058L040J39l610j128L686J064m389
3808a994o59M191J291l091k746J158M792J577n587l857N199N154l356n217o52
3823c797L568L789j651m854P15N530j48m576k6K556J12j880j404J342L805p37
$$ plain form
3716 5530 988 -5136 -2659 3316 3046 -569 -1594 312 2624 1411 -2517 -1916 2383 1181 -3445
3731 -3445 -2064 2982 3838 125 -3367 -1725 3951 4185 -2980 -5836 249 4718 1534 -2737 -2757 514
3747 514 3710 999 -3376 -1012 2922 792 -2647 -935 1881 1219 -1595 -3098 -355 4383 1887
3762 1887 -4214 -2877 3476 4261 -1029 -4450 -2727 2539 3552 -1783 -4569 535 3959 542 -2038
3777 -2038 -618 1107 869 -1359 -2516 524 3002 -898 -4386 -66 4463 1935 -2622 -3436 515
3792 515 4816 1659 -5047 -3906 2789 3442 -969 -2854 -796 2244 2383 -1227 -2355 1331 2395 -1994
3808 -1994 -2653 1538 2829 -262 -3008 -1850 2942 4519 -1068 -4925 274 5428 2072 -3145 -3797
3823 -3797 -229 3560 1909 -2945 -2230 3300 3152 -1424 -1450 1106 1218 -662 -2066 -724 3081 2344
3839B344n581R1O385J435n110l423K126N090J027n574l992M415N073k678m329
3854b701Q16K916J212j597k706J236L505k061m067K496M129j345m133n61L467
3869F06L662j776o097j3O777J615n762l394K528L936R06l285k864L579L067l277
3885B08l365K483K243j784j989N25L119J892l791m250L389N684k202n426K07L968
3901I11L288k006n607o22N809J569m625j190L198J714j191k310o86K293P31l809
3917b533j464N402K550m032l423J833L953J003m362m175L926N860j771n575L71
3932b437L443J355j378l109K74M279L1m154K26M086n33l826j166K752K904p50
3948A997n061j075O050L089n160m065K322L951R53l783l371K824N252j716l901
$$ plain form
3839 2344 -3237 -3146 3239 4674 -436 -3859 -1733 3357 4384 -1190 -5182 -767 4306 1628 -2701
3854 -2701 -1885 1031 2243 646 -2060 -824 2681 620 -3447 -951 3178 1833 -2300 -2861 606
3869 606 4268 2492 -3605 -3618 3159 4774 -988 -4382 -1854 2082 2988 -297 -3161 418 3485 208
3885 208 -3157 -674 1569 -215 -2204 -1679 1440 3332 -459 -4709 -1320 4364 2162 -3264 -3057 911
3901 911 4199 2193 -3414 -4036 1773 3342 -1283 -2473 725 2439 1248 -1062 -1748 545 1276 -2533
3917 -2533 -3997 1405 3955 -77 -3500 -1667 2286 3289 -1073 -5248 -1322 4538 2767 -2808 -2437
3932 -2437 1006 2361 983 -2126 -1852 2427 2458 -1696 -1470 2616 2083 -1743 -2909 -157 2747 1997
3948 1997 -3064 -4139 1911 5000 -160 -4225 -1903 2048 3001 -782 -4153 -1329 3923 2207 -1694
3963a694J301L053j098k435n10J882K097j812l911K411N294j099o144j489M161
3978GK859q99m688j314N625L198m708m245K470K604J19j569p33K223K300k759
3994D90l226K837K856l214l383K341M463J050l599m469J896N590j136o129p14
4009d347M678K711j091l807j402L597J656l788j581L723J796k810j265J837J975
4024A882n05l765j788N415L911m414m733K229M579O70l646l869J590N537j67n130
4040b204p22L551Q08k028j211J060J759k30l290j47M954N70n304j407M714L277
4056D150j729m682j693M563M413l982m645K114M581r2k783k333P91K914n37l363
4072b313J371L884j441l938N87L099Q17k536l235J205O366Q06o263k635M508L419
$$ plain form
3963 -1694 -393 2660 1562 -873 -1383 499 2596 784 -3127 -716 4578 3479 -2665 -4154 7
3978 7 2866 1967 -2721 -4035 1590 4788 80 -4165 -1695 909 1028 -541 -1274 949 3249 490
3994 490 -2736 101 2957 -257 -3640 -1299 3164 4214 615 -3854 -1958 3632 2496 -3633 -4347
4009 -4347 331 3042 1951 -1856 -3258 339 1995 -1793 -3374 349 2145 -665 -1930 -93 1882
4024 1882 1377 -2388 -4176 1239 5150 736 -3997 -1768 2811 3481 -165 -4034 -2444 3093 2926 -2204
4040 -2204 -2926 625 1433 -595 -1806 -746 1013 783 -2507 -2654 2300 2870 -2434 -3841 873 4150
4056 4150 2421 -2261 -3954 609 5022 1040 -3605 -1491 3090 2998 215 -2118 -1327 1587 1050 -2313
4072 -2313 -942 2942 1501 -2437 -1850 1249 2066 -470 -3705 -2500 3866 4672 -1591 -4226 282 3701
4088C701j928l597j285L862L630k793l849J856K340j890j844J305J924L13j943
4103a98k270K725L798l174n580J702N593J145l371l970P55N433J227n321k287
4118c793M175K457j885j929n3J863M30k583q73L743J544m327k266L613L203j780
4134A539m057j569L783N112k748o343Q60N016J271l027k468Q30L616P84l818r40
4150b159L333j91l316K14L352J080k008k845L78M718J179n895l155M726M574j671
4166B314m025j908K947M318j775m934Q59M297k77k249m03J026P17j219k278J766
4182h24M165j325n234N23N287J178m291l182J008N039K092n133l701L646M244
4197C492j835k791k76J799K017j183l032J429K798k741k730K767L722j352l047
$$ plain form
4088 3701 1773 -1824 -3109 753 4383 1590 -2259 -403 1937 47 -1797 -492 1432 1745 -198
4103 -198 -2468 257 4055 881 -4699 -2997 2596 3741 370 -3600 -2845 2588 3815 -1506 -3793
4118 -3793 382 2839 954 -975 -1028 835 1265 -1318 -2191 1552 3096 -1231 -3497 116 3319 1539
4134 1539 -2518 -4087 -304 4808 2060 -4283 -3423 1593 2864 -163 -2631 -1801 1815 2599 -1219 -2159
4150 -2159 1174 983 -2333 -2119 1233 2313 305 -2540 -2162 2556 3735 -2160 -5315 -589 3985 2314
4166 2314 -1711 -3619 -672 3646 1871 -3063 -2204 2093 1816 -433 -836 190 907 -312 -2590 -824
4182 -824 3341 2016 -3218 -2695 2592 3770 -521 -3703 -2695 2344 4436 -697 -4398 -752 3492
4197 3492 1657 -1134 -1410 389 2406 1223 -1809 -380 2418 -323 -3053 -286 3436 2084 -963
4212i63j827K703M153k129o091Q6O120J757l564k975P94L310J408l410k364L418
4228D26K345k558j552J993Q77j195k063m02L617K690l959l919L530M433j963m782
4244b482j636K954M367q62m973l47M650P85l420q41J131J275j31j634k42L266
4260A860J52m604m61M495K029l227k896P55L936K207m462m776L098M971j114l783
4276a820r61K276K412p74l289L76L379j103l246J101L224p61k398j065K182M061
4292C594m36n480j435N563K238l674l381Q17L418K419l110l608K128L408j701
4307G60k534J211J629m91j435q54J908K300k872m000K672N486q04m213j475K559
4323a53L342m87n316j372M938L011l202j983J236J645J63k192j297K199J709l055
$$ plain form
4212 -963 -2790 -87 4066 1937 -4154 -4068 2052 3809 245 -2730 -1936 1374 2782 -628 -2992 426
4228 426 2771 213 -1339 654 1531 336 -1727 -2129 1488 4178 219 -3700 -170 4263 2300 -2482
4244 -2482 -4118 -1164 3203 2341 -2632 -2979 1671 2456 -964 -1805 -674 601 470 -1164 -1406 1860
4260 1860 2012 -2592 -3053 1442 3471 244 -2652 -1897 2039 4246 -216 -4992 -1894 3077 1963 -1820
4276 -1820 -2781 -505 1907 1133 -2156 -1780 1599 496 -2750 -1649 1575 814 -1584 -2649 -467 3594
4292 3594 3158 -2322 -3757 1806 4044 370 -3011 -2194 1224 3643 533 -3075 -947 2461 760
4307 760 -1774 -563 1066 575 -860 -1714 194 2494 -378 -4378 -1706 3780 2976 -1237 -2712 -153
4323 -153 3189 2702 -2614 -3986 952 3963 761 -1222 14 1659 1822 -370 -1667 532 2241 -814
4339h14j999L694K190k940l019N21L457K320k883m451J948N800q27m781j487K475
4355g96K726L6k977q90L599J065l556m82K715J90k394j239R95K900N89m543j951
4372d013M862L507l602l972O18L288J940k257m160J475M713l46l715L45K140L56
4388A179j365j125R79K329r13m047R14M574N2m214j550K635L565J09m586k732
4404d196M262L516l307l783J522K474J124j267j792J140K570j900k657J922K674
4419B302j685k828N75K771K179k262m395Q65N641Q17m886k200K581K813k07l304
4435a223j938L186K635k509j938K397J310j695j425K42K254P55l298k175L693
4450B71M082k858m362P87L528K134k074m416K59M882P08l975j513K667J611j054
$$ plain form
4339 -814 -2813 881 3071 131 -2888 -2367 1090 3410 527 -3924 -1976 3824 2997 -1784 -3271 -796
4355 -796 1930 1966 -1011 -1901 1698 2763 -793 -1275 1440 1630 -764 -2003 -1008 1892 2481 -2062 -4013
4372 -4013 849 4356 754 -3218 -2600 688 2628 371 -3789 -2314 2399 2053 -1662 -1317 823 1179
4388 1179 -186 -1311 -332 1997 1084 -2963 -2049 2525 2577 -1637 -3187 -552 3013 3122 -1464 -4196
4404 -4196 66 3582 275 -3508 -1986 488 1612 345 -1447 -307 2263 363 -2294 -372 2302
4419 2302 617 -2211 -1636 1135 3314 1052 -3343 -2478 3163 3980 -906 -3106 -525 2288 2081 -1223
4435 -1223 -3161 25 2660 151 -1787 610 1920 225 -1200 -958 1296 2051 -1247 -3422 271
4450 271 4353 1495 -2867 -2080 1448 3582 1508 -2908 -2649 2233 2941 -1034 -2547 120 1731 677
4466F77j268k05J973L84l117p27L861R23l596j976K463L171Ol482k914L701M467
4483D341k542m735N59L310J293j847k527M57L305K45l219K79K955n24k767l32
4499a749J864J712j238l583J71N070J469m650k527K958L069l47l249k340K614
4514g56L601j775l796J375K901n30j722J7J032J331j564k882J644M036j523m241
4530b852N96L445J742j820l678j35M601J760m293k705K816K287p85k022o59K069
4546C67J699j866k119K531J862k735k256J700K337L08k586k299K461M470j688
4561B186m842J52L806J402k029k771K5L461J190l541j111K985J028k288j010J595
4577B38J439m02k767j031L657K372l987k915K646L439l05k662k601K249M090j599
$$ plain form
4466 677 -591 -796 1177 1561 -1556 -2283 1578 2501 -1095 -3071 -608 2563 2569 -913 -3827 -126 4341
4483 4341 1799 -2936 -2377 933 2226 379 -2148 -1691 1614 1859 -1360 -1081 1874 1350 -1417 -1749
4499 -1749 115 1827 589 -2994 -2823 2247 3716 -934 -3461 -503 2566 2219 -1030 -3370 -756
4514 -756 2845 1070 -2726 -1351 1550 1020 -702 -685 347 1678 114 -2768 -1124 2912 1389 -2852
4530 -2852 -2256 1189 2931 1111 -2567 -2702 1899 3659 -634 -3339 -523 1764 979 -1043 -1702 367
4546 367 2066 200 -1919 612 2474 -261 -2517 -817 1520 1828 -758 -3057 -596 3874 2186
4561 2186 -2656 -2504 1302 2704 675 -2096 -2071 1390 2580 -961 -2072 913 1941 -347 -1357 238
4577 238 1677 1275 -1492 -2523 1134 3506 -481 -3396 -750 2689 2384 -278 -2879 -630 3460 1861
4593A861m460K03L883J58j971r55J122J609k47k614K05L661m38m015k48L317J711
4610B782j859k861n09L839K516m029l289K738L090p59k663j069J430K541j153
4625G45k983J107L131j117k836J079K178K77k281k104J494M146p24m685k35L965
4641A157J808k280k789JL116K065l248k982K682K465j459j962R63J300K17j637
4657e83j662K354K618k924l184J949L520L5l167j892K051L971o17m700o05L905
4673A069J451k602j511N34J914Q26k235j263K784J411l197j478K642J833j515
4688F63k650o16L223K711l198l835K271M201m30l181j346J580K794l67l475j95
4704a850L468J91k661k6J904O38j519j545L73L215M04m433j519M125K398k222
$$ plain form
4593 1861 -2599 -2396 1487 1645 -326 -1281 -159 1450 1203 -1411 -1206 2455 2017 -1998 -2246 1071 2782
4610 2782 923 -1938 -2447 1392 3908 -121 -3410 -672 2418 1659 -1004 -2073 -643 1898 745
4625 745 -2238 -1131 2000 883 -1953 -874 1304 1581 -700 -2804 -1310 2836 2112 -2573 -2808 1157
4641 1157 2965 685 -2104 -2103 1013 3078 -170 -3152 -470 1995 536 -1426 -463 837 1054 -583
4657 -583 -2245 109 2727 -197 -3381 -1432 2088 2123 -1044 -2936 -885 3086 2469 -2231 -2836 1069
4673 1069 2520 -82 -1593 -1059 855 1681 -554 -1817 967 2378 -819 -2297 345 2178 663
4688 663 -1987 -2603 620 3331 133 -3702 -1431 2770 2340 -841 -2187 -607 2187 1820 -1655 -1850
4704 -1850 1618 1809 -852 -878 1026 1664 145 -1400 -1027 2188 2592 -1841 -3360 765 3163 941
4720I41k950m08L368K156k606l825J982L639r57k611J08J611R03j023j408J001
4736g9K523j304l661J180L505J31k922j946J532L542J78m321j827L862K610k460
4752E43k662K52J875J643j799k181J880K220j908k208K102K071j224k150l00K447
4768F01K405k107m265J555M349l2l329j822J717K980J68l657j579L175J721k198
4784c18j429J599Q24o28j117j14K263R62l354j534L230K878k153l360j0K903K515
4801C157k097m103J158M158L32l371q90J391J410k78j779l73K315L37l020k10
4817a863L196O50k893j592J625L025O25l867k707M019L433k316l656L55K754J493
4833B281j108l097Q34L001o72k496O91J803m47j491o43J366K220j230l777O40
$$ plain form
4720 941 -2009 -2417 951 3107 501 -3324 -1342 2297 1340 -1271 -1163 448 1351 328 -1080 -79
4736 -79 2444 1140 -2521 -1341 2164 2295 -627 -2573 -1041 2501 2679 -1642 -3469 393 3003 543
4752 543 -2119 -1867 8 1651 -148 -2329 -449 1771 -137 -2345 -243 1828 604 -1546 -1846 601
4768 601 3006 899 -3366 -1811 2538 2506 -823 -2645 -928 2052 2220 -1437 -3016 159 1880 -318
4784 -318 -1747 -148 676 48 -1069 -1183 1080 2042 -1312 -2846 384 3262 1109 -2251 -2261 642 3157
4801 3157 1060 -3043 -1885 2273 2605 -766 -1656 -265 1145 867 -912 -1285 1030 1367 -1653 -1863
4817 -1863 1333 1983 -910 -2502 -877 2148 2773 -1094 -3801 218 3651 1335 -2321 -1966 788 2281
4833 2281 1173 -1924 -1090 1911 1239 -1257 -566 1237 790 -701 -1344 22 2242 1012 -2765 -2125
4849b125M582N61l657k310J890K925M31l134k287L192K892k223k512J171J494
4864H90o3j078p84J201J588j907k311K238L032k139k798J18K551K334j624l956
4880b708J49M475J033l866j851K222K066o0k022j227K114J319k386j216K622J249
4896A913k432j430R67K284O96k836k501K930L824j562m079j42K758J830j445k790
4912b015P4L432N21k886n94K054K57j209o79O02J941m10l099o15M204J142l457
4929g37k411K183K973M56k997k632K122L784j496l199M19K258P66q49j232K61
4945c31J849p31k545J019K987p61l261k51K692J864j488l497k31M086J941l417
4961g5k854J929K374Q6j847j770J944K243j099k136J687J716j732j532N21J837
$$ plain form
4849 -2125 2457 3018 -639 -2949 -1059 1866 2297 -837 -3124 68 2960 737 -1775 -604 890
4864 890 827 -251 -1035 166 1754 -153 -2464 -226 2806 667 -2131 -2013 538 2872 1248 -2708
4880 -2708 -2559 1916 2949 -917 -2768 -546 1520 1460 -562 -1789 325 1644 -742 -1958 664 1913
4896 1913 -519 -1949 -982 1302 1998 -838 -3339 -409 3415 1853 -2226 -2368 390 2220 775 -2015
4912 -2015 -1941 1491 2012 -874 -1468 586 843 -366 -1045 -443 1498 1088 -2011 -2626 1578 2720 -737
4929 -737 -3148 -965 2008 2464 -533 -3165 -1043 2741 1245 -1954 -1535 723 1489 640 -592 -331
4945 -331 1518 787 -1758 -739 2248 1487 -1774 -2025 667 2531 1043 -2454 -2685 1401 3342 -75
4961 -75 -2929 -1000 1374 1460 -387 -2157 -213 2030 931 -1205 482 2198 466 -1066 -545 1292
4977A292P47k225k457J867M009j203m090m41L235J990j511l093p14L176J480k599
4993e37j598K223J435j010j032J17J157M21j945j235K917K130k859k608J477K858
5009A911N82k644k624J793L965p88l982o39K496J042j281j611M10J903P02k218
5025i83k33K345J20l080m74K319J633m40k848r23L591K526l035l454J288L420
5041A772K71j962k237J039K777o58k982N58K280m72j496L49J223P18j352k376
5057b548P39L705Nl827p86L087K483j229k962j043L105K310k178l020J470K233
5073A544r04j028k9R24P15j336j403J616K169k123k820J361K917Q75k631k330
5089b483J001L662Q52m147j434L159K018j133k203o33J678J179j561j294K083
$$ plain form
4977 1292 2039 -186 -2643 -776 3233 2030 -2060 -2501 734 2724 1213 -1880 -2594 582 2062 -537
4993 -537 -2135 88 1523 513 -519 -402 755 1176 -769 -2004 913 3043 184 -2424 -947 1911
5009 1911 2493 -151 -2775 -982 2983 2195 -1787 -2426 70 1112 -169 -1780 -1370 533 1235 -983
5025 -983 -1216 1129 1249 -1831 -2305 14 1647 1207 -1641 -2564 1027 3553 518 -2936 -1648 1772
5041 1772 2043 81 -2156 -1117 1660 1002 -1980 -1422 858 386 -1110 -761 462 1180 -172 -2548
5057 -2548 -1809 1896 1901 -1926 -2712 375 2858 1629 -1333 -2376 729 3039 861 -2159 -689 1544
5073 1544 640 -388 -417 507 1222 -114 -1517 99 2268 145 -2675 -1314 1603 2478 -153 -2483
5089 -2483 -1482 2180 3032 -1115 -2549 610 2628 1495 -708 -1341 337 1516 -45 -1339 744
5104G44J549k179j154J789J004p58k476j312K816L027k128l867J062L917L36k526
5120a56k342P73K979Q86k743r30K268M51j764l69J248Q15k13j768k46L018N19
5137B426l953j477K559K573r24k921q78K665K874j933l779O33L179l0j650r12
5153a548Q37J489n43j539O05K293o37k666L84K660L94k079k068N89L273J212l541
5170h85k268L205K591j546k332r15K000J876j344k353J145K110j168j484R98J749
5186A379k36j528j293J457K644j366l722K45L900R67k133k089P17K674J049l071
5202d06j959K241K007j586j261P34Q88o7r17q27J848J710k529k077K080K566j141
5219A304k725j039K137L142j186l695K26L629N98k434j365O52J562L49j940p33
$$ plain form
5104 744 2293 114 -1040 749 1753 995 -1481 -2793 23 3050 922 -2945 -1883 2034 2370 -156
5120 -156 -2498 -1725 1254 2140 -603 -1533 735 1186 -578 -947 301 1116 903 -865 -1111 1907 2426
5137 2426 -1527 -3004 -445 2128 1204 -1717 -2595 70 2944 1011 -2768 -2135 1044 1014 -636 -1548
5153 -1548 -711 778 235 -1304 -699 1594 957 -1709 -1325 1335 1729 -350 -2418 -1829 1444 2656 -885
5170 -885 -3153 52 2643 1097 -1235 -2150 -150 1726 382 -1971 -826 1284 116 -1368 -370 1379
5186 1379 1143 -385 -1678 -221 2423 1057 -2665 -2420 1480 2447 314 -1775 -1058 1616 2665 -406
5202 -406 -2365 -124 1883 297 -964 -230 658 591 -326 -1153 695 2405 -124 -2201 -121 2445 1304
5219 1304 -1421 -2460 -323 2819 1633 -2062 -1836 1793 2391 -43 -1408 -756 806 1155 -785 -1518
5235a518K348O53k144o42J937J232j547j739J22K658J275l223k597K397L257q58
5251A611k799m13J644K024r29l059M16K393J33k171N6J613K76j061j017N91K266
5268A574k90k929m02L116J382k745k088N20K742J503k547k329K149K577j289k463
5284a519K40J535M05j037j099J007J878j097k094R79K533o42k389j051K007K388
5300B044n48l451n24L630J493k527j835R85J959L41j880j476J801J854j998j464
5316a596J581J233p67j448j30J970J434j897k725J198L371o45l033o13J940K259
5332B132l69k825n25K846O62k364j113J670J117r47p98k2J763L82k622q89K395
5349D93J777j854k070M44K389J092k108k681J345L220o00k561P7J734Q63q84j855
$$ plain form
5235 -1518 830 1483 -661 -1303 634 1866 319 -1420 -1298 1360 2635 -588 -3185 -788 2469 1611
5251 1611 -1188 -1601 43 2067 1138 -1921 -1505 888 1021 -1150 -1094 519 795 -266 -1283 -692 1574
5268 1574 1284 -1645 -2047 1069 2451 -294 -2382 -1862 880 2383 -164 -2493 -344 2233 944 -1519
5284 -1519 -1279 256 661 -376 -1475 -468 1410 313 -1781 -802 1731 1089 -1300 -2351 -344 2044
5300 2044 1496 -1955 -2479 1151 2644 117 -1718 -733 1226 1567 -313 -1789 12 1866 -132 -1596
5316 -1596 -15 1218 451 -997 -1127 843 2277 380 -2345 -1147 2224 1579 -1454 -2067 -127 2132
5332 2132 1763 -1062 -1587 1259 1921 -443 -1556 114 1231 284 -514 -536 1227 1609 -1013 -1902 493
5349 493 2270 416 -1654 -1210 1179 2271 163 -2518 -1173 2047 1447 -1114 -1037 697 1560 676 -1179
5366a179L15J741k13k232J84K721L77k033j030J163J817N2l299j194L226K005
5382B421k058k161P05K115P20j871j950J128K542q28j979P87J451m55j593l59
5398a385R98J869j245k237P11L567l80k984j266J823J851l19k509q00K938J992
5414B624k421j838J222J263k74j269m04J108J304j313j538J565J940j735k233
5429a999M80K304J232j633k871J143L547l88l156o56K002J356m35j562m76J842
5445G30R93k098j002J827Q98j647q63J073J435J76k113j445K254K406k134k676
5461b186O95K734Q54j706k037P24K759k45k724k73K074M89j233n43O02J029j47
5478H66k244J92K298Q31k720r03J836J866l95k615j435K263K614j966k714J250
$$ plain form
5366 -1179 -864 877 664 -1568 -1384 1337 1714 -319 -1349 -186 1631 1683 -1616 -2810 416 2421
5382 2421 363 -1798 -1093 1022 1742 -129 -2079 -951 1591 763 -1216 -429 1022 567 -1026 -1385
5398 -1385 -387 1482 237 -2000 -1289 2278 1898 -1086 -2352 -529 1322 1003 -1506 -2306 632 2624
5414 2624 203 -1635 -413 850 576 -693 -1097 11 1315 2 -1536 29 1969 234 -1999
5429 -1999 -1519 785 2017 384 -2487 -1344 2203 1815 -1341 -1997 5 1361 926 -636 -1112 730
5445 730 1723 -375 -1377 450 1348 -299 -1162 -89 1346 1522 -591 -2036 218 2624 490 -2186
5461 -2186 -1491 1243 2097 391 -1646 -922 1837 1592 -1132 -1405 669 1158 -75 -618 -16 1013 866
5478 866 -1378 -1186 1112 1943 -777 -1680 156 2022 1627 -988 -2423 -160 2454 488 -2226 -976
5494i76K282L7j411j144O74J455o32j667P90K232p92j907O8J772O48j397j993
5511a961L67L357O03l202j365K064J754p14k011q03J928J780j602j913J302J587
5527A171j135j026K46J258M69j340j466J573K582j793k659O64K543Q57j810k031
5543a897K55L074P42k968j256K280J080j027j211N6J151P02j519r90K192J213
5559A877k279j523J648J811l77k043j223K099K667j338l288L15K607N36j435j411
5575a357O48J708M84k091o43J919J58j596j59J595P37q67j748k06K463J122k735
5592e68j797K278K252n63k354j147J734K127j198k435O29K428l23j567j09O27
5608A4P30n40j324N92K207l72k867q0K547O72j460j764L73K797J107k967k132
$$ plain form
5494 -976 1306 1343 -68 -1212 -538 917 285 -1382 -592 1640 848 -1059 -991 781 1429 32 -1961
5511 -1961 -1594 1763 2366 -836 -2201 -137 1617 903 -1108 -1911 17 1797 195 -1718 -416 1171
5527 1171 36 -990 -744 514 983 -357 -1823 -250 2332 539 -2120 -1456 1087 1944 134 -1897
5543 -1897 -1642 1432 2174 -794 -2050 230 1310 283 -928 -872 279 981 -538 -1528 664 1877
5559 1877 -402 -1925 -277 1534 1157 -886 -2109 -10 2657 1319 -1969 -1654 953 1489 54 -1357
5575 -1357 -709 999 1483 -608 -1251 668 826 -770 -929 666 1403 536 -1212 -1418 1045 2167 -568
5592 -568 -2365 -87 2165 1602 -752 -1899 -165 1962 764 -1671 -1042 1386 1063 -504 -613 14
5608 14 744 204 -1120 -528 1679 1307 -1560 -1640 907 1579 119 -1645 -1272 1525 2632 -335 -2467
5625b467K020J967r73j718J22J310J021q06j641R33J293j450j417J231J878k20
5641A083j569j222J308K156p10l117q2L393J072j801j581n4J875P13j992j272
5657a800J801J335j334q79P56Q49m46j261n66J898J521k150k214J643K516n90
5673A079k036j001J438K614o47k976j27K652L63j812l57P67O48Q2j148k65J863
5690A137K26k413o25K386J181j669j887o2K228J619k284k358J833K601k81k292
5706f60q16J078J303k99j559M30K082m53j766M50J425k66j576o97R16K537k73
5723A856l159q97K816J271j985j743N16K087J294j529k252J238J431q59j411Q55
5739d71R68J65m11o40R56J340j633k389J091K898k35k013j083J099K386k48l176
$$ plain form
5625 -2467 -447 1520 547 -1171 -1049 261 1282 476 -1165 -232 1061 -389 -1806 -575 1303 1083
5641 1083 -486 -1708 -400 1756 1046 -2071 -2153 1240 2312 511 -1070 -1124 751 1464 -528 -1800
5657 -1800 1 1336 2 -877 -121 728 282 -979 -1545 353 1874 -276 -2490 -847 1669 1079
5673 1079 -957 -1958 -520 2094 1447 -1529 -1656 996 1359 -453 -810 -43 605 687 -461 -726 1137
5690 1137 1363 -1050 -1675 711 1892 223 -1664 -1726 502 2121 -163 -2521 -688 1913 1632 -660
5706 -660 -1476 -398 905 606 -953 -523 1559 1106 -660 -210 1215 949 -627 -1324 -408 2129 1856
5723 1856 -1303 -2200 616 1887 -98 -1841 -1325 762 2056 527 -1725 -487 944 85 -1326 -471
5739 -471 497 662 251 -389 567 1907 274 -2115 -1024 1874 1639 -374 -1457 -358 2028 1780 -1396
5756a396r12K633J483j654j379M47J028L21r65q72J095J234j505r43J792J383
5772A790j399j704RK185J189j388l057J158L039J14k521q47J267J266J90k126
5788h35q80J636O20j393l97J629L46r74q69M99J569Q7k131j426K608K278j550
5805H17k201o5J802J507j471k167O61K751m5j831n26Q43j2n02m97L21J671k48
5823H08k133K81K649k80k496j139J459K176N27k288j638K351J978j581j820K09
5839i37J429P33o23j120L37J251q51j455J045J663j016j372J46J644J022j441
5855D55k613K67L193N86k271j610J637J816J76j753j277J578J768j367j396J168
5871C57M83q08q26N37J197O46j788j584J953K070j613k534j00K528J481j213k427
$$ plain form
5756 -1396 -2308 325 1808 154 -1225 -778 250 571 -394 -1266 -171 1063 -442 -1385 407 1790
5772 1790 391 -1313 -1304 881 2070 682 -2375 -1217 1822 1936 -585 -1432 -165 1101 1291 -835
5788 -835 -1715 -79 541 -852 -1249 380 726 -248 -1117 -618 951 1038 -1093 -2519 89 2367 817
5805 817 -1384 -1449 353 1860 389 -1778 -1117 1634 1589 -242 -768 75 63 -439 -936 -615 1056 808
5823 808 -1325 -1044 1605 1325 -1171 -2310 -851 1325 1852 -436 -2074 277 2255 674 -1146 -937
5839 -937 492 1225 602 -518 -181 1070 219 -1236 -191 1472 456 -916 -770 874 1896 455
5855 455 -2158 -1891 1302 1888 -383 -1993 -356 1460 1636 -117 -1394 184 1952 585 -811 357
5871 357 840 32 -794 -257 940 1586 -202 -1786 167 2237 624 -1910 -2010 518 1999 786 -1641
5888a641J14K493O99k235o60J224O92j23q97k71J034J80j757j90K157J012k026
5905a95j278J087J765O8k389j670J922K754j156k257J37J543J048q53j647j62
5921a283J957Rj563J68J588m80j412q6J270J121n58k086P4K631O20k630j701J367
5939i94K063J89j559j345J230K060j053k033Q30J427n00o30q0P66Q12j367j466
5956a650J294K409r44k245RJ803J217j271k348k31K863J118k306j047J343J255
5972A269o02r99l36O23R83j328n91J388J107j528j537J102J816K22j656j793J479
5989c81K537o59l134k51K154J031p63j627K55J666O80j768r37J458M32j068n95
6006i70J086Q04j60j727m51K115J401j955j981J142K017J73j875j463J110K272
$$ plain form
5888 -1641 -1527 966 1665 -570 -1230 -6 686 563 -334 -605 429 609 -1148 -1338 819 1831 -195
5905 -195 -1473 -386 1379 1447 -942 -2612 -690 2064 908 -1349 -1212 331 1379 526 -1121 -1283
5921 -1283 674 683 -880 -712 876 396 -1016 -1102 168 1289 731 -1355 -1281 1350 1970 -660 -2361 -994
5939 -994 1069 1258 -301 -1646 -416 1644 591 -1442 -612 815 315 -315 -395 371 1183 -184 -1650
5956 -1650 -356 2053 1109 -1136 -1127 676 1893 622 -1726 -1957 906 2024 -282 -1329 14 1269
5972 1269 667 -332 -668 -45 938 -390 -981 407 1514 -14 -1551 -449 1367 1589 -67 -1860 -381
5989 -381 2156 1497 -1637 -1888 266 1297 534 -1093 -838 828 1508 -260 -1197 261 693 -375 -970
6006 -970 116 920 760 -967 -1418 697 2098 143 -1838 -696 1321 1494 -381 -1844 -734 1538
6022A538m26k118o8J438L34j193l51M84R28l05j487L68J915j24k200l32K040J126
6040A567p25j862n42K293J215j898k125J298J824j03r39p14P29R12o25j711P56
6057f50J581r77j171O41J390L44j351j528O76K673j59k778n76K383J184r04j654
6074h76l15J279J263j316r81J149J140j096q98O84M73K47j443n65J474J367j190
6091C96k012P94K025J61j587j447Q80K133K51k400p46K224O30j007q40L10O60
6108D25M47j348k99J812J91j837p29J479J232l75j718q54J934J822j529k334P42
6125i39K100n6j536p96O23J633k38j388l18J889j67j696l6J345N50q84j360M73
6143h01K139K22k265j293J941J588r53j460m16J475J495j123k097O73J893n15
$$ plain form
6022 1538 1112 -1006 -1074 364 698 -495 -846 -362 566 261 -1226 -858 1057 933 -1267 -1599 441 1567
6040 1567 842 -1020 -1562 731 1946 48 -2077 -779 1045 942 3 -711 18 930 305 -1406 -650
6057 -650 931 -46 -1217 -576 814 1158 -193 -1721 -1045 1628 1469 -1309 -1885 498 1682 778 -876
6074 -876 -1191 88 1351 35 -946 203 1343 247 -651 33 506 753 -690 -1255 219 1586 396
6091 396 -1616 -822 1203 1364 -223 -1670 -790 1343 1594 -806 -1552 672 1302 295 -545 -235 425
6108 425 872 -476 -775 1037 1228 -609 -1338 141 1373 998 -720 -1574 360 2182 653 -1681 -939
6125 -939 1161 1105 -431 -1227 -604 1029 791 -597 -915 974 807 -889 -925 420 970 86 -1274 -801
6143 -801 1338 1560 -705 -1998 -57 1531 578 -882 -1298 177 1672 549 -1548 -875 1018 503
6159E03j100K27P59M21p80j170O24J615q58j937M70K394K95j418j237L63J941
6176A112L18k099j198K001J303r35j434J97P89P42r29p18R45R33r84j350J158
6193a49J293n30j325p23J396J810j046k393N78K325M01j834j081P08J497R0j680
6210f63o41J691P03j058q29P82N84m48o96k59J443Q42j746j299J616J501q62j808
6228a147k08J405J393p27k266P17J958J4j481n56Q42O72n0j101j46J547L6j796
6246h94n3J694N13j359j027M16J620O09j994j314J766J855j179j688L8J405P49
6263A157r28j210L06J658n15j337L04J178k55q32k51O88J324m46k216J60K066
6280H51N18j698j028P27J453N89k080q88J433J478j234j223P08R33k20p61l52
$$ plain form
6159 503 -597 -370 389 810 30 -1140 -516 1099 241 -1696 -1226 1168 1463 45 -1192 -829 1112
6176 1112 1430 -669 -1867 134 1437 502 -932 -735 54 796 -133 -851 94 1027 43 -1307 -149
6193 -149 1144 614 -711 -1434 -38 1772 726 -1667 -1089 1236 1637 -197 -1278 -570 927 1017 -663
6210 -663 -1304 387 1090 32 -797 -15 569 121 -575 -834 609 1451 -295 -1594 22 1523 661 -1147
6228 -1147 -1355 50 1443 716 -1550 -833 1125 1139 -342 -898 -56 616 566 -535 -681 866 902 -894
6246 -894 -947 747 1260 -99 -1126 -710 910 1519 -475 -1789 -23 1832 653 -1035 -997 408 1157
6263 1157 229 -981 -675 983 468 -869 -565 613 358 -474 -725 -37 1287 841 -1375 -1215 851
6280 851 1369 -329 -1357 -630 823 1412 -668 -1556 -123 1355 121 -1102 -394 539 319 -442 -794
6297g94Q97J025j318j336J114J912o26j868k09J320J288p62j988L32J835O11j688
6314b55j045Q62J261k07j158n40J356R34j307r73J363Q26q76j108K11J479N88
6331A411j399j574R91K091p99j739j17J582Q75o56j611j46J742K71j621j37J185
6348C49L65o50p29L81R70J36j665l08K000Q18j371j598O43J491M96j582j427J226
6366d55K107p92j853L56J124L70q96p00N14R00j96j459L61J691k42j398n40J186
6384G8J113l69j790k80J761J060j660j385J161J320pj280q80J002J281r09j137
6401i21N47J235o11j032J02Q96P04p91j737R46K001k34k183n05J603J032n70j392
6419i10j66J834Q59j614j209J389N61o10p41J18J065K01j393p67J641J052j161
$$ plain form
6297 -794 103 1128 -190 -1526 -412 1500 874 -994 -1203 117 1405 643 -1345 -1013 822 1433 -255
6314 -255 -1300 -438 823 616 -542 -1082 274 1208 -99 -1072 291 1117 241 -867 -656 823 1411
6331 1411 12 -1562 -571 1520 721 -1018 -1135 447 1322 666 -945 -1091 651 922 -699 -836 349
6348 349 714 64 -665 -284 686 822 -843 -1151 849 1667 296 -1302 -659 832 1328 -254 -1681 -455
6366 -455 1652 860 -993 -637 487 857 -39 -739 -225 675 479 -980 -619 1072 830 -568 -1108 78
6384 78 1191 822 -968 -1248 513 1573 -87 -1472 -311 1009 1002 -278 -1158 -156 1125 216 -921
6401 -921 -374 861 250 -782 -680 216 920 129 -1608 -662 1339 1105 -1078 -1583 20 1052 482 -910
6419 -910 -1076 758 1617 3 -1206 183 744 134 -607 -489 576 777 -616 -1383 258 1310 149
6436A49j627O38J689K02j140j364O25K255l89k269J15J351Q00p98q33M6J224P7
6454G51j281l25J258M98j420m40J191R53j99j770p42J915J191j648j543P62J726
6471H77J60j130j278R76J379j74j480l8J343pq10l57R63L86m18j564N08K164j05
6490A395j955p46J271J626q47j811l09J519J380j206j758Q83J204k09p68l95O89
6507c7N69o41q50R75J303r59j555P01J450K95j229j272N77K199j20k175q06J576
6525AJ096p63j025l72J195P85j043q55Q90P95j137n26P52Q18k61j026n56J449
6543B17J498j248j965M98K061J31j135j202N76J502K54j645o54J444N74j023o24
6560g41N43N04j3q96k00J428N30j825p44J468J264m71j661o15J453J556j038j881
$$ plain form
6436 149 -1478 -840 849 1051 -89 -1453 -828 1427 1038 -1231 -1116 235 1035 237 -596 -550 674 751
6454 751 -530 -855 403 901 -519 -959 232 1185 986 -784 -1526 389 1580 -68 -1611 -849 877
6471 877 1037 -93 -1371 -395 984 810 -670 -708 635 628 -182 -539 424 810 392 -1172 -664 1500 1395
6490 1395 -560 -1306 -35 1591 744 -1067 -1376 143 1523 317 -1441 -558 646 437 -331 -726 -37
6507 -37 532 -109 -959 16 1319 360 -1195 -494 956 1251 22 -1250 -673 1526 1406 -769 -1575 1
6525 1 1097 334 -691 -1063 132 917 -126 -981 -91 704 -433 -959 -207 611 350 -676 -1232 217
6543 217 1715 467 -1498 -1000 1061 1192 57 -1145 -569 933 1187 -458 -1112 332 906 -117 -741
6560 -741 -198 306 293 -603 -803 625 1155 -670 -1414 54 1318 847 -814 -1429 24 1580 542 -1339
6578a339N30J784q4r99m91N27P44j93r92K7J130k72j217J64J122M36q35j113L41
6597g30J637M44k033r88J310J397n83j303p1J009J322j070j212O92J050m19j186
6614g34N71N56R8p40o73Q51J603j038j946M15J951L49j344j267J63J938M06j705
6632e46o95J187J076r48n58K16O13J00q97k86J108N95j310r48R37J579n26j309
6650f12m96J153J645q72k150J3J968M73j251q51O10P21N37j131n25J273J53j421
6668g63r4J149N34q09j099M34J589M75j520j568J439J665l16j832o79J212J403
6685A220n72j426j35J618J15j370J70P94M2n42p26M26J358l59j643j99J840R64
6703A575j622j571P20J469R50j675j493J355J295n81q36N3N68M95n42n47M75Q53
$$ plain form
6578 -1339 -809 975 891 -108 -599 -72 672 479 -513 -486 644 372 -845 -681 441 877 42 -1071 -730
6597 -730 907 1351 -682 -1670 -360 1037 454 -849 -920 89 1411 341 -871 -179 871 452 -734
6614 -734 -163 393 491 -249 -922 -71 1532 494 -1452 -1037 914 1263 -81 -1348 -1185 753 1159 -546
6632 -546 -1241 -54 1022 74 -484 -268 345 445 -452 -738 370 965 -345 -1293 -356 1223 697 -612
6650 -612 -1108 45 1690 818 -1332 -1319 649 1122 -129 -980 -370 351 888 -243 -768 505 658 -763
6668 -763 -857 292 826 17 -1082 -648 941 1416 -104 -1672 -233 1432 1116 -716 -1395 -183 1220
6685 1220 648 -778 -913 705 820 -550 -380 414 456 -86 -812 -386 972 613 -1030 -1229 611 1575
6703 1575 -47 -1618 -898 571 1521 -154 -1647 -292 1003 422 -414 -361 207 702 160 -387 88 941
6721I41r20j059Q35J189k31j328m20Q84J481l51j986l55J830Q20j169j136J51
6738h24J248K78r85o15J020P11q48n53Q75L96m95r86J54J219P43j151j597P35
6756f75K037k42j578p87J071J278l02j372o21J665M15j188n24P47L76k55m82J15
6774c22Q16L47j571n91J651R41j294r69L29J427P16j256j652Q05J591k80j148
6791d60m03R49M20j72p47k46J113o2j121n7J453m1j275n54Q85J298n7j770p87
6810a634J948J275j275j387L55J071N87p73r53M01J050k65j075M64Q65k18q80
6827d44q1O14Q26p82j612P22J749K4j698n78J056J327j54j644o39J445J068r51
6845B48p41M87M05J69p34k49N85O13r74q65J232Q41p11j372K39J165Q82j077j672
$$ plain form
6721 941 21 -1038 -203 986 755 -573 -993 -109 1372 1021 -965 -1320 510 1330 161 -975 -824
6738 -824 424 702 -283 -898 122 833 -15 -568 307 703 208 -778 -624 595 1338 187 -1410 -675
6756 -675 1362 1120 -458 -1245 -174 1104 802 -570 -1191 474 889 -299 -823 -76 300 45 -437 -322
6774 -322 494 841 -730 -1321 330 1271 -23 -992 -663 764 1480 224 -1428 -623 968 688 -460
6791 -460 -863 86 506 334 -413 -659 454 392 -729 -786 667 626 -649 -1203 -318 980 923 -847 -1634
6810 -1634 314 1589 314 -1073 -718 353 940 167 -786 -385 665 400 -675 -211 654 436 -444
6827 -444 -525 89 915 133 -1479 -757 992 1016 -682 -1260 -204 1123 969 -675 -1314 131 1199 248
6845 248 -493 -6 399 568 -166 -415 170 783 -191 -1056 176 1017 306 -1066 -827 338 1220 143 -1529
6864a529P35K135j50j549p14Q52R68j42j061j46R80K91r80k33Q89M91j085n48
6882g96N61R92K63j708n82J467J233r73j723K91J403L85m31j329J69J593Q1j431
6900e35j37R26ko28q1N99N99m27j116j2J666K50j638q18J056J326p1j445n97J106
6920B1J284j007j246K70J042L9l06m96J50Q54n08q28L40J210l35j445J84J101
6938C24N66o37j500J26K028L34j638o85R34R91j28j078m89P65J097j057p24P64
6956gQ51o31r99M98P46L45r96r92R21J593p31j619L3J585L83o68j221Q4J566L46
6976A087j572k30Q22N21n44o30J86P79J02j002k31J251N94j227r44P32J107m1
6994G60j021p07Q02J173o20j258J19J254L69r49m60J56J178l65r20k7R20K98j225
$$ plain form
6864 -1529 -794 1341 1191 -358 -1072 -220 748 606 -455 -601 379 670 -310 -543 346 837 -248 -796
6882 -796 -235 757 1020 -688 -1270 197 1430 457 -1266 -975 428 813 382 -947 -778 815 896 -535
6900 -535 -672 254 252 -376 -457 142 741 314 -802 -814 852 1102 -536 -1354 -298 1028 957 -488 -1085 21
6920 21 1305 298 -948 -678 364 403 97 -399 -249 605 97 -731 -391 819 484 -961 -777 324
6938 324 890 253 -1247 -1121 907 1241 -397 -1082 -148 843 715 -363 -852 -87 1010 -47 -771 -7
6956 -7 844 213 -786 -288 458 803 -193 -1185 -264 1329 598 -1021 -988 597 980 312 -909 -825 741 1087
6976 1087 -485 -715 107 628 84 -546 -360 419 521 -481 -712 539 1133 -94 -1038 -306 801 760
6994 760 -261 -968 -166 1007 387 -871 -752 502 871 -78 -538 -382 796 431 -489 -516 404 702 -523
7013e23j24Q05O45m93j300k3J568O51j425j181J259Q89k21j074l11O48J098k95
7031E93j508M50J260l64j137L24N15L09n12q19N32J421l58j702p8J468N68q45
7049A17q86k12J265Q64j389r98J080R70n97o76R1O38K64n68p40Q93O27o31j081
7068i69M79J197J84r81p30M92J563l47j821l0J258M79r77m98N15O99J96j027l57
7087f75Q56N37j044m70O99O79j27j010j82R69J127j199j420P54J389r2r33p15
7105h57P60J070l47j297p9J360J62j025j89O59M05n44p17K4J289R0j380l18J398
7124D64N87r49q37j33J234Q07j130j145Q09J281l99q71l66N98N22l47r62M71J039
7143F73k10q97K5Q31rp52n32L66J437K15j758n58J368O13q58r37K48R70P63p99
$$ plain form
7013 -523 -647 158 803 310 -990 -1013 555 1206 -219 -1400 -141 748 527 -547 -858 -210 888 593
7031 593 -915 -465 795 431 -706 -382 133 442 -70 -889 -357 1064 706 -996 -1074 394 962 117
7049 117 -769 -981 284 1148 -241 -1239 -159 811 214 -462 -371 267 531 -37 -777 116 743 112 -969
7068 -969 -490 707 891 -90 -820 -328 1235 888 -933 -963 295 774 -203 -701 -186 513 709 -318 -675
7087 -675 181 718 -326 -796 -97 582 455 -555 -737 232 1359 160 -1260 -506 883 791 -142 -857
7105 -857 -97 973 626 -671 -750 610 772 -253 -442 217 622 78 -639 -615 674 764 -616 -934 464
7124 464 1051 102 -735 -868 366 1173 43 -1102 -293 988 589 -282 -648 -50 472 125 -837 -366 673
7143 673 463 -434 -409 422 413 -339 -871 -505 932 1147 -611 -1169 199 812 -46 -983 -735 235 998 199
7163A99j244R67Q32o50n78K02N70L2o88l82M97J244q32j444P78J357j45j036p58
7182a079O68J130J83j909l5J408M56r71o47O00N79Q3n40m63Q02N57j156o27R18
7201d3Q45n92q70K8R24J126j325j333N93J465j05j310j89O23Q98j55q20k77P57
7220B40M71j112j29Q99L22n98o81K06Q90K04j347n87J369J163p05j212N9P71P45
7239I68j084r73N30J456k52j051NO62J43m93k48L03P63k66j160K2J461K0j205
7258c99o07P60R69K44j226q95J362Q32p99j115J87R43K43n05n72M42P44n06q06
7277g04M10J016k78r54j39N52Q68n55j268N36J243J56j206m31M81R02j17q57p34
7296a079J081Q75r54n30M24O37m27k28k04P55M58r14o32P23Q68n56j234K59J139
$$ plain form
7163 199 -1045 -78 754 104 -474 -272 298 330 -358 -740 -243 1001 169 -1275 -497 860 715 -321 -1079
7182 -1079 -411 719 902 -1007 -1042 366 822 -149 -796 -196 383 466 -74 -537 265 822 -334 -961 -43
7201 -43 802 210 -660 -632 292 1418 93 -1240 -647 818 713 -597 -786 -163 735 580 -240 -517 240
7220 240 711 -401 -530 369 691 93 -588 -382 508 712 -635 -1222 147 1310 605 -607 -548 223 968
7239 968 -116 -1089 -559 897 645 -406 -401 261 404 -89 -337 -34 729 463 -697 -675 786 806 -399
7258 -399 -1006 -246 723 967 -259 -1154 208 1040 241 -874 -687 256 499 -6 -578 -136 608 102 -704
7277 -704 -294 722 444 -510 -649 -97 771 216 -1052 -516 727 883 -323 -754 -273 629 512 -345 -1079
7296 -1079 2 877 -77 -607 -183 454 27 -201 -405 350 808 -106 -738 -15 853 297 -937 -678 461
7315D61Q53q07j506M86J155K65j344m21J115L29j43n45m5M22J54r66k90J154M59
7334G86p22q37M96Q21L58j384o98J113J237o75j205J72R95K11o95n97K29R36M1
7353E82j059L44O11p9o86k38O11M95j76r56m04J833Q3j233p07Q35R55L1r15q61
7373i34P66Q56m98j079K79J037j33m96j32L83M94o07r57O89J308k64j450q2J083
7392B63N32o31j076J02J607K65j158p38P60P02l02o59k67N25O74p24n77J124K99
7411G21r08p03N20P80J43q85p38O58J403n22j308j4J188O50n29r97j55J078K28
7430F10r63l97J007L44n73m19N13K65k15q74k55J288Q75j264j014N98J095j3r26
7449c18p10O78J373n16j208K15Q59j42l31j59J73O76k77n86P9J218n52j265j37
$$ plain form
7315 461 1314 507 -999 -513 642 907 -437 -858 257 586 443 -102 -147 275 429 -537 -827 327 786
7334 786 64 -773 -277 544 902 -482 -1180 -67 1170 495 -710 -538 457 668 -27 -624 -395 541 582
7353 582 -477 -133 478 399 -287 -525 86 581 405 -551 -955 878 961 -272 -979 -144 811 842 -73 -934
7373 -934 -168 688 190 -889 -610 427 294 -202 -334 49 543 -64 -1021 -332 976 712 -738 -820 263
7392 263 795 164 -912 -810 797 1062 -96 -834 -74 628 326 -333 -600 -75 599 -125 -702 422 721
7411 721 -187 -890 -370 410 553 -332 -1070 -412 991 469 -839 -853 335 985 456 -541 -696 382 610
7430 610 -353 -750 257 601 28 -391 122 387 172 -702 -957 331 1206 -58 -1072 -474 621 608 -318
7449 -318 -1028 -350 1023 507 -701 -486 373 231 -100 -259 -86 590 313 -273 -194 1024 472 -793 -930
7468i30J029Q37p76q16j89J354M84j243r91P74J050P1p42l37M31M27k69q54M95
7487a95P28n56l92M34O83k7o64p29M60J188o7j631j26J167P82n64j154l11J092
7506A18P75j080p02P14M95k96l22L1O35n7n31l39P54P70q72j140P46J066N7r02
7526h0o68L67R75K17j339l77J219L86n32m07j92N55M8p14q5Q57L52q82k85Q39
7546B54M96o48q52p8J026R77r85j109O14J200l87p84n34M73J164j02j024R2O03
7565C96j11q67l6O12L62m59m24K83J016M8j330o98J242O87m52r44o8J148Q05o86
7585E24j480N25Q24m6p03K43L03K38k56m73J08Q51n15r04M51R20N5q57p35K27
7605g00J401J97j380l89R24P99l81r15J66M00M27m86m95N04O06q18m59O38N63
$$ plain form
7468 -930 99 936 160 -656 -845 509 993 -250 -1241 -467 583 654 -88 -425 6 433 164 -690 -195
7487 -195 533 -23 -415 19 702 675 11 -718 -258 930 863 -768 -894 273 1055 491 -663 -974 118
7506 118 893 -187 -889 -175 320 24 -298 -267 368 311 -220 -559 195 965 93 -1047 -301 765 822 -80
7526 -80 -748 -381 594 811 -528 -905 314 700 168 -239 -431 124 172 -542 -627 230 582 -300 -585 254
7546 254 750 102 -750 -828 198 1175 190 -919 -305 895 508 -276 -810 -337 827 725 -299 -207 396
7565 396 285 -582 -618 -6 356 -103 -527 -244 772 820 -510 -1208 34 721 269 -675 -743 405 1210 524
7585 524 -956 -431 393 347 -356 -113 190 428 172 -301 -193 658 143 -761 -310 610 665 -192 -927 -700
7605 -700 701 898 -482 -871 53 852 471 -444 -278 122 549 63 -432 72 678 -140 -599 39 602
7624F02k06q04j23Q30N80p77j103J11J734J48r85o18L70P60K5j186k37R51L08
7643C80m97J8K50J40l13n59QJ106J99q74q71J132Q87o15r56p2O68O70k86j314
7663h99K57J131J58q85l34L98M68l14l29K42O93k09r94j18J186K77p98p27M93
7682c04R87J09r75q62Q79R93l76r66k11P95M22k78q57L17Q21l73q76O55O60k74
7702B86n93k92O49P05l95j183m4J482L37q56r99M77R40K68j145l74Q79M79o32
7721a1o05M60M42j75j88l46Q73L87r19p22P55Q20k47j198MP45Q29m01j201j5J180
7742D67K95r67n24N41O56j63o15kO54J05q07l61R37N43q95p84M61R45N63j079
7762c0j082R29J181n27r47j01O95M62k36q43J29Q11j22p67J26M96J73m55k35K14
$$ plain form
7624 602 396 -408 -531 299 879 102 -1001 -890 844 992 7 -611 -241 519 544 -642 -879 72 380
7643 380 -117 -99 151 291 -22 -581 -573 533 732 -142 -1013 119 1006 391 -565 -637 31 701 415 -899
7663 -899 -642 489 647 -238 -572 -174 294 -20 -349 -107 586 377 -617 -735 451 728 -70 -797 -304
7682 -304 683 792 -183 -1045 -166 827 451 -515 -726 69 491 213 -644 -327 494 121 -755 -100 560 286
7702 286 -307 -599 50 755 360 -823 -867 615 952 96 -903 -426 514 782 -363 -737 142 621 -11
7721 -11 -616 -156 286 111 -77 -423 450 837 -82 -804 -49 771 524 -674 -670 75 904 503 -698 -713 467
7742 467 762 -205 -729 -188 468 305 -310 -312 342 447 -360 -721 216 759 -136 -920 -459 486 1049 -30
7762 -30 -1112 -183 998 471 -476 -577 118 580 344 -499 -370 441 319 -448 -322 174 347 -108 -343 -129
7782a29Q41j93j210nQ66P01r10p35J80J018L81r08q14O60Q79l52p52K17O19pl44
7803Cm80M01N77m97q20M06J212m21q90j68N94P74l60j092j19J121P67j073n84
7822f49L45P80J4p18k11K20P51m05o37N32P27m34q53J38P18K99o46q69O38J209
7842I49j98j171j93O28O97k52q69n2O99N00r42l18N95M24n76l92K87N56P3o99
7862b54k31P09Q60r84j001M02R35K31o45p21N72Q81n5j209j1O44J17k61l14L16
7882a9M95j00n32k56R40J03r24m27O18Q64j24j101k84Q54R48q19q63K65R69J55
7902G62o43l40J02N80m74o85M87P26j72o24k52P90J51l27q19J51R87K99j269j05
7922f75O69O72k34r60k66Q80N46o68n99N69N04j33o09Q0L13O7k50o59Q54N94l78
$$ plain form
7782 -129 712 519 -691 -696 170 871 -39 -774 -594 424 805 -103 -917 -257 622 270 -482 -265 354 347 3
7803 3 -477 -76 501 4 -816 -410 802 381 -509 -677 -83 691 331 -761 -880 241 1008 -65 -649
7822 -649 -304 476 490 -228 -439 -219 532 127 -510 22 749 315 -538 -400 318 617 -29 -898 -260 949
7842 949 751 -420 -613 15 712 460 -409 -461 238 738 -204 -522 73 497 -79 -471 -184 372 445 -254
7862 -254 -485 224 1084 100 -901 -499 436 667 22 -699 -127 754 699 -510 -521 123 240 -21 -335 -19
7882 -19 476 376 -156 -412 528 631 -293 -720 -102 762 638 -463 -747 107 1055 236 -627 -362 607 762
7902 762 119 -221 -119 461 -13 -698 -211 515 343 -281 -533 257 408 81 -738 -587 400 699 -570 -675
7922 -675 -6 666 432 -528 -794 86 632 -36 -635 -66 438 305 -304 -224 89 156 -94 -753 101 695 317
7943C17r96K09N56M97o85p15L31J303j19j131l02R85L34n21n94kQ83Jm01n20Q09
7964B39K87o09l73K72O97n1q60l07P14Q20n81q74J70Q48K00n76p28N43P70k48
7984C53o51l42Q82J53n72j31L69L04Jq03O6Q52K57q74o63P72P82n40n69j57P94
8005B83N17m72r87L15P07M9m99j94L51L60k17o43J31Q03j18p91r5R70J53n01q50
8026g28M16O52J02q80l49Q93N72o40m55K1N34L01p42l77O15N87m11o42M58L46
8046B73Km61k08L04R90n03j088J31R53J40n51o27L98P49o1o22n61Q57L44m68l69
8067c78K01N18j39n33k64P12M86o44p23N18P83k55p04k42P78O52l64j045OJ102
8087D65J9p73j14K98K95mn93K18M53J28p37j42P84L12m92p72K55R98J54j050o20
$$ plain form
7943 317 -679 -470 86 583 -102 -817 -486 817 698 -433 -735 250 584 63 -531 -533 350 351 -50 -570 239
7964 239 526 -83 -456 -184 513 462 -398 -705 9 829 248 -626 -456 392 592 16 -712 -169 601 353
7984 353 -298 -640 242 395 -177 -308 61 365 366 -437 -371 481 738 -136 -799 -27 755 215 -354 -511 283
8005 283 800 328 -659 -344 363 412 -87 -281 70 430 213 -430 -299 504 386 -405 -500 470 623 122 -728
8026 -728 -312 340 442 -438 -787 106 678 38 -417 -396 138 439 -303 -680 -65 522 111 -531 -73 273
8046 273 275 -186 -394 -90 900 397 -691 -560 393 533 -18 -645 -247 502 441 -181 -742 115 459 -9 -378
8067 -378 -177 341 202 -331 -595 117 603 -41 -764 -246 537 282 -422 -664 114 766 402 -643 -637 465
8087 465 484 -289 -403 -105 190 186 -407 -189 264 392 -345 -487 297 609 117 -655 -400 598 752 -298 -918
8108i18Q00R80m91o17l17P77K98l11p12K37O71j14o23M5N87J71l06m42J31O11
8128D57j2j060J30Q43K23m20p53K00Q40K40o42n37M22P85l86p12K60L35K51o02
8148a38n28Q77K97l59q53N42M56Pp36l53P31O15l69r10O0Q22M53p74l54L42N74
8169D02K32p92l24O50J96n00k19K99L15Q0q07J07Q17P8p15p17P26O79l1p59k13
8190d96L33
$$ plain form
8108 -918 -118 862 371 -246 -563 214 512 201 -511 -274 397 283 -340 -295 292 463 157 -285 -154 457
8128 457 445 -615 -485 358 581 161 -592 -392 448 688 46 -491 -69 716 330 -382 -122 213 464 -138
8148 -138 -666 211 508 149 -704 -162 294 301 -435 -788 -57 558 189 -721 -661 161 614 -160 -514 -172 402
8169 402 634 -158 -482 168 364 -136 -355 -56 259 339 -468 -361 456 534 -181 -898 -172 507 476 -283 -496
8190 -496 -163
8191a63
$$ Imaginary data points
##PAGE= N=2
##DATA TABLE= (X++(I..I)), XYDATA
0@%%%%%%%Qj6J6j6J6k4L2l7M5n6O5p3Q8j04J20j38J59j84K09k36K69l06L47l89
31b05M36m90N45o05O77p54Q34r26J027j136J258j393J543j712J900k112K356k637
49a394K963l350L820m401N142o119P473r486J2774j9040L5021j43792l27779L69288
63g8880K95335j99357k03510J32644R7586o6649j5461M5623p4134o6911J00785
74c2929J03250r2582q5833R9746O8452j18900l6084J42980K1808j59478k2935
85a12505J56895O4105j08694j05267K0600J05445L9275q3340o1628N2280M8352
96A5518j1861K472l069n4020j2047O5370K3107n1041j9971L3631O386k1360L4965
109H080N7993n8681j13341O6464J65807n5771j88823L4900J61249l3607j08974
$$ plain form
0 0 0 0 0 0 0 0 0 8 -8 8 -8 8 -16 16 -21 24 -32 33 -40 48 -56 64 -74 85 -99 110 -126 143 -163 184 -205
31 -205 231 -259 286 -319 358 -396 438 -488 539 -597 661 -732 811 -901 999 -1113 1243 -1394
49 -1394 1569 -1781 2039 -2362 2780 -3339 4134 -5352 7422 -11618 23403 -120389 -448168 -78880
63 -78880 216455 17098 -186412 -53768 43818 -22831 -38292 7331 -66803 -133714 -32929
74 -32929 70321 -22261 -108094 -8348 60104 -58796 -94880 48100 69908 -89570 -112505
85 -112505 44390 108495 -199 -105466 -84866 20579 59854 -23486 -85114 -32834 15518
96 15518 3657 6129 3060 -50960 -63007 2363 25470 -25571 -45542 -11911 -5525 -26885 8080
109 8080 66073 7392 -105949 -39485 126322 70551 -118272 -83372 77877 44270 -64704
120f4704M7997N7554o5811k1968P6966Q891p4123r835N1753l686l7966K9041L5865
133B9974o8284m8680J15812R0840j25541j15899J06857J20043o3018r6517Q780
144d5633M7156K1229l477j8033k518J3171l660j342J4982j0562l0317l377O694
157a5687Q999L6429O608p0890m0307P5289Q0160m3844j07493l636J19690N0914
169I6232j11265p7488P9714N9086n4812j5374N0217j1226l7949K9008K1242l8005
181a0620j4639K2129j1901j9380M1447M6641n2183r2903L5256J30393m747j41575
193g2082j9753J22203K8368q5464k7765L1870N749P576K2215r239k1845L395R240
206e532j693j781L199K336j6320k2241L4561N9333l8264r4785J9061J04913J3173
$$ plain form
120 -64704 -16707 40847 -24964 -46932 30034 38925 -35198 -45033 6720 3034 -34932 -5891 29974
133 29974 -38310 -86990 28822 119662 -5879 -121778 -14921 105122 42104 -54413 -45633
144 -45633 1523 22752 19275 1242 -1276 11895 8235 6893 21875 11313 -19004 -22381 -15687
157 -15687 -6688 29741 36349 -34541 -74848 441 80601 36757 -70736 -74372 45318 96232
169 96232 -15033 -92521 -12807 46279 -8533 -23907 26310 15084 -22865 6143 27385 -10620
181 -10620 -25259 -3130 -15031 -34411 7036 53677 1494 -91409 -56153 74240 69493 -72082
193 -72082 -91835 30368 58736 -26728 -54493 -22623 -16874 -9298 12917 3678 -18167 -14772 -5532
206 -5532 -7225 -9006 -5807 -3471 -19791 -42032 -7471 51862 13598 -81187 -62126 42787 55960
219E5960q2403l6452N1558N2911k3417o1609m04M4277l497k0751L0481J8592l3240
232g994p958K0687j2104o900K2178k1122m4915L6145P8831j2690r1117k4948Q6181
245A4274N8579p2613p7927N2295P2522l2600m4164K1946R731j9983J2889J7601
257A2550j3980M05J3849j8024j6464K7190K5212k9187n1434R817P9736K8027q5259
270a7562n4794P2744O1978m9222n5574J9349L6830O626j5710j7528L957J1587
282B681q445l105K0038O391j1440n554j1719q55L6176J886o8553j5950Q5209M2296
296F9056o8454n7604L5656N8637r317n8644r696M8375J1991l3747J591K2132j6497
309f521j4307J6859J255k058K2910q501m5088J0788N9989L95o7486l0751N5905
$$ plain form
219 55960 -26443 -62895 -11337 41574 18157 -43452 -43856 421 -3076 -23827 6654 25246 -7994
232 -7994 -15952 4735 -7369 -14269 7909 -13213 -58128 -21983 56848 44158 -46959 -71907 14274
245 14274 72853 240 -77687 -25392 47130 14530 -29634 -7688 2043 -17940 -5051 12550
257 12550 -1430 -1025 12824 -5200 -21664 5526 30738 1551 -49883 -40066 39670 67697 -17562
270 -17562 -72356 388 62366 13144 -42430 -23081 13749 20375 4665 -12863 -8906 2681
282 2681 -5764 -8869 11169 17560 6120 566 -11153 -12008 24168 26054 -42499 -58449 26760 69056
296 69056 602 -57002 -21346 37291 27974 -30670 -40366 8009 20000 -13747 -12156 9976 -6521
309 -6521 -20828 -3969 -2714 -4772 18138 9637 -35451 -24663 35326 35721 -31765 -62516 -6611
322f611O1991l0849p5457J2391P4569K7n8169p182K5944p75n437M295l161N481
336b943J0085j3694j1759K0022J7715j7803l3338m712M8627M0816m9285o7503
348f3772M1650Q0807k3253p5291j883N0655K2057k0418k5818L701K0855m186j8584
361a3480N522R419n618O72J271n197K0537J5471m5334l5896N1688M9493m1329
374G219n4482K2627O0534J0265n4114l6641L6312L8981k2819k5316J7089J0120
386I775p166N616k732j6391P335J0106j9854k422L5200J0238l4742k4467K2432
399g072L8778j1716n9506n505P0679K5791n5410k5885L4945J7977j6536j5025
411h485m393J1152J8508n576j7520P362J5479m891j7615j1475J4196L1073j1761
$$ plain form
322 -6611 55380 24531 -50926 -38535 36034 36061 -22108 -29290 -3346 -4121 -9558 -5263 -8424 -2943
336 -2943 7142 -6552 -18311 1711 19426 1623 -31715 -36427 12200 53016 3731 -63772
348 -63772 -22122 58685 35432 -39859 -41742 8913 30970 10552 -15266 -11565 9290 5104 -13480
361 -13480 -7958 1461 -4157 -3485 -2214 -7411 13126 28597 -16737 -52633 -945 48548 7219
374 7219 -47263 -24636 35898 46163 -7951 -44592 -8280 30701 7882 -17434 -345 9775
386 9775 2609 8225 5493 -10898 -3563 6543 -13311 -15733 19467 29705 -5037 -29504 -7072
399 -7072 31706 19990 -39516 -45021 25658 51449 -3961 -29846 5099 23076 6540 -8485
411 -8485 -12878 -1726 16782 11206 -6314 1048 16527 11636 -5979 -17454 -3258 27815 16054
424A6054m7702J1460O1456m731o3255r817M7591K1284k7311l0673R278L7136L792
437B4562l3893q035K3293N580j0444n892p073R867K4671j4569l6899J7969M2849
450C1986j6481m6126L144M1807J5511l4831l2406K6785M1519k1659m2109J3677
462a9183L0051o987j4112j32N61J1395J0165k1278j7483K3272J8464k1234k3048
475b9549J1516L2187P043l8525k2793M3630L4191m2449l9538K9739L4605j1460
487H597k3610l798J7391J9296j1167k6416M965K2835l06j4217o325O467K0631
500A4343L224l5433j1231M4820J7056m7420k1433M2161L2226k3132l8683J110
512b2392L9694J3520l9065k2283L0498K5387r629j4455q240M618K2686j019l5193
$$ plain form
424 16054 -31648 -20188 41268 36537 -26718 -36535 11056 32340 5029 -25644 -16366 20770 24562
437 24562 -9331 -17366 5927 11507 1063 -4829 -11902 -2035 22636 8067 -28832 -10863 31986
450 31986 15505 -30621 -27477 14330 29841 -4990 -37396 -10611 30908 9249 -32860 -19183
462 -19183 10868 3881 -10231 -10363 -9802 1593 11758 -9520 -27003 -3731 14733 -6501 -29549
475 -29549 -18033 14154 21197 -17328 -40121 3509 37700 -4749 -44287 -14548 20057 8597
487 8597 -15013 -18811 -1420 17876 6709 -19707 -14742 8093 7787 -6430 -12755 -6288 14343
500 14343 17567 -17866 -29097 15723 32779 -14641 -36074 6087 38313 15181 -23502 -22392
512 -22392 17302 30822 -8243 -30526 -28 25359 15730 1275 -6965 -2347 20339 19320 -15873
525a5873k503L8661M542l4967p168K9796J6802k3089l2555J3810M5522l945m9657
538b0624m659M2487J1640k6728k0358K582K3567K1002j7721k8496J2482K6932
550B2106o226k3421q411J2319J7819q082k4162J3548L3754j6405l8649J3515L5407
563B3112p619l1637q433K1752K4210q694l2752k281K9468R704j4950j2746j741
576a2607J4233J6763j7075k5858J9467K6112k3554k3993K3458K5131j4635k6200
588a8758P78K9649J3698l1782k8914K4010L1376j1768k4110m091J3107K2037K841
601A8073k9995j0952L0403J2063k8483j3695K0110J6054r760k2188J792L4180
613A7602Q680m0999j6670M1104K3762k9570k9235N560K5833J6140j7514k7554
$$ plain form
525 -15873 -18376 20285 24827 -10140 -17308 12488 29290 6201 -26354 -12544 32978 29033 -20624
538 -20624 -25283 17204 28844 2116 -18242 -15660 7907 28909 11188 -17308 -4826 22106
550 22106 15880 -7541 -15952 -3633 14186 6104 -18058 -4510 29244 12839 -25810 -12295 23112
563 23112 15493 -16144 -24577 -2825 21385 12691 -20061 -22342 7126 16830 1880 -10866 -12607
576 -12607 1626 18389 1314 -24544 -5077 21035 -2519 -26512 -3054 22077 7442 -18758
588 -18758 -17980 11669 25367 -6415 -35329 -11319 20057 8289 -15821 -19912 -6805 15232 18073
601 18073 -11922 -22874 7529 19592 -8891 -22586 -2476 13578 3818 -18370 -16578 17602
613 17602 26282 -14717 -31387 9717 33479 3909 -25326 -19766 6067 22207 4693 -22861
625b2861J0734L1674J739k1362j0336P371J6024j155k5235j489L4805J436l8697
638a7352O49M1602N159l5048j6810K0429K8164k783l4642j4553K6410J9519j3203
651G541j7315k649J4091K1609m990k8312K351K4592j0793k5416J2705K4952o215
664A2151k0039k530K2729K0140k1735l8724R696M1837K399l2091j4181J3522K0871
677A4045M612k3926j7947J8902K0282j0328j1460N853N423l735j1851o962J8648
690A556J7174k5920k3156L4090L6721k3313l9970J184K8946J7489j6309l1091
702b2599J113L1421J0019j8261j3332K856J2819Q593j4129j1416J7326O208k8328
715a7710m657L4938Q924l1962j5904K1793L0463K714l3868k5008K5660L3914j1860
$$ plain form
625 -22861 -12127 19547 21286 -76 -10412 -3041 12983 11828 -13407 -14896 19909 21345 -17352
638 -17352 -16703 24899 30058 -4990 -21800 -1371 26793 24010 -10632 -25185 1225 20744 7541
651 7541 -9774 -12423 1668 23277 18287 -10025 -7674 16918 6125 -19291 -6586 18366 12151
664 12151 -7888 -10418 12311 32451 10716 -28008 -18312 23525 25924 -6167 -20348 -6826 14045
677 14045 18657 -5269 -23216 -4314 15968 5640 -5820 33 5456 1721 -10130 -17092 1556
690 1556 18730 -7190 -30346 3744 40465 17152 -22818 -21634 7312 24801 8492 -22599
702 -22599 -21486 9935 19954 1693 -11639 -8783 4036 12629 -1500 -12916 4410 10618 -17710
715 -17710 -22367 12571 21495 -10467 -26371 -4578 25885 28599 -5269 -30277 -4617 29297 17437
728A7437l2007p140J9049K2632j911k5498n228K3326L439j9599J413J2384q186
741A11j6609l04J6324J8424r797l4064J916M5251J2401l9234k5056J7326K8558
754A5247P188k1902k3115J2592K7582p65j8039m164P413O465j768r054M699J2204
768A4583j8220k6127K2427L5641j7602l7058N372L2632J5667j6148l1945o968
780b7746L0308J8509j9053k0008N529J9303J0978j1040j4824J1188J4411j6535
792A020j1735K2506J1037k5677j9092J4090K6119P938k7030k8916K0086M1998
804C2344p144m0669j1426K1603J9761l036k1448j0317J8563J5454r436o398Q235
817F086Q21q333m209O831J4960k684l3476r138M3243K5660l5265l2830J6278L0670
$$ plain form
728 17437 -14570 -21710 -2661 19971 18060 -7438 -12666 10660 14099 -5500 -4087 8297 111
741 111 -16498 -16802 -478 17946 8149 -25915 -23999 21252 33653 -5581 -30637 -13311 15247
754 15247 22435 533 -22582 -9990 17592 16827 -1212 -5376 2037 8502 6734 -2320 2379 14583
768 14583 -3637 -29764 -7337 28304 10702 -26356 -20984 11648 27315 11167 -20778 -27746
780 -27746 2562 21071 2018 -17990 -12461 6842 17820 6780 -8044 3144 17555 1020
792 1020 -10715 11791 22828 -2849 -21941 -7851 18268 26206 -824 -29740 -9654 32344
804 32344 25200 -15469 -26895 -5292 14469 11433 -10015 -20332 -1769 13685 4249 -2149 6086
817 6086 6907 -1426 -5635 1196 16156 13472 -20004 -29142 14101 39761 4496 -28334 -12056 18614
$$ [...]
8191F70
##END NTUPLES=NMR FID
##END=
