##TITLE=1H_TG-2253-0
 DMSO, 8 sc, 
 25.9.2019
##JCAMPDX= 6.0         $$ Bruker NMR JCAMP-DX V2.0
##DATA TYPE= NMR FID
##DATA CLASS= NTUPLES
##ORIGIN= UXNMR, Bruker Analytische Messtechnik GmbH
##OWNER= root
$$ XWIN-NMR		Version 3.5
$$ Wed Sep 25 14:20:19 2019 Russian Standard Time (UT+4h)  she@DPX200
##.OBSERVE FREQUENCY= 200.1315
##.OBSERVE NUCLEUS= ^1H
##.DELAY= (6, 6)
##.ACQUISITION MODE= SIMULTANEOUS
##.ACQUISITION SCHEME= undefined
##.AVERAGES= 8
##.DIGITISER RES= 18
##SPECTROMETER/DATA SYSTEM= spect
##.PULSE SEQUENCE= zg30
##.SOLVENT NAME= DMSO
##.SHIFT REFERENCE= (INTERNAL, DMSO, 0, 15.7039)
##AUDIT TRAIL= $$ (NUMBER, WHEN, WHO, WHERE, WHAT)
$$ ##TITLE= Audit trail, XWIN-NMR		Version 3.5
$$ ##JCAMPDX= 5.01
$$ ##ORIGIN= Bruker BioSpin GmbH
$$ ##OWNER= she
$$ F:/spectra/data/she/nmr/H-F/1/audita.txt
$$ ##AUDIT TRAIL=  $$ (NUMBER, WHEN, WHO, WHERE, WHAT)
(   1,<2019-09-25 14:19:16.01 +0400>,<she>,<DPX200>,
      <created by zg, POWCHK disabled, PULCHK disabled
       configuration hash MD5:
       00 E9 B6 7A A2 85 ED C7 34 08 36 98 17 FE 4E 26
       data hash MD5: 16K
       10 BA 85 B0 EF 56 EF 13 92 B8 96 6B 8C 1E B3 3B>)
$$ ##END=
$$ 
$$ hash MD5
$$ 45 C0 08 19 94 FA CB 4B 89 8D C5 12 EF DF 1C EC
##$RELAX= 
##$RELAX= 
##$RELAX= 
##$RELAX= 
##$RELAX= 
##$RELAX= 
$$ Bruker specific parameters
$$ --------------------------
##$DU= <F:/spectra>
##$EXPNO= 1
##$NAME= <H-F>
##$PROCNO= 1
##$TYPE= <nmr>
##$USER= <she>
##$AMP= (0..31)
100 100 100 100 100 100 100 100 100 100 100 100 100 100 100 100 100 100 
100 100 100 100 100 100 100 100 100 100 100 100 100 100 
##$AQSEQ= 0
##$AQ_mod= 1
##$AUNM= <au_zg>
##$AUTOPOS= <>
##$BF1= 200.13
##$BF2= 200.13
##$BF3= 200.13
##$BF4= 200.13
##$BF5= 200.13
##$BF6= 200.13
##$BF7= 200.13
##$BF8= 200.13
##$BYTORDA= 1
##$CFDGTYP= 0
##$CFRGTYP= 5
##$CHEMSTR= <none>
##$CNST= (0..31)
1 1 145 1 1 1 1 1 1 1 1 1 1 1 1 1 1 1 1 1 1 1 1 1 1 1 1 1 1 1 1 1 
##$CPDPRG= <>
##$CPDPRG1= <>
##$CPDPRG2= <>
##$CPDPRG3= <>
##$CPDPRG4= <mlev>
##$CPDPRG5= <mlev>
##$CPDPRG6= <mlev>
##$CPDPRG7= <mlev>
##$CPDPRG8= <mlev>
##$CPDPRGB= <>
##$CPDPRGT= <>
##$D= (0..31)
0 1.2 0 0 0 0 0 0 0 0.06 0 0.03 0 0 0 0 0.0002 0 0 0 0 0 0 0 0 0 0 0 0 
0 0 0 
##$DATE= 1569406755
##$DBL= (0..7)
120 120 120 120 120 120 120 120 
##$DBP= (0..7)
150 150 150 150 150 150 150 150 
##$DBP07= 0
##$DBPNAM0= <>
##$DBPNAM1= <>
##$DBPNAM2= <>
##$DBPNAM3= <>
##$DBPNAM4= <>
##$DBPNAM5= <>
##$DBPNAM6= <>
##$DBPNAM7= <>
##$DBPOAL= (0..7)
0.5 0.5 0.5 0.5 0.5 0.5 0.5 0.5 
##$DBPOFFS= (0..7)
0 0 0 0 0 0 0 0 
##$DE= 6
##$DECBNUC= <off>
##$DECIM= 24
##$DECNUC= <off>
##$DECSTAT= 4
##$DIGMOD= 1
##$DIGTYP= 9
##$DL= (0..7)
0 120 120 120 120 120 120 120 
##$DP= (0..7)
150 150 150 150 150 150 150 150 
##$DP07= 0
##$DPNAME0= <>
##$DPNAME1= <>
##$DPNAME2= <>
##$DPNAME3= <>
##$DPNAME4= <>
##$DPNAME5= <>
##$DPNAME6= <>
##$DPNAME7= <>
##$DPOAL= (0..7)
0.5 0.5 0.5 0.5 0.5 0.5 0.5 0.5 
##$DPOFFS= (0..7)
0 0 0 0 0 0 0 0 
##$DQDMODE= 0
##$DR= 18
##$DS= 0
##$DSLIST= <SSSSSSSSSSSSSSS>
$$ [...]
##$SUBNAM2= <"">
##$SUBNAM3= <"">
##$SUBNAM4= <"">
##$SUBNAM5= <"">
##$SUBNAM6= <"">
##$SUBNAM7= <"">
##$SUBNAM8= <"">
##$SUBNAM9= <"">
##$SW= 24.0689530833862
##$SWIBOX= (0..15)
0 0 2 0 0 0 0 0 0 0 0 0 0 0 0 0 
##$SW_h= 4816.95568400771
##$TD= 16384
##$TD0= 1
##$TE= 0
##$TE2= 300
##$TE3= 300
##$TEG= 300
##$TL= (0..7)
0 120 120 120 120 120 120 120 
##$TP= (0..7)
150 150 150 150 150 150 150 150 
##$TP07= 0
##$TPNAME0= <>
##$TPNAME1= <>
##$TPNAME2= <>
##$TPNAME3= <>
##$TPNAME4= <>
##$TPNAME5= <>
##$TPNAME6= <>
##$TPNAME7= <>
##$TPOAL= (0..7)
0.5 0.5 0.5 0.5 0.5 0.5 0.5 0.5 
##$TPOFFS= (0..7)
0 0 0 0 0 0 0 0 
##$TUNHIN= 0
##$TUNHOUT= 0
##$TUNXOUT= 0
##$USERA1= <user>
##$USERA2= <user>
##$USERA3= <user>
##$USERA4= <user>
##$USERA5= <user>
##$V9= 5
##$VALIST= <valist>
##$VCLIST= <CCCCCCCCCCCCCCC>
##$VD= 0
##$VDLIST= <DDDDDDDDDDDDDDD>
##$VPLIST= <PPPPPPPPPPPPPPP>
##$VTLIST= <TTTTTTTTTTTTTTT>
##$WBST= 1024
##$WBSW= 4
##$XGAIN= (0..3)
0 0 0 0 
##$XL= 0
##$YL= 0
##$YMAX_a= 246151
##$YMIN_a= -306442
##$ZGOPTNS= <>
##$ZL1= 120
##$ZL2= 120
##$ZL3= 120
##$ZL4= 120
##$ABSF1= 10
##$ABSF2= 0
##$ABSG= 5
##$ABSL= 3
##$ALPHA= 0
##$AQORDER= 0
##$ASSFAC= 0
##$ASSFACI= 0
##$ASSFACX= 0
##$ASSWID= 0
##$AUNMP= <proc_1d>
##$AZFE= 0.1
##$AZFW= 0.1
##$BCFW= 1
##$BC_mod= 2
##$BYTORDP= 1
##$COROFFS= 0
##$CY= 11.3945322036743
##$DATMOD= 1
##$DC= 2
##$DFILT= <>
##$DTYPP= 0
##$F1P= 20.1720416913024
##$F2P= 0.152960286110954
##$FCOR= 0.5
##$FTSIZE= 0
##$FT_mod= 4
##$GAMMA= 1
##$GB= 0.15
##$INTBC= 1
##$INTSCL= 1
##$ISEN= 128
##$LB= 0.24
##$LEV0= 0
##$LPBIN= 0
##$MAXI= 10000
##$MC2= 0
##$MEAN= 0
##$ME_mod= 0
##$MI= 1.114404
##$NCOEF= 0
##$NC_proc= 0
##$NLEV= 6
##$NOISF1= 3.799351
##$NOISF2= 2.8
##$NSP= 1
##$NTH_PI= 0
##$NZP= 0
##$OFFSET= 15.70392
##$PC= 1
##$PHC0= -9583.906
##$PHC1= 29.20095
##$PH_mod= 1
##$PKNL= yes
##$PPARMOD= 0
##$PSCAL= 0
##$PSIGN= 0
##$REVERSE= no
##$SF= 200.130013532006
##$SI= 16384
##$SIGF1= 3
##$SIGF2= 2
##$SINO= 400
##$SIOLD= 16384
##$SREGLST= <1H.CDCl3>
##$SSB= 0
##$STSI= 0
##$STSR= 0
##$SW_p= 3612.71676300578
##$SYMM= 0
##$S_DEV= 0
##$TDeff= 0
##$TDoff= 0
##$TI= <>
##$TILT= no
##$TM1= 0
##$TM2= 0
##$TOPLEV= 0
##$USERP1= <user>
##$USERP2= <user>
##$USERP3= <user>
##$USERP4= <user>
##$USERP5= <user>
##$WDW= 1
##$XDIM= 8192
##$YMAX_p= 0
##$YMIN_p= 0
$$ End of Bruker specific parameters
$$ ---------------------------------
##NTUPLES= NMR FID
##VAR_NAME=  TIME,          FID/REAL,        FID/IMAG
##SYMBOL=    X,             R,               I
##VAR_TYPE=  INDEPENDENT,   DEPENDENT,       DEPENDENT
##VAR_FORM=  AFFN,          ASDF,            ASDF
##VAR_DIM=   8192,          8192,            8192
##UNITS=     SECONDS,       ARBITRARY UNITS, ARBITRARY UNITS
##FACTOR=    0.0002076,     1,               1
##FIRST=     0,             0,               0
##LAST=      1.7004516,     0,               0
##MIN=       0,             -306442,         0
##MAX=       1.7004516,     246151,          0
$$ Real data points
##PAGE= N=1
##DATA TABLE= (X++(R..R)), XYDATA
$$ [...]
$$ plain form
1601 1641 2072 713 -1630 -1921 -502 1657 1838 203 -1601 -1933 -184 1453 1510 560 -1215 -1684 -336
1618 -336 1218 1457 398 -895 -1933 -598 1212 1804 587 -1260 -1632 -465 1415 1865 572 -1179
1634 -1179 -1709 -382 1433 1692 413 -1261 -1643 -400 1393 1787 322 -1511 -1769 -125 1553 1575 225
1651 225 -1599 -1459 -158 1356 1424 240 -1029 -1714 -224 1016 1309 524 -1143 -1533 -350 1017 1562
1668 1562 232 -1393 -1420 -241 1066 1626 326 -932 -1644 -370 1183 1665 445 -1135 -1520 -409
1684 -409 1235 1644 555 -1463 -1586 -201 1351 1663 94 -1193 -1455 -116 1155 1478 287 -1042
1700 -1042 -1205 -198 1053 1045 322 -936 -1310 -131 1219 1380 163 -935 -1304 -203 908 1315 299
1717 299 -894 -1106 -361 864 1320 312 -1083 -1389 -472 1084 1571 276 -1223 -1515 -266 1011 1325
$$ packed form
1601A641M31j359k343k91J419K159J81j635j804l32J749J637N7r50j775m69J348
1618c36J554K39j059j293j038J335J810N92j217j847l72J167J880M50j293j751
1634a179n30J327J815K59j279j674l82J243J793L94j465j833k58J644J678K2j350
1651B25j824J40J301J514O8j184j269o85J490J240K93p85j667l90J183J367N45
1668A562j330j625k7J179J307N60j300j258p12J274J553M82j220j580l85J111
1684d09J644M09j089k018j23J385J552L12j569j287k62J339J271L23j191j329
1700a042j63J007J251qp23j258l74J179J350J61j217j098l69J101J111M07j016
1717B99j193k12P45J225M56j008j395l06R17J556M87j295j499k92J249J277L14
$$ plain form
1734 1325 226 -1410 -1128 -204 1103 1227 34 -1130 -1294 -70 1150 1200 108 -1145 -1348 23 1104
1751 1104 1157 224 -974 -1206 -224 932 935 207 -718 -1168 -204 868 1164 508 -998 -1279 -292 1211 1377
1770 1377 150 -1202 -1284 -16 1073 1079 84 -1116 -1171 -128 1116 1013 156 -930 -890 -176 894 1029
1788 1029 15 -1010 -1257 -164 1120 847 -106 -812 -897 -125 963 866 196 -633 -1061 -278 870 1150
1806 1150 423 -951 -1272 -247 987 1198 -105 -936 -1132 -2 1051 1231 70 -888 -870 71 798 823
1824 823 23 -886 -1086 26 909 976 201 -917 -914 85 853 811 -178 -949 -908 -166 807 830 271 -767 -929
1845 -929 -30 888 715 211 -669 -1125 -92 945 1034 27 -913 -989 -159 935 839 17 -852 -881 -45 862
1865 862 1033 -33 -704 -847 2 821 793 76 -932 -889 265 809 663 -86 -707 -793 -56 863 556 168
$$ packed form
1734A325j099j636K82R24J307J24j193j164j64J224J220N0j092j253k03J371J081
1751A104N3r33j198k32R82J156Lp28r25m50R64J072K96o56j506k81R87J503J66
1770A377j227j352q2J268J089Or95j200n5J043J244j03q57j086M0P14J070J35
1788A029j014j025k47J093J284k73r53p06q5P72J088r7o70q29m28P83J148K80
1806A150p27j374l21J025J234K11j303q31j96J130J053J80j161r58J8R41P27K5
1824H23q00r09k00J112Q83O7p75j118LR99P68m2r89p71M1P42R73K3n59j038j62
1845i29Q99R18j73n04q80m56J033J037Q9j007r40p6Q30J094r6q22q69k9Q36R07
1865H62J71j066o71j43Q49Q19k8p17j008M3J154N44j46p49o21q6P37R19l07l88
$$ plain form
1885 168 -623 -782 -101 721 704 193 -974 -852 -233 827 761 -6 -932 -636 97 606 788 -49 -799 -683
1905 -683 -83 835 835 -64 -811 -824 -34 736 773 -68 -887 -567 145 820 575 -137 -472 -698 43 629 675 181
1927 181 -644 -876 -85 630 903 -117 -695 -808 -49 951 721 -21 -664 -577 -128 582 600 195 -572 -666
1947 -666 -157 639 831 16 -584 -861 -49 809 647 -220 -758 -567 28 741 446 -277 -534 -423 92 493
1967 493 518 -67 -515 -502 -150 628 419 55 -672 -446 -259 548 670 -131 -579 -594 29 751 666 65 -739
1988 -739 -646 133 535 576 -182 -532 -684 339 733 612 -227 -652 -465 35 622 597 -149 -811 -574 -49 508
2009 508 420 -77 -711 -410 77 522 246 -88 -401 -467 -39 401 412 -144 -420 -688 -66 563 680 -38 -507
2030 -507 -501 -53 549 620 -149 -575 -572 181 598 544 -240 -633 -412 172 509 344 -40 -464 -431 106 582 519 -57
$$ packed form
1885A68p91j59O81Q22j7n11j167J22O19J060o6p67r26K96P33N09J82q37p50J16
1905f83O00R18%q99p47j3P90P70L7q41q19L20P12O75k45p12l35k26P41N86M6m94
1927A81q25k32P91P15K73j020n78j13P59J000k30p42o43Q7M49P10J8m05p67r4
1947f66N09P96J92q15o00k77Q12Q58j62q67n38J91N95P13k95p23k57J11N15M01
1967D93K5n85m48J3L52P78k09l64p27K26J87Q07J22q01m48j5O23P22q5o01q04
1988g39R3P79M02M1p58l50j52J023L94j21q39m25J87N00N87k5p46o62K37N25N57
2009E08q8m97o34L01M87M45k76l34l13o6M28M40J1n56k76k68O22O29J17p18m69
2030e07OM48O02P1p69m26LP53M17n4p84l93K21N84L37j65l84m24L3N37M76o3n76
$$ plain form
2053 -57 -372 -421 60 734 502 -144 -674 -344 61 536 380 -136 -474 -330 44 487 611 -74 -433 -369 89
2074 89 530 418 -86 -428 -602 186 777 537 -268 -800 -247 213 586 298 24 -464 -234 160 495 287
2094 287 37 -621 -319 26 347 260 -112 -330 -337 97 439 297 -145 -548 -469 82 384 293 -123 -451 -376 207
2116 207 164 471 3 -417 -249 29 258 385 88 -648 -356 -47 541 690 -113 -636 -448 133 425 396 -385
2137 -385 -597 -314 226 602 151 -73 -367 -242 79 334 324 -22 -302 -335 -141 396 470 71 -433 -405 251
2158 251 750 374 -315 -503 -298 280 600 356 -116 -392 -406 200 356 249 -51 -161 -470 100 534 396
2178 396 138 -753 -510 105 472 168 -67 -414 -256 427 466 59 -20 -258 -408 128 324 200 -139 -314 -268
2199 -268 10 425 586 -44 -592 -397 42 426 204 -203 -499 -248 197 418 259 -487 -402 -134 367 278 16
$$ packed form
2053e7l15m9M81O74k32o46n30L30M05M75j56n16l38J44L74M43J24o85l59O4M58
2074H9M41j12n04l42j74P88N91k40q05n32N53M60L73k88k74m88K30L94L35k08
2094B87k50o58L02L45L21q7l72k18pM34L42j42m42m03P9N51L02r1m16l28P5N83
2116B07m3L07m68m20J68K78K29J27k97p36K92L09N88J49q03n23J88N81K92k9p81
2137c85k12K83N40L76m51k24k94J25L21K55j0l46k80l3J94N37P4l99n04K8O56
2158B51M99l76o89j88K05N78L20k44m72k76j4O06J56j07l00j10l09N70M34j38
2178C96k58q91K43O15L67l04k35l47J58O83L9m07p9k38j50N36J96j24l39j75M6
2199b68K78M15J61o30n48J95M39L84k22m07k96K51M45K21j59p46Q5K68N01q9k62
$$ plain form
2220 16 -86 -222 -88 -2 347 412 268 -261 -185 -17 526 258 -86 -532 -429 341 482 255 -241 -323 31 315
2242 315 140 188 -119 -290 -170 -77 93 141 153 -259 -433 -9 419 424 153 -538 -397 211 710 214 -249 -389
2264 -389 -129 255 270 -42 5 -400 -96 167 216 191 -139 -147 -269 -80 327 581 98 -327 -221 238 348 142
2286 142 -230 -271 -124 174 481 149 -77 47 -93 50 244 160 162 -175 -415 17 367 500 -131 -432 -516 119
2308 119 467 204 -99 -431 8 212 223 241 -316 -343 -110 79 1 195 -193 -236 -297 16 129 419 99 -291
2330 -291 -370 -21 529 342 -211 -558 -255 420 610 -61 -300 -105 63 377 146 217 -260 -295 -54 -118 72
2351 72 307 94 -182 -402 94 242 371 -410 -375 -87 133 289 35 -360 -349 22 198 -54 -180 -78 -28
2372 -28 -224 -232 74 320 166 -129 -173 -65 502 334 -41 -485 -292 207 509 75 -195 -497 20 369 164
$$ packed form
2220A6j02j36J34Q6L49O5j44n29P6J68N43k68l44m46J03P70J41k27m96q2L54K84
2242C15j75M8l07j71J20R3J70M8J2m12j74M24M28Nk71o91J41O08M99m96m63j40
2264c89K60L84J5l12M7m05L04K63M9k5l30qj22J89M07K54m83m25J06M59J10k06
2286A42l72m1J47K98L07l32k26J24j40J43J94q4Kl37k40M32L50J33o31l01q4O35
2308A19L48k63l03l32M39K04J1J8n57k7K33J89p8J94l88m3o1L13J13K90l20l90
2330b91p9L49N50j87n53l47L03O75J90o71k39J95J68L14k31P1m77l5K41o4J90
2351G2K35k13k76k20M96J48J29p81L5K88K20J56k54l95J1L71J76k52j26J02N0
2372b8j96qL06K46j54k95m4J08N67j68l75m44J93M99L02m34k70l02N17L49k05
$$ plain form
2393 164 162 -125 -297 -8 29 179 85 210 -307 -15 185 357 314 -169 -319 -324 134 360 13 -304 -270 -114 200
2416 200 151 -2 -85 -133 -198 191 206 77 -62 -177 -282 -70 199 300 66 -252 -462 164 253 142 59 -441
2438 -441 -47 502 485 -78 -205 -55 -38 123 113 70 -32 -179 -237 9 94 300 -11 -315 -253 29 511 6
2460 6 -189 -417 -55 447 300 -182 -177 -278 132 131 -25 -130 28 64 39 -41 141 337 260 -234 -144 85 440 327
2484 327 -75 -347 -302 303 339 18 -228 -158 -7 33 -97 -239 -113 -52 -131 -8 63 113 38 -318 -213 -18 426
2507 426 288 -71 -228 -306 330 494 69 -95 -391 -7 435 205 -21 -27 -54 -78 81 171 49 33 -336 -154
2529 -154 123 444 404 149 -178 -104 167 366 182 -254 -290 12 249 336 -199 -226 -50 -36 15 -108 88 -88
2551 -88 23 -179 -117 -88 340 4 -232 -264 1 298 272 -408 -281 -185 259 124 34 -152 -166 91 60 98 -184
$$ packed form
2393A64kk87j72K89L7J50r4J25n17K92K00J72m3m83j50nM58K26l47l17L4J56L14
2416B00m9j53q3m8o5L89J5j29j39j15j05K12K69J01k34l18k10O26Q9j11q3n00
2438d41L94N49j7n63j27J50J7J61j0m3j02j47n8K46Q5K06l11l04O2K82M82n05
2460Fj95k28L62N02j47m82Nj01M10jj56j05J58L6k5q0J82J96p7m94R0K29L55j13
2484C27m02k72M5O05L6l21k46P0J51M0j30j42J26O1p9J23P1N0p5l56J05J95M44
2507D26j38l59j57p8O36J64m25j64k96L84M42k30k26ok7k4J59R0j22j6l69J82
2529a54K77L21m0k55l27P4K71J99j84m36l6L02K37Q7n35k7J76J4N1j23J96j76
2551h8J11k02O2K9M28l36k36l2K65K97k6o80J27R6M44j35r0j86j4K57l1L8k82
$$ plain form
2574 -184 -30 10 108 -67 98 413 152 -142 -146 119 256 10 -87 -370 -43 262 235 44 -132 -175 283 103
2596 103 43 -53 -45 12 -20 -39 152 31 11 -72 -178 50 382 182 -260 -328 -133 74 99 -146 -336 104 102 158 -32
2621 -32 -172 -55 -118 109 -3 129 138 82 -8 -7 -270 20 158 -58 -331 -307 232 345 61 -90 -161 139 157 -89
2645 -89 -30 -102 219 89 36 -22 84 -132 -194 -199 -296 154 334 22 -217 -239 215 301 22 -418 -406 -44 249 158
2669 158 -16 -154 68 -75 8 -43 -67 64 2 -176 -125 187 126 37 -112 -195 21 228 263 -102 -310 -62 200
2692 200 42 -1 -93 -38 319 126 128 -50 67 -14 98 111 248 324 40 16 -299 101 320 263 -162 -264 33
2715 33 254 223 -245 -54 94 115 197 -34 26 -39 65 -206 -90 -69 113 91 -53 -149 -25 216 284 -141 -271
2738 -271 44 210 241 3 -229 -139 5 174 77 -41 79 134 122 -47 -134 -49 92 -66 -220 -59 217 134 -98
$$ packed form
2574a84J54M0R8j75J65L15k61k94mK65J37k46r7k83L27L05k7j91j76m3M58j80
2596A03o0r6QN7l2j9J91j21k0q3j06K28L32k00m42o8J95K07K5k45j90M40kN6j90
2621c2j40J17o3K27j12J32Rn6r0Jk63K90J38k16k73K4N39J13k84j51p1L00J8k46
2645h9N9p2L21j30n3n8J06k16o2nr7M50J80l12k39k2M54Q6k79m40J2L62K93r1
2669A58j74j38K22j43Q3n1k4J31o2j78N1L12o1q9j49q3K16K07L5l65k08K48K62
2692B00j58m3r2N5L57j93Kj78J17q1J12J3J37P6k84k4l15M00K19n7m25j02K97
2715C3K21l1m68J91J48K1Q2k31O0o5J04k71J16K1J82k2j44r6J24K41O8m25j30
2738b71L15J66L1k38k32R0J44J69r7j18J20N5j2j69q7Q5J41j58j54J61K76q3k32
$$ plain form
2761 -98 -70 -173 91 225 23 -197 -137 -19 122 187 -11 -10 -157 165 -64 2 -78 120 -11 -206 174 201 78
2784 78 -325 -100 -101 225 237 102 -228 -121 -21 292 155 -33 -151 -104 -27 -32 -160 24 232 -41 -80 -211 1
2807 1 -28 -48 -196 -58 32 361 -16 -144 -116 142 90 228 -231 -54 83 -38 56 -28 49 132 119 39 -2 -88 143
2832 143 -26 -73 27 10 266 106 -104 -232 58 82 126 -9 -363 -106 -45 -23 -184 -54 -148 74 -20 -104 -71
2855 -71 239 39 199 -137 -236 161 -47 -59 -256 12 101 -44 -72 -193 48 57 35 71 0 34 -44 -70 -36 -14 -87
2880 -87 4 -185 -60 67 242 146 -140 -180 109 101 171 73 -98 -2 -14 68 -14 -60 71 226 18 9 -74 81 -2 -67
2906 -67 -107 7 158 109 69 -181 -118 51 166 187 -176 -205 137 233 -22 29 -174 -137 -56 159 55 -90 -101 -19
2930 -19 29 218 26 80 48 142 -59 41 7 -42 -108 -40 45 -33 190 -8 -162 -168 155 -105 -232 -61 -117 -215 -317
$$ packed form
2761i8K8j03K64J34k02k20O0J18J41O5j98Jj47L22k29O6q0J98j31j95L80K7j23
2784G8m03K25jL26J2j35l30J07J00L13j37j88j18M7P7nj28J84K08k73l9j31K12
2807Ak9k0j48J38R0L29l77j28K8K58n2J38m59J77J37j21R4q4P7Q3j3q0m1q6K31
2832A43j69m7J00j7K56j60k10j28K90K4M4j35l54K57O1K2j61J30r4K22r4q4L3
2855g1L10k00J60l36r9L97k08j2j97K68Q9j45k8j21K41Rk2L6p1L4p8k6L4K2p3
2880h7R1j89J25J27J75r6k86m0K89qP0r8j71R6j2Q2q2m6J31J55k08rq3J55q3o5
2906f7m0J14J51m9m0k50O3J69J15K1l63k9L42R6k55N1k03L7Q1K15j04j45j1Q2
2930a9M8J89j92N4l2R4k01J00l4m9o6O8Q5p8K23j98j54oL23k60j27J71n6r8j02
$$ plain form
2955 -317 -203 154 27 -99 -106 7 -15 145 101 -113 -101 -172 339 -35 44 -87 -53 -103 -29 124 105 3 50 85
2979 85 48 3 5 87 69 -93 -29 98 122 115 -102 28 62 128 -24 -135 67 140 -39 -27 61 -195 136 -95 -86 415
3005 415 -161 -63 98 -223 232 -122 199 2 11 -17 -8 -70 -156 34 -69 -24 52 -70 23 -42 95 3 58 165 -148
3030 -148 44 -357 -187 -58 -70 -21 6 -125 -72 126 196 141 -258 -45 -13 -156 149 8 -90 -130 155 -59 118
3053 118 -53 -30 40 16 -84 -51 -64 -111 22 127 72 6 -102 -208 13 -14 15 -45 -89 -123 -109 -6 47 -117 -91
3078 -91 37 167 37 -304 148 64 -115 -102 -189 -18 202 0 -70 31 43 208 125 -43 -206 59 134 -123 43
3101 43 -124 -114 -10 -51 -2 -87 143 256 128 -126 243 -2 28 -196 -67 -156 -25 301 -148 -53 7 30 62 25
3125 25 116 -14 -18 141 61 -66 74 -231 -208 -24 -47 -114 91 47 -120 20 137 -23 -10 -100 10 22 -87 28
$$ packed form
2955c17J14L57j27j26pJ13k2J60m4k14J2p1N11l74P9j31L4n0P4J53j9j02M7L5
2979H5l7m5KQ2j8j62O4J27K4pk17J30L4O6j52j11K02P3j79J2Q8k56L31k31RN01
3005D15n76R8J61l21M55l54L21j97Rk8Ro2q6J90j03M5P6j22R3o5J37r2N5J07l13
3030a48J92m01J70J29j2M9K7j31N3J98P0n5l99K13L2j43L05j41r8m0K85k14J77
3053A18j71K3P0k4j00L3j3m7J33J05n5o6j08j06K21k7K9o0m4l4J4J03N3j64K6
3078i1J28J30j30l41M52q4j79J3q7J71K20k02p0J01J2J65q3j68j63K65P5k57J66
3101D3j67J0J04m1M9q5K30J13j28k54L69k45L0k24J29q9J31L26m49R5O0K3L2l7
3125B5R1j30mJ59q0j27J40l05K3J84k3o7K05m4j67J40J17j60J3r0J10J2j09J15
$$ plain form
3149 28 -24 42 0 -109 9 -45 45 131 14 -77 37 -151 134 -74 -171 160 96 128 -72 64 -157 -63 19 210
3173 210 23 -7 -14 -32 33 54 40 -42 30 -95 -149 -31 75 -1 -98 124 -53 51 -51 9 -67 63 246 -66 -221
3198 -221 42 245 7 25 -31 23 100 -7 3 69 46 47 54 -55 45 70 0 0 -34 -38 -35 -264 96 111 -41 -56 -107 47
3226 47 45 13 -55 116 -127 129 122 117 97 62 27 -120 -8 -44 11 -185 33 150 -36 -12 -29 22 44 230 20 -150
3252 -150 148 -203 -109 261 156 -77 52 -142 103 50 -100 -32 -21 -115 37 -22 81 -15 22 -48 222 126 -123
3275 -123 195 121 -74 192 -42 -12 -141 -105 -52 -122 -164 -58 119 -82 -22 25 167 90 43 -57 -105 120 -57 15
3299 15 121 -78 231 26 90 -112 -127 33 -52 226 -277 80 290 -6 -28 22 23 249 92 -56 -90 96 -111
3322 -111 -135 -152 22 -19 51 -140 71 6 15 109 -71 -169 6 -24 143 -78 248 -74 28 37 27 27 -42 116 73 67
$$ packed form
3149B8n2O6m2j09J18n4R0Q6j17r1J14j88K85k08r7L31o4L2k00J36k21R4Q2J91
3173B10j87l0pj8O5K1j4q2P2j25n4J18J06p6r7K22j77J04j02O0p6J30J83l12j55
3198b21K63K03k38J8n6N4P7j07J0O6k3JPj09J00K5p0%l4mLk29L60J5j52j5n1J54
3226D7kl2o8J71k43K56pnk0l5l5j47J12l6N5j96K18J17j86K4j7N1K2J86k10j70
3252a50K98l51R4L70j05k33J29j94K45n3j50O8J1r4J52n9J03r6L7p0K70r6k49
3275a23L18p4j95K66k34L0j29L6N3p0m2J06J77k01O0M7J42p7m7j00m8K25j77P2
3299A5J06j99L09k05O4k02j5J60q5K78n03L57K10k96k2N0JK26j57j48l4J86k07
3322a11k4j7J74m1P0j91K11o5RR4j80r8J75l0J67k21L26l22J02Rj0%o9J58m3o
$$ plain form
3348 67 103 -54 -56 5 -58 -55 95 9 -46 8 -47 47 12 20 193 115 159 -66 119 -38 -52 214 -38 111 -19 56 -77
3375 -77 -183 -54 -119 31 -54 -102 -7 -50 -6 -201 -139 -68 -252 -45 16 -161 -106 206 -87 -71 -37 -171 -126 -94 91
3400 91 -8 34 -27 70 -8 -23 201 -33 48 5 55 -2 -3 42 127 45 145 19 68 129 42 119 -56 42 28 8 19 -106
3428 -106 8 16 130 -64 -43 21 147 72 -69 -53 -2 -49 47 -69 -49 48 -144 76 -32 90 -182 -78 -4 98
3452 98 23 151 -60 -37 -8 19 -96 61 10 177 -128 -95 127 41 131 81 -60 -72 -43 177 36 48 76 -172 -51
3477 -51 93 141 -40 47 -113 -9 45 -99 89 23 -12 189 -33 55 -28 2 147 38 62 13 -101 119 -87 -146
3501 -146 -92 -66 -28 -186 -115 113 0 101 -87 26 -295 28 -54 -249 -15 -63 82 121 133 -44 -34 -72 -22 -76
3525 -76 -59 -153 -93 17 -52 -8 209 60 -74 155 52 3 -4 -43 177 -88 10 19 48 113 60 -53 105 36 -80 117
$$ packed form
3348F7L6j57kO1o3LJ50q6n5N4n5R4l5QJ73p8M4k25J85j57j4K66k52J49j30P5j33
3375g7j06J29o5J50q5m8R5m3M4j95O2P1j84K07O1j77N5L12k93J6L4j34M5L2J85
3400I1r9M2o1R7p8j5K24k34Q1m3N0n7jM5Q5q2J00j26M9O1q7P7j75R8j4k0J1j25
3428a06J14QJ14j94K1O4J26p5j41J6N1m7R6j16K0R7j92K20j08J22k72J04P4J02
3452I8p5J28k11K3K9K7j15J57n1J67l05L3K22q6R0n0j41j2K9K20j41J2K8k48J21
3477e1J44M8j81Q7j60J04N4j44J88o6l5K01k22Q8q3L0J45j09K4m9j14K20k06n9
3501a46N4K6L8j58P1K28j13J01j88J13l21L23q2j95K34m8J45L9J2j77J0l8N0n4
3525g6J7r4O0J10o9M4K17j49j34K29j03m9pl9K20k65R8RK9O5n3j13J58o9j16J97
$$ plain form
3551 117 -22 -120 61 -88 22 71 80 43 96 69 23 -119 -55 67 -49 -33 -45 -203 -215 -15 221 -160 -97 127
3575 127 -33 211 -23 -48 142 10 -26 61 -199 11 -14 297 52 41 109 132 39 46 -58 -100 -36 19 152 30
3599 30 -117 47 -129 11 -89 -69 82 41 0 22 -34 255 -8 29 80 48 -32 46 90 -22 -80 25 70 8 -63
3624 -63 -55 -167 -65 138 70 15 43 41 -102 -159 73 129 1 -68 122 35 93 -20 207 -207 -67 -110 14 216 78
3649 78 -161 -53 -77 -198 -161 82 -209 -5 -4 -108 -13 -74 -139 49 108 -49 -20 40 100 48 63 -49 15 16 -60 -146
3675 -146 -149 -155 -115 58 263 4 -55 -42 22 -12 62 61 -52 376 18 107 -259 -7 89 -122 -158 138 108 -137 237
3700 237 101 -25 -71 88 163 53 85 -33 -164 -147 -172 122 195 40 -39 -4 -37 -77 -29 10 -114 10 -145 -148 89
3725 89 21 -86 46 25 -41 -227 -5 -88 9 49 -56 14 -87 -32 -70 -89 118 -202 -263 42 219 28 -166 -5
$$ packed form
3551A17j39r8J81j49J10M9Rl7N3k7m6j42O4J22j16J6j2j58j2K00K36l81O3K24
3575A27j60K44k34k5J90j32l6Q7k60K10k5L11k45j1O8K3r3Pj04m2O4N5J33j22
3599C0j47J64j76J40j00K0J51m1m1K2n6K89k63L7N1l2q0P8M4j12n8J05M5o2p1
3624f3Qj12J02K03o8n5K8kj43n7K32N6j28o9J90q7N8j13K27m14J40m3J24K02j38
3649G8k39J08k4j21L7K43k91K04Jj04R5o1o5J88N9j57K9O0O0n2J5j12O4Jp6q6
3675a46loM0J73K05k59n9J3O4l4P4jj13M28l58Q9l66K52R6k11l6K96l0k45L74
3700B37j36j26m6J59P5j10L2j18j31J7k5K94P3j55p9L5l3m0M8L9j24J24j55lK37
3725H9o8j07J32k1o6j86K22q3R7M0j05P0j01N5l8j9K07l20o1L05J77j91j94J61
$$ plain form
3749 -5 119 42 -77 -47 -25 -89 -91 4 -11 68 -96 -28 110 33 -86 12 90 -12 -101 123 -7 67 56 -120 -3 -10 94
3776 94 -7 35 42 -8 64 -143 -21 64 93 -35 -4 83 -97 -141 14 -71 52 187 -47 -32 -27 -57 -12 -122 -16 98
3802 98 -209 -137 -13 28 -121 9 -8 41 43 -44 -52 -36 81 238 77 112 28 -64 -60 -92 -3 -15 71 -127 35 178 -4
3829 -4 112 -13 19 -137 -6 175 2 -21 -41 -121 82 193 21 38 89 -112 1 83 55 -73 66 -77 -96 31
3853 31 60 84 63 34 -24 -16 -210 37 -14 -54 -276 68 -25 184 -79 -45 23 -2 38 -38 54 101 -82 -130 -89 -6 -18
3880 -18 -190 -71 10 106 170 221 18 72 104 -41 -3 44 12 57 43 71 -176 19 58 -64 -104 59 -70 171 85
3905 85 -8 23 11 -261 45 -9 -71 -51 -95 -17 170 -46 54 29 25 -285 96 130 -219 -136 10 78 -49 129 -79
3930 -79 279 102 159 -37 -60 15 24 21 -42 45 -4 60 142 -23 -64 -230 -73 108 195 -147 125 -53 19 -10 -58 -183
$$ packed form
3749eJ24p7j19L0K2o4kR5j5P9j64O8J38p7j19R8P8j02q9K24j30P4j1j76J17pJ04
3776I4j01M2Pn0P2k07J22Q5K9j28L1Q7j80m4J55q5J23J35k34J5Nl0M5j10J06J14
3802I8l07P2J24M1j49J30j7M9Kq7qJ6J17J57j61L5q4r2Ml2Q9j2Q6j98J62J43j82
3829dJ16j25L2j56J31J81j73k3k0q0K03J11j72J7N1k01J13Q2k8j28J39j43j9J27
3853C1K9K4k1k9n8Qj94K47n1m0k22L44r3K09k63L4O8k5M0p6R2M7j83m8M1Q3j2
3880a8j72J19Q1R6O4N1k03N4L2j45L8M7l2M5j4K8k47J95L9j22m0J63j29K41q6
3905H5r3L1j2k72L06n4o2K0m4P8J87k16J00k5ml10L81L4l49Q3J46O8j27J78k08
3930g9L58j77N7j96k3P5Rlo3Q7m9O4Q2j65m1j66J57J81Q7l42K72j78P2k9m8j25
$$ plain form
3956 -183 28 56 -219 76 -65 103 135 -155 95 -143 -40 125 -46 -186 59 141 -84 29 12 106 -100 135
3978 135 -127 87 -56 33 -10 -22 -16 72 81 -127 29 31 13 50 -116 -144 69 52 -162 17 3 208 85 -53 -237
4003 -237 150 -165 1 -40 127 -23 123 2 -105 -86 -88 97 -208 -155 -83 -85 41 105 -145 -275 -16 0 7 104
4027 104 16 15 22 17 10 -1 -181 101 67 94 43 -22 94 -114 -148 97 -18 -107 205 148 70 -5 4 -116 144 -99 64
4054 64 215 58 -68 -130 -55 194 -18 11 -17 158 0 169 39 176 132 80 34 13 48 -46 163 -12 -10 108
4078 108 61 38 -27 20 -1 178 179 126 -62 58 76 -20 89 70 89 -5 -99 71 -14 1 46 -84 -142 87 11 -130
4104 -130 -127 -78 206 67 67 -7 78 53 -64 27 -102 122 -113 -117 -129 37 -5 141 85 7 8 -67 -4 19 124 43 26
4131 26 -133 -79 -58 84 323 -66 219 91 -5 56 -114 34 -266 152 -83 15 -1 -18 -27 132 74 67 -73 90
$$ packed form
3956a83K11K8k75K95j41J68L2k90K50k38J03J65j71j40K45Q2k25J13j7R4k06K35
3978A35k62K14j43Q9m3j2OQ8Rk08J56Kj8L7j66k8K13j7k14J79j4K05j23j38j84
4003b37L87l15J66m1J67j50J46j21j07J9kJ85l05N3P2kJ26O4k50j30K59J6PR7
4027A04q8jPnpj1j80K82l4K7n1o5J16k08l4K45j15q9L12n7p8p5Rj20K60k43J63
4054F4J51j57j26o2P5K49k12K9k8J75j58J69j30J37m4n2m6k1L5r4K09j75KJ18
4078A08m7k3o5M7k1J79Jn3j88J20J8r6J09j9J9r4r4J70q5J5M5j30n8K29p6j41
4104a30LM9K84j39%p4Q5k5j17R1j29K24k35mj2J66m2J46n6p8Jp5O3K3J05q1j7
4131B6j59N4K1J42K39l89K85j28r6O1j70J48l00M18k35R8j6j7rJ59n8pj40J63
$$ plain form
4155 90 55 -136 -113 77 -33 -106 187 -28 -11 -58 12 19 43 88 -40 106 -63 -88 81 -88 2 -34 -53 48 -119
4180 -119 165 -161 -132 31 76 6 51 55 140 107 -45 116 7 31 3 -78 -45 118 -23 165 -19 33 21 77 -102
4205 -102 161 -102 -175 27 -69 -120 70 56 -19 -42 32 365 83 124 -76 -76 -251 -126 -12 -51 86 26 387 56
4229 56 -216 -39 38 21 75 -41 -149 -126 155 61 51 -161 -124 73 48 -160 -87 185 185 -229 138 -97 -45 -89 -217
4254 -217 -41 -71 56 2 186 -161 -107 -59 -30 -39 84 -4 50 39 93 111 -55 -205 201 16 -101 -68 -238 -5
4278 -5 66 -54 -114 177 41 -77 -64 -29 220 -32 -66 39 -52 -19 -20 -77 -29 -47 -110 36 72 52 -87 -8 158 -209
4304 -209 -58 -32 75 -96 24 -71 120 40 113 38 -3 -88 15 156 -79 -102 -7 85 119 -97 -90 53 -88 -75 3
4329 3 49 -34 -42 -256 -74 123 50 -217 -34 275 59 -37 -42 51 81 -140 -50 50 35 -20 44 80 126 32 76 -53 -27
$$ packed form
4155I0l5j91K3J90j10p3K93k15J7m7P0PK4M5j28J46j69k5J69j69R0l6j9J01j67
4180a19K84l26K9J63M5p0M5MQ5l3j52J61j09K4k8q1L3J63j41J88j84N2j2N6j79
4205a02K63k63p3K02r6n1J90j4p5k3P4L33k82M1k00%j75J25J14l9J37o0L61l31
4229E6k72J77P7j7N4j16j08K3K81r4j0k12L7J97k5k08P3K72%m14L67k35N2m4j28
4254b17J76l0J27n4J84l47N4M8K9rJ23q8N4j1N4J8j66j50M06j85j17L3j70K33
4278eP1j20o0K91j36j18J3L5K49k52l4J05r1L3jn7M8j8o3J46L6k0j39P9J66l67
4304b09J51K6J07j71J20r5J91q0P3p5m1q5J03J41k35k3R5R2L4k16PJ43j41J3P8
4329CM6q3qk14J82J97p3k67J83L09k16r6nR3L0k21R0J00j5n5O4L6M6r4M4j29K6
$$ plain form
4356 -27 41 11 63 -136 44 -120 -8 69 -22 242 8 10 -148 158 -11 67 -250 -17 -86 -128 37 -88 -216 30
4380 30 78 -191 -25 63 -108 153 -12 -24 -191 -59 -24 -104 117 84 83 -25 43 -50 150 35 -33 239 -45 -140
4404 -140 79 131 -13 -95 30 8 -15 -127 -129 -317 174 -66 164 88 0 -177 -5 -42 -104 87 -60 99 -201
4427 -201 121 -59 21 -143 47 114 16 -121 -42 -18 -73 42 -28 -16 35 34 -72 48 67 -63 210 34 188 39
4451 39 103 8 78 -139 103 -14 137 -61 1 170 -73 -39 68 -23 -171 27 -134 2 140 41 -18 99 7
4474 7 34 86 -98 -84 77 0 -44 -46 -192 13 -42 54 -42 81 1 70 221 -13 -152 -197 102 -49 -13 -15 163 -22
4500 -22 -119 39 -137 44 -122 -89 -94 -9 -49 -77 -60 -18 -118 76 -93 30 38 -25 -30 -8 173 -10 65 25 179 -6
4526 -6 -98 96 95 -37 -128 -23 -175 -10 117 -21 -41 55 -8 -78 128 -1 24 111 -15 -102 22 -56 -63 -37 -18 5
$$ packed form
4356b7O8l0N2j99J80j64J12P7r1K64k34Kj58L06j69P8l17K33o9m2J65j25j28K46
4380C0M8k69J66Q8j71K61j65j2j67J32L5q0K21l3jj08O8r3K00j15o8K72k84r5
4404a40K19N2j44q2J25k2k3j12kj88M91k40K30p6q8j77J72l7o2J91j47J59l00
4427b01L22j80Q0j64J90O7r8j37P9K4n5J15p0J2N1jj06J20J9j30K73j76J54j49
4451C9O4r5P0k17K42j17J51j98O2J69k43L4J07r1j48J98j61J36J38r9n9J17r2
4474GK7N2j84J4J61p7m4kj46K05n5R6r6J23q0O9J51k34j39m5K99j51L6kJ78j85
4500b2r7J58j76J81j66L3nQ5m0k8J7M2j00J94j69J23Qo3nK2J81j83P5m0J54j85
4526fr2J94jj32r1J05j52J65J27j38k0R6o3p0K06j29K5Q7j26q7J24p8pK6J9K3
$$ plain form
4552 5 78 168 57 109 143 29 -39 -41 -47 22 -33 -119 157 -32 25 39 3 -62 76 156 35 46 -219 -126 46 -48 -118 -50
4580 -50 19 -58 -111 -198 -113 56 65 -10 -66 -33 40 -46 32 -43 67 -22 -49 102 -33 115 94 -98 -85 57 47 30 -70
4607 -70 -23 12 6 119 69 -2 -16 6 -210 41 91 23 -50 -102 71 -27 0 -46 -109 -44 -15 168 0 43 136 103 171 -89
4635 -89 20 -54 -44 -147 174 55 -21 153 -160 50 107 -65 -75 231 67 126 16 -136 5 -186 -145 141 -178
4658 -178 -23 75 -138 -201 -50 -136 -104 195 66 32 96 -5 -123 -44 72 -150 206 -19 85 25 -10 75 -19 117
4682 117 -96 5 61 76 -147 134 -31 -313 0 15 -30 81 -85 -7 111 26 177 146 -214 122 -22 -192
4704 -192 -140 83 -10 0 19 -20 119 -75 -68 5 114 -35 -19 121 65 150 54 -67 93 7 -149 -75 133 171 214
4729 214 -58 -88 -8 -49 46 -92 -62 -14 73 85 1 -94 103 -235 -91 105 49 -71 -106 132 68 -86 48 39 -94
$$ packed form
4552EP3R0j11N2L4j14o8koO9n5q6K76j89N7J4l6o5J38Q0j21J1k65R3J72r4p0O8
4580e0O9p7n3q7Q5J69Rp5n6L3P3q6P8p5J10q9k7J51j35J48k1j92J3J42j0j7j00
4607g0M7L5oJ13n0p1j4K2k16K51N0o8p3n2J73r8K7m6o3O5K9J83j68M3R3l3O8k60
4635h9J09p4J0j03L21j19p6J74l13K10N7j72j0L06j64N9j10j52J41j91M1K86l19
4658a78J55R8k13o3J51q6L2K99j29l4O4j01j18P9J16k22L56k25J04o0l5Q5r4J36
4682A17k13J01N6J5k23K81j65k82L13J5m5J11j66P8J18q5J51l1l60L36j44j70
4704a92N2K23r3J0J9l9J39j94PP3J09j49J6J40n6Q5r6j21J60q6j56P4K08L8M3
4729B14k72l0Q0m1R5j38L0M8Q7J2q4r5J97l38J44J96n6j20l5K38o4j54J34rj33
$$ plain form
4754 -94 96 -102 78 69 -32 23 -41 -6 69 68 -156 158 89 -113 131 -121 -39 -270 38 -194 41 2 -61 13 -58
4779 -58 110 -199 -50 -76 -65 83 53 -70 115 -237 119 -207 -90 214 43 -29 -26 70 -171 -16 -9 98 114 31
4803 31 -82 67 8 68 97 -101 -71 -30 -167 24 104 -17 23 -9 -86 78 141 138 -17 228 89 -6 28 96 -56
4828 -56 71 -154 -33 -13 84 -78 -145 39 56 133 -130 -129 -333 -269 19 -14 -65 61 181 -1 78 101 -103 162
4852 162 162 -205 -113 43 93 9 -12 -19 -65 92 128 -86 -12 -198 81 10 42 201 -123 -134 -91 56 -107 57 67
4877 67 -137 -41 -55 76 -129 -8 174 16 61 -49 98 -13 81 -109 -13 128 11 -144 15 -43 135 217 56
4900 56 16 -248 213 -88 41 23 32 21 79 184 15 15 -189 -65 -21 -17 -9 -19 82 76 -75 27 114 35 109 -230 23
4927 23 -18 117 -138 -119 113 -12 189 105 43 -36 40 187 12 76 172 -80 233 31 91 26 -73 120 -66 -2
$$ packed form
4754i4J90j98J80rj01N5o4L5P5jk24L14o9k02K44k52Q2k31L08k32K35l9o3P4p1
4779e8J68l09J49k6J1J48l0j23J85l52L56l26J17L04j71p2LR6k41J55PJ07J6q3
4803C1j13J49n9O0K9j98L0M1j37J91Q0j21M0l2p7J64O3lj55K45j39r5L4O8j52
4828e6J27k25J21K0R7j62o7J84J7P7k63Jk04O4K88l3n1J26J20j82P9K3k04K65
4852A62%l67R2J56N0q4k1pm6J57L6k14P4j86K79p1L2J59l24j1M3J47j63J64J0
4877F7k04R6j4J31k05J21J82j58M5j10J47j11R4j90R6J41j17j55J59n8J78Q2j61
4900E6m0k64M61l01J29j8Rj1N8J05j69%k04J24M4MQj0J01oj51J02Q7p9P4l39K53
4927B3m1J35k55J9K32j25K01q4o2p9P6J47j75O4R6k52L13k02O0o5r9J93j86O4
$$ plain form
4951 -2 209 25 160 36 -39 -78 -40 -49 154 0 151 114 -62 -14 0 -47 38 -85 131 -45 35 -58 75 -117 -6
4976 -6 20 -1 -111 -29 -12 -82 65 159 392 -103 -75 11 -16 -70 124 28 -16 -35 79 62 120 172 39 90 95 -159 -82
5003 -82 -86 -51 38 47 177 38 -101 99 139 117 -101 7 -146 172 128 42 -133 -4 -135 -108 -251 -60 238 53
5027 53 -22 64 -90 -53 -107 -103 160 -42 -181 -39 8 -164 -69 -70 105 -182 -45 27 106 113 258 150 109 -47 15 -103
5053 -103 14 -37 -118 -199 25 24 190 -20 -101 -58 -35 -50 204 95 -32 -188 117 31 -61 -96 -21 -274 111 103 -6
5078 -6 121 137 -70 -69 62 -121 -16 -113 1 -48 53 -20 50 -26 84 320 -80 -59 -36 -21 -57 50 -19 -81 38
5103 38 22 107 23 66 -58 99 20 -7 36 -48 -62 -43 72 -20 41 -174 -91 63 13 -30 -64 21 -108 50 -57 -8
5129 -8 82 -10 237 -39 31 121 23 37 30 -99 43 199 10 2 -84 183 -34 -13 -142 -69 -101 3 23 113 28 -27 -99
$$ packed form
4951bK11j84J35j24p5l9L8rK03j54J51l7j76M8J4m7Q5j23K16j76Q0r3J33j92J11
4976fK6k1j10Q2J7p0J47R4K33m95K8Q6k7n4J94r6m4j9J14j7N8N2j33N1Nk54P7
5003h2mL5Q9RJ30j39j39K00M0k2k18J08j53L18m4q6j75J29j31K7j43J91K98j85
5027E3p5Q6j54L7n4MK63k02j39J42M7j72R5jJ75k87J37P2P9PJ45j08m1j56O2j18
5053a03J17n1q1q1K24jJ66k10q1M3K3j5K54j09j27j56L05q6r2l5P5k53L85qj09
5078fJ27J6k07JJ31j83J05r7J14m9J01p3P0p6J10K36m00K1K3J5l6J07o9o2J19
5103C8j6Q5q4M3j24J57p9k7M3q4j4J9J15r2O1k15Q3J54n0m3l4Q5j29J58j07M9
5129hR0r2K47k76P0R0r8J4pj29J42J56j89qq6K67k17K1j29P3l2J04K0R0q5n5p2
$$ plain form
5156 -99 89 -30 68 -3 -46 -74 129 -82 -67 -57 65 -69 -11 75 -122 -11 -135 143 -50 240 -54 -65 32 -175
5180 -175 -148 140 60 -29 47 -45 -65 -21 117 -117 2 -24 -36 83 -133 27 28 7 -57 30 -37 17 -69 99 5 -75
5206 -75 -78 -56 -54 -49 82 -28 362 -203 124 -68 45 -95 -55 -54 -30 77 21 -26 -45 60 20 -108 174 191 18 -46
5232 -46 -72 176 -101 214 -57 105 6 -1 67 61 99 -70 -41 11 101 -180 100 -5 -142 -53 -63 -6 -15 -11 -70 -71 -104 180
5260 180 -238 -174 56 -14 49 117 113 65 -9 17 65 -4 53 66 146 -18 -112 -104 -233 -20 59 181 -15 93 115 109 172
5287 172 39 -147 -43 -122 -73 48 29 80 121 -18 75 188 89 -37 167 153 -124 135 -120 4 33 -59 -29 10
5311 10 136 129 -60 176 109 -44 71 32 187 54 -121 38 8 -56 98 75 17 64 2 79 83 51 -56 -105 1
5336 1 -30 -87 -175 237 -157 51 -1 18 -53 -19 96 30 -40 -73 -96 227 173 53 44 22 -9 76 -28 115 126 11 3
$$ packed form
5156i9J88j19R8p1m3k8K03k11J5J0J22j34N8Q6j97J11j24K78j93K90k94j1R7k07
5180a75K7K88q0q9P6r2k0M4J38k34J19k6j2J19k16J60Jk1o4Q7o7N4q6J68r4q0
5206g5lK2KNJ31j10L90n65L27j92J13j40M0JK4J07n6m7j9J05m0j28K82J7j73o4
5232d6k6K48k77L15k71J62r9pO8oL8j69K9N2R0k81K80j05j37Q9j0N7rMn9jl3K84
5260A80m18O4K30p0O3O8mm8p4K6M8o9N7J3Q0j64r4Qj29K13P9J22j96J08K2oO3
5287A72j33j86J04p9M9J21j9N1M1j39R3J13r9j26K04j4k77K59k55J24K9r2L0L9
5311A0J26pj89K36o7j53J15l9J55j33j75J59l0o4J54k3n8M7o2P7Ml2j07m9J06
5336Al1n7q8M12l94K08n2J9p1L4J15o6p0l3k3L23n4j20rk2l1Q5j04J43J1j15q
$$ plain form
5363 3 -26 43 78 -262 -77 -116 -89 62 -140 -34 -37 44 17 48 167 -31 41 -265 6 -233 -157 -90 -55 173 6
5388 6 -107 -31 -60 -42 83 114 19 74 35 38 -61 -40 140 -119 21 -57 158 70 -44 -270 -179 -3 153 75 71 58 -52
5415 -52 63 66 -27 -121 -90 111 -62 -8 -110 -16 -16 36 33 107 2 42 84 19 -18 -47 -65 104 83 41 -3 -72 -51 71
5443 71 -33 -53 -97 -39 30 111 -67 16 76 -15 -65 -12 -34 -52 -66 72 -120 120 12 -179 0 -111 21 153 -37
5468 -37 -33 -66 100 91 -116 189 91 57 -39 -78 -127 40 90 -63 188 14 34 -86 165 14 -80 -10 -155 -69 87
5493 87 -83 47 -58 -56 -99 -140 -52 -79 -68 -27 96 10 62 60 93 4 49 -67 148 147 97 -16 -70 62 -73 -171 65
5520 65 -34 98 18 260 -12 -114 -95 47 -89 -38 -127 20 -29 32 104 -2 3 -60 177 -62 24 203 41 -58 -98
5545 -98 15 -56 68 -54 -40 -202 -111 -35 -9 11 -90 281 70 -98 102 -24 156 -48 -179 109 41 -116 -25
$$ packed form
5363Ck9O9L5l40J85l9K7J51k02J06lQ1k7L1J19j98P2l06K71k39P6O7L5K28j67
5388Fj13P6k9J8J25L1r5N5l9Lr9K1J80k59J40p8K15q8j14k26R1J76J56p8mj3j10
5415e2J15Lr3r4L1K01j73N4j02R4%N2lP4j05M0M2o5l7k9j8J69k1m2m4o9K1J22
5443G1j04k0m4N8O9Q1j78Q3O0r1n0N3k2j8j4J38j92K40j08j91J79j11J32J32j90
5468c7Ml3J66rk07L05r8l4r6l9m9J67N0j53K51j74K0j20K51j51r4P0j45Q6J56
5493H7j70J30j05Km3m1Q8k7J1M1J23q6N2kL3q9M5j16K15jn0j13n4J32j35r8K36
5520F5r9J32q0K42k72j02J9J42j36N1q9J47m9O1P2j06No3K37k39Q6J79j62r9m0
5545i8J13p1J24j22J4j62R1P6K6K0j01L71k11j68K00j26J80k04j31K88o8j57R1
$$ plain form
5568 -25 71 -62 -52 15 -27 -53 2 -72 210 69 -190 -78 -54 -62 28 43 -120 -71 -29 -173 -45 -11 -34 288 -196 -33
5594 -33 -100 150 -4 1 174 9 -58 9 34 223 131 -19 -242 -22 3 -63 -67 -109 24 -123 164 -58 -131 42 8
5619 8 -81 34 -19 135 48 -183 -44 50 45 -59 188 15 -42 170 -158 36 -52 -45 7 38 -72 -62 -51 -55 151 -141
5645 -141 90 -68 -209 163 -104 -20 124 -53 -28 -39 96 81 -6 -88 -59 155 138 -29 -98 -68 -112 -104 67 -134
5669 -134 -7 56 126 -132 -43 60 -105 -45 -45 -19 -39 266 -31 68 32 19 29 -77 -68 164 -44 -76 -62 51 59 218
5695 218 10 -75 -41 -40 -43 135 40 11 -152 78 24 89 111 -36 -210 44 -123 45 -99 64 111 206 83 82 -131
5720 -131 -102 34 186 180 -1 14 -74 -144 -150 -36 -22 15 25 137 -213 15 -92 28 70 6 107 43 73 -8 40 -89
5746 -89 30 14 182 -63 30 -100 -34 132 153 195 223 76 1 85 -125 32 -97 121 22 83 137 -45 11 -49 -153
$$ packed form
5568b5R6j33J0O7m2k6N5p4K82j41k59J12K4qR0J5j63M9M2j44J28L4k3L22m84J63
5594c3o7K50j54NJ73j65o7O7K5J89r2j50k23K20K5o6mm2J33j47K87k22p3J73l4
5619Hq9J15n3J54q7k31J39R4nj04K47j73n7K12l28J94q8PN2L1j10J0J1mK06k92
5645a41K31j58j41L72k67Q4J44j77K5j1J35j5q7q2K9K14j7j67o9L0m4QJ71k01
5669a34J27O3P0k58Q9J03j65O0%K6k0L05k97R9l6j3J0j06RK32k08l2J4J13QJ59
5695B18k08q5L4JlJ78r5k9j63K30n4O5K2j47j74K54j67J68j44J63M7R5j23jk13
5720a31K9J36J52oj81J5q8p0oJ14J4L7J0J12l50K28j07J20M2o4J01o4L0q1M8j29
5746h9J19j6J68k45R3j30O6J66K1M2K8j47p5Q4k10J57j29K18r9O1N4j82N6o0j04
$$ plain form
5771 -153 117 25 -107 -20 72 -221 -62 93 -52 74 83 -216 106 74 0 85 70 118 -93 -46 -68 -208 -154 -160 -50
5796 -50 -74 131 60 -116 47 51 137 19 142 81 -36 161 -118 -60 88 -47 -53 10 -53 41 177 -144 -100 -5 38
5821 38 42 10 -22 113 62 -20 -36 -55 -248 -79 -36 67 0 -66 50 135 143 -151 154 -45 18 -113 45 -101 99
5846 99 -5 -9 -139 -61 -134 208 -55 -29 52 39 94 171 145 105 100 108 -26 -57 -23 -135 186 -119 124 83 -59 109
5872 109 95 -44 -190 59 -70 -50 -12 -61 149 165 24 9 -90 -37 169 -140 -180 -248 -3 206 -97 -110 -94 4
5896 4 -32 74 55 -16 107 -28 -32 40 -78 -2 -216 107 -90 -21 144 2 146 41 -63 -14 -18 57 -27 32 -7 -65
5922 -65 93 41 -50 -81 186 103 -124 -45 -102 -90 -111 -177 -83 65 -172 -83 173 -70 46 -112 88 0 187 10
5946 10 -213 -116 -171 -103 -12 -47 50 -107 69 -27 -31 49 10 52 -64 267 -97 95 65 86 89 -238 -26 -84 -63 -46 82
$$ packed form
5771a53K70r2j32Q7R2k93J59J55j45J26Rk99L22l2p4Q5j5M8k11M7k2j40N4oJ10
5796e0k4K05p1j76J63MQ6j18J23o1j17J97k79N8J48j35oO3o3R4J36l21M4R5M3
5821C8Ml2l2J35n1q2j6j9j93J69M3J03o7o6J16Q5Qk94L05j99O3j31J58j46K00
5846I9j04mj30P8p3L42k63K6Q1j3N5P7k6m0nQj34l1L4j12L21l05K43m1j42J68
5872A09j4j39j46K49j29K0L8m9K10J6j41j5r9N3K06l09m0o8K45K09l03j3J6R8
5896Dl6J06j9p1J23j35mP2j18P6k14L23j97O9J65j42J44j05j04M9mP5q4N9l9n8
5922f5J58n2r1l1K67q3k27P9n7J2k1o6R4J48k37Q9K56k43J16j58K00q8J87j77
5946A0k23R7n5O8R1l5R7j57J76r6mQ0l9M2j16L31l64J92l0K1Ll27K12n8K1J7J28
$$ plain form
5973 82 98 -38 -133 -14 -40 -85 51 -147 -29 42 -46 135 -53 -31 -115 -95 83 53 -93 63 -117 203 265 169
5997 169 -60 61 261 28 -114 31 182 113 -69 -105 -98 94 80 56 121 5 87 67 83 135 75 -81 19 -71
6021 -71 -271 -70 -160 110 -79 30 -110 -207 -165 -62 -29 2 92 1 105 3 -89 -54 -29 5 -192 63 -13 188
6045 188 16 129 -64 2 1 -13 4 -122 11 -76 243 -211 -11 -47 -70 -5 117 -47 -162 -78 42 -129 -69 -91
6069 -91 -92 45 71 -27 -58 -17 -89 -12 110 132 -32 27 -1 -9 60 -136 31 -52 -122 -15 -206 40 -21 196 155 -265
6095 -265 63 -162 -136 -43 -100 -66 -79 5 -71 77 22 -114 77 28 96 -108 73 -100 22 -56 -6 -10 -19 -157 -73 -126
6121 -126 -43 32 -87 167 10 -113 -69 298 -22 -19 130 -179 -7 57 24 -38 -135 -96 -37 79 -72 160 0 -13
6145 -13 -16 -28 -90 109 -163 -36 39 -125 30 -73 100 -76 -12 22 -83 -26 -131 37 167 117 22 -2 24 98 -31
$$ packed form
5973H2J6j36r5J19k6m5J36j98J18P1q8J81j88K2q4K0J78l0j46J56j80L20O2r6
5997A69k29J21K00k33j42J45J51o9j82l6PJ92j4k4O5j16Q2k0J6N2o0j56J00r0
6021g1k00K01r0K70j89J09j40r7M2J03L3L1R0r1J04j02r2L5K5L4j97K55p6K01
6045A88j72J13j93O6jj4J7j26J33q7L19m54K00l6k3O5J22j64j15Q4J20j71O0k2
6069i1jJ37K6r8l1M1p2P7J22K2j64N9k8qO9j96J67q3p0J07j91K46o1K17m1m20
6095b65L28k25K6R3n7L4j3Q4p6J48n5j36J91m9O8k04J81j73J22p8N0mrj38Q4n3
6121a26Q3P5j19K54j57j23M4L67l20LJ49l09J72O4l3o2r7L9N9J16j51K32j60j3
6145a3lj2o2J99k72J27P5j64J55j03J73j76O4L4j05N7j05J68J30n0r5k4K6P4j29
$$ plain form
6170 -31 57 116 57 7 -52 -35 -122 4 17 -142 -93 -69 -158 -1 -34 -31 76 -8 -126 -127 134 -53 15 58 45 -116 32
6197 32 91 109 -70 -33 -106 72 95 -107 54 -45 -18 -38 144 0 -58 62 -104 -87 161 6 28 96 -82 -6 115
6222 115 -103 -38 2 -76 12 -37 -36 63 -56 12 50 -105 -26 68 20 -75 -56 -23 176 -4 -87 141 -139 84 -90 34
6248 34 -121 -25 156 -62 -96 243 83 -44 168 -163 -140 -102 100 56 113 5 -27 45 159 -72 -39 -135 -54 -82
6272 -82 31 -73 -58 -20 38 -249 27 -9 -17 -39 121 11 48 -62 199 -49 -101 -213 -205 -85 -142 98 -108 94
6296 94 -266 86 104 -162 3 59 173 -9 -32 129 65 102 -209 77 -8 -148 -26 -109 49 19 161 82 -46
6319 -46 -220 -70 2 41 -13 -3 -125 -36 144 -98 -155 -176 74 44 -2 -24 71 -94 52 -38 -58 39 -9 7 -80 -192
6345 -192 45 -25 5 30 -45 2 45 246 -83 59 45 -152 41 103 -71 -117 105 -14 182 52 -85 70 -31
$$ packed form
6170c1Q8N9n9n0n9J7q7J26J3j59M9K4q9J57l3LJ07q4j18jK61j87O8M3j3j61J48
6197C2N9J8j79L7p3J78K3k02J61r9K7k0J82j44n8J20j66J7K48j55K2O8j78P6J21
6222A15k18O5M0p8Q8m9JR9j19O8L8j55P9R4m8r5J9L3J99j80q3K28k80K23j74J24
6248C4j55R6J81k18l4L39j60j27K12l31K3L8K02m4N7j08l2P2J14k31L3r6Q1k8
6272h2J13j04J5L8N8k87K76l6qk2J60j10L7j10K61k48n2j12QJ20n7K40k06K02
6296I4l60L52J8k66J65N6J14j82k3J61o4L7l11K86q5j40J22q3J58l0J42p9j28
6319d6j74J50P2L9n4J0j22Q9J80k42n7k1K50l0m6k2R5j65J46r0k0R7m8J6q7j12
6345a92K37p0L0K5p5M7M3K01l29J42j4j97J93O2j74m6K22j19J96j30j37J55j01
$$ plain form
6368 -31 13 128 -61 139 -149 -90 38 31 111 31 67 -204 -61 83 -79 -33 50 32 -144 87 84 104 -9 146 -16
6393 -16 -174 67 -85 44 49 100 84 48 -157 49 -39 7 129 23 -246 -26 -2 -181 -73 -38 109 12 16 -16 8
6418 8 -76 -13 -41 142 -101 -72 -201 0 -2 80 134 -55 -74 45 163 -11 90 103 42 11 103 -47 -135 102 28 89
6444 89 47 25 42 -61 75 -148 132 178 -76 54 54 -45 -40 -51 212 -110 -42 -14 -50 106 -21 15 -54 -144 -5 36
6470 36 78 -50 126 145 15 -152 150 -9 123 30 5 141 -133 -31 -10 -174 80 72 -18 38 5 -30 49 -29 -71
6495 -71 185 67 38 26 66 142 -173 133 208 -103 -42 -55 64 -73 -63 75 -209 -50 -78 29 -12 19 41 -26 172
6520 172 104 300 158 60 -97 151 -20 159 61 -129 67 -6 68 58 -47 107 18 -67 -86 -6 82 71 -17 141
6544 141 57 56 -22 -21 38 54 80 109 96 -93 36 -47 -35 137 156 36 -54 44 -25 9 16 85 -195 -58 -54 -10 208 -18
$$ packed form
6368c1M4J15j89K00k88N9J28pQ0q0L6k71J43J44j62M6Q3j8j76K31lK0j13J55j62
6393a6j58K41j52J29NN1j6l6k05K06q8M6J22j06k69K20K4j79J08L5J47r7Ml2K4
6418Hq4O3k8J83k43K9j29K01kQ2N4j89j9J19J18j74J01J3o1l1R2j50q8K37p4O1
6444H9m2k2J7j03J36k23K80M6k54J30%r9Nj1K63l22O8K8l6J56j27L6o9r0J39M1
6470C6M2j28J76J9j30j67L02j59J32r3k5J36k74J02K1j64K54qr0N6l3l5P9p8m2
6495g1K56j18k9j2M0P6l15L06P5l11O1j3J19j37J0J38k84J59k8J07m1L1K2o7J98
6520A72o8J96j42r8j57K48j71J79r8j90J96p3P4j0j05J54q9q5j9Q0Q8j1q8J58
6544A41q4jp8JN9J6K6K9j3j89J29q3J2J72J9j20r0R8o9L4PO9k80J37MM4K18k26
$$ plain form
6572 -18 -146 118 19 -84 45 -69 -18 123 3 -17 137 79 88 -59 131 -147 198 -158 -183 154 95 27 11 88
6596 88 129 44 -40 57 -4 15 87 144 -4 -74 98 2 153 -5 11 151 122 -11 46 -47 -89 140 72 -6 -41 -12 25
6623 25 59 86 -112 -170 -50 -173 -19 -18 40 -21 16 -72 156 179 -165 206 -178 -164 1 69 101 -57 193 30 7
6648 7 113 96 122 -46 -38 -43 -92 25 -248 116 -48 149 -131 -71 106 108 -34 100 144 -7 52 78 -203 40 24
6673 24 97 101 22 27 -80 -108 -107 95 -132 -30 -40 -32 -65 -54 -22 -19 107 201 18 -139 -72 68 -24 38 34 -9 15 -59 33
6702 33 -165 42 -34 -28 -47 72 -1 -19 57 87 -12 -39 91 10 -33 141 -130 -16 -45 -33 -127 173 -12 -120 46
6727 46 16 -39 137 38 105 -24 -104 154 -33 -3 39 9 67 80 23 -40 80 -28 -72 59 -50 -72 5 -63 -233 -43
6753 -43 -140 17 33 -51 -22 5 -70 -175 -201 -7 -61 6 -248 -39 -116 -130 34 37 21 38 94 -32 -136 8 -130 75
$$ packed form
6572a8j28K64r9j03J29j14N1J41j20k0J54n8Rj47J90k78L45l56k5L37n9o8j6P7
6596H8M1q5q4R7o1J9P2N7j48p0J72r6J51j58J6J40k9j33N7r3m2K29o8p8l5K9L7
6623B5L4K7j98n8J20j23J54JN8o1L7q8K28K3l44L71l84J4J65O8L2j58K50j63k3
6648GJ06j7K6j68Qnm9J17k73L64j64J97k80O0J77Kj42J34M4j51N9K6k81K43j6
6673B4P3Mp9Nj07k8JK02k27J02j0Ql3J1L2LJ26R4j83j57O7J40r2O2mm3K4p4R2
6702C3j98K07p6Oj9J19p3j8P6L0r9k7J30q1m3J74k71J14k9J2r4L00j85j08J66
6727D6l0n5J76r9O7j29q0K58j87L0M2l0N8J3n7o3J20j08m4J31j09k2P7o8j70J90
6753d3r7J57J6q4K9K7p5j05k6J94n4O7k54K09p7j4J64Lj6J7N6j26j04J44j38K05
$$ plain form
6779 75 -108 -16 -136 -60 178 -2 96 130 -97 -34 40 49 -75 -83 48 59 -27 -53 -17 -34 91 -93 -150 22 67 218
6805 218 51 7 -186 -42 50 -23 -124 102 86 -133 98 276 91 110 182 -21 -110 88 -11 -54 40 78 16 -86
6829 -86 -104 3 -135 -99 -125 -77 14 -130 -113 -179 297 119 -276 56 15 -20 116 157 83 -132 -59 -29 78 -292 4
6854 4 -80 40 -65 -35 -24 10 91 -61 -39 -98 14 -131 32 -74 -49 -88 -126 -208 74 150 179 -4 -82 133 -36
6879 -36 29 -247 38 -159 -129 84 23 65 26 -69 -120 37 -83 -8 -92 -109 -170 -89 112 112 60 -43 13 -47 109 -148
6905 -148 -65 -68 58 229 -182 134 -45 57 -1 -92 -312 -115 -58 -97 -44 91 178 -126 -112 -69 -46 82 130 19
6929 19 -121 66 -50 136 98 -23 158 -59 -31 72 43 107 -88 -65 -155 39 -36 117 -47 131 20 -84 149
6952 149 -81 -22 -86 -99 53 -66 -39 4 -5 -163 -14 -9 -90 -38 18 -17 -73 -70 98 75 -20 1 -28 -13 -146 -166 -11
$$ packed form
6779G5j83R2j20P6K38j80R8L4k27O3P4Rj24qJ31J1q6k6L6j7J25j84n7J72M5J51
6805B18j67m4j93J44R2p3j01K26j6k19K31J78j85J9P2k03q9J98r9m3R4L8o2j02
6829h6j8J07j38L6k6M8R1j44J7o6M76j78l95L32m1l5J36M1p4k15P3L0J07l70K96
6854Dq4J20j05L0J1L4Q1j52K2n9J12j45J63j06K5l9l8q2K82P6K9j83p8K15j69
6879c6O5k76K85j97L0K13o1M2l9r5n1J57j20P5q4j7o1Q1K01%n2j03N6o0J56k57
6905a48Q3lJ26J71m11L16j79J02n8r1k20J97N7l9N3J35Q7l04J4M3K3J28M8j11
6929A9j40J87j16J86l8j21J81k17K8J03k9O4j95K3r0J94p5J53j64J78j11j04K33
6952A49k30N9o4j3J52j19K7M3rj58J49Nq1N2N6l5n6LJ68k3r5K1k9J5j33k0J55
$$ plain form
6979 -11 -46 73 155 -67 -66 94 -76 -61 -90 -23 -21 -70 -29 198 28 -62 -25 -224 -36 -189 27 -41 -53 184 -182
7004 -182 43 -86 -38 90 81 -22 107 9 -218 -140 -115 18 144 -131 35 47 14 144 -116 -28 66 -2 -129 137
7028 137 -138 -52 111 59 -73 73 54 19 -22 -2 -121 -137 67 30 113 39 21 147 148 110 -118 -4 -41 -62 71
7053 71 -12 -29 17 -171 35 -89 -9 -36 -87 -44 -132 -33 183 -29 73 17 35 -196 64 157 158 41 129 -77 -27 123
7079 123 43 -129 11 -70 -135 110 -10 -37 -104 -97 52 113 36 66 -101 67 34 -70 -7 100 39 25 38 10 59 185
7105 185 52 23 -34 38 -15 -252 -145 -32 31 155 69 81 121 -23 -1 2 171 -49 -56 -20 -29 76 142 93 61 181
7131 181 35 11 -44 -111 59 -96 74 159 -105 102 -140 26 71 -235 -2 145 -88 280 -62 91 -220 -150
7153 -150 -76 36 -46 -91 -108 67 188 -27 94 -166 -8 -186 -110 30 -17 95 -41 71 10 -71 10 -76 -33 54
$$ packed form
6979a1l5J19Q2k22JJ60j70J5k9O7Km9M1K27j70r0L7j99J88j53K16o8j2K37l66
7004a82K25j29M8J28rj03J29r8k27P8K5J33J26k75J66J2l3J30k60Q8R4o8j27K66
7028A37k75Q6J63n2j32J46j9l5m1K0j19j6K04l7Q3p4j8J26Jl8k28J14l7k1J33
7053G1q3j7M6j88K06j24Q0k7n1M3q8R9K16k12J02n6J8k31K60R3Jj17Q8k06N0J50
7079A23q0j72J40q1o5K45j20k7o7PJ49O1p7L0j67J68l3j04O3J07o1j4J3k8M9J26
7105A85j33k9n7P2n3k37J07J13O3J24q6J2M0j44K2LJ69k20pL6rJ05O6m9l2J20
7131A81j46k4n5o7J70j55J70Q5k64K07k42J66M5l06K33J47k33L68l42J53l11P0
7153a50P4J12q2m5j7J75J21k15J21k60J58j78P6J40m7J12j36J12o1q1Q1q6M3Q7
$$ plain form
7177 54 -117 -10 -217 66 -186 22 44 103 -174 -113 110 -79 -63 14 -4 57 -138 -73 -47 203 52 70 37 24
7201 24 71 2 22 68 -189 48 46 -16 3 -93 -211 1 20 132 68 -61 7 145 89 -117 26 -127 140 21 -103
7226 -103 -35 -54 -121 101 -16 -37 83 49 -45 -143 52 14 -138 22 -180 124 -91 62 -36 -51 -43 -39 72 -28 34
7251 34 -134 -64 -3 -178 49 -111 58 -51 2 107 40 -20 -133 104 -82 22 149 -282 338 44 66 -115
7273 -115 -98 14 -19 80 42 73 118 54 262 183 -118 -34 206 23 264 0 41 57 33 -78 -46 11 111 -14 -13
7298 -13 38 47 56 83 -80 -142 56 -45 14 -6 128 -110 49 -1 29 -137 -22 56 -52 -128 -113 -90 -107 -77 179 98
7324 98 -140 -61 -157 76 16 39 -24 -19 116 103 -29 29 34 2 -18 -71 -151 -31 -4 -35 -67 74 -72 -34 88 93 -8
7351 -8 44 -20 -12 -23 102 152 -32 116 -83 -59 9 -51 92 -39 68 -55 -156 -25 -141 210 6 -10 55 70 168
$$ packed form
7177E4j71J07k07K83k52K08K2N9k77O1K23j89J6P7j8O1j95O5K6K50j51J8l3j3
7201B4M7o9K0M6k57K37ko2J9r6j18K12J9J12o4j29O8J38n6k06J43j53K67j19j24
7226a03O8j9o7K22j17k1J20l4r4r8J95l8j52J60k02L04k15J53r8j5QMJ11j00O2
7251C4j68P0O1j75K27j60J69j09N3J05o7o0j13K37j86J04J27m31O20k94K2j81
7273a15J7J12l3R9l8L1M5o4K08p9l01Q4K40j83K41k64M1J6k4j11L2N7J00j25J
7298a3N1RRK7j63o2J98j01N9k0J34k38J59n0L0j66J15P8j08p6J5K3j7L0K56q1
7324I8k38P9r6K33o0K3o3NJ35j3j32N8Nl2k0n3q0J20K7l1l2J41j46L8J22Nj01
7351hN2o4Qj1J25N0j84J48j99K4O8o0J43j31J07j23j01J31j16L51k04j6O5J5R8
$$ plain form
7376 168 -38 127 48 -121 -52 -9 -132 123 -99 20 -26 25 71 142 3 -116 158 39 66 60 -53 53 118 -86
7400 -86 -116 211 -41 -105 172 -150 -42 -114 -103 -74 -119 -72 -109 -37 -91 108 -93 26 -64 -25 -2 59 -28 -92 -77 -41
7426 -41 -142 -120 -214 47 14 72 169 -30 -87 4 132 -73 111 47 -124 -7 72 -113 -89 -101 132 -51 135 -126
7450 -126 -87 -41 -64 -102 -17 119 -91 18 -13 41 192 41 -27 220 112 113 112 148 -201 -32 -47 6 47 83 58 3
7476 3 121 80 -143 9 -127 1 -48 68 35 108 102 42 187 49 -69 -91 38 -128 -21 136 -19 -205 35
7499 35 -57 54 155 -77 -70 -80 -45 61 1 -19 -75 -70 -89 100 50 -224 91 -84 -9 224 191 -47 86 135 72 148
7525 148 -49 -43 -153 -5 43 -161 -53 80 124 186 82 96 47 118 -39 44 58 31 90 18 34 33 -23 77 4 40
7551 40 97 7 32 68 -61 183 11 -16 209 153 -170 -66 -102 13 24 -12 37 -62 -131 53 62 -74 -63 68 -50
$$ packed form
7376A68k06J65p9j69O9M3j23K55k22J19m6N1M6P1j39j19K74j19K7oj13J06O5k04
7400h6l0L27k52o4K77l22J08p2J1K9m5M7l7P2n4J99k01J19r0L9K3O1q7o4J5L6
7426d1j01K2r4K61l3N8R7j99n7R1J28k05J84o4j71J17P9j85K4j2K33j83J86k61
7450a26L9M6k3l8Q5J36k10J09l1N4J51j51o8K47j08JjL6l49J69j5N3M1L6k5n5
7476CJ18m1k23J52j36J28m9J16l3P3oo0J45j38j18k2J29j66J07J57j55j86K40
7499C5r2J11J01k32Pj0L5J06o0k0n6Nj9J89n0k74L15j75P5K33l3k38J33M9o3P6
7525A48j97Oj10J48M8k04J08J33M4O2j04J4m9P1j57Q3J4k7N9p2J6jn6J00p3L6
7551D0N7r0K5L6j29K44j72k7K25n6l23J04l6J15J1l6M9r9o9J84Rj36J1J31j18
$$ plain form
7576 -50 -135 -46 -38 81 -6 34 170 14 -79 16 50 31 125 41 -93 -9 14 19 -28 -58 -13 -19 -118 158 -7 211 -8 67
7604 67 28 159 24 69 36 -21 153 101 -20 40 51 83 -23 -135 15 -206 44 12 70 45 -33 -18 53 4 54 41
7630 41 44 -130 -160 -114 53 132 -21 -105 9 -54 47 -192 0 64 83 92 108 10 -54 -10 -162 -46 -25 -65 11 61 -32
7657 -32 -86 11 -28 -67 2 66 111 102 193 59 -264 -206 60 0 54 -58 11 -86 -162 -90 101 29 -57 -76 83 -60 -105
7684 -105 69 -14 124 37 -2 -229 -65 -48 -111 -318 -53 -66 41 232 -277 51 29 -106 -117 151 -30 97 169
7707 169 56 65 -20 -4 -42 -62 -104 -101 -94 90 -31 115 -131 -50 -37 -106 165 -55 126 -40 -32 29 -41 163 48 -169
7733 -169 42 0 -76 197 -115 -66 146 -106 164 -118 12 -55 -28 4 -39 -13 39 -52 -102 -93 -5 52 -67 100 43
7758 43 45 121 54 19 187 -18 -60 -65 -60 158 -38 -9 74 -238 66 -16 59 6 -91 -4 -25 -75 -31 127 -1 114 12
$$ packed form
7576e0q5Q9QJ19q7M0J36j56r3R5L4j9R4q4j34Q4K3Nm7l0M5or9K76j65K18k19P5
7604F7l9J31j35M5l3n7J74n2j21O0J1L2j06j12J50k21K50l2N8k5p8J5P1m9N0j3
7630D1Lj74l0M6J67P9j53q4J14o3J01k39J92O4J9RJ6r8o4M4j52J16K1m0P6N0r3
7657c2n4R7l9l9O9O4M5rR1j34l23N8K66o0N4j12O9r7p6P2J91p2q6j9J59j43m5
7684a05J74q3J38q7l9k27J64J7o3k07K65j3J07J91n09L28k2j35j1K68j81J27P2
7707A69j13Rq5J6l8k0m2LPJ84j21J46k46Q1J3o9K71k20J81j66QO1p0K04j15k17
7733a69K11m2p6K73l12M9K12k52K70k82J30o7K7L2m3K6N2r1n0RQ8N7j19J67n7
7758D3KP6o7l5J68k05m2nNK18j96K9Q3l12L04q2P5n3r7Q7k1n0M4J58j28J15j02
$$ plain form
7785 12 137 -8 -107 -97 217 -221 31 113 -40 -67 -72 148 -32 -45 72 -82 89 25 92 124 307 101 -171 251
7809 251 198 -68 11 61 -70 -80 21 113 37 1 -18 -156 26 43 70 71 -16 139 -41 -53 -137 -99 -3 112 97 -95
7835 -95 -201 160 50 93 57 89 -108 -116 -11 146 22 -31 52 -235 -162 -139 53 109 -42 -71 97 -33 -61 72
7859 72 -161 111 114 -60 -45 145 -168 40 -143 140 46 -67 -95 210 -18 -156 -79 -180 -117 189 -26 113 3
7882 3 47 -86 -39 43 -8 -150 -59 44 -16 1 83 108 90 40 17 -75 9 -21 -40 103 -95 206 -148 26 91 -32
7908 -32 66 -29 15 12 2 99 -43 -72 125 18 5 111 -160 -141 104 -118 27 44 -68 -59 -146 6 -35 88 -221
7933 -221 71 31 -198 70 -43 -168 48 52 233 -45 -2 -46 34 -68 -141 -125 -166 36 -138 -11 52 -3 -56 -82
7957 -82 209 47 -66 -100 62 -46 145 -4 68 2 -72 -77 -23 -101 -73 -7 -77 259 82 19 -120 60 -134 -152 -40
$$ packed form
7785A2J25j45r9J0L14m38K52Q2j53k7nK20j80j3J17j54J71o4O7L2J83k06k72M22
7809B51n3k66P9N0j31j0J01R2p6l6j9j38J82J7K7Jq7J55j80j2q4L8R6J15j5j92
7835i5j06L61j10M3l6L2j97qJ05J57j24n3Q3k87P3K3J92N6j51k9J68j30k8J33
7859G2k33K72Lj74J5J90l13K08j83K83r4j13k8L05k28j38P7j01O3L06k15J39j10
7882CM4j33M7Q2n1j42R1J03o0J7Q2K5j8n0k3r2Q4l0j9J43j98L01l54J74O5j23
7908c2R8r5M4lj0R7j42k9J97j07j3J06k71J9K45k22J45J7j12Rq7J52m1J23l09
7933b21K92m0k29K68j13j25K16MJ81k78M3m4Q0j02p3J6m1K02j74J27O3n5n3k6
7957h2K91j62j13l4J62j08J91j49P2o6p4nN4p8K8O6p0L36j77o3j39J80j94j8J12
$$ plain form
7982 -40 -51 46 -127 142 87 90 -160 104 -90 -84 -24 -122 124 16 -102 47 53 -99 19 15 88 -98 -24 -62 112 -32
8008 -32 8 -110 -98 88 -31 84 -88 -19 107 191 -262 -9 116 -211 53 -16 -55 10 82 162 -35 68 69 86
8032 86 124 18 80 141 14 142 -153 -76 144 -13 -29 59 145 -46 69 196 54 164 62 32 -41 -142 -192 -45
8056 -45 86 5 -37 26 78 -29 69 125 -76 -41 -111 -41 -148 93 145 -54 -64 -96 -39 109 -64 -41 20 116 5 119
8082 119 -23 -84 85 -211 6 77 151 -89 -75 -42 -59 -46 26 62 59 -41 -69 179 -41 126 6 -19 -170 -67
8106 -67 89 41 20 98 28 41 112 -17 -121 -113 61 13 42 141 -79 -7 62 -119 -170 -46 -73 123 -27 -109 14 -57
8132 -57 -5 48 52 97 128 65 -58 80 119 -44 -87 -37 88 81 -9 178 13 -172 36 -66 6 57 -229 104 -83
8157 -83 -163 1 20 19 120 39 -10 32 16 138 64 -66 59 116 -64 0 53 -23 -121 -27 -256 155 -74 -120 -30 134
$$ packed form
7982d0j1R7j73K69n5Lk50K64j94OO0r8K46j08j18J49Oj52J18mP3j86P4l8J74j44
8008c2M0j18J2J86j19J15j72O9J26Q4m53K53J25l27K64o9l9O5P2Q0j97J03JJ7
8032H6L8j06O2O1j27J28k95P7K20j57j6Q8Q6j91J15J27j42J10j02l0p3j01n0J47
8056d5J31q1m2O3N2j07R8N6k01L5p0P0j07K41N2j99j0l2N7J48j73K3O1R6j11J14
8082A19j42o1J69k96K17P1P4k40J4L3j7J3P2L6lj00k8K48k20J67j20k5j51J03
8106f7J56m8k1P8p0J3P1j29j04QJ74m8K9R9k20P2O9j81n1J24k7J96j50q2J23p1
8132e7N2N3MM5L1o3j23J38L9j63m3N0J25pr0J87j65j85K08j02P2N1k86L33j87
8157h3q0J64J9jJ01q1m9M2j6J22p4j30J25N7j80O4N3p6r8R4k29M11k29m6R0J64
$$ plain form
8183 134 109 94 158 -101 63 -74 56 15
$$ packed form
8183A34k5j5O4k59J64j37J30m1
8191A5
$$ Imaginary data points
##PAGE= N=2
##DATA TABLE= (X++(I..I)), XYDATA
$$ plain form
0 0 0 0 0 0 0 0 0 0 0 8 -8 8 -8 8 -13 16 -16 24 -24 32 -32 40 -48 56 -64 72 -80 96 -104 118 -135 150 -167
33 -167 187 -211 232 -259 287 -317 353 -391 432 -479 529 -586 652 -725 808 -907 1021 -1156
51 -1156 1321 -1526 1787 -2141 2637 -3385 4656 -7207 14380 -75690 -306442 -179915 95464
64 95464 246151 122104 -104295 -211339 -105598 80834 178915 105031 -61131 -175566 -126838
75 -126838 47166 192258 154409 -41766 -202641 -147465 73331 227799 150120 -72443 -209679
86 -209679 -128948 74280 194672 122992 -57346 -169715 -112012 55448 171689 121964 -50562
97 -50562 -178209 -130799 50453 187171 139021 -48294 -183566 -126733 62412 188223 121991
108 121991 -66766 -186139 -117755 67226 183223 114487 -69160 -180565 -108189 68269
$$ packed form
0@%%%%%%%%%Qj6J6j6J6k1K9l2M0m8N6o4P2q8J04j20J36j52J76k00K22k53K85l17
33a67L54l98M43m91N46o04O70p44Q23r11J008j115J238j377J533j715J928k177
51a156K477k847L313l928M778o022Q041j1863K1587r0070k30752J26527K75379
64I5464J50687j24047k26399j07044J05741J86432R8081p3884j66162j14435M8728
75a26838J74004J45092l7849j96175j60875N5176K20796J54468p7679k22563j37236
86b09679Q0731K03228J20392p1680j80338j12369N7703J67460J16241m9725j72526
97e0562j27647M7410J81252J36718m8150j87315j35272N6833J89145J25811o6232
108A21991j88757j19373O8384J84981J15997o8736j83647j11405P2376J76458
$$ plain form
118 68269 166217 91887 -73370 -165734 -99599 55809 149367 94289 -50221 -144409 -99677
129 -99677 41186 143283 102947 -47952 -161137 -113687 56433 175256 115584 -62283 -173001
140 -173001 -104861 65689 162080 90791 -66747 -148174 -78886 63848 140992 85081 -47564
151 -47564 -131022 -85379 49002 142650 98777 -47115 -147990 -93339 66669 166596 99824
162 99824 -64399 -155474 -84047 67867 142566 71760 -63437 -127291 -65364 54890 117239
173 117239 67711 -45806 -120450 -85379 33298 124621 92293 -39287 -136997 -94418 49800
184 49800 147237 93581 -56230 -145622 -82187 64716 141188 73632 -61059 -124475 -60401
195 -60401 60601 121774 67556 -49530 -118208 -72134 45288 119927 77751 -41563 -118620
$$ packed form
118F8269R7948p4330j65257r2364O6135J55408R3558n5078j44510r4188M4732
129i9677J40863J02097m0336j50899j13185M7450J70120J18823n9672j77867j10718
140a73001O8140J70550R6391p1289j57538q1427O9288J42734P7144n5911j32645
151d7564q3458M5643J34381R3648m3873j45892j00875N4651J60008R9927o6772
162I9824j64223r1075P1427J51914P4699p0806j35197o3854O1927J20254O2349
173A17239m9528j13517p4644L5071J18677R1323l2328j31580r7710M2579J44218
184D9800R7437n3656j49811q9392O3435J46903P6472o7556j34691o3416O4074
195f0401J21002O1173n4218j17086o8678M6074J17422P4639m2176j19314p7057
$$ plain form
206 -118620 -73820 49970 125981 73989 -53742 -126276 -69370 57288 123880 66924 -52325
217 -52325 -114790 -62191 49661 110230 61475 -46637 -109303 -66678 39680 106381 68348
228 68348 -36875 -106995 -70638 38819 112303 71974 -45714 -119745 -70539 53450 124956
239 124956 70616 -52778 -117904 -60119 56681 110996 51935 -54317 -100270 -46997 48029
250 48029 93619 51451 -38268 -92759 -59031 33914 96999 63722 -37319 -105262 -66321 44866
262 44866 113623 66123 -48356 -108744 -54256 53521 102348 48021 -47861 -89764 -42712 43948
274 43948 89513 51705 -34603 -89099 -57799 32677 95084 62041 -37684 -102471 -60206 46750
286 46750 105361 53485 -53506 -102592 -46210 51975 91021 38010 -48294 -83829 -38249 41653
$$ packed form
206a18620M4800J23790P6011n1992j27731p2534N6906J26658O6592n6956j19249
217e2325o2465N2599J11852O0569m8755j08112o2666M2625J06358O6701l8033
228F8348j05223p0120L6357J09457P3484m0329j17688p4031M9206J23989P1506
239A24956n4340j23394o5126N7785J16800N4315n9061j06252m5953N3273R5026
250D8029M5590m2168q9719n4491L3728R2945O3085l3277j01041o7943L8941J11187
262D4866O8757m7500j14479o0388N4488J07777M8827n4327r5882m1903M7052Q6660
274D3948M5565l7808q6308n4496L1300R0476O2407l3043r9725o4787M2265J06956
286D6750N8611n1876j06991m9086N6382R8185L9046n3011q6304l5535M5580P9902
$$ plain form
298 41653 80371 42768 -35823 -81581 -50158 31381 83662 53045 -32342 -86318 -51374 39139
310 39139 91509 50169 -42152 -90683 -46827 44016 90180 46432 -41773 -84770 -41040 42867
322 42867 82397 40101 -40862 -80906 -42257 36410 78052 42120 -36536 -80318 -44875 34860
334 34860 78914 41674 -40746 -85653 -45331 40353 83245 39774 -43217 -80286 -35641 41540
346 41540 73488 32255 -37241 -67542 -32608 33377 68611 40363 -25069 -66482 -42322 27639
358 27639 75389 49011 -29273 -78991 -45700 38094 84063 43010 -41033 -78547 -34698 41259
370 41259 71138 28805 -39762 -67428 -30156 32894 62834 32427 -29956 -66376 -40075 25881
382 25881 66678 38341 -32597 -72899 -38010 36261 71974 32503 -38916 -69375 -29990 36701
$$ packed form
298D1653L8718l7603p8591m5758L1423Q1539N2281l0617q5387n3976L4944R0513
310C9139N2370m1340r2321m8531M3856R0843M6164m3748q8205m2997M3730Q3907
322D2867L9530m2296q0963m0044L8649P8667M1642l5932p8656m3782L5443P9735
334C4860M4054l7240q2420m4907M0322Q5684M2892m3471q2991l7069M4645P7181
346D1540L1948m1233o9496l0301L4934O5985L5234k8248o5432m1413K4160O9961
358B7639M7750k6378p8284m9718L3291Q3794M5969m1053q4043l7514M3849P5957
370D1259K9879m2333o8567k7666L7272O3050K9940l0407o2383l6420K6301O5956
382B5881M0797k8337p0938m0302L4889P4271L5713l9471p1419l0459L9385O6691
$$ plain form
394 36701 63647 27140 -33646 -59177 -27483 30496 60368 32922 -26485 -61586 -35945 27586
406 27586 65787 37741 -29524 -66345 -33486 35225 68594 31842 -36787 -66893 -28363 37450
418 37450 63197 25499 -35613 -59483 -24258 33292 56242 23537 -31912 -56694 -27115 28061
430 28061 54777 27380 -27240 -55949 -29609 26719 57417 30116 -28941 -59973 -30419 29932
442 29932 59854 28407 -31187 -58113 -25992 31092 55391 23335 -31174 -54304 -25258 27076
454 27076 52247 26631 -25458 -53600 -28669 26123 56356 29022 -29233 -58019 -26048 33699
466 33699 59080 24207 -32630 -52749 -17442 33640 49240 17206 -27977 -43607 -17960 24477
478 24477 45040 24001 -20149 -46476 -27637 20827 49946 28072 -24697 -53089 -26837 27929
$$ packed form
394C6701K6946l6507o0786k5531L1694N7979K9872k7446n9407l5101K5641O3531
406B7586L8201k8046o7265l6821L2859O8711L3369l6752o8629l0106L8530O5813
418C7450K5747l7698o1112k3870L5225N7550K2950l2705n5449k4782K9579N5176
430B8061K6716k7397n4620k8709K6340N6328L0698k7301n9057l1032K9554O0351
442B9932K9922l1447n9594k6926L2121N7084K4299l2056n4509k3130K9046N2334
454B7076K5171k5616n2089k8142K4931N4792L0233k7334n8255k8786L1971N9747
466C3699K5381l4873n6837k0119L5307N1082J5600l2034m5183j5630K5647M2437
478B4477K0563k1039m4150k6327J8839M8464K9119k1874n2769k8392K6252N4766
$$ plain form
490 27929 53790 23501 -30282 -51620 -20611 28650 46865 18543 -27065 -45577 -19976 24497
502 24497 45560 21837 -24658 -47786 -23270 24570 47237 22034 -26119 -47922 -19776 28649
514 28649 47346 18787 -26681 -43908 -17024 26160 43308 18680 -22731 -40524 -17771 23395
526 23395 41895 19541 -21740 -41998 -20718 20688 41858 20752 -21838 -43298 -21688 21732
538 21732 43605 20670 -24188 -45021 -20350 24786 44839 19005 -25037 -41989 -14940 26932
550 26932 41156 15244 -23458 -37241 -14118 22918 38094 17514 -18787 -36636 -17487 20540
562 20540 38945 19002 -20726 -39999 -18190 23071 40958 17159 -22706 -37463 -14197 22481
574 22481 36077 14414 -20148 -34657 -15799 18357 35592 18254 -17885 -37578 -19958 18656
$$ packed form
490B7929K5861l0289n3783k1338L1009M9261J8215k8322m5608j8512K5601M4473
502B4497K1063k3723m6495k3128K4516M7840K2667k5203m8153k1803K8146M8425
514B8649J8697k8559m5468j7227K6884M3184J7148k4628m1411j7793K2753M1166
526B3395J8500k2354m1281k0258K1280M1406K1170k1106m2590k1460K1610M3420
538B1732K1873k2935m4858k0833K4671M5136K0053k5834m4042j6952K7049M1872
550B6932J4224k5912l8702j3783K3123L7036J5176k0580l6301j7849J9149L8027
562B0540J8405j9943l9728j9273K1809M1261J7887k3799l9865j4757K3266L6678
574B2481J3596k1663l4562j4509J8858L4156J7235j7338l6139j9693J7620L8614
$$ plain form
586 18656 38994 18478 -22392 -40834 -16810 23983 38942 13439 -24546 -36325 -11750 22766
598 22766 33165 11614 -19984 -31434 -12546 18738 32212 14821 -17303 -33091 -16082 17735
610 17735 33649 15019 -19337 -34442 -14729 19209 33289 13492 -19309 -32657 -14105 18055
622 18055 32198 14648 -17381 -31486 -13438 19115 33956 15501 -17703 -32309 -12970 20173
634 20173 33432 13786 -18481 -30951 -11836 19347 31380 12654 -18674 -31379 -12435 18202
646 18202 29998 11375 -18457 -29737 -11602 17736 28338 10211 -17603 -28015 -11640 15509
658 15509 26855 12336 -14809 -28047 -13953 14558 29251 14090 -16524 -30893 -13587 17513
670 17513 30900 12282 -18109 -28898 -9791 18646 28080 10264 -16534 -25592 -9212 16468
$$ packed form
586A8656K0338k0516m0870j8442K4024M0793J4959k5503l7985j1779K4575L4516
598B2766J0399k1551l1598j1450J8888L1284J3474j7391l2124j5788J7009L3817
610A7735J5914j8630l4356j5105J9713L3938J4080j9797l2801j3348J8552L2160
622A8055J4143j7550l2029j4105J8048L2553J4841j8455l3204j4606J9339L3143
634B0173J3259j9646l2267j2470J9115L1183J2033j8726l1328j2705J8944L0637
646A8202J1796j8623k9832j1280J8135K9338J0602j8127k7814j0412J6375K7149
658A5509J1346j4519k7145j3238J4094K8511J4693j5161l0614j4369J7306L1100
670A7513J3387j8618l0391j0789J9107K8437R434j7816k6798r058J6380K5680
$$ plain form
682 16468 26662 11847 -13952 -26251 -11507 15515 27274 10988 -16837 -27810 -10739 16231
694 16231 25588 8366 -16968 -25661 -10138 13755 22582 8434 -14297 -24216 -11984 12113 24693
707 24693 12161 -13440 -26025 -12469 14484 26894 11700 -15654 -25990 -9410 16672 26060
719 26060 9608 -15314 -23862 -8546 15266 23845 9317 -14238 -23048 -8392 14932 23665 9098
732 9098 -14326 -23101 -8298 14850 22457 7715 -13758 -21361 -8221 12982 21208 8332 -12845
745 -12845 -22034 -9926 11820 21717 9180 -13174 -22896 -9650 13280 22326 8308 -13567 -21819
758 -21819 -8338 13202 21637 9135 -12358 -21050 -8202 13105 22119 9010 -13355 -22067 -7985
771 -7985 14079 21525 6938 -14578 -20774 -6141 13353 18566 5435 -13023 -19073 -6976 11024
$$ packed form
682A6468J0194j4815k5799j2299J4744K7022J1759j6286k7825j0973J7071K6970
694A6231R357j7222k5334q693J5523K3893Q827j4148k2731r919J2232K4097J2580
707B4693j2532k5601j2585J3556K6953J2410j5194k7354j0336J6580K6082R388
719B6060j6452k4922q548J5316K3812Q579j4528k3555q810J4656K3324Q733j4567
732I098k3424q775J4803K3148P607j4742k1473p603J3140K1203Q226j2876k1177
745a2845r189J2108K1746R897j2537k2354r722J3246K2930R046j4018k1875q252
758b1819J3481K1540Q435j2502k1493q692J2848K1307R014j3109k2365q712J4082
771g985K2064P446j4587k1516o196J4633J9494N213j3131j8458o050J2097J8000
$$ plain form
784 11024 18107 7657 -10866 -19096 -8522 11140 19878 8195 -11955 -20038 -7485 12659 20003
797 20003 7236 -12328 -18933 -6480 12096 18648 6888 -11531 -18540 -7209 11684 19355 7384
810 7384 -12056 -19343 -6826 12538 18878 5724 -13078 -18268 -5086 12687 17032 4821 -11506
823 -11506 -16430 -5621 10379 16170 6063 -10385 -16809 -6472 10318 17139 6777 -10779 -17268
836 -17268 -6507 10905 17290 6339 -10611 -16414 -5867 10877 17077 6591 -10303 -16816 -6270
849 -6270 10862 17296 5971 -11478 -17188 -5242 11751 16456 4231 -12143 -16089 -4345 10822
862 10822 14540 3658 -10626 -14637 -4461 9778 14166 4576 -9825 -15046 -5025 10127 14939
875 14939 4850 -9987 -14280 -4408 9856 14481 4695 -9359 -14062 -4849 9191 14666 5881 -8880
$$ packed form
784A1024P083j0450j8523q230J0574J9662Q738j1683k0150q083J2553K0144P344
797B0003j2767j9564o605J2453J8576O552j1760j8419p009J1331J8893P671j1971
810G384j9440p287J2517J9364O340j3154j8802n190J3182J7773M345j2211j6327
823a1506m924J0809J6000N791j0107j6448o424J0337J6790O821j0362j7556o489
836a7268J0761J7412O385j0951j6950n803J0547J6744O200j0486j6894o513J0546
849f270J7132O434j1325j7449n710J1946J6993M705j2225j6374l946J1744J5167
862A0822L718j0882j4284m011J0176J4239M388r590j4401n221J0021J5152M812
875A4939j0089j4837m293R872J4264M625r786j4054m703R213J4040N475q785j4761
$$ plain form
889 -8880 -14800 -5106 10097 15651 5109 -10561 -15214 -4335 10865 14603 3694 -10694 -13682
902 -13682 -3248 10106 13017 3132 -9563 -13298 -3812 9338 13021 3623 -9699 -13340 -3809 9361
916 9361 12769 3270 -9443 -12641 -3345 9251 12191 3684 -8399 -12018 -3991 8362 12828 4622
930 4622 -8519 -12998 -4069 9339 13688 3935 -9547 -12836 -2942 9835 12406 2754 -9396 -12046
944 -12046 -2539 9094 11779 2925 -8770 -11835 -2969 8966 11560 2903 -8847 -11592 -2504 9028
958 9028 11243 2073 -8479 -10629 -2362 7832 10549 2731 -7748 -10477 -3256 7601 11134 3403
972 3403 -8082 -11837 -3442 8384 11393 2639 -8865 -11403 -2407 8839 11013 2103 -8467 -10743
986 -10743 -2312 8499 10714 2317 -8057 -10568 -2061 8526 10682 1900 -8240 -9971 -1624 8114
$$ packed form
889h880n920R694J5203N554j0542j5670m653J0879J5200L738j0909j4388k988
902a3682J0434J3354K911r885j2695l735R486J3150L683r398j3322l641R531J3170
916I361L408r499j2713l198R296J2596K940q507j2083l619Q027J2353M466q206
930D622j3141m479Q929J3408M349r753j3482l289R894J2777K571r652j2150k650
944a2046R507J1633K685q854j1695l065Q866J1935K594q657j1750k745R088J1532
958I028K215r170j0552k150Q267J0194K717p818j0479k729P221J0857L533p731
972C403j1485l755Q395J1826L009q754j1504k538Q996J1246K174q910j0570k276
986a0743Q431J0811K215q397j0374k511Q507J0587K156q782j0140j731Q347R738
$$ plain form
1000 8114 9562 1564 -7518 -9078 -1527 7128 8868 2130 -6701 -9384 -2604 6932 9987 2922 -7344
1015 -7344 -9951 -2597 7595 9903 2101 -8163 -9848 -1849 7776 9482 1828 -7854 -9484 -1943
1029 -1943 7341 9199 1804 -7949 -9405 -1450 8063 9179 1278 -7798 -8793 -845 7842 8273 872
1044 872 -6921 -7598 -927 6776 7913 1808 -6340 -7996 -2009 6711 8507 1722 -6936 -8529 -1607
1059 -1607 6867 8354 1076 -7247 -8381 -1667 6430 7982 1446 -6651 -8337 -1309 6756 8181 1342
1074 1342 -7154 -8260 -1103 7214 7990 792 -7177 -7513 -328 6836 7126 496 -6047 -6856 -693 6043
1090 6043 7063 1402 -5747 -7084 -1308 6403 7674 1304 -6240 -7317 -1033 6494 7216 919 -6154
1105 -6154 -6979 -926 5776 6939 1003 -6136 -7402 -1595 6001 7382 952 -6575 -7499 -635 6636
$$ packed form
1000H114J448p998r082j560P551Q655J740o738q831k683O780R536L055p065j0266
1015g344k607P354J0192K308p802j0264j685P999R625J706p654r682j630P541
1029a943R284J858p395r753j456P955R513J116p901r076r95P948Q687M31p401
1044H72p793o77O671P703J137o105q148j656N987Q720J796o785q658j593O922
1059a607Q474J487p278q323j134O714Q097J552o536q097j686P028Q065J425o839
1074A342q496j106P157Q317P76p198p969l36P185P164K90o630o543q09O163O736
1090F043J020n661p149j337N776P711J271o370p544j077O284P527P22o297p073
1105f154q25O053O702J163n936p139j266N807P596J381o430p527r24O864P271
$$ plain form
1120 6636 7053 206 -6542 -6461 -10 6116 6033 314 -5489 -6020 -497 5492 6092 864 -5243 -6253 -918
1137 -918 5606 6328 697 -5459 -6362 -727 5592 6104 670 -5405 -6054 -912 5287 6405 1143 -5276
1153 -5276 -6435 -954 5558 6630 808 -6045 -6542 -483 6061 6132 189 -5853 -5666 202 5496 5606
1169 5606 84 -5182 -5341 -329 5356 5586 419 -5265 -5604 -122 5169 5464 153 -4925 -5210 -391
1185 -391 4888 5151 396 -4679 -5279 -683 4539 5692 939 -5107 -5996 -720 5295 6021 503 -5574
1201 -5574 -5714 8 5508 5244 22 -5076 -4865 409 4923 4989 142 -4661 -4941 -127 4660 5029 270
1218 270 -4902 -4874 -309 4914 4857 -358 -4836 -4356 -58 4308 4303 323 -4242 -4338 -565 3962 4788 441
1236 441 -4546 -5111 -436 4552 5194 315 -5112 -4902 12 4659 4577 -336 -4639 -4490 309 4471 4241
$$ packed form
1120F636M17o847o748Q1O451O126q3n719n803n31N523N989O00n228o107j010N335
1137i18O524P22n631o156r03N635O319N12n434o075o49N142O199J118n262o419
1153e276j159N481O512J072n822o853m97O059O544P1n943o042J87N868N294J10
1169E606n522n266j59N012N685K30n167n684l39N482N291K95n311n078k85M819
1185c91N279K63m755n075o00M596N222J153m753o046q89N276O015P26n518o077
1201e574j40N722N500k64n222n098K11N274M514O6m847m803k80M814M787L69m759
1218B70n172K8M565N223n7n215m478M80M298M366nl980m565r6L773M527Q26m347
1236D41m987n65M675M988O42m879n427K10M914M647q2m913m303J49M799M162k30
$$ plain form
1253 4241 -39 -4467 -4167 128 4429 4290 9 -4331 -4040 374 4468 4095 -299 -3903 -3846 40
1269 40 3812 3884 197 -3715 -4114 -343 3750 4045 351 -4036 -4362 -419 4251 4342 -27 -4279 -4126
1286 -4126 79 4109 3952 -189 -4033 -3908 86 3981 4098 128 -4174 -4044 8 4400 4024 -334
1302 -334 -4228 -3586 645 4055 3551 -345 -3603 -3048 347 3472 3285 339 -3056 -3485 -281 3419
1318 3419 3714 207 -3702 -3656 -129 3858 3653 -341 -3984 -3660 154 3627 3422 -360 -3554 -3430 121
1335 121 3422 3511 60 -3679 -3691 151 3854 3388 -253 -3850 -3382 588 3716 3006 -518 -3259 -2922
1352 -2922 481 3241 3004 -233 -3208 -3057 -137 3230 3343 39 -3416 -3080 39 3310 3150 -196
1368 -196 -3251 -3042 201 3147 3355 -39 -3330 -3204 78 3238 3293 -205 -3404 -3260 606 3595 2993
$$ packed form
1253D241m280m428L00M295M301j39m281m340K91M414M094l73m394l604N7L886
1269D0L772P2l687l912l99L771M093K95l694m387l26L943M670R1m369m252J53
1286d126M205M030j57m141l844J25L994L895J17l970m302J30M052M392l76m358
1302c34l894O42M231L410n04l896l258N55L395L125j87k946l395m29L204L700
1318C419K95l507l909M6L527L987k05l994l643L24L814L473k05l782l194J24L551
1335A21L301Q9l451l739j2L842L703m66l641l597M68L970L128p10l524k741L37
1352b922L403K760k37l237k975J51K920L367J13l304l455L36L119L271j60l346
1368a96l055K09L243K946K08l394l291J26L282L160N5l498l199J44L866K989o02
$$ plain form
1385 2993 -571 -3361 -2813 610 3209 2566 -583 -2842 -2279 598 3023 2625 -231 -2895 -2530 317
1401 317 2952 2800 -279 -2975 -2761 394 2811 2529 -379 -2740 -2443 123 2695 2710 -246 -2835 -3017
1418 -3017 -38 2987 2767 -490 -3293 -2810 763 3191 2648 -604 -3339 -2341 690 3072 2233 -605
1434 -605 -2623 -2147 468 2677 2250 -394 -2688 -2525 329 2689 2446 -303 -2619 -2200 305 2507
1450 2507 2250 -545 -2616 -2157 210 2473 2427 -343 -2650 -2482 89 2663 2354 -340 -2803 -2250 478
1467 478 2824 2451 -423 -2712 -1981 631 2612 1979 -486 -2424 -1960 479 2495 1860 -605 -2445
1483 -2445 -2088 687 2595 1889 -506 -2235 -2055 290 2332 1886 -362 -2205 -2010 274 2227 2238 -285
1500 -285 -2339 -2178 436 2598 2216 -477 -2644 -1918 638 2472 1888 -355 -2338 -1552 578 2041
$$ packed form
1385B993l564k790N48L423K599o43l149k259N63K877K425l98k856k664L65K847
1401C17K635j52l079k696K14L155K417k82k908k361K97K566K572J5k956k589j82
1418c017K979L025k20l257k803M83L573K428n43l252k735R98L031K382q39k838
1434f05k018M76K615K209m27k644k294J63K854K360k43k749k316M19K505K202
1450B507k57k795k071M59K367K263m6k770k307J68K571K574l09k694k463N53K728
1467D78K346l73k874k289P31K612J981o33k465j938M64K439K016o35k465j840
1483b445L57K775J908p06k395j729J80K345K042m46k248j843J95K284J953J1k523
1500b85k054J61K614K162l82k693k167P26K556J834n84k243j983P86K130J463
$$ plain form
1516 2041 1765 -503 -2311 -1770 368 2351 1963 -517 -2300 -1798 645 2363 1593 -731 -2017 -1195
1532 -1195 410 1970 1520 -234 -1915 -1605 179 2090 1884 -165 -2040 -1897 225 2197 1955 -475
1548 -475 -2457 -1900 406 2327 1710 -559 -2211 -1708 579 2280 1764 -555 -2099 -1547 526 2262
1564 2262 1593 -554 -2021 -1603 777 2062 1610 -520 -1732 -1452 474 1848 1315 -406 -1861 -1553
1580 -1553 316 1772 1662 -312 -1985 -1544 604 1837 1591 -342 -1912 -1369 397 1905 1599 -330
1596 -330 -1902 -1417 344 2034 1396 -477 -2078 -1374 428 2054 1096 -683 -1940 -1219 575 1816
1612 1816 1043 -509 -1500 -1056 399 1649 1245 -379 -1657 -1268 117 1816 1634 -320 -1652 -1383 641
1629 641 1624 1271 -399 -1736 -1265 550 1685 1156 -462 -1763 -1263 534 1743 1392 -695 -1780 -1200
$$ packed form
1516B041k76k268j808N41K138J983l88k480j783N02K443J718p70k324j286Q22
1532a195J605J560m50j754j681L10J784J911k06k049j875J43K122J972k42k430
1548d75j982N57K306J921o17k269j652N03K287J701n16k319j544N52K073J736
1564B262o69k147j467M18K380J285m52k130j212K80J926J374n33j721j455L08
1580a553J869J456j10j974j673M41K148J233k46j933j570N43J766J508l06j929
1596c30j572M85J761J690o38j873j601P04J802J626r58j779j257P21J794J241
1612A816p73j552r91M44J455J250m04j624j278L89J385J699j82j954j332K69K024
1629F41R83l53j670j337M71J815J135n29j618j301N00J797J209l51k087j085N80
$$ plain form
1646 -1200 480 1747 1373 -663 -1826 -1233 688 1723 857 -638 -1457 -1028 517 1547 962 -610
1662 -610 -1414 -1306 570 1528 1198 -513 -1628 -1098 479 1530 1262 -533 -1480 -1104 605 1459 1115 -640
1680 -640 -1632 -947 472 1765 1295 -450 -1607 -985 819 1589 1072 -609 -1670 -858 816 1553 865
1697 865 -513 -1537 -976 530 1339 871 -587 -1412 -852 545 1383 835 -575 -1331 -831 458 1379 868
1715 868 -237 -1160 -772 354 1395 1005 -380 -1146 -1080 241 1484 1052 -821 -1537 -970 439 1648
1732 1648 761 -599 -1386 -804 417 1417 791 -819 -1089 -886 418 1264 800 -535 -1405 -853 558
1749 558 1300 764 -529 -1215 -421 550 1223 635 -422 -1039 -884 398 1204 854 -522 -1204 -905 343
1767 343 1348 883 -550 -1364 -689 422 1378 805 -610 -1441 -497 496 1073 605 -597 -1227 -772 636
$$ packed form
1646a200J680J267l74k036j163N93J921J035q66j495q19M29J545J030n85j572
1662f10q04J08J876R58l30j711j115N30J577J051k68j795r47L76J709Q54l44j755
1680f40r92O85J419J293m70j745j157O22J804P70n17j681j061Q12J674P37o88
1697H65j378j024N61J506Q09m68j458q25N60J397Q38n48j410p56N00J289R21n11
1715H68j105r23L88J126J041l90j385p66O6J321J243m32j873p16N67J409J209
1732A648q87j360p87N82J221J000o26j610k70K03J304Q46m64j335q70N52J411
1749E58P42n36j293o86P94R71O73n88j057o17J55J282Q06l50j376o82K99J248
1767C43J005m65j433q14O75J111R56n73j415q31R44R93N77m68j202o30M55J408
$$ plain form
1785 636 1216 616 -650 -1251 -587 440 1229 728 -649 -1143 -797 339 1113 618 -355 -814 -761 381 1226
1804 1226 812 -334 -1261 -874 480 1036 486 -672 -1234 -781 496 1273 663 -700 -1160 -651 392 1090
1822 1090 735 -519 -1150 -679 564 1261 648 -574 -1097 -466 406 1184 345 -409 -1059 -326 480 910 449
1841 449 -319 -840 -504 335 1141 594 -381 -762 -512 644 841 611 -471 -1092 -602 434 1001 515 -639
1860 -639 -1002 -771 477 1154 438 -650 -1007 -654 468 969 389 -322 -862 -432 456 853 487 -364 -857
1879 -857 -381 342 753 477 -190 -662 -451 344 845 557 -446 -853 -479 261 889 450 -460 -1005 -302 483
1899 483 772 303 -512 -803 -520 371 918 357 -638 -1042 -319 603 954 328 -582 -854 -493 455 851 221
1919 221 -576 -651 -248 393 631 280 -280 -727 -428 430 833 550 -429 -589 -645 474 1151 296 -479 -921
$$ packed form
1785F36N80o00j266o01O64J027P89n01j377m94L46J136P74m95r73m59N3J142Q45
1804A226m14j146r27L87J354N56n50j158n62M53J277P77o10j363m60N09J043O98
1822A090l55j254o31M71J243O97o13j222n23O31Q72P78q39p54o50P33Q06M30m61
1841D49p68n21L36Q39Q06n47r75l81K50J156J97k30j082o21M90J036N67m86j154
1860f39l63K31J248O77p16j088l57L53J122N01n80p11n40M30Q88L97l66q51m93
1879h57M76P23M11k76o67m72K11P95N01k88j003m07L74P40O28m39r10n45P03P85
1899D83K89m69q15k91K83Q91N47n61r95m04P23R22L51o26r10k72L61R48L96o30
1919B21p97p5M03O41K38l51n60m47K99Q58M03k83r79j60n6J119O77q55p75m42
$$ plain form
1939 -921 -159 443 969 605 -251 -916 -269 451 971 623 -523 -882 -396 617 884 115 -554 -692 -360
1958 -360 601 779 233 -414 -697 2 541 640 135 -204 -529 -511 266 779 351 -223 -678 -227 374 647 480
1979 480 -266 -740 -477 358 563 343 -403 -721 -242 505 467 497 -409 -901 -310 525 863 236 -535 -653 -174
2000 -174 349 694 317 -411 -529 -78 472 645 75 -325 -623 -241 418 551 130 -313 -389 -221 296 691
2020 691 299 -384 -553 -377 310 587 323 -308 -671 -427 405 580 380 -289 -894 -58 446 579 120 -359
2040 -359 -538 -251 431 675 11 -401 -548 -308 238 549 247 -340 -563 -421 630 618 106 -396 -550 -59
2060 -59 307 427 297 -268 -596 -189 239 437 164 -56 -365 -359 196 732 369 -272 -589 -351 382 576 294
2081 294 -510 -629 24 410 644 38 -433 -528 86 392 427 109 -290 -344 -249 359 708 298 -388 -330 -383 79
$$ packed form
1939i21P62O02N26l64q56o65O47P20N20l48j146l59M86J013K67p69o69j38L32
1958c60R61J78n46o47k83O99N39R9n05l39l25J8P77N13m28n74m55M51O01K73j67
1979D80p46m74K63Q35K05k20p46l18M79P47l8L0r06m92N91Q35L38o27p71j18M79
2000a74N23L45l77p28j18M51N50J73n70m00k98L82O59J33m21m43p6J68N17L95
2020F91l92o83j69J76O87K77k64o31l63K44Q32J75k00o69o05Q36N04J33m59m79
2040c59j79K87O82K44o64m12j47K40N46L11l02n87k23J42J051j2n12n02j54M91
2060e9L66J20j30n65l28M07M28J98k73k20l09ON55N36l63o41l17K38P33J94k82
2081B94q04j19O53L86K34o06m71r5O14L06L5l18l99n4R5O08L49m10o86N8n3M62
$$ plain form
2103 79 651 215 -351 -434 -219 309 418 204 -87 -505 36 362 271 -223 -350 -574 -305 286 542 308 -193
2124 -193 -611 -125 482 478 282 -353 -639 -163 438 637 82 -340 -547 -10 508 314 -48 -423 -386 188 291
2145 291 126 124 -234 -358 -148 358 415 162 -330 -377 -281 370 630 108 -267 -427 -160 438 415 26 -435 -442 -92
2168 -92 241 129 136 -258 -445 -365 187 530 148 -178 -596 -197 223 355 -75 -290 -484 94 264 497 -63
2189 -63 -176 -361 -140 366 94 93 -67 -188 -88 204 255 168 -227 -384 -419 288 495 173 -376 -527 -248 590
2211 590 394 15 -432 -275 -25 267 328 -162 -347 -110 -7 246 380 271 -57 -392 -35 224 462 229
2231 229 -295 -383 -267 169 486 -31 -404 -350 -39 329 210 0 -241 -271 -219 -70 294 124 -72 -580 -253
2252 -253 94 441 307 -119 -365 -172 432 487 36 -350 -327 93 327 258 -160 -300 -163 94 294 187 -58
$$ packed form
2103G9N72m36n66q3K15N28J09k14k91m18N41L26r1m94j27k24K69N91K56k34n01
2124a93m18M86O07mj96o35k86M76O01J99n55m22k07N37N18j94l62l75L7N74J03
2145B91j65kl58j24K10N06N7k53m92m7R6O51K60n22l75j60K67N98k3l89m61pL50
2168i2L33j12Pl94j87Q0N52L43l82l26m18L99M20J32m30k15j94N78J70K33n60
2189f3j13j85K21N06k72jj60j21J00K92N1q7l95j57l5P07K07l22n49j51K79Q38
2211E90j96l79m47J57K50K92O1m90j85K37J03K53J34j09l28l35L57K59K38k33
2231B29n24q8J16M36L17n17l73N4L11L68j19k10k41l0N2J49L64j70j96n08L27
2252b53L47L47j34m26k46J93O04N5m51l86K3M20K34o9m18j40J37K57K00j07k45
$$ plain form
2273 -58 -70 -255 -277 170 315 339 -299 -234 -47 465 490 148 -384 -346 23 387 310 -75 -269 -124 33 240 166
2296 166 133 -50 -270 -52 93 407 403 -191 -353 -175 261 326 42 -320 -407 -147 384 385 -79 -344 -191 18
2318 18 184 315 132 -198 -102 -8 -58 86 110 31 -515 -226 218 527 255 -405 -350 -175 321 386 5 -326 -250
2341 -250 80 215 185 -260 -335 -79 -13 -130 351 187 -107 -341 -256 219 350 311 -219 -406 -207 357 262 -46
2363 -46 -303 -210 -178 328 93 -63 20 208 -67 -151 91 4 -185 -221 -331 267 560 366 -276 -347 16 178 287
2386 287 7 -406 -247 278 76 67 -23 -162 -119 134 -62 8 196 120 -51 -198 195 311 172 -103 -253 -228
2408 -228 239 272 -88 -434 -175 3 339 182 -139 -410 -30 -104 36 -9 224 -56 -237 74 48 330 413 -260
2430 -260 -319 -225 158 404 51 -533 -465 42 240 224 50 -208 -56 165 190 55 -133 84 -27 -136 -102 100
$$ packed form
2273e8j2j85k2M47J45K4o38O5J87N12K5l42n32L8L69L64p7l85j94J45J57K07p4
2296A66l3j83k20K18J45L14mn94j62J78M36O5k84l62q7K60N31Jm64k65J53K09
2318A8J66J31j83l30R6R4n0J44K4p9n46K89M44L09k72o60N5J75M96O5l81l31P6
2341b50L30J35l0m45p5K56O6j17M81j64k94k34Q5M75J31l9n30j87J99N64r5l08
2363d6k57R3L2N06k35j56Q3J88k75q4K42q7j89l6j10N98K93j94o42p1L63J62J09
2386B87k80m13J59N25k02rr0j39M3K53j96P0J88p6j71j47L93J16j39k75j50K5
2408b28M67L3l60l46K59J78L36j57l21k71L80p4J40m5K33k80j81L11k6K82Q3o73
2430b60n9R4L83K46l53n84O8N07J98j6j74k58J52K21K5j35j88K17j11j09L4K02
$$ plain form
2452 100 178 -1 -203 -207 242 163 75 -178 -534 -139 300 153 -70 -229 -48 139 261 -108 -261 -103 -130 -94
2474 -94 115 169 310 -112 -235 -97 96 447 19 -278 -390 -15 312 65 -40 -242 6 213 214 160 1 -14
2496 -14 -55 72 85 81 11 128 -244 -216 242 268 225 -69 -439 -139 340 345 111 -380 -74 296 402 86 -220 -308
2520 -308 -117 114 68 40 -10 64 -104 -125 117 349 4 -209 -383 -86 281 252 -106 -272 -101 189 603 -121
2542 -121 -220 -334 9 182 -34 -78 -70 -76 -239 -192 -121 282 177 90 -173 -78 327 277 240 -347 -186 75 446 190
2566 190 -237 -345 -43 145 61 -22 -184 -112 53 -113 -131 131 218 -203 -364 -68 213 480 69 -259 -303 57
2588 57 380 -37 -262 -210 -212 194 43 55 -113 179 140 -60 105 104 292 26 -132 -255 53 234 -48 -160 -225
2611 -225 59 274 171 -127 -246 -140 8 72 -9 -91 228 29 -23 -237 -38 261 -62 77 -109 8 133
$$ packed form
2452A00P8j79k02mM49p9q8k53l56L95M39j47k23j59J81J87J22l69j53J58k7L6
2474i4K09N4J41m22j23J38J93L51m28k97j12L75L27k47j05k02K48K07Jn4j59j5
2496a4m1J27J3mp0J17l72K8M58K6m3k94l70L00M79Nk34m91L06L70J06l16l06q8
2520c08J91K31m6k8n0P4j68k1K42K32l45k13j74K97L67k9l58j66J71K90M14p24
2542a21r9j14L43J73k16m4Qoj63M7P1M03j05q7k63R5M05n0l7n87J61K61L71k56
2566A90m27j08L02J88q4q3j62P2J65j66j8K62Q7m21j61K96K81K67m11l28m4L60
2588E7L23m17k25N2kM06j51J2j68K92l9k00J65jJ88k66j58j23L08J81k82j12o5
2611b25K84K15j03k98j19J06J48O4q1q2L19j99n2k14J99K99l23J39j86J17J25
$$ plain form
2632 133 34 -127 -108 -288 294 399 -14 -450 -127 285 182 14 -138 73 57 249 101 -92 156 91 136 -129
2654 -129 -173 123 47 -250 -472 -95 319 167 -34 -285 -146 89 196 60 -46 63 -65 33 -37 -12 -179 200
2676 200 -172 -53 69 -22 254 66 -141 -99 136 83 -34 -220 -63 148 119 -84 -71 -145 56 220 -15 78
2698 78 14 -73 -54 -30 -1 57 174 4 -335 -208 162 129 -235 -196 -392 59 262 158 -229 -127 12 110 178 -53
2722 -53 -125 19 85 -71 35 161 18 150 -78 -101 -10 297 89 -198 -228 -6 219 107 -97 -343 -37 326
2744 326 26 35 -111 -82 -74 6 -62 -78 55 -64 -47 -94 -28 162 -151 -59 -123 -87 225 139 -53 -16 14 127 130 8
2770 8 -171 -123 -125 265 203 -141 -39 58 -29 -132 59 31 124 -124 -134 -45 140 316 -171 -221 11 52 187 2 -68
2795 -68 -187 167 248 137 -20 -34 244 21 -202 132 120 95 16 -142 -10 106 80 107 -202 -121 -1 125 -34
$$ packed form
2632A33r9j61J9j80N82J05m13m36L23M12j03j68j52K11j6J92j48j93K48o5M5k65
2654a29m4K96p6k97k22L77M14j52k01k51J39K35J07j36j06J09j28R8p0K5j67L79
2676B00l72J19J22r1K76j88k07M2K35n3j17j86J57K11k9k03J3p4K01J64k35R3
2698G8o4q7J9K4K9N8J17j70l39J27L70l3l64L9j96M51K03j04l87J02J39R8O8k31
2722e3p2J44O6j56J06J26j43J32k28k3R1L07k08k87l0K22K25j12k04k46L06L63
2744C26l00Rj46K9QQ0o8j6J33j19J7m7O6J90l13R2o4L6L12q6j92L7L0J13Lj22
2770Hj79M8kL90o2l44J02R7q7j03J91k8R3k48j0Q9J85J76m87n0K32M1J35j85p0
2795f8j19L54Q1j11j57j4K78k23k23L34j2k5p9j58J32J16k6K7l09Q1J20J26j59
$$ plain form
2818 -34 -188 -226 62 76 -36 -21 -188 -34 37 -7 -70 356 4 34 -107 -58 68 71 8 -317 -282 -1 279 174
2842 174 -279 -247 55 18 154 -105 -78 120 114 -150 91 31 30 -44 -99 68 -11 143 10 -284 -238 -107 117 148
2866 148 -24 -82 127 158 -9 -209 -219 -31 1 42 -75 -85 4 -59 -199 -127 38 70 16 -127 -86 35 137 227
2890 227 -92 -59 133 123 259 -9 -247 -128 -66 14 -21 62 170 36 -60 -231 19 186 143 -19 -110 72 62
2913 62 53 49 -53 -126 145 198 -2 -161 -168 82 100 27 -171 -37 100 103 -169 4 78 42 -92 -50 -27 237 128 -57
2939 -57 -211 14 0 95 -14 94 19 27 33 36 -96 -35 -176 -72 -160 113 3 -2 20 -20 -134 20 147 -103 -63 10
2965 10 160 279 194 -139 -97 -129 40 82 -124 -63 23 109 12 -39 53 -121 -98 53 147 81 27 -172 -106 -48 114 173
2991 173 -87 -18 -72 2 -68 -132 -139 -205 -224 -21 88 -33 211 150 -62 24 103 -27 -7 -102 15 -50 86 83 61 86
$$ packed form
2818c4j54l8K88J4j12J5j67J54P1m4o3M26l52L0j41M9J26Lo3l25L5K81K80j05
2842A74m53L2L02l7J36k59K7J98ok64K41o0jp4n5J67p9J54j33k94M6J31K24L1
2866A48j72n8K09L1j67k00j0J88L2M1j17j0Q9o3j40P2J65L2n4j43M1J21J02R0
2890B27l19L3J92j0J36k68k38J19O2Q0l5Q3J08j34r6j71K50J67m3j62r1J82j0
2913F2rmj02p3K71N3k00j59pK50J8p3j98J34J37Lk72J73P4l6j34M2K3K64j09j85
2939e7j54K25j4R5j09J08p5QOLj32O1j41J04q8K73j10nK2m0j14J54J27k50M0P3
2965A0J50J19q5l33M2l2J69M2k06O1Q6Q6r7n1R2j74K3J51R4o6n4j99O6N8J62N9
2991A73k60O9n4P4p0o4po6j9K03J09j21K44o1k12Q6P9j30K0r5J17o5J36lk2K5
$$ plain form
3017 86 -269 65 -90 13 36 51 14 202 40 -3 252 -144 101 -180 12 -66 145 -5 -73 -115 -22 174 43
3040 43 27 -66 -69 -277 101 -6 203 96 -47 7 229 -27 2 -119 -38 -37 36 91 -73 25 -48 77 118 1 77
3065 77 133 -73 130 270 -44 -100 -123 106 150 78 -209 -153 181 199 90 -51 74 18 -57 -93 -221 -34 115 173
3089 173 -84 -105 121 -53 139 -139 11 -37 103 -55 -6 -15 36 -85 107 -88 -28 43 17 -113 90 -9 32 -54
3113 -54 10 -145 -28 27 105 -114 -251 -63 -42 77 32 -114 -33 83 -48 122 -153 88 -58 -135 82 -26 -19
3136 -19 53 -18 -106 236 233 159 -61 -55 -219 -25 1 -25 36 65 158 178 40 47 -70 84 -55 -114 -112 180 20 80 115
3163 115 -61 98 -91 61 -30 -51 2 -64 -64 -31 -235 22 -108 92 125 98 -81 -73 22 3 -92 11 18 -110 -9
3188 -9 69 137 -152 -82 138 -31 -43 -169 -77 -141 76 49 59 166 -59 94 22 24 -134 107 -84 84 17 0 17
$$ packed form
3017H6l55L34j55J03K3J5l7J88j62m3K55l96K45k81J92p8K11j50o8m2R3J96j31
3040D3j6r3lk08L78j07K09j07j43N4K22k56K9j21Q1JP3N5j64R8p3J25M1j17P6
3065G7N6k06K03J40l14n6k3K29M4p2k87N6L34J8j09j41J25n6p5l6j28J87J49N8
3089A73k57k1K26j74J92k78J50m8J40j58M9rN1j21J92j95O0P1k6j30K03r9M1q6
3113e4O4j55J17N5P8k19j37J88K1J19m5j46Q1J16j31J70k75K41j46p7K17j08P
3136a9P2p1q8L42lp4k20Oj64J94K6k6O1K9R3K0j38Pj17J54j39n9KK92j60O0L5
3163A15j76J59j89J52r1k1N3o6%L3k04K57j30K00L3k7j79QR5j9r5J03Pj28J01
3188iP8O8k89P0K20j69j2j26R2o4K17k7J0J07k25J53p2Kj58K41j91J68o7j7J7
$$ plain form
3213 17 -53 -96 49 -113 -96 48 -55 -68 -96 87 -137 -14 -76 -36 -32 52 -26 -74 -149 -55 -13 -169 -13 -26 -129 73
3239 73 105 -125 -152 56 52 53 -151 36 -3 -9 80 -174 63 103 -141 -133 34 -54 -64 -77 -37 207 103 13 -155 -5
3265 -5 108 33 -85 -135 128 167 25 -20 -85 -106 50 -22 130 -143 -141 -88 30 -162 -85 130 34 -38 -30 -62 -56 -20 -34
3292 -34 -70 82 -229 -61 76 -14 214 -84 -119 -102 107 -35 37 185 -25 121 112 38 119 -200 23 15 87 33 -49
3317 -49 133 35 76 -3 107 -7 56 123 45 -82 -30 -99 220 -114 129 38 227 -93 38 -36 -189 -110 -21 35 -185
3342 -185 -79 39 -204 -58 165 -61 -106 90 -116 -206 66 -3 186 -46 127 41 27 87 21 -126 89 2 49
3365 49 167 25 -67 9 4 -96 94 143 55 100 16 22 172 200 107 -32 164 -80 -36 -29 -94 53 90 16 -136 23
3391 23 37 56 -96 -8 -1 66 37 15 -114 -199 -5 0 30 30 -188 191 32 -84 173 216 -77 44 -77 -213 79
$$ packed form
3213A7p0m3J45j62J7J44j03j3k8J83k24J23o2M0MQ4p8m8p5R4M2j56J56j3j03K02
3239G3L2k30k7K08mJk04J87l9oQ9k54K37M0k44QJ67q8j0j3M0K44j04r0j68J50
3265eJ13p5j18n0K63L9j42m5o5k1J56p2J52k73KN3J18j92P7K15r6p2Ql2OL6j4
3292c4l6J52l11J68J37r0K28k98l5J7K09j42P2J48k10J46rp4Q1l19K23qP2n4q2
3317d9J82r8M1p9J10j14O3O7p8j27N2o9L19l34K43r1J89l20J31p4j53P9Q9N6k20
3342a85J06J18k43J46K23k26m5J96k06r0K72o9J89k32J73q6j4O0o6j47K15q7M7
3365D9J18j42r2P6nj00J90M9q8M5q4OJ50K8r3j39J96k44M4Po5J47L7p4j52J59
3391B3J4J9j52Q8PO7k9k2j29q5J94NL0%k18L79j59j16K57M3k93J21j21j36K92
$$ plain form
3416 79 70 -87 -31 47 -244 -73 -139 -6 -88 -2 39 -67 -48 36 19 138 63 -252 -47 26 -3 -115 -60 113 -191
3441 -191 21 -85 28 84 103 68 -44 43 -50 195 -57 122 -168 96 38 157 145 -74 -12 95 -46 3 176
3464 176 -129 1 -126 78 -78 -31 64 78 -203 94 -132 -11 1 18 -2 178 -22 56 280 -7 123 -67
3486 -67 -118 -27 -44 -142 -168 174 30 28 125 188 27 -87 -113 168 -116 59 -56 20 -49 55 -218 -95 -157 -3 71
3511 71 43 24 68 -61 -97 -6 14 6 -140 18 -85 -32 128 -61 -86 -81 -103 -26 -28 134 -4 131 -48 -25 -10 236
3537 236 102 213 -44 170 74 -22 28 -149 40 163 111 -92 74 -175 52 90 -17 -36 39 -61 142 68 127
3560 127 79 4 227 -5 35 -83 -86 -28 -121 -94 153 21 109 246 -4 76 96 -80 137 -127 -105 -46 69 -167
3584 -167 -4 -27 -27 -28 -124 -85 -73 -53 -72 59 99 77 63 2 18 -21 -29 -29 -54 137 -181 -24 -103 -189 66 37 -69 -45
$$ packed form
3416G9rj57N6P8k91J71o6J33q2Q6M1j06J9Q4j7J19p5l15K05P3k9j12N5J73l04
3441a91K12j06J13N6J9l5j12Q7r3K45k52J79k90K64n8J19j2k19O2J07j41M9J73
3464A76l05J30j27K04j56M7R5J4k81K97k26J21J2J7k0J80k00P8K24k87J30j90
3486f7n1R1j7r8k6L42j44kR7O3j61j14k6K81k84J75j15P6o9J04k73J23o2J54P4
3511G1k8j9M4j29l6R1K0qj46J58j03N3J60j89k5Nk2P7kJ62j38J35j79K3J5K46
3537B36j34J11k57K14r6r6N0j77J89J23n2k03J66k49K27L8j07j9P5j00K03p4N9
3560A27m8p5K23k32M0j18lN8r3K7K47j32Q8J37k50Q0K0j76K17k64K2N9J15k36
3584a67J63k3%jr6L9J2K0j9J31M0k2j4o1J6l9q%k5J91l18J57p9q6K55k9j06K4
$$ plain form
3612 -45 70 -50 5 49 127 -72 26 61 157 152 78 68 136 147 -43 -124 -17 -12 -143 58 221 -39 -14 70 -42 -87
3638 -87 45 -95 -66 125 -119 -63 -158 56 -147 16 -200 -27 12 -37 -12 -192 7 106 -61 -84 74 66 41 -17
3662 -17 14 45 91 40 -92 138 -106 -53 -12 55 53 132 24 52 -126 -141 -58 200 163 -12 -29 173 -70 -114 214 45
3688 45 152 -2 61 60 -156 38 -45 50 99 83 45 -46 -127 -8 106 -135 -17 -11 -24 -266 -52 -17 -105 -37 86 64
3714 64 55 74 22 0 -74 122 -38 111 23 252 143 -96 127 -1 5 118 28 -39 -30 65 -2 37 10 188 110 17 -46
3741 -46 198 63 -33 161 148 162 80 118 99 252 -138 -283 -47 27 -55 122 -24 -16 -88 -67 64 -68 11 44 -201
3766 -201 5 173 -37 -49 -192 -128 85 -134 0 194 -27 257 -9 82 220 93 71 7 -152 -83 -31 143
3788 143 -88 137 72 91 -88 -36 122 56 238 -61 93 37 152 47 101 14 70 -30 73 89 -38 -18 -79 -61
$$ packed form
3612d5J15j20N5M4P8j99R8L5R6np4j0O8J1j90q1J07Nj31K01J63k60K5Q4j12m5
3638h7J32j40K9J91k44N6r5K14k03J63k16J73L9m9K5j80J99R9j67k3J58qk5n8
3662a7L1L1M6n1j32K30k44N3M1O7kP9j08K8j78j5Q3K58l7j75j7K02k43m4L28j69
3688D5J07j54O3jk16J94q3R5M9j6l8r1q1J19J14k41J18Oj3k42K14L5q8O8J23k2
3714F4rJ9n2k2p4J96j60J49q8K29j09k39K23j28OJ13r0o7RR5o7L9k7J78p8r3o3
3741d6K44j35r6J94j3J4q2L8j9J53l90j45K36P4q2J77j46Qp2K1J31j32P9L3k45
3766b01K06J68k10j2j43O4K13k19J34J94k21K84k66R1J38j27k2o4j59O9N2J74
3788A43k31K25o5J9j79N2J58o6J82k99J54n6J15j05N4q7N6j00J03J6j27K0o1J8
$$ plain form
3812 -61 -33 -29 -46 88 9 -102 -15 -247 9 -59 102 64 21 55 228 -113 146 187 -204 13 -86 -39 -142 47 154
3837 154 21 -44 64 63 -58 48 46 58 -112 179 -19 -16 -101 -86 202 -58 15 -45 -46 110 -139 -89 111 36 96 -150
3863 -150 4 48 23 138 -44 -43 -71 -110 146 90 135 -22 -128 130 186 -77 220 110 21 -54 8 136 -225 14
3887 14 9 5 -58 5 78 10 -155 30 69 41 64 -75 -109 -34 59 119 157 1 -140 111 121 73 -54 -36 -2 -98 -10 2
3915 2 -89 -28 -72 81 115 -33 -71 176 136 -40 -77 -280 41 36 173 105 82 184 26 87 -182 22 176 -112 -71
3940 -71 10 -91 43 29 12 16 -44 -83 -286 159 60 89 22 -60 38 -164 -183 147 -67 -84 78 68 47 -12 53 60 -27
3967 -27 -197 -102 -1 -62 -25 -47 -144 144 62 -42 4 54 -94 -103 -139 120 121 53 76 -100 -163 -76 203 91 121 161 -27
3994 -27 -31 -61 20 108 -112 -48 -53 -204 67 -52 -121 54 -23 -70 -41 52 -82 -48 -8 140 139 28 -32 -47 -155 -76 -14
$$ packed form
3812f1K8Mj7J34p9j11Q7k32K56o8J61l8m3L4J73l41K59M1l91K17r9M7j03J89J07
3837A54j33o5J08jj21J06kJ2j70K91j98Lq5J5K88k60P3o0jJ56k49N0K00p5O0k46
3863a50J54M4k5J15j82Jk8l9K56n6M5j57j06K58N6k63K97j10q9p5O2J28l61K39
3887A4nmo3O3P3o8j65J85L9k8K3j39l4P5R3O0L8j56j41K51J0m8j27J8L4r6Q8J2
3915Br1O1m4J53L4j48l8K47m0j76l7k03L21nJ37o8k3J02j58O1k69K04J54k88M1
3940g1Q1j01J34j4j7Mo0l9k03M45r9K9o7q2R8k02j9L30k14j7J62j0k1n9O5Pq7
3967b7j70R5J01o1L7k2r7K88q2j04M6N0j48rl6K59Jo8K3j76o3Q7K79j12L0M0j88
3994b7ml0Q1Q8k20O4nj51K71j19o9J75p7m7K9R3j34L4M0J48jj11o0j5j08P9O2
$$ plain form
4021 -14 -41 -181 -20 60 126 147 2 94 24 71 -88 58 90 -187 -88 73 -33 -97 -10 45 -97 185 -41 102
4045 102 -36 -153 198 -149 54 12 28 -77 15 -156 -10 -30 -124 -117 81 26 108 48 160 176 129 74 -27 182
4069 182 -19 -168 -211 -24 -1 14 76 -97 19 146 105 -115 -101 12 29 -12 51 -41 -67 -52 32 16 15 43 148 -49
4095 -49 179 -106 -43 153 18 88 -19 -1 -160 69 29 13 -62 75 -117 -139 126 -84 84 14 44 -79 87
4118 87 70 -24 118 22 69 207 -8 -10 -16 -115 99 -76 187 -80 -165 -116 -12 22 25 -131 108 -5 -26 108 87 -13
4144 -13 -170 -16 -31 119 133 0 117 -22 -135 -3 -166 -104 -79 -18 28 -225 -164 -112 -108 -36 95 -145 -96 149
4168 149 -25 56 65 180 -36 -21 -225 -113 -81 -195 22 207 25 -49 -9 -66 -58 34 -65 113 -16 -19 13 -12 -131
4193 -131 75 45 -36 -36 -175 218 -150 -75 -195 -39 82 97 -22 -5 -129 -45 21 5 -82 -18 168 52 -37 53 -95
$$ packed form
4021a4k7j40J61Q0O6K1j45R2p0M7j59J46L2k77R9J61j06o4Q7N5j42K82k26J43
4045A02j38j17L51l47K03m2J6j05R2j71J46k0r4PJ98n5Q2o0J12J6m7n5j01K09
4069A82k01j49m3J87K3J5O2j73J16J27m1k20J4J13J7m1O3r2k6J5Q4j6jK8J05j97
4095d9K28k85O3J96j35P0j07J8j59K29m0j6p5J37j92k2K65k10J68p0L0j23J66
4118H7j7r4J42r6M7J38k15kor9K14j75K63k67q5M9J04L4Lj56K39j13k1J34k1j00
4144a3j57J54j5J50J4j33J17j39j13J32j63O2K5O1M6k53O1N2MP2J31k40M9K45
4168A49j74Q1RJ15k16J5k04J12L2j14K17J85j82p4M0n7QR2r9J78j29lL2k5j19
4193a31K06l0q1%j39L93l68P5j20J56J21J5j19J7j24Q4O6j6q7O4J86j16q9R0j48
$$ plain form
4218 -95 6 66 -35 -53 -165 -99 85 -76 32 -33 -100 17 128 35 61 90 -84 -59 147 -414 -111 -24 89 -28
4242 -28 -38 49 -26 4 -129 -33 37 -78 29 11 -214 -75 28 -232 -23 78 -66 -214 162 102 244 28 105
4265 105 -81 -62 63 201 -212 -120 -16 -199 -35 -114 -13 -68 -15 57 75 -37 19 73 -73 -190 -85 126 -134
4288 -134 27 -65 -11 71 33 -131 -26 -62 -71 -37 -183 65 75 -36 19 -173 -201 -14 -95 70 -37 74 65 -226 -30
4313 -30 -41 -87 -170 -16 -12 116 55 -73 75 60 -109 30 31 -106 -117 37 -103 -56 2 -101 145 -210 88 23 -86
4338 -86 -145 -60 124 -110 160 60 -141 40 56 -57 55 -127 -2 -164 9 60 166 -104 63 32 7 -14 -78
4361 -78 59 112 273 10 -110 -20 -24 2 22 -76 8 3 206 -78 -40 -33 27 8 -8 -54 -111 16 74 140 -68 40 -148
4388 -148 -50 2 25 46 68 -31 71 11 -118 16 -108 20 53 10 88 135 -55 -36 -88 -104 -66 -131 -37 0 182 35
$$ packed form
4218i5J01O0j01j8j12O6J84j61J08o5o7J17J11r3K6K9j74K5K06n61L03Q7J13j17
4242b8j0Q7p5L0j33R6P0j15J07j8k25J39J03k60K09J01j44j48L76o0J42k16P7
4265A05j86J9J25J38m13R2J04j83J64p9J01n5N3P2J8j12N6N4j46j17J05K11k60
4288a34J61r2N4Q2l8j64J05l6rL4j46K48J0j11N5j92k8J87q1J65j07J11rk91J96
4313c0j1m6q3J54MJ28o1j28J48j5j69J39Jj37j1J54j40M7N8j03K46l55K98o5j09
4338h6n9Q5J84k34K70j00k01J81J6j13J12j82J25j62J73N1J06k70J67l1k5k1o4
4361g8J37N3J61k63j20R0mK6K0r8Q4nK03k84L8PO0j9j6m6n7J27N8O6k08J08j88
4388a48R8N2K3K1K2r9J02o0j29J34j24J28L3m3P8M7j90J9n2j6L8o5R4L7J82j47
$$ plain form
4414 35 -126 193 15 56 -66 -97 23 -13 -87 -47 44 106 82 86 -29 -157 194 60 40 -33 -48 -17 -31 92 143 53
4440 53 88 -68 87 94 -25 48 60 46 -51 63 -12 46 -40 8 -1 -14 -17 31 12 11 -108 -84 70 -55 -143 0 -146 -111
4468 -111 -82 -20 -152 96 61 -144 191 -24 69 46 -1 29 89 -87 -26 125 -92 85 4 8 23 -183 -4 -4 191
4493 191 -38 -38 -4 -146 190 -166 -281 -67 21 -29 -13 29 -82 -58 62 67 -66 61 -134 102 -66 -32 8 -63
4517 -63 3 -151 108 -2 141 41 -37 -47 -59 -39 179 100 -119 -43 -101 71 -86 -57 117 75 -100 25 102 -25
4541 -25 -33 59 -22 45 -2 5 7 47 -183 -34 -83 37 -1 97 178 90 15 -8 -2 -94 -35 131 38 -84 81 -100 183 10
4569 10 45 81 -134 129 145 -118 -149 121 -1 -20 19 82 -44 81 -128 112 181 70 124 82 27 -13 -30 -5 -55
4594 -55 -164 153 -132 -145 129 -162 5 76 -5 50 -7 -8 66 95 87 108 57 75 61 -27 27 53 -45 -128 -24 79 -48
$$ packed form
4414C5j61L19j78M1j22l1J20l6p4M0R1O2k4Mj15j28L51j34k0p3j5L1j4J23N1r0
4440E3L5j56J55Pj19P3J2j4r7J14p5N8q6M8rj3lM8j9jj19K4J54j25q8J43j46L5
4468a11K9O2j32K48l5k05L35k15R3k3m7L0O0j76O1J51k17J77q1MJ5k06J79%J95
4493A91k29%L4j42L36l56j15K14Q8n0J6M2j11K4J20Nj33J27j95K36j68L4M0p1
4517f3O6j54K59j10J43j00p8j0j2K0K18p9k19P6n8J72j57K9J74m2j75J25P7j27
4541b5qR2q1O7m7PKM0k30J49m9J20l8R8Q1q8p5k3Or2N9J66r3j22J65j81K83j73
4569A0L5L6k15K63J6k63l1K70j22j9L9O3j26J25k09K40O9j11N4m2n5m0j7K5n0
4594e5j09L17k85j3K74k91J67P1q1N5n7jP4K9qK1n1J8j4q8N4K6r8q3J04J03j27
$$ plain form
4621 -48 -61 -61 -145 212 -59 -156 70 -62 -27 -187 15 15 53 178 210 -26 36 34 -67 -2 -62 136 -37 135 91 -20
4647 -20 100 140 41 188 53 135 263 77 -15 35 -201 75 58 220 -35 74 69 -41 176 186 57 -38 -16 -31
4671 -31 -111 -48 134 -65 33 -208 41 46 -26 5 -52 70 -118 -98 73 33 -28 20 -71 104 92 -139 30 104 140 -47
4697 -47 -109 123 68 -61 114 -14 22 -21 146 -38 17 249 -5 -179 -98 -37 158 45 52 38 11 164 31 49
4721 49 72 96 61 105 154 37 -110 229 107 -92 109 -177 -121 105 92 291 48 -6 -50 -11 81 6 57 -56 -85
4746 -85 117 181 227 107 -75 -71 85 147 26 -44 -39 -10 147 -53 -95 39 42 41 -17 24 92 -58 -196 -236 -242 -30 106
4773 106 -100 27 80 88 95 -90 -87 34 9 101 -148 -5 -134 -11 -3 3 -75 77 137 -78 16 -36 -143 -15 2 -44
4799 -44 -15 -72 -148 -31 -81 -96 5 75 24 10 -62 -60 -110 162 -258 105 -241 168 123 48 -86 3 91 -42 106 -275
$$ packed form
4621d8j3%q4L57k71r7K26j32L5j60K02%L8J25L2k36O2kj01O5o0J98j73J72m4j11
4647b0J20M0r9J47j35Q2J28j86r2N0k36K76j7J62k55J09nj10K17J0j29r5K2j5
4671c1q0O3J82j99R8k41K49Np2L1n7J22j88K0J71m0o1M8r1J75j2k31J69P4L6j87
4697d7o2K32n5j29J75j28L6m3J67j84N5K32k54j74Q1O1J95j13Pj4k7J53j33J8
4721D9K3K4l5M4M9j17j47L39j22j99K01k86N6K26j3J99k43n4m4L9R2p5N1j13k9
4746h5K02O4M6j20j82MJ56O2j21p0NK9J57k00m2J34Ljn8M1O8j50j38m0oK12J36
4773A06k06J27N3QPj85LJ21k5R2k49J43j29J23QOp8J52O0k15R4n2j07J28J7m6
4799d4K9n7p6J17n0j5J01P0n1j4p2Kn0K72m20L63l46M09m5p5j34Q9Q8j33J48l81
$$ plain form
4825 -275 -52 -9 36 -107 -72 -22 109 164 -15 10 75 -121 57 -115 117 -38 8 75 56 -166 -39 -1 12 151
4849 151 109 41 -52 -51 -40 -101 -147 -26 5 138 139 67 -188 9 65 0 -1 114 6 11 -133 31 -40 44 3 -24 65 -166
4877 -166 116 -165 5 151 105 -82 34 116 -104 -175 -34 61 -167 -117 -228 -105 199 5 152 -51 159 -8
4899 -8 -31 106 177 179 -90 -46 -69 4 -13 52 182 5 -22 4 -6 183 -102 -47 3 69 -9 -14 -71 79 100 8 -8 57
4927 57 11 -179 146 184 -58 -311 43 -68 -21 204 -54 -137 -20 53 63 -60 123 -33 -15 150 97 113 -159
4950 -159 35 -40 -43 -175 -15 70 -79 -39 -100 63 141 -23 60 -37 194 -2 7 112 -144 4 46 13 158 -96
4974 -96 132 104 194 37 51 66 34 -20 -105 -145 -97 43 -138 25 -79 -102 49 -29 -21 -12 -166 -191 -19 69 -133 46
5000 46 -39 -138 -182 -42 -36 -155 45 -150 -2 -39 233 -88 185 27 -114 -21 218 -90 -83 105 6 -49 -56 -50 34 25
$$ packed form
4825b75K23M3M5j43L5N0J31N5j79K5O5j96J78j72K32j55M6O7j9k22J27L8J3J39
4849A51m2o8r3JJ1o1m6J21L1J33Jp2k55J97N6o5jJ15j08Nj44J64p1Q4m1k7Q9k31
4877a66K82k81J70J46m6j87J16Q2k20p1J41R5k28N0j11J23L04j94J47k03K10j67
4899hk3J37P1Kk69M4k3P3j7O5J30j77k7K6j0J89k85N5N0O6p8nn7J50K1r2j6O5
4927E7m6j90L25L8k42k53L54j11M7K25k58q3J17P3J0j23J83j56J8J65n3J6k72
4950a59J94p5lj32J60Q5j49M0o1J63P8j64Q3r7K31j96RJ05k56J48M2l3J45k54
4974i6K28k8R0j57J4J5l2n4q5m0M8J40j81J63j04k3J51p8QRj54k5J72Q8k02J79
5000D6q5r9m4J40Oj19K00j95J48l7K72l21K73j58j41R3K39l08PJ88r9n5pOQ4r
$$ plain form
5026 25 -8 -114 -174 125 -58 -116 -76 -1 131 -174 -58 -30 46 -27 30 117 -77 194 47 132 -23 180 -78 85
5050 85 -82 42 -69 -122 -120 108 166 -5 72 0 -30 102 -35 65 -124 57 -133 125 2 -17 -55 19 190 -66
5074 -66 2 228 -26 42 81 -35 86 -68 36 -66 87 -20 -2 -127 123 -77 -72 -20 -34 48 -73 161 -112
5097 -112 2 -56 48 -6 82 -152 -37 -78 -3 10 303 181 -201 -3 -26 -42 -24 44 -9 96 3 156 -21 34
5121 34 -97 72 142 37 -40 266 118 189 -31 20 153 -218 -102 23 46 -3 -33 33 -43 35 -97 -22 19 31 170
5146 170 -84 56 -153 39 45 130 -93 -177 -27 97 -4 -7 140 186 -41 -48 -282 199 42 40 -39 51 118 -134 -30
5171 -30 69 42 134 164 -75 -64 18 161 -50 83 -128 -68 -31 -170 124 -113 -108 -35 25 257 -197 -118 -25 54 -30 -97
5197 -97 119 -17 -62 18 -131 160 173 20 202 36 298 -72 4 -114 -102 28 216 64 -60 -29 -101 127 183
$$ packed form
5026B5l3j06o0K99j83n8M0P5J32l05J16K8P6p3N7Q7j94K71j47Q5j55K03k58J63
5050H5j67J24j11n3KK28N8j71P7p2l0J32j37J00j89J81j90K58j23j9l8P4J71k56
5074f6O8K26k54O8L9j16J21j54J04j02J53j07J8j25K50k00NN2j4Q2j21K34k73
5097a12J14n8J04n4Q8k34J15m1P5J3K93j22l82J98k3j6J8O8n3J05r3J53j77N5
5121C4j31J69P0j05p7L06j48P1k20N1J33l71J16J25K3m9l0O6p6P8j32P5M1J2J39
5146A70k54J40k09J92OQ5k23q4J50J24j01lJ47M6k27pk34M81j57kp9R0O7k52J04
5171c0R9k7R2L0k39J1Q2J43k11J33k11O0L7j39K94k37NP3O0K32m54P9R3P9q4o7
5197i7K16j36m5Q0j49K91J3j53J82j66K62l70P6j18J2J30J88j52j24L1p2K28N6
$$ plain form
5220 183 -118 -97 -39 -132 31 54 152 -61 -132 -24 -67 8 -214 -183 45 -26 -51 -55 192 -20 -129 -109 -49 -63 -99 -14
5246 -14 -73 12 -11 21 53 26 -1 -61 -73 -24 -230 26 -242 -103 43 162 98 1 -152 28 -133 98 116 49 70
5271 70 17 -15 115 95 18 197 62 28 33 16 71 -85 -33 131 40 -100 121 -205 97 -163 -30 117 -111 -79
5295 -79 -57 126 -114 1 -49 -17 -14 -47 -36 -82 -13 11 126 38 68 24 -25 36 -53 -81 58 25 74 36 -156 23 12
5322 12 40 32 -91 -39 155 13 59 -50 175 9 49 39 -87 -14 33 -77 -81 25 82 40 -139 -183 -146 62 279
5347 279 -10 196 -52 -43 171 7 99 57 93 93 -96 276 46 103 -138 6 31 -81 -118 -118 136 25 168 124
5371 124 126 -83 33 192 87 191 74 -49 73 136 40 137 65 -81 -58 83 -40 -91 126 -21 159 -166 53
5394 53 -43 2 -5 -68 75 59 -15 49 4 118 131 151 23 -40 81 -39 -104 -119 -25 -182 76 -65 -208 27 -187
$$ packed form
5220A83l01K1N8r3J63K3R8k13p1J08m3P5k22L1K28p1k5mK47k12j09K0O0j4l6Q5
5246a4n9Q5k3L2L2k7k7o0j2M9k06K56k68J39J46J19o4r7j53J80j61K31J8o7K1
5271G0n3l2J30k0p7J79j35l4Nj7N5j56N2J64r1j40K21l26L02k60J33J47k28L2
5295g9K2J83k40J15n0L2Ll3J1m6O9K4J15q8L0m4m9O1q9k8J39l3M9l8j92J79j1
5322A2K8qj23N2J94j42M6j09K25j66M0j0j26P3M7j10mJ06N7m2j79m4L7K08K17
5347B79k89K06k48RK14j64R2m2L6%j89L72k30N7k41J44K5j12l7%K54j11J43m4
5371A24Kk09J16J59j05J04j17j23J22O3r6R7p2j46K3J41j23n1K17j47J80l25K19
5394E3r6M5po3J43j6p4O4m5J14J3K0j28o3J21j20o5j5R4j57K58j41j43K35k14
$$ plain form
5419 -187 -26 -93 -46 144 82 83 16 -124 -23 -113 -83 46 150 -78 45 -97 -124 72 78 163 -155 -240 162 24
5443 24 113 190 -76 -12 52 93 -50 -14 -11 8 27 -26 -3 -20 -40 47 11 -14 41 93 -71 -25 -287 -160 82 -122 -112
5470 -112 -60 141 58 28 -37 -111 8 166 26 49 80 -19 79 -66 8 -51 -120 17 178 -7 -3 34 102 76 -135 95
5496 95 6 -31 -84 -46 -61 -155 -122 262 -49 -102 -45 -79 -232 47 123 9 172 196 104 61 -82 48 -92 107 -86
5521 -86 27 45 113 -5 -74 82 135 77 -29 62 72 175 56 72 11 -25 73 -109 -101 -23 106 -23 85 -23 120
5546 120 74 -57 -10 21 -27 -120 -21 22 32 -92 136 31 -7 -56 -81 152 55 88 -96 121 78 69 -155 -196 -64 45
5572 45 100 -9 -45 131 -38 82 -22 -47 174 171 79 148 -160 -4 54 -170 -10 -105 -4 -17 -13 -29 -121 -95 -100 -166
5598 -166 29 -153 -164 -68 -42 -167 9 -116 -84 -6 114 152 -89 -33 155 -112 -31 143 -18 -11 -2 43 31 77 65
$$ packed form
5419a87J61o7M7J90o2Jo7j40J01r0L0J29J04k28J23j42k7J96OQ5l18q5M02j38
5443B4Q9P7k66O4O4M1j43L6LJ9J9n3K3j7k0Q7l6k5N5N2j64M6k62J27K42k04J0
5470a12N2K01q3l0o5p4J19J58j40K3L1r9R8j45P4n9o9J37J61j85ML7O8k6k11K30
5496I5q9l7n3L8j5r4L3L84l11n3N7l4j53K79P6j14J63K4r2m3j43J30j40J99j93
5521h6J13J8O8j18o9J56N3n8j06R1J0J03j19J6o1l6R8j82QP8J29j29J08j08J43
5546A20m6j31M7L1m8r3R9M3J0j24K28j05l8m9k5K33r7L3j84K17m3rk24m1J32J09
5572D5N5j09l6J76j69J20j04k5K21lr2O9l08J56N8k24J60r5J01j3Mj6r2K6no6
5598a66J95j82j1R6K6j25J76j25L2P8J20L8k41N6J88k67Q1J74j61PRM5j2M6j2
$$ [...]
8191a79
##END NTUPLES=NMR FID
##END=
