##TITLE=1H_TG-2252
 CDCl3, 8 sc, 
 29.8.2019
##JCAMPDX= 6.0         $$ Bruker NMR JCAMP-DX V2.0
##DATA TYPE= NMR FID
##DATA CLASS= NTUPLES
##ORIGIN= UXNMR, Bruker Analytische Messtechnik GmbH
##OWNER= root
$$ XWIN-NMR		Version 3.5
$$ Thu Aug 29 13:46:52 2019 Russian Standard Time (UT+4h)  she@DPX200
##.OBSERVE FREQUENCY= 200.13155
##.OBSERVE NUCLEUS= ^1H
##.DELAY= (6, 6)
##.ACQUISITION MODE= SIMULTANEOUS
##.ACQUISITION SCHEME= undefined
##.AVERAGES= 8
##.DIGITISER RES= 18
##SPECTROMETER/DATA SYSTEM= spect
##.PULSE SEQUENCE= zg30
##.SOLVENT NAME= CDCl3
##.SHIFT REFERENCE= (INTERNAL, CDCl3, 0, 15.7039)
##AUDIT TRAIL= $$ (NUMBER, WHEN, WHO, WHERE, WHAT)
$$ ##TITLE= Audit trail, XWIN-NMR		Version 3.5
$$ ##JCAMPDX= 5.01
$$ ##ORIGIN= Bruker BioSpin GmbH
$$ ##OWNER= she
$$ F:/spectra/data/she/nmr/H-F/1/audita.txt
$$ ##AUDIT TRAIL=  $$ (NUMBER, WHEN, WHO, WHERE, WHAT)
(   1,<2019-08-29 13:45:46.98 +0400>,<she>,<DPX200>,
      <created by zg, POWCHK disabled, PULCHK disabled
       configuration hash MD5:
       00 E9 B6 7A A2 85 ED C7 34 08 36 98 17 FE 4E 26
       data hash MD5: 16K
       B4 7C 3F BD CC 1C 3B 55 65 28 5E 67 C4 CC 94 8C>)
$$ ##END=
$$ 
$$ hash MD5
$$ 57 F1 3E 46 94 AE AB 49 A7 16 90 42 55 68 73 04
##$RELAX= 
##$RELAX= 
##$RELAX= 
##$RELAX= 
##$RELAX= 
##$RELAX= 
$$ Bruker specific parameters
$$ --------------------------
##$DU= <F:/spectra>
##$EXPNO= 1
##$NAME= <H-F>
##$PROCNO= 1
##$TYPE= <nmr>
##$USER= <she>
##$AMP= (0..31)
100 100 100 100 100 100 100 100 100 100 100 100 100 100 100 100 100 100 
100 100 100 100 100 100 100 100 100 100 100 100 100 100 
##$AQSEQ= 0
##$AQ_mod= 1
##$AUNM= <au_zg>
##$AUTOPOS= <>
##$BF1= 200.13
##$BF2= 200.13
##$BF3= 200.13
##$BF4= 200.13
##$BF5= 200.13
##$BF6= 200.13
##$BF7= 200.13
##$BF8= 200.13
##$BYTORDA= 1
##$CFDGTYP= 0
##$CFRGTYP= 5
##$CHEMSTR= <none>
##$CNST= (0..31)
1 1 145 1 1 1 1 1 1 1 1 1 1 1 1 1 1 1 1 1 1 1 1 1 1 1 1 1 1 1 1 1 
##$CPDPRG= <>
##$CPDPRG1= <>
##$CPDPRG2= <>
##$CPDPRG3= <>
##$CPDPRG4= <mlev>
##$CPDPRG5= <mlev>
##$CPDPRG6= <mlev>
##$CPDPRG7= <mlev>
##$CPDPRG8= <mlev>
##$CPDPRGB= <>
##$CPDPRGT= <>
##$D= (0..31)
0 1.2 0 0 0 0 0 0 0 0 0 0.03 0 0 0 0 0 0 0 0 0 0 0 0 0 0 0 0 0 0 0 0 
##$DATE= 1567071946
##$DBL= (0..7)
120 120 120 120 120 120 120 120 
##$DBP= (0..7)
150 150 150 150 150 150 150 150 
##$DBP07= 0
##$DBPNAM0= <>
##$DBPNAM1= <>
##$DBPNAM2= <>
##$DBPNAM3= <>
##$DBPNAM4= <>
##$DBPNAM5= <>
##$DBPNAM6= <>
##$DBPNAM7= <>
##$DBPOAL= (0..7)
0.5 0.5 0.5 0.5 0.5 0.5 0.5 0.5 
##$DBPOFFS= (0..7)
0 0 0 0 0 0 0 0 
##$DE= 6
##$DECBNUC= <off>
##$DECIM= 24
##$DECNUC= <off>
##$DECSTAT= 4
##$DIGMOD= 1
##$DIGTYP= 9
##$DL= (0..7)
0 120 120 120 120 120 120 120 
##$DP= (0..7)
150 150 150 150 150 150 150 150 
##$DP07= 0
##$DPNAME0= <>
##$DPNAME1= <>
##$DPNAME2= <>
##$DPNAME3= <>
##$DPNAME4= <>
##$DPNAME5= <>
##$DPNAME6= <>
##$DPNAME7= <>
##$DPOAL= (0..7)
0.5 0.5 0.5 0.5 0.5 0.5 0.5 0.5 
##$DPOFFS= (0..7)
0 0 0 0 0 0 0 0 
##$DQDMODE= 0
##$DR= 18
##$DS= 0
##$DSLIST= <SSSSSSSSSSSSSSS>
##$DSPFIRM= 0
$$ [...]
##$SUBNAM2= <"">
##$SUBNAM3= <"">
##$SUBNAM4= <"">
##$SUBNAM5= <"">
##$SUBNAM6= <"">
##$SUBNAM7= <"">
##$SUBNAM8= <"">
##$SUBNAM9= <"">
##$SW= 24.9336996594482
##$SWIBOX= (0..15)
0 0 2 0 0 0 0 0 0 0 0 0 0 0 0 0 
##$SW_h= 4990.01996007984
##$TD= 16384
##$TD0= 1
##$TE= 0
##$TE2= 300
##$TE3= 300
##$TEG= 300
##$TL= (0..7)
0 120 120 120 120 120 120 120 
##$TP= (0..7)
150 150 150 150 150 150 150 150 
##$TP07= 0
##$TPNAME0= <>
##$TPNAME1= <>
##$TPNAME2= <>
##$TPNAME3= <>
##$TPNAME4= <>
##$TPNAME5= <>
##$TPNAME6= <>
##$TPNAME7= <>
##$TPOAL= (0..7)
0.5 0.5 0.5 0.5 0.5 0.5 0.5 0.5 
##$TPOFFS= (0..7)
0 0 0 0 0 0 0 0 
##$TUNHIN= 0
##$TUNHOUT= 0
##$TUNXOUT= 0
##$USERA1= <user>
##$USERA2= <user>
##$USERA3= <user>
##$USERA4= <user>
##$USERA5= <user>
##$V9= 5
##$VALIST= <valist>
##$VCLIST= <CCCCCCCCCCCCCCC>
##$VD= 0
##$VDLIST= <DDDDDDDDDDDDDDD>
##$VPLIST= <PPPPPPPPPPPPPPP>
##$VTLIST= <TTTTTTTTTTTTTTT>
##$WBST= 1024
##$WBSW= 4
##$XGAIN= (0..3)
0 0 0 0 
##$XL= 0
##$YL= 0
##$YMAX_a= 186674
##$YMIN_a= -218779
##$ZGOPTNS= <>
##$ZL1= 120
##$ZL2= 120
##$ZL3= 120
##$ZL4= 120
##$ABSF1= 10
##$ABSF2= 0
##$ABSG= 5
##$ABSL= 3
##$ALPHA= 0
##$AQORDER= 0
##$ASSFAC= 0
##$ASSFACI= 0
##$ASSFACX= 0
##$ASSWID= 0
##$AUNMP= <proc_1d>
##$AZFE= 0.1
##$AZFW= 0.1
##$BCFW= 1
##$BC_mod= 2
##$BYTORDP= 1
##$COROFFS= 0
##$CY= 11.3945322036743
##$DATMOD= 1
##$DC= 2
##$DFILT= <>
##$DTYPP= 0
##$F1P= 20.1720416913024
##$F2P= 0.152960286110954
##$FCOR= 0.5
##$FTSIZE= 0
##$FT_mod= 4
##$GAMMA= 1
##$GB= 0.15
##$INTBC= 1
##$INTSCL= 1
##$ISEN= 128
##$LB= 0.24
##$LEV0= 0
##$LPBIN= 0
##$MAXI= 10000
##$MC2= 0
##$MEAN= 0
##$ME_mod= 0
##$MI= 1.114404
##$NCOEF= 0
##$NC_proc= 0
##$NLEV= 6
##$NOISF1= 3.799351
##$NOISF2= 2.8
##$NSP= 1
##$NTH_PI= 0
##$NZP= 0
##$OFFSET= 15.70392
##$PC= 1
##$PHC0= -9212.955
##$PHC1= 16.40096
##$PH_mod= 1
##$PKNL= yes
##$PPARMOD= 0
##$PSCAL= 0
##$PSIGN= 0
##$REVERSE= no
##$SF= 200.130013532006
##$SI= 16384
##$SIGF1= 3
##$SIGF2= 2
##$SINO= 400
##$SIOLD= 16384
##$SREGLST= <1H.CDCl3>
##$SSB= 0
##$STSI= 0
##$STSR= 0
##$SW_p= 3612.71676300578
##$SYMM= 0
##$S_DEV= 0
##$TDeff= 0
##$TDoff= 0
##$TI= <>
##$TILT= no
##$TM1= 0
##$TM2= 0
##$TOPLEV= 0
##$USERP1= <user>
##$USERP2= <user>
##$USERP3= <user>
##$USERP4= <user>
##$USERP5= <user>
##$WDW= 1
##$XDIM= 8192
##$YMAX_p= 0
##$YMIN_p= 0
$$ End of Bruker specific parameters
$$ ---------------------------------
##NTUPLES= NMR FID
##VAR_NAME=  TIME,          FID/REAL,        FID/IMAG
##SYMBOL=    X,             R,               I
##VAR_TYPE=  INDEPENDENT,   DEPENDENT,       DEPENDENT
##VAR_FORM=  AFFN,          ASDF,            ASDF
##VAR_DIM=   8192,          8192,            8192
##UNITS=     SECONDS,       ARBITRARY UNITS, ARBITRARY UNITS
##FACTOR=    0.0002004,     1,               1
##FIRST=     0,             0,               0
##LAST=      1.6414764,     0,               0
##MIN=       0,             -218779,         0
##MAX=       1.6414764,     186674,          0
$$ Real data points
##PAGE= N=1
##DATA TABLE= (X++(R..R)), XYDATA
0 0 0 0 0 0 0 0 8 -8 8 -8 16 -16 24 -25 32 -40 48 -57 66 -80 95 -109 127 -145 168 -192 219 -249 282 -319
30 -319 358 -403 451 -505 564 -629 698 -778 862 -957 1059 -1173 1298 -1438 1592 -1766 1961
47 1961 -2187 2440 -2740 3090 -3512 4027 -4677 5524 -6682 8368 -11064 16089 -28732 130924
61 130924 186674 20905 105610 140254 144909 135348 143277 106133 108589 93707 56683 19709 20040
74 20040 37365 87719 73858 -16755 -59908 -19719 -35780 -75959 -46181 -9154 -37233 -68802
86 -68802 -106429 -145527 -115240 -52732 -69653 -110826 -105405 -104920 -113532 -92722 -104202 -138747 -101856
99 -101856 -42542 -57658 -92688 -98163 -102422 -78942 -27651 -26341 -56690 -49751 -38960 -41732 -16052
112 -16052 258 -22924 -21610 -273 -6480 6491 34897 -478 -36213 13874 46387 4703
124 4703 -8724 14203 4417 349 23830 10308 -22897 -20736 -7212 1452 7634 -14198 -32249
137 -32249 -9792 -18490 -64993 -39706 23907 1527 -52264 -46640 -31226 -28947 -10387 -17564 -46845
150 -46845 -22242 19917 9272 -17741 -33442 -40316 9139 78605 52617 -19500 -9342 41689
162 41689 51712 47302 44903 42849 71071 95206 64392 39712 63011 78640 86635 106931 91852
175 91852 61493 84724 100961 57146 47473 96960 111482 85536 61663 31345 27318 73454
187 73454 83996 32961 11918 31842 36396 27359 6419 -30266 -23875 19375 14125 -23736 -35211
200 -35211 -49171 -63813 -32766 -15587 -55311 -68092 -42712 -55100 -79951 -65128 -57079 -65808
212 -65808 -58748 -58178 -67022 -53594 -55539 -85001 -70652 -30125 -37447 -53408 -38444 -45788 -64903
225 -64903 -40490 -15788 -25045 -23974 -18562 -28955 -21415 -8231 -22065 -15924 12675 -1274 -19919
238 -19919 12392 21016 -21741 -26561 10929 24800 23756 15670 -16114 -23336 11963 23894 8352
251 8352 6488 384 -4628 20439 21451 -23751 -25782 20180 30143 10839 3655 -10780 -13758 14160
265 14160 17002 -7180 8606 35100 14681 -6162 155 3665 18441 42317 25545 -1097 18204
278 18204 37203 23407 18256 18248 14864 44098 69358 30238 -7641 17998 47558 46912 42684 28343
292 28343 16053 37820 49627 22097 15521 33580 26792 24346 40761 23879 -2192 17631 30872
305 30872 5863 297 15911 11513 4065 255 -13207 -6838 11069 -10567 -33127 -10390 910
318 910 -19859 -18619 -12837 -37751 -40842 -15296 -16137 -28989 -23592 -29766 -39193 -28257 -30977 -44337
332 -44337 -27291 -13162 -31528 -31755 -17504 -38203 -54931 -30360 -12314 -13586 -9839 -23581 -46909
345 -46909 -33535 -13271 -22542 -20010 -2265 -9099 -17433 -10435 -25299 -37928 -9323 12547 2944
358 2944 -256 -3265 -22222 -16933 1123 -6619 -2950 27444 24139 -9306 -15263 -4889 1181 19701
372 19701 26458 9031 10812 24824 8716 -4275 10723 16126 21751 46730 39447 -2193 -3596
385 -3596 25303 28909 25291 30611 25751 27139 35028 15706 1404 25314 37903 24916 30167 33977
399 33977 9989 7623 27205 19408 7963 24279 29459 15451 10497 2491 -2967 16278 22741
412 22741 -1730 -3670 14904 3589 -9943 522 -3765 -15407 -537 5990 -11611 -13062 -7272
425 -7272 -17029 -14714 -4373 -17269 -21364 -3465 -8394 -24239 -14077 -9842 -24132 -18985 -7474
438 -7474 -14391 -12372 -4203 -19518 -25933 -7382 -8087 -20015 -6827 -263 -13837 -12262 -6451 -17881
452 -17881 -15002 527 -4639 -9057 263 -8464 -21017 -6276 -2489 -16641 -4892 10758 -7109
465 -7109 -20010 -9620 -8687 -9659 -1040 -6493 -12302 559 -2624 -20836 -12428 -661 -10764 -5344
479 -5344 10645 -5228 -20660 -4914 2578 -6526 -1100 3980 -261 6735 6813 -8874 -1817 18098
493 18098 10072 3107 19147 16551 2771 14077 21155 9744 16311 29229 21690 18112 23028 14605
507 14605 16332 32807 26324 12948 25736 31124 14318 15474 23836 14919 16123 26592 15355
520 15355 6286 15546 11400 665 10473 11854 -2590 1460 7957 -6744 -11717 -1391 -6761 -12489
534 -12489 -4634 -11656 -21421 -11043 -11762 -26944 -18768 -7255 -21107 -25610 -13961 -20042 -27935 -16638
548 -16638 -15043 -21449 -14481 -14005 -23060 -14007 -8034 -20315 -14459 2820 -7369 -17075 -2176 240
562 240 -10872 -2540 5754 66 3394 7167 -1658 1873 11909 3245 1969 17495 12211 -1935
576 -1935 8751 14705 1170 3289 14805 7675 4235 9696 1940 -2149 7339 2980 -4806 6601
590 6601 7093 -8541 -4551 3282 -8473 -10103 3095 -1876 -9218 -1650 -5196 -13471 -4221 -1071 -10706
605 -10706 -3381 5491 -6135 -8855 1819 -2372 -5578 6621 6355 -308 8317 9121 -1650 5890
619 5890 16129 7525 9384 22600 14346 5168 16034 17605 10412 17469 21858 14465 17556 18485 6115
634 6115 9472 21740 12409 5580 17470 13122 -2254 3137 7711 -2395 -1183 4967 -3695 -7778
648 -7778 -5763 -14796 -16169 -5115 -12135 -23990 -12513 -10804 -27604 -26685 -15613 -22522 -25103 -17227
662 -17227 -21847 -27660 -19995 -21439 -26253 -17607 -16122 -24278 -15822 -8353 -20032 -19028 -3684 -6725
676 -6725 -13176 -3757 -2019 -5759 3116 5997 -1957 4907 14066 5351 5950 17746 13766 10197 20275
691 20275 17827 9209 17072 22113 14841 18826 23655 13418 13882 21769 12662 7403 20473 20203 8162
706 8162 10498 11666 3234 6257 11190 3107 4446 10720 -230 -7753 1595 7 -7856 2760 5817
721 5817 -8574 -9289 -1751 -7131 -8953 -820 -2684 -3477 2041 -6648 -14177 -465 4386 -5930 -116
736 -116 8649 -1765 -5253 4987 2069 -1494 9377 11517 3322 5186 4627 -648 8138 14064 2826
751 2826 3327 13812 4935 -4445 3904 5054 298 5911 4895 -7362 -5468 -89 -8086 -8076 -781
766 -781 -8232 -13976 -6402 -11460 -22471 -14508 -7909 -16419 -17032 -14909 -22585 -21583 -13187 -19536 -23114
781 -23114 -12333 -13607 -23102 -17853 -13821 -19353 -13222 -6014 -13113 -13082 -5481 -10189 -11041 969 10
796 10 -5994 4214 7320 -3759 1338 13104 8941 7139 15277 13913 10367 15542 14427 12321 22077
811 22077 22550 12754 17785 23808 14196 13586 24124 19272 13197 21145 19564 9405 13000 16242 11169
826 11169 14143 15254 4274 5537 14657 5424 -2219 7060 8482 -198 2291 2061 -6219 -2583 3624
841 3624 -3588 -5536 -451 -5316 -7235 -539 -6147 -12830 -2272 3018 -8400 -9340 -3629 -7423 -6103
856 -6103 301 -6239 -9707 1058 190 -9864 -5948 -1785 -5898 -948 3203 -6098 -8379 -386 -2459
871 -2459 -5858 -304 -3594 -6788 1511 -554 -13214 -8673 1800 -4537 -7397 -1477 -6236 -11602 -4709
886 -4709 -5670 -11544 -6121 -3450 -9741 -6953 -5512 -14897 -12288 178 -4603 -11714 -5067 -5424 -11315
901 -11315 -6292 -2756 -7625 -3237 1692 -5380 -5058 627 -4662 -4843 8203 6393 -3883 1095 6484
916 6484 838 3485 10045 5515 5654 11949 7515 3177 9870 10387 7967 15740 14724 3096 6473
931 6473 15676 11224 9650 14989 10487 7788 14041 9063 1883 10761 17399 9173 8052 8441 629
946 629 2760 13068 9113 2308 6591 5842 -62 2020 836 -3656 5590 12227 -718 -8339 -2709
961 -2709 -3623 -4052 3614 1511 -6277 -2282 -1524 -11379 -10040 -3499 -4598 -597 3363 -10274 -19147 -8535
977 -8535 -3360 -8389 -4310 -1740 -8542 -8926 -8487 -15871 -13051 -1656 -1522 -4556 -3645 -12769 -19495 -7041
993 -7041 -40 -7827 -6052 362 -6019 -10723 -7807 -10612 -8202 4472 4208 -5479 -5838 -6049 -9525 -1243
1009 -1243 6351 -1144 -2183 5405 641 -6248 -1832 183 1739 10309 8979 -3477 -2352 5147 2435
1024 2435 3464 9531 4313 1247 9116 6561 -2355 2791 9442 7342 8529 7714 -2306 290 11973
1039 11973 8870 2325 6247 6216 2073 6398 6485 -25 5171 11851 5209 1221 3227 72 2332 13005
1055 13005 8518 -2957 1418 7168 947 1326 5658 2886 4567 8930 540 -6430 606 3532 3210
1070 3210 8522 4283 -7028 -3991 4597 -1171 -3768 3544 2942 -174 955 -5788 -11843 -2283 4580
1085 4580 -688 -1571 -1583 -10383 -9048 -708 -5707 -9763 -829 997 -7159 -9560 -11699 -13702 -4282 3136
1101 3136 -6373 -11183 -6581 -8863 -10671 -5683 -7270 -10024 -937 1505 -9762 -12904 -8056 -6589 -989
1116 -989 3743 -5080 -10306 -829 1041 -6632 -4023 862 269 4829 5369 -4541 -5686 4426 5601
1131 5601 3403 6491 3050 -165 7986 8363 -1425 1221 11633 9906 6007 5824 986 2445 11509
1146 11509 9641 2000 5694 8768 4304 6370 7322 -795 1317 12118 9256 91 1620 2187 1263
1161 1263 7043 5545 -2477 1278 6572 931 -1535 1986 -1447 -2000 6247 4275 -5332 -3117 1387
1176 1387 -2105 -165 1794 -3377 -2116 4048 -1517 -7053 -1273 427 -1902 2674 1251 -6763 -4113
1191 -4113 3009 -1026 -3992 -275 -1713 -1123 3907 -2209 -10630 -2909 4839 1020 -1507 -2009 -6688
1206 -6688 -3531 4018 -1729 -7512 -1815 556 -2153 -271 -3860 -10657 -3060 5462 -1793 -7900 -3408
1221 -3408 -2832 -3248 -182 -4558 -8054 -47 2875 -5647 -5995 -1732 -3118 -798 3107 -5133 -8739 2135
1237 2135 5515 -1734 -3092 -1454 -1555 4277 5180 -3924 -3320 7108 6424 815 2148 -844 -2156 7881
1253 7881 11451 1725 382 4616 2644 2852 5994 2835 3473 10907 7578 -1526 341 3808 1549
1268 1549 5991 9688 2925 331 4278 -648 -3792 3082 5197 2954 6066 2196 -8428 -6551 1591
1283 1591 776 1320 3891 -1345 -5486 -1940 -4177 -8778 -2159 3357 562 633 -1943 -12930 -11572 732
1299 732 2372 -921 -36 -2978 -7261 -3116 -2763 -7762 -2285 5621 1734 -1726 -2117 -7664 -7337 3923
1315 3923 5037 -1928 601 3369 -2166 -3354 -1352 -2835 3078 9688 1475 -5772 -804 1386 -567
1330 -567 2873 2277 -2925 2338 7815 -633 -6478 -1424 1604 3373 5567 -1149 -6956 1298 6053
1345 6053 -931 -2630 244 -1461 1216 5341 -363 -4990 1607 2949 -2154 361 1608 -1022 3492
1360 3492 5694 -2544 -3613 3782 3021 -401 3270 3639 977 4237 2956 -4230 -678 7166 5328
1375 5328 3743 4821 -1023 -3845 3570 4838 296 3264 5317 1009 1540 1851 -4389 -2570 5218
1390 5218 3758 906 2434 -2344 -8432 -2321 2855 -1284 -946 1388 -3687 -4776 -2234 -6254 -6680
1405 -6680 695 1072 -4965 -3427 -3901 -9397 -5703 -178 -4129 -3992 1248 -2960 -8317 -5682 -4466 -3828
1421 -3828 2733 1541 -7028 -5197 512 -2527 -3804 -145 -1796 -1036 5401 1821 -6744 -3626 2164
1436 2164 2098 4247 3887 -3094 -1336 5791 1950 -2531 2396 4416 2219 4293 2879 -2495 1368 6219
1452 6219 1761 194 5036 3267 152 3611 1097 -2079 4430 7199 654 -644 2177 541 2169
1467 2169 5098 -377 -1864 5398 4832 -1304 748 2415 -1087 2966 6588 857 -1255 3173 1884
1482 1884 -120 3936 2499 -975 3463 3934 -1636 245 4128 -207 -647 4739 1645 -1735 1454
1497 1454 769 -2619 1796 3058 -1891 -431 1508 -3293 -3292 1654 -1010 -3971 367 -888 -5356 -2182
1513 -2182 -750 -5319 -4092 -556 -3605 -3578 -1146 -6295 -8357 -1637 -1196 -5676 -3746 -2686 -6159 -3794
1529 -3794 -1253 -6188 -6520 -448 -2069 -4174 -1253 -3380 -7111 -1588 669 -4443 -2421 1955 -1820
1544 -1820 -2707 -140 -2581 -2213 3186 1718 -2096 1604 2933 -1888 -441 2821 346 1755 6815
1559 6815 3092 -1578 2000 2270 693 4968 5342 663 3622 6427 584 -1089 4611 3684 2812 6863
1575 6863 4887 -314 2196 3584 307 3510 7104 3371 2585 4957 366 -1988 3988 4715 1470
1590 1470 4913 4929 -389 286 2341 -871 971 6310 3295 28 2401 -510 -3771 828 3490 -38
1606 -38 1459 3478 -1729 -3458 -72 -2467 -2511 2821 1421 -3138 -1107 -1203 -6097 -3477 654 -1906
1622 -1906 -2341 535 -2624 -6371 -2837 -3150 -5003 -873 153 -4394 -3397 -1965 -6468 -6463 -1142 -2125 -3796
1639 -3796 -541 -2293 -6517 -3750 -2713 -5221 -1954 1312 -2997 -3577 -879 -4511 -6293 -595 96
1654 96 -2715 244 610 -3797 -3077 -503 -3055 -1202 3751 1082 -1944 1078 -652 -3965 1137 3699
1670 3699 735 2392 4441 155 -1151 2391 1663 1230 6280 5080 1442 3486 3974 -85 2732 6731
1686 6731 4565 4075 6766 3442 899 4977 4611 2489 6690 7607 2492 3454 5109 1224 1889 6216
1702 6216 4097 2310 5360 3601 -790 1547 2974 318 2818 4387 -767 -1356 2282 -343 -3072
1717 -3072 280 -2 -2815 385 -43 -4998 -3627 -994 -3991 -3186 -450 -3493 -5385 -1336 -2876 -6948
1733 -6948 -3481 -807 -3868 -3347 -1624 -4712 -4477 -937 -4090 -5215 -262 -343 -3832 -1739 -2046 -5321
1749 -5321 -1856 1741 -2552 -3310 745 -697 -3029 -690 -1879 -3796 1064 1989 -2901 -2211 497 -2608
1765 -2608 -2339 1322 -1399 -2769 1183 -158 -4286 -1595 -248 -2430 -232 410 -2802 -2462 1597 -1671
1781 -1671 -4022 492 1384 -1115 1067 624 -2803 92 3341 362 132 3981 1944 478 3872 3219
1797 3219 869 4479 6224 2711 3914 6255 3127 3361 6858 4968 4716 8167 5902 1768 5245
1812 5245 7582 3971 4870 6592 3454 3609 6133 2809 741 4850 4424 1174 2899 1954 -2048 41
1828 41 2226 -1973 -1951 1518 -1204 -4375 -2980 -4117 -5053 -1477 -1689 -6829 -5216 -2242 -5921 -6596 -3927
1845 -3927 -5378 -5234 -682 -3528 -8703 -5757 -2719 -4414 -2750 -1597 -4426 -3461 -248 -3451 -5721
1860 -5721 -485 982 -751 637 -143 -3569 -140 2113 -805 -409 3788 2364 -390 1061 -863
1875 -863 -1763 3122 4050 -698 -834 1967 -323 -1137 499 -1312 -688 2930 169 -4221 -1894 22
1891 22 -2445 -928 498 -2904 -2158 632 -2081 -4070 -272 396 -1854 101 -117 -2625 982 2587
1907 2587 -1369 -1282 3227 2502 514 3078 2439 1359 5095 5209 1017 3333 6656 4955 4544 6397
1923 6397 3650 3311 6798 5367 2554 6346 7922 4264 3692 3531 1400 3444 6820 2921 743 3877
1939 3877 2191 -1511 -673 472 -1271 1552 1931 -3672 -5600 -2610 -3452 -4129 -2064 -2927 -4937 -2540
1955 -2540 -4590 -9365 -7069 -2216 -3240 -3966 -3539 -6723 -7102 -3356 -4595 -6049 -1302 360 -3399 -4308
1971 -4308 -3391 -5391 -2162 2076 45 -2260 946 273 -2665 -847 670 828 4108 4487 -989 -1690
1987 -1690 2356 1911 785 2854 2497 826 2814 1878 -2352 -47 3989 1816 667 1310 -1313 -1308 2024
2004 2024 43 -2847 1076 2608 -1231 -2473 -1093 -2408 -6 2002 -1880 -3485 551 821 -1718
2019 -1718 -498 397 -892 1930 2427 -2145 -1472 3066 3263 904 1647 1031 594 4207 3784 274 2417
2036 2417 5873 3284 1611 2934 2350 2954 6211 3918 218 2769 4240 1437 1761 2867 1001 2404
2052 2404 3796 -364 -3231 1055 1920 -330 284 -555 -2842 -765 -327 -4675 -3735 150 -1495 -3800
2068 -3800 -2499 -3930 -5295 -2118 -1916 -5075 -3146 -967 -4055 -5018 -2771 -3540 -2783 255 -2287 -4828
2084 -4828 -1706 -50 -3121 -2235 24 -910 -293 1262 -2148 -2732 1918 2334 -576 1040 1711 -113
2100 -113 1187 1802 -1234 397 4293 2541 -442 762 1114 477 2735 1388 -1810 1308 4213 675
2116 675 -1531 -14 159 911 3047 -69 -2993 495 2368 -785 -1048 40 -413 1090 2649 -1717
2132 -1717 -3152 1580 2144 -292 -12 377 -106 1762 1799 -1954 -721 4064 2859 -144 907 177 126
2149 126 3333 2506 -869 1282 4130 1601 -149 483 175 1330 4436 1695 -1815 645 1821 -615
2165 -615 -17 1900 -564 194 1556 -1487 -2920 447 495 -1437 83 -344 -2881 -1372 -681 -3418 -2152
2182 -2152 1212 -1135 -3344 -1480 -2157 -2932 -392 -321 -3008 -1087 -58 -3014 -3332 -133 -526 -811 534
2199 534 -1473 -2894 40 589 -2070 -767 1514 316 -121 171 -2675 -1796 3149 2415 -1629 -595
2215 -595 399 -435 622 732 -1555 564 3749 740 -2657 -579 481 736 2706 744 -2654 126
2231 126 2267 -838 -1436 979 957 1411 1640 -1590 -3140 1343 3725 427 -196 1003 -315 771 2062
2248 2062 -785 -1040 3294 3308 -184 -288 -255 248 2963 3426 -372 -464 2316 928 -754 1012 1177 1001
2266 1001 3483 1701 -2240 -910 1728 763 743 1768 -256 -943 1163 -367 -2492 507 1529 -739
2282 -739 -497 -211 -2651 -1610 708 -737 -964 765 -1185 -3214 -1090 -249 -1861 -378 624 -1841
2298 -1841 -1621 209 -1991 -2432 985 848 -946 -426 -1289 -2847 -58 1733 -1296 -1515 1185 93
2314 93 -1812 -609 -897 -495 2603 1662 -2210 -1910 718 -92 258 1385 -922 -838 1991 339 -3137
2331 -3137 -993 1390 1289 1361 -28 -2946 -1106 2602 -76 -1438 766 657 -83 786 -845 -2699
2347 -2699 650 3204 265 -1277 -65 -348 -181 1703 -297 -1481 2091 2620 -656 -1220 520 499
2363 499 1821 2914 -178 -1404 1746 2006 -15 912 1491 118 1487 2245 -971 -582 2622 1588
2379 1588 832 1789 610 -651 1774 1150 -789 826 2153 -515 -414 1085 -676 -1062 966 449
2395 449 -1576 54 154 -1869 -458 653 -1670 -1348 327 -1108 -1793 29 -898 -2686 281 799
2411 799 -1866 -1544 -570 -1623 -785 724 -1665 -2533 454 278 -1682 -747 -547 -1696 938 1445 -2056
2428 -2056 -1700 1030 589 -556 387 -788 -1090 1600 1566 -1796 -598 1868 185 -2 816 -854 -395
2445 -395 2339 736 -1915 195 1497 242 515 251 -1712 77 2878 464 -1849 136 497 -88
2461 -88 1387 -6 -2086 361 2236 -676 -1373 528 -726 -327 1673 -123 -1662 585 1127 -975
2477 -975 -161 1022 -261 327 1411 -908 -1173 1593 1604 -754 688 1032 -1146 699 1789 -236 221
2494 221 2120 894 -72 1218 194 -831 1881 2320 -82 639 1294 -640 -151 1838 279 -250 1758
2511 1758 895 -1012 317 5 -1332 670 2257 -755 -872 -32 -1342 -1356 796 93 -1312 648 358
2528 358 -2253 -1540 -471 -1518 -634 1043 -1608 -2327 -123 -801 -2500 -461 -148 -1189 -65 249 -2731
2545 -2731 -2039 432 -197 -817 602 -500 -1870 539 453 -1447 -312 1641 407 95 749 -1457 -988
2562 -988 2040 1028 -951 928 1230 -355 555 1109 -823 -13 2191 191 -748 1235 318 -599 760
2579 760 245 -1419 642 1821 -608 -761 752 -651 -878 1263 -213 -1195 560 958 -1360 -144
2595 -144 446 -1349 45 1593 -393 -1163 828 -223 -1460 769 726 -951 784 1611 -931 -410 1243
2612 1243 89 -24 2038 1160 -408 1165 954 -724 751 2295 466 971 1953 155 -687 1569
2628 1569 884 -400 1430 1679 -440 651 1027 -970 -70 1569 545 164 1246 -342 -1911 192
2644 192 417 -1069 359 913 -916 -1173 488 -1233 -1884 685 71 -1216 128 -332 -2200 -826 -73
2661 -73 -1850 -1016 820 -844 -1659 -72 -1110 -1893 314 242 -1573 -463 440 -1589 -1196 207 -873
2678 -873 -856 638 179 -1675 153 162 -1350 117 812 -682 -41 1379 -490 -1143 1104 275 -1042 1173
2696 1173 688 -1164 204 757 -959 -194 1324 441 -477 1229 138 -1377 650 975 -566 442
2712 442 1545 -496 -288 889 -339 -887 1800 508 -833 779 656 -1327 454 1423 -580 -93
2728 -93 1584 -16 -788 1077 423 -159 1215 1227 -734 259 1457 -711 -90 1487 -117 -24 1551 524
2746 524 -1114 898 1252 -315 490 1408 -738 0 1607 -32 -726 1385 513 -768 775 845 -1248
2763 -1248 263 1504 -530 -244 873 -284 -898 696 -505 -1484 834 468 -1359 -750 171 -1631
2779 -1631 -789 655 -1197 -1572 374 -478 -2098 -500 -608 -1961 -260 434 -1749 -1458 -360 -1425
2795 -1425 -1385 243 -822 -1460 430 -293 -2084 -1083 289 -863 -521 1149 -976 -1589 659 29 -1185
2812 -1185 664 1212 -877 344 812 -1063 -344 1648 69 96 1286 228 -498 1394 906 -438 636
2829 636 1623 412 856 1379 -301 -478 1666 922 -232 1334 1045 -332 694 985 -1002 -250 1412
2846 1412 481 -182 1085 -156 -941 1000 255 -1303 746 1664 -189 -323 626 -419 -507 1308 543
2863 543 -733 1212 830 -1256 -424 247 -947 389 2480 288 -1054 739 -38 -842 1074 796 -247
2880 -247 1200 1398 -1285 -832 573 -348 369 1753 15 -1548 -296 233 -1600 51 824 -390 -376
2897 -376 350 -1976 -2306 -265 -321 -1229 377 -367 -2458 -1070 -524 -2315 -1264 710 -409 -845 -479
2914 -479 -2003 -2486 -75 468 -1184 -384 306 -1323 -914 216 -1313 -945 1143 910 -1044 16 -59
2931 -59 -1285 493 1361 -460 41 1430 131 -431 762 53 -537 1690 1316 -669 660 1566 25
2948 25 461 1502 -342 -45 2122 864 -419 878 1000 -430 988 1334 -567 241 2060 -255 -806
2965 -806 644 35 -388 1444 987 -888 187 1091 -789 -184 1223 -155 608 1927 227 -1151 761
2982 761 1262 -335 1204 1803 -417 -56 1291 -306 -657 1398 791 11 922 339 -1573 51 964
2999 964 -403 -337 744 -533 -1127 423 -840 -1716 347 535 -1281 -635 -496 -2243 -993 294 -1177
3016 -1177 -1263 109 -547 -2050 -663 -814 -2115 -99 637 -1732 -1662 -98 -988 -1001 256 -624 -1147 645
3034 645 368 -1638 -399 426 -507 181 1255 -716 -700 955 305 -590 967 872 -548 1080 1044 -993
3052 -993 -440 1646 77 70 1186 -23 -905 892 598 -755 526 1343 -560 -135 763 -461 -533 1370
3070 1370 198 -613 775 374 -1038 72 1059 -591 252 1451 -198 -439 971 -314 -657 1278
3086 1278 1239 -429 482 1018 -413 87 1284 -204 127 1585 447 -839 611 534 -417 1095 1083 -401
3104 -401 47 1355 -414 -484 860 28 -202 991 557 -1557 -23 546 -735 -438 533 -1282 -1062 311
3122 311 -1042 -1829 71 7 -1422 -530 -285 -1782 -901 880 -1290 -1233 148 -367 -1348 356 85 -1570
3140 -1570 722 784 -1087 -692 723 -205 -72 1011 -6 -776 846 776 -544 726 1000 57 303 1349
3158 1349 -484 26 2015 571 -300 869 475 -1139 462 710 -341 496 1364 -429 -1279 335 -278
3175 -278 -525 1323 567 -1255 -132 1 -1529 -766 928 -29 -366 -2 -1168 -1636 -145 44 -850 368
3193 368 1045 -1003 -1147 109 -998 -245 1516 287 -637 377 -263 -1457 31 1140 114 722 1537
3210 1537 -604 -938 404 183 -270 1255 338 -665 186 368 -1044 -207 1441 253 -184 766 -272
3227 -272 -1423 356 295 -611 632 804 -792 -825 19 -1174 -751 1058 48 -1420 309 273 -1066 124
3245 124 262 -898 -31 639 -598 -885 594 -102 -633 557 206 -837 222 908 -632 118 1391
3262 1391 139 -471 944 343 67 1730 845 -519 774 1674 22 650 1546 160 596 1651 -281
3279 -281 -596 1296 1070 161 969 690 -546 52 907 -419 -599 1438 420 -960 -137 -428 -1096 730
3297 730 848 -1134 -477 589 -963 -1406 -367 -1119 -1047 573 -137 -2132 -684 -232 -1244 -558 366 -1013
3315 -1013 -647 456 -1211 -1607 167 169 -909 -45 -16 -1600 -477 27 -876 -604 580 -42 -805 236
3333 236 -130 -984 173 999 -706 -148 1006 -577 -366 1021 134 -386 1370 571 -724 554 695
3350 695 -498 294 1258 -357 -147 877 20 -893 1087 1139 -216 372 662 -405 548 927 -513 -392
3368 -392 1080 460 -681 1013 156 -357 822 1030 -692 586 1250 -292 -169 902 313 -169 991
3385 991 402 -570 598 1088 -87 124 1030 529 846 1059 -252 -700 1198 1238 -320 350 194 -487 401
3404 401 1026 -288 -269 1216 370 -663 173 -30 -813 397 417 -992 -723 269 -973 -1428 22 -257
3422 -257 -955 -264 -677 -1959 -855 -217 -1269 -924 -365 -1509 -1410 84 -995 -2139 -633 -573 -1368 -533
3440 -533 -723 -1903 -683 259 -1489 -1165 337 -539 -1384 180 31 -880 -37 334 -842 -207 849 -183
3458 -183 49 803 188 -173 869 577 -555 954 1535 -204 742 1461 90 310 1381 715 479 1569
3476 1569 1169 -192 1085 1500 264 1158 1659 105 414 2063 662 -346 1190 1443 362 1035 604
3493 604 -705 479 1576 301 508 1233 307 -282 486 74 -725 972 1231 -275 -146 166 -601 -50
3511 -50 799 71 -537 896 400 -1182 -340 330 -970 312 723 -1071 -1204 485 -103 -1026 4 -124
3529 -124 -1189 149 -269 -1650 -1177 -10 -879 -785 -231 -1293 -1743 -381 -1018 -1981 -339 -149 -1472 -1219
3547 -1219 -539 -1406 -1208 -155 -1444 -1503 -661 -1014 -1595 -508 -268 -1244 -331 437 -953 -890 154 -720 -906
3566 -906 341 -159 -779 -120 76 -631 320 855 -691 -69 923 209 -166 926 545 135 689 945 -255
3585 -255 438 1204 486 653 1793 743 284 1823 1423 255 1237 1746 732 1149 1506 416 698 2070
3603 2070 1036 476 1237 1278 685 1384 1442 486 1154 1669 366 179 1285 900 578 1520 453 -182 800
3622 800 932 -296 -19 344 -390 -324 636 -780 -1142 191 -316 -849 -343 -413 -1349 -936 -313 -1591 -1624 -214
3642 -214 -1168 -1506 -908 -947 -2109 -907 -1128 -2190 -1257 -633 -1541 -1494 -310 -1412 -1430 -307 -899 -1808 -451
3661 -451 -177 -1560 -664 -36 -1118 -681 205 -470 -867 354 -58 -776 386 360 -983 -49 457 -487 -414
3680 -414 814 -304 -511 724 375 -788 332 552 -723 166 717 -513 -279 725 -390 -348 790
3697 790 12 -608 668 419 -573 191 1249 -464 282 754 306 89 935 973 -148 1135 1277 494 1255
3716 1255 1755 727 874 1883 1322 833 2151 1488 793 1881 1809 540 1541 2287 1055 1054 2289 1053
3734 1053 653 1765 825 293 1239 1076 -201 629 811 -395 -275 452 -463 -966 -64 -631 -1474 -615 -885
3753 -885 -1879 -1321 -487 -1831 -1757 -1159 -1754 -2447 -1340 -1750 -2415 -1501 -1218 -2392 -1701 -988 -2094 -1668 -857
3772 -857 -1446 -1624 -379 -870 -1476 -504 -143 -912 -541 220 -306 -229 576 123 149 791 450 99 558 639 190
3793 190 634 1124 293 296 1348 535 -75 849 172 -400 356 630 -406 7 558 -162 -77 358 -352 -698
3813 -698 488 -104 -851 -144 11 -739 -183 186 -812 -441 282 -247 -650 334 489 -444 1153 877 -11
3832 -11 758 1255 447 684 1487 1043 758 1634 1415 455 1504 1670 842 1381 1990 954 978 1486 1213 958
3852 958 1914 1134 411 832 610 -363 397 700 -211 -280 250 -359 -1211 21 -604 -1627 -893 -836 -1336 -1335 -872
3873 -872 -1822 -1599 -992 -2016 -2134 -1764 -1454 -2147 -1239 -1222 -2288 -1277 -1111 -1898 -1229 -616 -1397 -1084 -168
3892 -168 -546 -1184 -99 107 -607 133 567 -461 112 1067 324 -51 1111 1253 431 899 891 359 1267 1834
3912 1834 508 803 1511 1061 494 1085 574 -138 1190 968 -84 150 375 89 72 881 -300 -437 138
3931 138 -52 -781 -283 -120 -405 239 229 -835 -705 378 -372 -722 326 94 -560 102 260 -685 37
3950 37 1066 -13 -198 764 448 280 1191 620 -129 1010 1298 303 645 1232 326 686 1747 620 -69
3969 -69 984 658 -132 598 669 -641 312 518 -420 -482 269 -658 -922 97 -330 -1318 -762 -701 -1486 -1072
3989 -1072 -442 -1573 -1531 -624 -1470 -1679 -597 -1269 -1691 -791 -603 -1814 -1211 -175 -1013 -1214 -416 -589 -700
4008 -700 443 -504 -1135 255 536 -49 -263 -7 -491 674 1368 -52 -187 1040 1029 624 1106 883 -153
4027 -153 942 1997 345 261 1413 688 483 1353 651 -47 1018 872 -178 300 698 168 175 535 -238
4046 -238 -199 811 362 -699 187 95 61 142 14 -699 -501 647 -32 -344 174 -456 -645 296 94 -613
4066 -613 -216 396 -452 -318 239 -348 -510 479 126 -277 559 263 -379 -103 515 -272 54 342 -770 -692
4086 -692 583 395 -778 246 121 -634 -120 160 -847 -387 105 -460 -734 158 -191 -1289 -463 62
4104 62 -767 30 -92 -1331 -978 377 -168 -577 -406 -277 -1009 -204 -368 -1087 -291 412 -383 -604 -119 -437
4124 -437 -575 474 -164 -767 177 588 -547 -384 242 128 589 1113 -89 -527 840 590 -58 760 300
4143 300 -78 1009 995 -88 -246 674 712 551 881 43 -427 880 1089 227 -15 827 11 263 663 -144
4163 -144 -262 832 494 -263 365 727 -174 82 325 -367 -36 569 -507 -388 29 40 -423 589 -204
4182 -204 -1027 -443 521 -303 -413 140 -500 -715 90 -50 -1219 -141 -8 -986 -416 -77 -1123 -537 58
4201 58 -549 -541 -59 -525 -1224 136 72 -787 -498 152 -577 -410 370 -619 -890 588 157 -631 -225 -148 -617
4222 -617 162 718 -447 -170 916 17 -390 95 524 151 606 552 -444 430 753 -54 112 796 193 366
4242 366 1356 332 -580 555 978 487 548 538 -404 424 998 378 -259 457 455 264 322 325 -514 590 585 -280
4264 -280 151 815 -99 -416 338 280 -190 461 551 -667 -62 489 18 -54 465 -340 -372 148 -50 -817 16
4285 16 -103 -330 -16 -39 -525 -283 337 -224 -340 208 -161 -961 -117 -197 -683 -153 287 -878 -747 429
4305 429 -701 -786 -224 -233 -744 -166 -382 -1096 -526 50 -1157 -738 -135 -974 -930 -187 -353 -982 -373 -541 -1238
4326 -1238 -552 -264 -788 -499 99 -725 -560 319 31 -705 58 -66 -423 353 525 -206 -324 653 264 122
4346 122 903 432 280 1176 1188 -90 873 1523 759 767 1216 726 791 1350 833 289 1217 1388 267 684 969
4367 969 726 782 1641 531 47 1111 667 -273 555 429 -168 363 824 -263 87 606 -150 -257 606
4386 606 1 -975 128 125 -1015 -361 276 -553 -660 37 -643 -614 27 -637 -1059 88 -81 -982 -588 -15
4406 -15 -649 -377 374 -510 -731 -99 -255 -941 -358 -136 -738 87 -99 -987 -647 -143 -459 -633 188 -95
4426 -95 -1202 -69 -505 -1010 -285 19 -559 -714 15 -785 -1097 -282 -515 -1175 -35 -325 -813 -536 -308
4445 -308 -615 -446 231 -535 -516 254 -274 -930 191 167 -277 353 385 25 -106 825 273 251 630 437 107
4466 107 1070 1150 356 1027 1474 545 906 1455 633 569 1429 944 557 1313 1325 633 783 1435 444 1168 1246
4487 1246 789 499 1239 828 16 671 916 188 218 676 -194 -263 832 -272 -650 463 -671 -534 150
4506 150 -119 -592 -725 -83 -1320 -1035 -450 -632 -625 -168 -655 -888 -298 -764 -912 -472 -74 -862 -855 -273 -1130
4527 -1130 -944 119 -598 -783 -82 -234 -863 -328 0 -688 -336 127 -428 -689 424 -166 -765 70 -22
4546 -22 -483 -204 48 -713 -503 185 -270 -441 28 -442 -340 66 -26 -970 -212 398 -265 -218 201 -388 -454
4567 -454 456 -131 -28 298 68 -252 412 348 -137 107 1050 173 57 661 447 92 534 831 59 816
4587 816 1331 444 918 1207 314 661 1182 854 221 1329 1087 275 552 1024 357 604 1162 297 196 1002
4607 1002 372 76 368 227 69 89 183 -391 -35 308 -143 -664 -9 -293 -841 327 -398 -994 -214 -256
4627 -256 -933 -558 -345 -801 -692 -289 -883 -1374 -299 -332 -905 -340 -444 -760 -805 -142 -599 -712 -104 -540
4647 -540 -555 -109 -173 -809 -251 -8 -587 -470 73 -198 -508 142 -295 -592 448 -9 -229 68 548 -224
4667 -224 -257 475 -514 -215 548 368 -271 459 265 -546 312 313 -120 320 530 -169 -247 545 -42 -46 386 383 -210
4690 -210 328 751 -29 -12 478 -45 -262 619 276 -23 803 469 -178 413 620 173 278 1037 332 240 691
4711 691 445 255 944 649 -51 323 786 169 262 690 -305 315 507 221 -356 229 632 -353 267 397
4731 397 -298 -213 122 -310 -523 174 -88 -554 44 -210 -779 -121 62 -400 -589 12 -451 -637 -390 -582
4751 -582 -932 -114 -356 -597 -531 -244 -964 -535 99 -646 -615 -45 -701 -793 28 -266 -629 -323 -307 -468 -403 81
4773 81 -447 -371 454 45 -494 590 263 -385 -36 253 -180 153 619 106 39 557 299 -262 569 384 44
4794 44 384 590 57 96 636 26 155 747 357 -132 652 65 -42 410 276 -222 185 482 -101 30 450
4815 450 2 -225 403 200 -242 285 309 -235 381 108 -60 -252 317 40 -375 -136 -102 -498 81 455 -153
4836 -153 142 166 -106 -57 291 52 -215 199 99 -746 334 357 -338 -13 478 -42 -81 358 -232 -127 184
4857 184 -53 -563 348 506 -546 -252 234 -533 -254 146 23 -298 79 -178 -429 -359 98 -461 -45 195
4877 195 -107 -255 119 -535 -836 -141 -144 -618 102 76 -531 -209 260 -446 -177 129 -130 -526 -65 10 -402
4898 -402 301 170 -307 43 453 98 24 533 183 -234 730 238 -156 758 558 377 87 849 -10 10 468
4919 468 214 -77 326 435 -119 367 493 -193 -249 301 -87 -235 375 12 -334 175 177 -450 -109 363 -452
4940 -452 -121 128 -89 -294 -144 -134 -320 -126 -112 -284 -330 22 -411 -456 369 -247 -384 -68 -55 -555 181 118
4962 118 -485 140 -63 -303 268 258 182 -423 429 -55 -431 -11 128 -255 136 441 -293 -23 481 134 -169
4983 -169 565 256 47 519 14 -321 282 26 90 -49 219 -318 -180 173 -270 -354 349 172 -58 10 185
5004 185 -469 -60 226 -351 -290 -199 438 -127 147 211 -181 167 274 -90 -431 343 -306 -13 260 -169 -243
5025 -243 292 516 -169 292 299 -62 240 324 -155 -11 448 120 -233 -130 17 -392 156 485 -125 -222 449
5046 449 -235 -63 327 -214 -27 172 289 -577 423 91 -370 -249 326 -295 -429 -40 -97 -508 -102 -300
5066 -300 -454 -126 -29 -699 -690 -57 -335 -549 -93 -268 -728 191 -444 -442 -263 -156 -405 -292 9 -392 -80 359
5088 359 -187 -403 -1 -37 -254 146 59 16 49 731 36 169 663 370 67 567 637 139 475 820 166 364
5110 364 741 222 406 729 336 -209 621 556 -36 275 855 175 381 493 185 84 356 176 -44 176
5130 176 63 -496 370 371 -301 -125 -12 -433 -443 118 -413 -596 -187 -15 -536 12 -206 -321 -141 221 -213
5151 -213 -375 108 -153 92 -165 -57 -416 -32 273 -32 161 258 -184 -52 190 71 -224 227 413 -324
5171 -324 -67 3 -362 -260 394 -420 -583 102 -86 -456 -109 -65 -448 -202 -20 -537 -369 -357 -324 -242 -67 -379
5193 -379 -646 119 -113 -783 -311 -222 -459 -131 33 -510 -504 151 277 -323 -123 382 -92 32 363 143 384
5214 384 807 -97 24 594 616 -21 620 564 119 1074 905 531 448 689 562 592 1062 538 166 417 317
5235 317 489 803 550 -14 289 571 -316 26 315 77 -96 450 -64 -243 161 40 -382 -156 -65 -527
5255 -527 -558 148 43 -651 -288 -450 -810 -204 -187 -1052 -406 -5 -266 -526 -237 -386 -443 -136 -129 -97 -145 154
5277 154 -518 -39 -34 -358 -268 235 -2 -186 417 306 -162 40 317 -154 203 390 -400 -236 248 -105 -134
5298 -134 -100 6 -355 -60 -175 -529 -205 -171 -276 -230 29 -147 -303 35 -75 -511 -141 -244 -300 -289 -425 -405
5320 -405 -178 252 37 -437 -25 208 -188 175 112 -84 656 888 308 206 289 366 292 613 452 343 582
5341 582 1050 406 510 505 589 416 996 669 -71 604 637 402 688 436 440 253 496 -67 -58 445 -130 260 277
5364 277 -99 -314 -234 -77 -238 -278 -292 -298 -540 -140 -387 -454 -364 -300 -501 -405 -616 -758 -528 -25 -547 -614 -46
5387 -46 -143 -461 -19 -58 -648 -251 -241 -236 -270 66 -345 -373 102 -431 -375 -62 41 -359 32 171 -268 110 316
5410 316 -104 -139 502 93 -63 -99 -78 -194 276 -7 -284 19 186 69 -88 193 13 -166 295 397 -31
5431 -31 -172 166 -257 115 269 -80 191 155 -57 -49 372 91 78 211 -13 -202 433 664 344 312 418 29
5453 29 29 670 582 416 469 788 156 324 496 185 198 417 381 251 422 152 -132 382 515 27 450 599
5475 599 26 125 570 101 28 183 -3 -436 -160 -105 -32 -347 49 -418 -439 -106 -224 -222 -160 -368 -614 -77 -131
5498 -131 -573 -623 -217 -408 -569 -215 -381 -504 -175 -192 -536 15 -54 -699 -515 -198 -401 -362 -30 -282 -587
5519 -587 -54 -22 -429 180 -220 -324 1 126 -144 -129 197 -100 15 233 117 -142 195 39 1 237 313
5540 313 -159 -63 640 402 -101 242 -31 -467 300 231 162 247 421 20 318 617 75 94 292 349 97 427
5562 427 162 61 325 411 178 -99 229 174 -195 388 400 -84 258 364 -205 158 389 -156 341 169 -4
5583 -4 -254 194 -51 -6 172 265 -226 51 156 -107 -89 475 -170 -87 117 -235 -510 150 -99 -434 -40 55
5605 55 -161 -410 183 -90 -218 -110 27 -290 45 -202 -520 -15 79 -678 -602 -110 -376 -17 297 -231 -409
5626 -409 0 -108 -715 -285 -138 -357 -184 -29 -253 -251 116 -62 -209 140 -95 -485 -245 64 -333 96 359
5647 359 -36 -243 382 326 189 -235 269 26 418 255 254 239 225 399 -18 496 318 335 342 801 43 422 393
5670 393 135 233 627 48 36 499 107 -81 332 240 157 203 357 -103 -13 389 145 129 164 -130 -323 217 113
5693 113 -250 246 26 -91 68 -97 -97 -305 -103 -257 -246 -56 330 -225 107 20 -108 10 150 -63 -345
5714 -345 -164 -233 -182 153 -235 -338 -34 28 -292 -181 -288 -293 -126 -9 -144 -529 -42 600 -234 7 174 -180
5736 -180 -328 279 90 -19 70 -351 -333 137 257 -227 34 75 -103 -108 191 -36 -304 393 -108 -88 316 125
5758 125 -63 -220 146 -381 -83 247 -65 221 257 87 12 232 -6 -159 204 23 -25 193 626 161 13
5779 13 250 247 28 293 267 70 35 490 223 187 285 18 8 283 122 -188 239 75 -211 252 183 54 270
5802 270 244 -144 -36 385 -95 -42 497 323 -580 195 280 25 -333 287 -34 -243 44 -284 -409 -19 -41
5823 -41 -309 -311 217 -196 -295 239 -126 -52 -58 -199 -544 -165 -62 -93 -100 124 -486 -256 129 -126 -170 -148 -66 -327
5847 -327 323 161 -602 -313 116 -261 84 34 -201 -14 286 -155 -23 212 295 -315 118 212 204 -246 163 128
5869 128 -38 327 241 -137 529 435 -259 122 -27 -110 -50 289 -57 130 494 -56 -192 54 2 -471 -47 186
5891 186 -9 -243 383 -22 -266 403 -21 -293 79 24 -206 30 117 -376 81 208 -176 -164 -77 279 -603
5912 -603 411 147 -54 10 300 -123 -35 286 2 -118 303 -69 -108 113 17 -86 83 -1 -135 36 180
5933 180 -79 -668 -14 -383 -94 -76 202 -329 -78 284 -369 -125 -70 -334 -536 -394 -210 -523 173 -180 -382
5954 -382 -80 -301 -234 -229 -130 102 -336 194 144 -304 8 -51 -426 14 140 -47 197 517 -131 45 146 247
5976 247 -216 290 361 84 -143 457 215 -169 357 216 290 298 228 -100 227 358 -19 323 163 -122 42 230
5998 230 133 159 265 123 -176 396 224 -172 -339 121 -417 17 -103 -332 -97 109 -18 -313 -134 -145 -314
6019 -314 -317 20 -24 -229 2 -142 -353 9 172 -194 191 101 -212 88 376 -189 -278 178 -400 332 303 -76
6041 -76 -127 7 101 -192 115 2 -420 156 -62 65 -170 89 -233 -265 150 36 -441 -139 219 -364 -22
6062 -22 51 -83 -110 -280 -122 -119 -152 -57 -456 -113 -252 -484 -133 -119 43 -65 196 -347 -500 94 358 15 114
6085 114 218 151 114 133 -194 269 297 115 78 487 365 -55 152 166 -125 180 700 466 -341 407 328 13
6107 13 390 231 44 -57 433 26 167 504 6 -59 705 93 -18 33 121 -138 304 9 110 -300 -85
6128 -85 163 -596 425 88 -71 63 -139 -115 -148 110 -148 -114 158 -213 -214 179 46 -168 -138 136 -149 77
6150 77 211 -674 -18 44 -98 -253 32 -154 -266 -79 -251 -616 -188 -317 -167 -74 123 -332 -256 507 196
6171 196 8 97 37 143 -116 -462 -115 -34 303 -121 -64 34 -38 -352 144 -152 -353 83 -138 -198 201 369
6193 369 -272 126 349 -159 155 460 -138 -273 14 -222 111 323 64 -250 9 21 -44 -160 -11 168 -74
6214 -74 -25 32 -221 240 215 -147 324 176 -168 56 -19 -67 57 -199 153 158 194 82 -111 -172 226 -130 -176 294
6238 294 404 -26 159 189 -18 -29 229 90 -79 368 -20 -187 -46 217 -116 187 317 3 -67 149 -368
6259 -368 -116 150 -146 30 5 -226 -84 94 103 -252 -140 -108 -162 -90 136 -154 -249 -173 0 -387 -127 0 -433
6282 -433 -196 211 -63 -363 16 -132 119 224 173 -118 23 307 -62 106 33 18 45 218 422 375 342 640
6304 640 -68 -8 136 135 -18 464 78 91 370 250 -141 -9 54 -42 572 210 15 150 317 24 101 -65
6326 -65 9 -148 47 -98 -183 311 -323 -30 86 278 -61 -207 -94 -264 -141 335 267 -133 59 -300 -149
6347 -149 -196 -68 -206 14 84 388 37 317 -226 -364 -178 -126 -255 -20 43 -139 -196 129 -90 -310 291 73
6369 73 -428 120 176 -339 -188 98 -216 -37 131 -509 37 178 -70 -495 -48 9 -42 25 150 -226 -192 136
6391 136 34 -387 131 -398 -132 -67 116 -5 247 167 -214 180 49 -110 -206 -101 -151 -86 227 -190 -230 73
6413 73 36 -74 -159 148 150 -263 121 8 -282 187 305 -43 2 646 -113 -40 581 -17 64 552 -170 298 -3
6436 -3 233 198 273 -30 -84 -30 176 331 -141 25 -161 35 -95 182 -209 46 111 -383 -370 16 28 -426 -9
6459 -9 -226 -214 -45 6 -288 -13 312 -121 -78 219 -211 32 14 142 -111 -180 72 6 334 167 1 15 196
6482 196 -75 -314 395 0 -68 264 49 -170 371 196 -312 4 248 -217 33 153 -5 208 -79 -90 110
6503 110 305 213 -76 -325 111 246 -256 288 97 -165 -44 350 16 -228 -130 -101 -176 -286 -36 78 27 49
6525 49 -109 73 -151 -317 133 -53 -50 -149 -6 -201 -365 -40 75 189 55 250 -184 -15 129 -1 13 310
6547 310 51 161 457 -141 -244 476 -153 59 -17 122 -104 421 344 -31 -131 -70 -33 231 170 429 -60 -193
6569 -193 -31 -44 -218 -168 19 -401 -30 -31 -275 -194 126 -431 -43 -46 -9 -93 217 177 21 -12 164 -42 162 9
6593 9 -84 192 -16 -213 -60 11 -34 -126 -72 111 -94 -293 -2 -178 -246 157 248 55 -7 52 -85 -37 -18 -127
6617 -127 46 223 -139 167 190 130 -58 281 -9 -84 356 25 -231 70 -28 -169 87 158 145 -291 25 45
6639 45 -218 56 -152 -196 154 139 -344 -199 -6 138 -31 153 -252 62 -57 -54 -86 161 -146 -175 168 280
6661 280 -86 -22 187 -314 33 180 -40 -63 71 272 8 41 153 63 -181 -94 -203 -156 63 -392 62 186
6683 186 180 -287 37 180 353 79 148 -170 108 322 -167 -84 67 -160 79 -110 -94 -217 63 279 48 -187
6705 -187 94 1 -37 164 -172 109 -12 271 -260 196 -141 -174 -45 30 270 -219 37 -69 -349 374 43
6726 43 -294 82 489 191 -250 243 -160 74 -28 229 2 300 -16 49 -32 167 -8 -207 58 308 -147
6747 -147 331 -136 116 287 168 204 40 226 -44 220 -147 42 45 199 160 45 -80 270 -203 -58 24 -13
6769 -13 -39 264 60 -200 -69 76 -181 91 249 -223 1 47 -60 55 25 -108 -293 45 156 -252 -37
6790 -37 56 -99 151 -69 -115 57 201 -132 -231 5 -67 -186 -130 299 -275 60 108 -65 59 56 242 87 205
6813 205 35 -297 194 215 79 123 75 67 -196 278 29 -281 -222 -46 -39 -289 301 -4 -49 342 70 -75 189
6836 189 -80 -91 38 47 -300 144 69 -373 321 92 -84 -144 -154 -57 266 28 -172 -399 -205 5 -195 255
6858 255 118 -21 -186 266 127 -104 -70 324 123 99 142 38 164 101 60 -48 239 165 -347 286 -52 -153
6880 -153 129 144 -243 -120 158 15 28 -67 49 -271 304 -167 -213 64 240 -208 66 -4 16 -108 -79 -101 -119
6903 -119 -16 18 33 -50 32 -195 56 93 -286 -335 10 -105 -275 141 -192 123 20 375 12 -70 130 -122
6925 -122 -71 334 -98 -390 296 158 -18 19 103 -112 -9 220 -269 78 67 -99 -135 290 301 -103 97 -2
6947 -2 -10 80 192 -71 184 221 -2 -281 26 -80 -100 152 16 -252 -85 145 -99 -253 183 -41 59 21 46
6970 46 -495 108 58 -278 -18 21 85 10 -43 115 -267 -14 74 -121 -161 68 -78 -93 147 -300 -25 144 268
6993 268 -156 295 -314 -119 -57 -119 -120 -109 34 -125 -338 97 -100 -204 -105 -104 -378 227 -56 -235 20 247 -212
7016 -212 -13 122 -219 -70 206 44 -190 -11 -265 -228 -104 -128 262 158 229 223 87 324 116 135 541 145
7038 145 -208 94 -24 -260 -321 46 454 81 395 72 -196 163 303 -224 30 20 -54 -34 -159 209 -119
7059 -119 157 -70 -222 -165 285 -556 30 -96 -412 224 1 22 147 -84 93 77 27 262 121 128 168 -305
7081 -305 -62 166 179 47 170 -147 -94 78 218 -120 8 259 -202 -81 278 91 186 201 371 -232 217
7102 217 119 -177 -254 16 -78 -124 31 -228 -246 -187 6 -115 -210 -11 -112 -161 -39 -237 -54 -276 7 -128 74
7125 74 -36 -38 295 2 -52 109 414 40 40 24 -91 83 193 226 -56 -56 55 74 -135 327 -127 251 270 -154
7149 -154 -41 109 67 -197 232 374 -76 272 -102 -31 -49 199 -69 -302 230 -120 -192 107 72 -278 -11 -54
7171 -54 -129 -149 -128 48 -335 80 -177 -214 25 -142 109 -81 49 -347 122 102 -159 -269 -21 -86 60 245
7193 245 278 22 -346 251 148 9 353 202 -222 82 10 -80 258 138 -140 126 1 114 126 -102 -159 -3
7215 -3 -48 -313 -185 162 -221 -148 112 300 7 -246 -62 82 -138 93 -218 -186 -138 182 91 67 160 -321 -82
7238 -82 81 242 -245 276 31 -9 204 199 313 217 165 55 -87 253 70 -37 338 304 -328 11 136 -44
7260 -44 66 -80 3 183 255 -57 155 42 115 109 298 -85 43 208 542 -89 -109 196 -273 -295 71 209 -16
7283 -16 264 -22 -253 -146 -79 -223 58 -56 -300 -190 -246 -129 -311 -9 -60 -310 -62 -39 -307 -413 -327 -389
7305 -389 122 -17 -53 -346 47 -63 -430 -69 116 -140 -161 272 -98 -94 210 18 -24 448 -23 -406 84 149
7327 149 -367 -103 71 -128 -294 392 194 45 347 -67 -97 77 1 -275 26 233 -35 -255 90 -18 -289
7348 -289 -77 148 306 171 -113 -133 -286 183 -156 -13 -210 -82 82 90 84 -107 221 191 -85 -28 302 -220
7370 -220 248 197 250 149 305 -11 72 494 640 250 315 175 -156 51 93 239 156 218 184 -91 239 74 -10
7393 -10 -55 66 -93 179 272 -96 -221 144 253 -200 -90 144 3 -327 -145 26 -161 123 16 -147 -151 64
7415 64 -34 -180 -202 -428 -129 362 -58 -306 -10 172 -239 11 238 -168 -38 197 -320 -231 -145 -160 -226 -47
7437 -47 270 -43 -101 -24 -165 119 167 -37 -230 252 -25 -161 113 268 -19 229 521 -208 156 200 -127 -17
7459 -17 204 278 219 407 -345 -279 51 82 -156 244 407 -149 -84 -154 183 -172 -11 89 -464 305 73 -185
7481 -185 216 350 -112 -26 375 17 113 281 -33 -53 284 86 163 140 415 -100 133 278 70 -14 547 -168
7503 -168 -180 78 126 118 10 106 -133 61 19 -34 -25 267 50 103 84 -144 -217 -395 -129 -79 -175 -139 25 175 -24
7528 -24 -116 -187 -93 -87 -192 -284 82 21 -155 -92 -60 -112 -86 -243 -374 107 3 -79 29 -112 -14 44 -138 -19 -40
7553 -40 -28 -118 -311 89 19 -247 -328 75 -69 -168 -243 -390 -32 -158 107 -326 160 -61 56 -124 346 92
7575 92 114 367 -116 -211 121 -124 -391 126 -85 -32 -64 340 -191 -112 80 76 141 48 145 -131 200 120 20 152
7599 152 4 134 -84 106 -152 51 117 447 -122 383 133 64 50 218 -17 -52 -149 135 154 159 142 225 124
7622 124 57 -10 -14 -48 -118 -152 16 23 -205 200 -36 11 -32 187 -123 265 -107 -235 -61 -12 2 190 -101 -53 -93
7647 -93 -49 51 -199 27 -65 -463 -135 103 62 -117 69 154 -253 91 -14 -39 115 -23 -313 -191 132 -285
7669 -285 191 88 235 -84 -294 -133 71 66 228 -113 3 207 -307 -131 -61 -65 -352 151 -107 -113 168 194 127
7692 127 -23 -25 -85 108 315 -92 -42 146 26 -276 -77 -305 -178 -356 -36 193 -288 -109 67 -109 20
7713 20 -13 151 429 213 -108 -89 503 -76 266 233 -54 -52 69 -33 -8 175 -72 -139 -53 278 121 -20 225
7736 225 176 -290 -40 145 137 10 178 30 239 191 -353 -211 220 -285 -41 171 158 -251 -111 -6 -227 -41
7758 -41 -68 -278 218 125 -22 -30 -152 249 -295 33 323 -309 -12 71 231 -292 0 29 84 292 158 -245 324
7781 324 -67 -387 304 0 -33 319 86 -176 63 226 226 -185 6 88 -308 350 214 -262 132 178 -94 -176
7803 -176 57 -161 -329 16 183 -156 -6 -261 -316 -289 237 -8 -84 114 -58 -492 -109 -88 -161 258 505 37
7825 37 -70 130 305 58 138 67 318 332 235 67 -21 521 32 -259 368 92 -32 -2 125 103 153 227 -29
7848 -29 -23 -226 -162 -155 343 29 189 19 -59 -303 27 -98 21 205 487 -168 -343 19 -13 52 412 92 -262
7871 -262 88 -79 81 -280 284 -318 -321 306 -11 15 130 353 46 -18 219 54 -172 189 -24 -129 139
7892 139 -243 94 280 14 -78 308 97 55 375 14 117 -28 -125 86 -86 -4 9 -94 131 27 -315 -17
7914 -17 -27 -136 -313 143 272 -28 -112 171 -208 -144 -209 -285 -230 63 -464 66 231 -209 -185 31 -93 -205 232
7937 232 -125 -79 -57 -358 -78 -195 -73 -123 -73 -224 -187 -488 -33 9 46 119 -109 -168 -254 20 10 -7 89 172 -188
7962 -188 167 235 97 -22 99 -118 -93 288 -128 -132 -4 138 -76 -75 140 -215 12 -109 79 96 351 87
7984 87 -39 182 207 -432 292 78 -230 183 216 -112 31 20 -234 8 -1 177 177 26 200 5 267 127 -180
8007 -180 -108 179 175 86 332 -212 7 223 160 142 -6 19 -87 254 174 -138 -181 75 -90 9 71 201 84 -37
8031 -37 272 -152 -146 16 -186 62 -261 -161 -247 18 252 -204 -150 188 150 -229 171 -269 -92 164 43 -429
8053 -429 -5 -54 -265 20 167 -189 -307 109 -270 5 -107 -33 -283 -189 97 -236 280 62 -112 -125 -37 -180
8075 -180 -176 32 74 -6 -44 -33 19 301 38 66 -26 -38 -113 -103 121 56 -43 262 6 -211 -8 247 81 -17 12
8100 12 -1 -247 138 222 -205 264 193 -222 -147 37 244 -401 -221 -21 -209 333 236 -250 133 167 8 170
8122 170 126 -165 98 400 81 -121 195 288 -256 117 188 -151 -18 155 -59 61 8 -269 44 183 -314
8143 -314 -272 24 238 -150 236 -159 -165 169 -56 -61 -351 106 48 -68 -67 6 -99 13 -364 -195 -272 49 -272
8166 -272 -234 41 -37 -143 315 4 -340 -91 16 -160 241 -150 -172 89 511 59 -10 -31 -36 -5 374 -49 -310
8189 -310 -70 -1
8191a
$$ Imaginary data points
##PAGE= N=2
##DATA TABLE= (X++(I..I)), XYDATA
0 0 0 0 0 0 0 0 0 0 0 8 -8 8 -8 8 -16 16 -16 24 -24 32 -37 40 -48 55 -64 72 -82 93 -105 117 -133 149 -168
33 -168 187 -208 232 -259 285 -317 352 -389 432 -478 528 -587 651 -726 807 -905 1018 -1153
51 -1153 1315 -1517 1775 -2118 2597 -3317 4518 -6884 13343 -66900 -218779 -100025 -14593
64 -14593 -34790 -61056 -57235 -85331 -88603 -83192 -101632 -110604 -79876 -47916 -19703 -39772 -115897
77 -115897 -136385 -65341 -44116 -74979 -45716 -4681 -39922 -79248 -84512 -84069 -42454 18493 -4603
90 -4603 -59658 -50547 -30578 -38355 -25028 -23182 -48707 -21185 28601 -1586 -53822 -50158 -31862
103 -31862 -13423 19585 8989 -36418 -34877 -12776 -16271 -5566 6885 -18613 -25273 1069 -193
116 -193 -3183 16672 -6361 -36811 11879 51301 7268 -13158 24307 29098 19506 41201 38185
129 38185 11506 25673 55699 62402 62881 49168 36004 60620 69841 39063 60687 119488 94123
142 94123 31354 44963 80841 80132 83210 77981 51208 65785 99535 75470 33827 29420 40532
155 40532 72941 109015 62695 -20422 -7951 52556 49577 18432 8403 2590 11673 19255 -18119
168 -18119 -48639 -22781 -3068 -14244 -15816 -32468 -65479 -49950 -27723 -62706 -74570 -25653
180 -25653 -15491 -59000 -81482 -84457 -72402 -28761 -19239 -68914 -85280 -47784 -34054 -48059
192 -48059 -58234 -69470 -51527 -5592 -9598 -53203 -56375 -41456 -39545 -11550 8795 -26798 -43072
205 -43072 -9010 -8105 -32353 -15429 3761 -7630 -6624 -1542 -11772 -6475 -1274 -22588 -12872
218 -12872 25288 14097 -17569 -7208 -3749 -20805 -1441 22923 5462 -7393 -140 -7497 -6035
231 -6035 9106 449 -2106 21772 13052 -11440 13050 28259 -8791 -11475 34765 46271 27343
244 27343 15925 398 2740 42958 57108 31969 25816 32043 30753 47272 51566 17027 18056
257 18056 67447 73748 38373 27456 28579 29395 53190 57126 29239 33826 56874 33323 6155
270 6155 18874 30992 33956 42372 21909 -9517 6258 26968 6215 -8643 -2281 -3841 7980
283 7980 18952 -21617 -57970 -25368 9305 -5870 -24683 -34841 -42806 -25573 -13400 -40221
295 -40221 -50428 -26638 -26416 -37714 -26506 -34529 -56915 -37050 -15170 -37665 -46168 -23892 -23237
308 -23237 -34632 -32399 -35087 -28698 -10549 -23030 -42983 -18463 1088 -20654 -25497 -11299 -24309
321 -24309 -25881 2890 5784 -14338 -10912 -7547 -15363 -5187 753 -10309 1159 16925 -2103
334 -2103 -10639 5727 -4240 -18161 8346 28914 15381 6488 -1425 -16657 -689 25767 16529
347 16529 8396 22876 16797 1213 8435 6632 -537 25391 45992 25238 10015 12334 3514
360 3514 9235 32687 29075 22279 41031 34947 -1113 -2487 22501 30659 36946 38318 16820 11458
374 11458 25979 15489 1604 19554 30683 25343 33369 23153 -15262 -13247 24446 27945 11510
387 11510 11260 7400 1804 6133 -5681 -17586 5558 19628 -896 -7072 -1264 -18712 -23017 40
401 40 -2504 -18982 -6407 12 -18606 -25046 -21914 -22560 -8209 -902 -24561 -30268 -8704 -14235
415 -14235 -31374 -20179 -15069 -26338 -15715 -6535 -24550 -29103 -16949 -21273 -22335 -10720 -18204
428 -18204 -26177 -9604 -9794 -28080 -19717 -8349 -20736 -18764 -3111 -9472 -14637 -6023 -15209 -21864
442 -21864 -2076 2447 -11758 -3638 6800 -7057 -8692 3151 -2203 -1912 14981 11763 1485
455 1485 9942 8476 -2351 12120 22929 9495 14379 30697 14451 -142 15718 23943 19480
468 19480 24540 22854 14015 22921 23986 7555 13448 30268 20798 15998 28643 16100 -2017 13777
482 13777 25343 11765 10866 17201 9678 8431 9588 -3508 -522 17923 8963 -6321 4159 4732
496 4732 -11469 -4800 5587 -7117 -7487 5001 -3878 -13621 -7324 -9283 -11008 2315 -1824 -17773
510 -17773 -7663 2005 -13190 -15120 -1229 -5590 -9032 1573 -4847 -15468 -4460 -935 -10767
523 -10767 -2866 3826 -9315 -8232 3057 -6792 -12672 1214 555 -7986 -1387 -2623 -12709 -4091
537 -4091 544 -13085 -8934 5048 -6860 -16857 -4334 -5580 -15728 -6814 -2405 -12852 -10150 -6777
551 -6777 -15992 -11465 -3145 -13660 -13716 1855 -6010 -20188 -6594 803 -12018 -7174 3857 -3030
565 -3030 -4395 1939 -3662 -2831 9352 4730 -178 14319 13114 -1339 7992 20215 8657 8570 23069
580 23069 18566 10921 18194 16260 11690 21801 22002 12327 20501 24609 9486 10263 22376 13615 7851
595 7851 19971 17058 4529 9582 10071 -61 5819 10545 -646 70 7910 -4328 -12417 -1608
609 -1608 -3364 -11344 -3862 -3430 -15035 -11592 -8744 -19508 -16199 -5109 -13521 -18273 -7001 -12953
623 -12953 -24592 -14022 -7925 -16288 -11996 -4651 -12626 -12740 -7491 -14524 -12202 2581 -2785 -11833
637 -11833 -161 1525 -11542 -5628 6047 -983 -1297 7868 2205 -2930 3471 1197 -1056 10739
651 10739 7625 -4091 4816 10991 -3951 -4460 9957 5745 -1780 5234 3152 -5002 1154 2850
665 2850 -4349 1088 4495 -5629 -2361 5355 -5304 -9174 5169 3118 -8290 -1370 3080 -4186
679 -4186 436 4793 -3948 -1478 8545 1054 -2249 9380 8179 664 9082 10105 947 8008 16306
694 16306 9233 9349 16090 8722 7019 16984 13113 6741 18503 20883 7087 7839 14378 8292 9127
709 9127 16402 9221 5918 12261 4269 -4154 6154 7947 -2320 2849 6321 -8249 -12324 -2121
723 -2121 -5789 -11586 -5136 -6843 -12911 -10897 -16585 -24057 -12581 -6001 -19086 -19602 -10457 -19801 -26271
738 -26271 -15068 -14355 -20841 -12830 -10230 -20258 -19602 -14631 -17120 -11023 -3080 -12932 -15071 -2926 -6753
753 -6753 -15716 -5067 2238 -3316 -134 2836 -5789 -3571 7410 3612 1874 10874 7407 560 8622
768 8622 9633 509 8161 17303 8791 4959 10282 6216 5546 13884 10267 3830 11849 11952 896
783 896 3953 10917 5097 5757 12067 4452 -118 7039 4640 -72 8567 8647 -747 4479 8835 -2135
799 -2135 -1217 11224 6660 -212 6631 6306 61 4477 6242 2939 9048 11137 637 2711 11635
814 11635 4206 1196 11969 9794 1165 7839 9701 46 2878 9879 5034 4507 7048 -1018 -1820
829 -1820 7604 2191 -7121 1761 5483 -4867 -5870 -2482 -9320 -7673 -734 -7647 -13322 -7211 -9986
844 -9986 -15098 -9447 -11814 -19068 -10819 -5505 -18116 -21415 -12973 -14602 -16574 -10589 -15001 -20057 -10760
859 -10760 -9318 -19403 -15912 -8094 -11068 -10133 -4699 -11884 -14489 -3790 -2560 -7503 -2201 -817 -4338
874 -4338 2247 4027 -5971 -1462 12190 7410 1094 8335 7548 2180 9685 12754 6149 10133 15261
889 15261 8850 8255 12777 6536 7702 19269 14806 4426 9555 12817 5828 8588 13273 7731 7743
904 7743 11936 5033 2194 8565 5606 2068 11378 9579 -3195 -324 7848 1627 916 6938 2955
919 2955 -1011 4221 1539 -4033 1929 4742 -316 3761 4136 -6645 -4119 7062 3138 -2155 3098
934 3098 622 -3811 1896 837 -6001 1550 8363 -1265 -5718 -1474 -5177 -4358 5799 2212 -7554
949 -7554 -4104 -1344 -7386 -6288 -3583 -6976 -1818 2917 -9736 -17991 -8400 -4844 -7511 -2818 -4302
964 -4302 -13806 -10966 -6941 -14363 -12929 -3844 -4560 -6495 -4433 -14077 -21021 -7062 1395 -5917 -5889 -2206
980 -2206 -8112 -9747 -5051 -7955 -5180 6210 5423 -2698 -2714 -5348 -8506 4433 13063 3755 809
995 809 8173 3260 -2156 3590 5989 6847 15614 13713 1080 919 6089 5053 10787 17132 8651 3864
1011 3864 10880 8439 851 6059 11250 10087 13070 10594 -1572 -425 10008 8626 5561 9939
1025 9939 5688 225 6384 6374 -1858 2050 10391 5690 2480 2725 -4090 -2506 9282 6318 -3926
1040 -3926 -568 2309 -2443 -399 1728 -4080 -1721 5045 -2017 -8156 -3704 -3297 -3411 3847 -252
1055 -252 -12508 -8596 247 -4907 -7908 -2219 -4829 -6754 -3269 -9369 -15277 -6543 -747 -4654 -4189
1070 -4189 -6267 -15826 -11860 -1197 -5349 -10374 -2945 -2169 -8079 -7369 -9245 -12418 -2246 5466 -2257
1085 -2257 -6539 -4257 -8183 -6420 3404 870 -4358 3041 5738 -3227 -5546 -1541 -356 6548 12103
1100 12103 2175 -4592 2500 3974 725 5583 5951 2238 7764 9961 -1470 -4284 4414 7094 7731
1115 7731 9640 1458 -4918 4827 8291 -309 225 7073 4933 4555 4400 -3640 -4507 6675 8118 1371
1131 1371 3041 1877 -2180 4180 6158 -2791 -1271 9943 7350 -127 411 224 948 8646 8004 -1259
1147 -1259 1672 6949 2806 2318 5300 84 681 11004 7810 -3155 -1377 3587 2108 4693 4586
1162 4586 -3552 -1711 4889 -683 -5190 -704 -1890 -4197 1752 202 -10524 -8740 -1794 -5456 -6642
1177 -6642 -4140 -8423 -9428 -3705 -8134 -14698 -7852 -3945 -8068 -7110 -6807 -13801 -10952 -2175 -5799
1192 -5799 -10296 -5413 -4647 -6277 -2238 -4905 -11359 -2914 6691 885 -3984 -1774 -2327 541 8142
1207 8142 3782 -2631 4059 9163 4711 4937 4783 721 7031 15428 7231 -233 5946 9270 6545
1222 6545 7740 5884 1930 8026 11148 2067 -378 6219 5111 3516 5515 -505 -5116 4657 7741
1237 7741 -2358 -5426 -1281 -1595 777 1262 -7273 -7836 2523 1480 -7375 -6331 -5021 -5626 1734
1252 1734 4007 -6548 -9126 -1580 -1540 -3186 1044 -683 -1803 3874 1886 -6738 -3097 3997 2693
1267 2693 4105 7452 1234 -2768 3007 2484 -392 6145 9563 4256 3226 1999 -5358 -2247 8358
1282 8358 6966 2184 3418 1 -5690 -1054 -141 -4226 442 5809 -407 -4551 -5672 -11604 -9737
1297 -9737 3009 3936 -5018 -6250 -7002 -10204 -6606 -3723 -7863 -4391 2433 -2663 -9511 -7701 -8235
1312 -8235 -6671 3168 4477 -4847 -4199 1192 -3130 -4023 893 1926 5176 9196 2152 -5163 1869
1327 1869 8108 5072 6537 7596 3288 6466 12098 4776 -1079 6325 11316 9763 9274 4043 -990
1342 -990 6459 11995 3727 40 4499 4064 3024 6231 737 -4667 1546 3703 -2800 -2282 359 -2863
1358 -2863 -2131 94 -7025 -9319 -1567 -1581 -6881 -4613 -3039 -7233 -5625 -5379 -10565 -6975 1290 -1570
1374 -1570 -6612 -5102 -7718 -8998 -989 1592 -4462 -3008 587 -3219 -3671 -916 -3675 -1825 6214
1389 6214 4980 -1035 71 -840 -4679 2229 8700 3508 1053 3730 592 -1267 2546 1379 412
1404 412 6303 6343 -1433 -1312 786 -2863 -238 5874 1352 -1880 2432 -418 -6719 -3024 1016 -10
1420 -10 2617 1563 -6934 -5702 1889 -477 -4188 -73 123 -1512 2364 58 -7495 -3510 4740 3489
1436 3489 1692 1868 -2757 -1669 6040 3445 -1824 3529 6939 3060 3523 3847 -90 3337 9274 4844
1452 4844 1937 6713 5802 1587 4732 4862 1819 5921 9081 1957 -900 3912 3260 2497 4534 426
1468 426 -2220 3625 4063 -3385 -2976 775 -1900 -978 2161 -4012 -7183 -2236 -1915 -5259 -3061 -3093 -7465
1485 -7465 -4820 -2443 -7816 -7285 -2203 -5523 -7473 -2587 -4261 -8509 -4881 -3462 -6720 -3361 -742
1500 -742 -5699 -5336 -1196 -4724 -5021 931 -775 -4851 -619 732 -3734 -1214 2395 -1870 -840 3816
1516 3816 1430 -742 2479 469 -2164 4216 5483 -184 594 3679 715 1315 4396 708 -328
1531 -328 5264 4275 -436 2073 2299 -1240 2863 5740 517 264 4769 1583 -1296 2298 1545 196
1547 196 4772 3732 -1291 1197 4079 -440 -298 4421 2403 1676 5418 2438 -2865 1065 4263 1813
1563 1813 3807 4726 105 1216 4988 107 -2287 4320 4992 1726 3927 2705 -2671 -77 3363
1578 3363 454 1431 4984 931 -1853 940 -1828 -3938 2054 3688 -1977 -852 528 -4801 -4771 -784
1594 -784 -2811 -2757 1599 -1205 -6669 -4313 -4117 -6872 -3003 580 -3969 -5001 -2013 -5889 -8180 -3402
1610 -3402 -3285 -4707 -515 -1232 -6769 -5280 -2844 -6243 -4435 887 -1319 -3667 -963 -2967 -6138
1625 -6138 -2059 -183 -2122 499 2577 -2443 -2624 872 -1823 -2359 3507 3384 -514 2051 1617 -2348
1641 -2348 231 3288 1261 2706 6095 1940 -565 2961 1424 -565 4618 7130 2254 3166 4704
1656 4704 202 582 4951 3586 3592 7364 4552 192 3045 3172 689 4295 7954 3748 2545 5155
1672 5155 1727 -177 4284 4602 2896 5657 4657 -537 1105 3130 -635 1112 5688 2633 -628
1687 -628 1939 -280 -3300 416 1722 -1361 318 1587 -3651 -3840 -694 -3367 -4235 130 -903 -5107
1703 -5107 -2955 -2815 -6962 -4754 -1752 -4128 -3673 -1548 -5778 -7165 -2654 -3473 -6515 -3168 -2072 -4751
1719 -4751 -3166 -2119 -6286 -5092 -369 -2572 -3292 -132 -1775 -4091 -302 -521 -4394 -810 2627
1734 2627 -923 -1793 1362 -1121 -1836 1790 590 -1759 2412 3202 -1312 -766 1037 -1495 679 4478
1750 4478 377 -1749 1936 1506 -1649 596 618 -1268 2159 3861 -1695 -2010 2109 399 -660 2745
1766 2745 1815 -882 2458 2436 -1596 986 4245 1742 2172 4346 1265 1003 4820 3533 729 4785
1782 4785 6564 3237 4009 5028 1886 3985 7642 4798 2782 6092 5130 2259 4802 5245 1950 4131
1798 4131 6081 1809 1279 3616 1120 -124 2967 1672 -1220 1135 -368 -4894 -2234 494 -3120
1813 -3120 -4403 -1914 -4646 -6301 -3507 -5750 -7946 -4210 -3044 -7448 -6491 -5852 -8747 -6759 -3434
1828 -3434 -6225 -7707 -3307 -4420 -7883 -5887 -3922 -4779 -1842 -1221 -5347 -3977 -164 -2120 -3186
1843 -3186 668 757 -133 3075 1646 -3022 262 4879 2722 2431 4110 1800 1310 4491 2381 -183
1859 -183 4512 6446 2739 2192 2346 21 1532 4698 1120 23 3603 1857 -2319 -648 67 -1329
1875 -1329 1796 2911 -2610 -3365 461 -981 -2573 -166 -650 -1331 1847 -138 -4503 -1573 2246 -35
1891 -35 -33 2297 47 -66 3533 1887 -160 3710 5216 2080 3125 4547 2245 4243 6964 3156
1907 3156 2265 7106 6122 3076 4526 5111 3076 4508 4890 801 1272 5484 2933 325 1746 -140
1923 -140 -1813 1345 790 -3553 -1092 555 -4087 -5587 -4094 -5203 -4298 -1788 -4951 -8349 -5820 -5429
1939 -5429 -8986 -7223 -4720 -5723 -4794 -4198 -8975 -9643 -4307 -3536 -5176 -3147 -2695 -4942 -3159 -2623
1955 -2623 -5533 -2652 3509 2143 -1120 100 -949 -1187 3160 3575 1320 4545 6344 1567 507
1970 507 3210 2990 4438 8136 5354 1782 3531 4313 1114 2200 4957 3835 4555 4260 -845 -2045
1986 -2045 2919 2808 611 1654 1497 -1255 -80 -352 -3295 -1398 2605 123 -2651 -1135 -2268 -2611
2002 -2611 528 87 -3185 -199 1992 -1994 -3028 -11 95 766 2786 -108 -2131 2306 3628 137
2018 137 1391 3125 2213 2791 4049 344 103 5385 4847 1204 1906 2070 1495 3623 3877 -395 605
2035 605 4077 1136 -1883 4 122 -725 1835 -712 -4542 -2517 -45 -3155 -3674 -2002 -3127 -3539
2051 -3539 -1979 -5097 -7601 -2814 -1221 -4748 -4722 -4121 -5368 -3858 -2290 -5223 -5092 -392 -1634 -4857
2067 -4857 -2920 -2188 -3199 -544 836 -2051 -634 1576 -578 -1732 1213 1887 1701 3474 1928 -744
2083 -744 2400 4956 1673 1370 4388 3592 2562 3717 1402 257 4411 4979 1442 1601 3047 1499
2099 1499 2001 2833 -86 452 3934 2196 -1980 -206 1212 152 1035 797 -2219 -509 2953 -607
2115 -607 -3370 -508 792 236 1061 -1120 -3794 -78 2504 -997 -2142 620 261 490 1514 -1758
2131 -1758 -2488 2140 3625 -821 -568 1245 244 1090 1663 -1391 -451 3837 2318 -1623 -502 198
2147 198 37 1928 1930 -2110 -749 2343 -267 -2479 -783 -248 -19 1535 -802 -4177 -1972 603 -2074
2164 -2074 -2172 -358 -1928 -2709 -552 -2614 -4162 -364 78 -2480 -1886 -977 -2918 -2099 109 -2053 -1629
2181 -1629 1588 -544 -3450 -1304 -197 -978 731 1344 -1094 -454 1656 -966 -1464 1971 2200 138
2197 138 1397 434 -1319 1569 2819 254 297 3241 1422 163 870 -433 201 4408 3226 -1670
2213 -1670 -506 1867 1215 736 1606 -178 564 3575 758 -2893 -236 2619 1643 1988 603 -2206
2229 -2206 -89 3013 263 -1729 1611 2120 664 675 -1261 -2238 1912 4359 -259 -1630 246 -219
2245 -219 -35 1605 -435 -1330 2764 2162 -2281 -2439 -524 387 1513 1857 -2177 -2636 1053 69 -2387
2262 -2387 -183 534 -701 433 -550 -4035 -2528 1272 -179 -1336 -503 -1514 -2728 -401 -678 -2892
2278 -2892 -384 1434 -1738 -2237 -625 -1912 -1506 1229 182 -1527 129 -674 -2615 -116 1590 -469
2294 -469 -311 1180 -900 -1288 1167 -89 -1214 1724 2138 -810 -611 234 -872 1099 2917 16
2310 16 -1062 1865 842 -1221 261 973 397 2382 1734 -2302 -1789 2117 1141 31 1126 -302 -472
2327 -472 1958 675 -2578 -298 2652 1693 170 -298 -1934 -505 3038 1374 -1610 563 1993 -92
2343 -92 367 159 -1425 1521 4068 182 -2144 476 903 521 1749 520 -1382 1880 2530 -989 -1577
2360 -1577 1167 1243 1149 1727 -547 -2126 1244 1838 -915 -582 579 -473 214 902 -1848 -1726 1218
2377 1218 340 -1495 -512 -895 -2014 -206 382 -2252 -1259 622 -1404 -2157 -102 -1408 -2299 312 -207
2394 -207 -2361 -658 117 -1807 -1178 605 -1557 -1675 806 -479 -1521 310 -214 -1746 300 1591
2410 1591 -1115 -1121 488 -245 4 1744 -444 -1656 1516 1543 -970 -390 824 -266 1270 2239 -914
2427 -914 -1134 2031 1508 -482 697 494 -147 1738 1781 -1677 -455 2333 799 -254 686 -400 -401 2064
2445 2064 598 -1717 166 1988 353 -71 597 -1249 -148 2537 455 -1923 269 1140 191 820
2461 820 530 -1237 440 2641 -236 -1593 795 593 -25 1321 115 -1542 411 1720 -387 -435
2477 -435 1418 -63 -325 1323 -589 -1266 1753 1305 -1089 -27 987 -1174 1 1422 -695 -468
2493 -468 1710 500 -1063 15 75 -1007 851 1482 -1336 -1440 338 -1426 -1416 1009 -339 -1508 265
2510 265 -302 -2066 -962 -146 -1625 -186 1376 -1339 -2314 -781 -1028 -1808 653 349 -1759 -413 170
2527 170 -2349 -1478 699 -859 -297 779 -608 -2208 117 613 -1181 297 1332 -349 474 778
2543 778 -1706 -790 2019 1456 -324 1070 532 -866 1201 1437 -478 502 2567 1044 35 1024 79
2560 79 -329 2142 1821 -604 529 1677 -589 119 1347 -277 -164 2004 467 -1035 605 809 -762
2577 -762 416 827 -1313 42 1855 -772 -1509 718 210 -746 909 166 -1235 206 1034 -1469 -732
2594 -732 918 -776 -210 1502 32 -1670 472 705 -1031 580 1628 -178 459 1753 -532 -1152
2610 -1152 1420 733 -500 1836 1176 -931 -78 965 -774 -143 1521 -228 -735 788 -877 -1739
2626 -1739 602 618 -992 563 737 -1662 -1154 20 -1373 -1137 901 -246 -1542 -117 -707 -2735
2642 -2735 -673 97 -1874 -935 464 -1511 -1949 -291 -1037 -1694 166 368 -1855 -732 48 -1670 -433
2659 -433 1088 -992 -607 854 -216 -1473 706 617 -864 712 1694 -674 -146 1189 -308 -344 1418
2676 1418 635 196 1431 1334 -866 843 1687 -59 483 1864 140 -264 1716 416 -757 1083 1293
2693 1293 -400 872 1404 -757 -20 1474 -219 -488 1683 645 -892 981 142 -1211 687 1196
2709 1196 -629 75 1031 -444 -642 996 -156 -762 1131 569 -1245 460 744 -722 -79 1618 -273
2726 -273 -681 952 -76 -1027 677 857 -682 774 706 -958 -281 1328 -351 -348 1316 139 -604 754
2744 754 263 -1402 223 1516 -862 -522 756 -874 -1129 678 -441 -1489 424 349 -1592 -409
2760 -409 -266 -1609 -860 1030 -1073 -1854 390 -771 -1726 -315 -446 -1959 -44 300 -1752 -1374 197
2777 197 -1132 -1175 828 -493 -1550 181 164 -1435 -156 748 -578 279 1448 -619 -1371 1288 449
2794 449 -768 1478 1398 -432 422 1353 -411 21 2154 698 499 1655 711 -685 1343 1305 -120
2811 -120 1355 2037 251 507 1719 -238 -57 2123 1197 -494 1160 801 -807 595 1011 -1032 -5
2828 -5 1658 125 -775 436 -850 -1308 985 358 -1489 -44 905 -983 -541 694 -1137 -1046 1506
2845 1506 425 -1100 294 273 -1106 364 711 -860 345 1701 -631 -911 461 -617 -663 1134
2861 1134 785 -1160 398 949 -1304 -1299 415 -23 343 1542 -302 -2234 -441 -261 -960 292 656
2878 656 -1345 -740 268 -1824 -2067 143 -32 -928 591 -889 -2704 -1368 110 -1780 -640 829
2894 829 -774 -1072 -25 -1909 -2176 951 959 -878 82 -121 -1490 -730 897 -552 -185 1947 720
2911 720 -411 177 -180 -699 1448 2329 -140 571 1633 -376 191 1617 453 88 2164 1462 -111
2928 -111 378 1017 -101 1050 2314 74 -123 1622 533 -558 737 772 -251 891 1183 -1071 -374
2945 -374 1219 -485 -465 664 -320 -656 1186 520 -1674 -352 723 -1033 84 1025 -740 -526 1020
2962 1020 -459 -1581 423 315 -307 846 1155 -1277 -497 998 -562 -715 1074 139 -649 697 -137
2979 -137 -1787 -166 816 -737 -190 525 -1211 -1236 439 -740 -1690 290 255 -1072 -386 -631 -2138 -809
2997 -809 712 -738 -1259 -25 -1087 -2094 -400 -979 -1702 -21 720 -1409 -1145 -197 -1243 -672 1191
3014 1191 -511 -1250 605 237 -1480 25 732 -492 954 1462 -552 -817 1143 458 42 1524 464
3031 464 -674 930 1346 -542 405 1911 661 762 2059 -40 -579 1298 996 -504 907 1652 -270
3048 -270 479 1032 -626 -254 1733 394 -377 582 517 -1229 349 449 -1100 70 1561 -618 -902
3065 -902 660 -479 -983 1177 419 -1153 165 517 -1218 -460 868 -740 -202 1280 213 -868
3081 -868 552 208 -668 668 1292 -710 -191 882 -619 -172 902 125 -541 742 -94 -1425 -87
3098 -87 607 -1042 214 477 -1213 -1063 383 -520 -1199 444 -114 -822 -181 19 -2104 -748 786 -663
3116 -663 -701 345 -978 -1160 263 -62 -1768 509 807 -768 -609 198 -780 -382 1307 267 -897
3133 -897 884 765 -810 640 788 -429 915 1412 -332 -480 1674 600 -145 1234 616 -411 771
3150 771 1399 -394 289 1140 -374 -293 710 -243 -442 1515 716 -1084 -30 394 -656 -127 1037 -547
3168 -547 -243 579 -1087 -1549 285 359 -677 671 476 -1078 -758 134 -1102 -498 1075 -80 -987 -87
3186 -87 -761 -1307 258 793 -409 -78 1222 -1059 -1491 609 229 319 1346 426 -1189 -142 500 -846
3204 -846 215 1587 54 66 975 -1018 -1314 574 839 -337 723 654 -1075 -415 786 -812 -222
3221 -222 1400 614 -389 -40 -82 -1102 611 877 -324 187 1255 -603 -511 568 -158 -142 1710 523
3239 523 -997 74 905 -598 163 1234 -24 -283 1068 -13 -968 1095 645 -424 354 652 -350
3256 -350 335 1374 -543 -393 1231 -363 -800 676 304 -442 928 335 -1102 -62 1084 -468 -375
3273 -375 618 -104 -673 677 -494 -1433 365 614 -858 -398 -287 -1206 -569 595 -586 -787 445 -96
3291 -96 -1769 -643 -91 -969 220 433 -1173 -1312 275 -553 -1497 188 -305 -787 652 -69 -1702 -706
3309 -706 827 -411 -278 772 -647 -1041 398 -223 -847 384 1001 -578 -250 604 -679 -272 859
3326 859 -78 -341 1108 605 -662 221 979 -220 755 1632 -89 -128 1100 570 -51 1198 630 6
3344 6 1147 1260 -251 635 1687 297 229 1852 738 125 984 615 -378 1006 1269 -477 110 896
3362 896 100 11 1086 -133 -745 1244 393 -881 189 263 -372 310 641 -1119 -613 846 -282 -1227
3380 -1227 285 351 -785 -223 -239 -1477 -104 555 -790 -1106 274 -247 -949 383 -998 -1632 426
3397 426 659 -1046 -686 -126 -781 -518 527 -876 -1122 212 -73 -1450 -407 -215 -877 18 414 -1271
3415 -1271 -697 555 -451 -1426 137 -472 -583 237 -131 -1480 -359 680 -373 -531 94 -607 -717
3432 -717 446 -205 -1258 374 905 -366 26 620 -528 -49 1345 118 -110 1080 730 -316 1103
3449 1103 1177 183 654 1430 363 718 1842 591 254 1674 1226 561 1325 1494 286 1196 1733 263
3467 263 533 1332 620 286 1457 773 53 1042 675 -525 316 1211 255 178 1019 -371 -691 734 13
3486 13 -1179 148 690 -848 -452 -545 -1748 -1037 660 -530 -1326 -358 -823 -1303 -470 -555 -1339 -170 84
3505 84 -1386 -1586 -659 -1210 -1007 -134 -920 -1652 -588 -16 -1596 -1032 -90 -881 -350 135 -1207 -1289 203
3524 203 36 -1397 -331 -11 -1085 -44 -169 -1363 -797 728 -145 -535 45 -291 -1134 178 627 -599
3542 -599 213 876 -513 -425 591 80 -177 1078 346 -489 670 703 -132 559 1151 300 524 1348 313
3561 313 -12 1491 783 85 1206 1374 54 746 1838 599 750 1406 478 34 1573 1299 -147 966
3579 966 1451 104 1112 1564 -204 940 1809 976 200 1054 314 -37 880 1002 -308 451 1440 -50
3597 -50 92 763 -5 -263 1108 133 -867 359 662 -743 -267 135 -874 -422 -70 -1019 -1384 -167
3615 -167 -807 -1535 -549 -733 -1936 -1081 -376 -1750 -1521 -619 -1391 -1824 -825 -1744 -2304 -1031 -687 -1971 -1618
3634 -1618 -703 -1620 -1480 -498 -1399 -1610 -273 -719 -1500 -637 -340 -1442 -722 -3 -1254 -601 611 -483
3652 -483 -651 734 374 -422 775 957 -360 558 1375 376 646 1260 858 518 1858 1089 200 1614
3670 1614 1554 443 1217 1627 566 882 1652 727 673 1470 1037 71 1368 1122 228 900 1104 -151 436
3689 436 1272 259 233 1071 505 -187 743 755 -197 419 1132 -214 301 1075 244 -76 1060 420 -506 829
3709 829 644 -185 517 986 286 110 928 66 -44 969 -4 -460 582 449 -804 177 323 -700 -531
3728 -531 188 -743 -763 -50 -539 -1219 -506 -434 -1378 -764 -690 -1854 -1545 -602 -1755 -1990 -813 -1578 -1844 -1073
3748 -1073 -1253 -2443 -1469 -1177 -1963 -1679 -513 -1428 -1763 -375 -1044 -1770 -529 -389 -1605 -537 96 -781
3766 -781 -496 622 -159 -358 1056 383 -203 1065 818 -46 758 1181 140 867 1316 763 856 1641 1046
3785 1046 769 1493 1692 655 1181 1694 653 907 1738 653 403 1483 986 703 817 931 -77 1026
3803 1026 992 5 184 890 20 -320 509 337 -192 625 516 -466 -124 568 -311 -104 435 -301 -280 663
3823 663 403 -548 201 522 -449 393 454 -624 -48 1017 -233 -410 212 -128 -480 226 -207 -879 -155
3842 -155 350 -549 -259 169 -607 -1143 328 -525 -1286 -125 -80 -1129 -798 -324 -1366 -879 -12 -943 -1211
3861 -1211 -219 -1057 -1762 -559 -544 -1433 -808 -519 -1492 -999 -426 -1078 -1023 -369 -533 -1152 -50 -134 -692 140
3881 140 182 -428 -28 534 -291 -53 807 247 155 696 653 -242 409 1358 165 293 1244 450 410 1231 1051
3902 1051 -47 1132 1088 433 557 1034 -54 873 1406 417 -26 1031 876 -141 817 337 510 979
3920 979 827 -416 -202 804 469 375 853 212 -684 539 276 -756 192 586 223 -104 429 -637 -658
3939 -658 808 224 -695 -227 -21 -765 -421 -296 -816 -295 456 -408 -1040 -405 -420 -813 -119 -625 -1221 -329
3959 -329 190 -1081 -1035 -376 -814 -541 103 -715 -1311 -152 -142 -923 -348 159 -946 -600 355 -826 -676
3978 -676 182 -311 -690 204 449 -430 58 640 -445 165 746 -190 -322 545 456 -221 479 605 -405 313
3998 313 726 -216 614 1093 -85 -147 615 504 47 585 374 -673 503 988 22 107 512 -275 -61 1116
4018 1116 345 -695 656 734 -147 224 284 -246 477 1104 -153 -255 839 479 59 399 307 -161 1091
4037 1091 551 -286 -108 913 188 -134 605 224 -231 783 869 -962 -70 733 191 -135 208 -753 -445
4056 -445 697 236 -955 -370 -503 -1034 -122 98 -1476 -943 165 -691 -865 -395 -655 -1134 -257 -511 -1238
4075 -1238 -481 -265 -1325 -782 421 -527 -882 -75 -696 -1061 400 151 -678 -121 261 -718 -610 287 -153
4094 -153 -156 831 387 -418 518 600 -152 262 1190 299 441 878 -203 234 1465 902 29 420 563 249
4114 249 735 887 -169 243 1280 464 -104 612 102 -104 1087 865 -602 136 795 -236 -332 442 -57
4133 -57 -155 768 -870 -1257 78 535 -558 -85 35 -473 67 589 -755 -999 656 590 -113 135 -205
4152 -205 -569 542 810 -406 -401 434 55 -440 549 -496 -331 524 402 -648 338 526 -351 -330 374 -205
4172 -205 -317 584 -450 -799 263 211 -519 -266 -15 -1242 -545 430 -386 -1179 101 -620 -991 -49 -511
4191 -511 -1015 -279 -90 -880 -356 180 -950 -680 249 -123 -595 -158 -332 -753 225 564 -485 -74 450
4210 450 23 -264 799 161 -424 697 1398 87 821 580 190 542 1252 653 86 1094 512 -214 849
4229 849 891 306 1056 917 -409 232 1151 431 143 759 455 43 735 -69 -579 275 761 -448 -236 199
4249 199 -422 -512 551 -50 -920 102 502 -792 -204 30 -660 -457 230 -547 -740 -18 -497 -1014 -525
4268 -525 -459 -899 -195 -146 -1070 -943 290 -506 -794 -131 -554 -1004 157 -262 -1053 -410 142 -735 -665 -48
4288 -48 -840 -903 108 -337 -605 -5 -312 -462 -188 501 -395 -102 248 -506 -310 799 -110 -403 326 584
4308 584 -20 426 328 -487 385 833 404 -200 621 231 -34 596 521 -102 341 712 -93 351 675 111 258
4329 258 756 254 214 1014 871 -372 310 521 219 192 781 -185 61 1023 531 -243 530 713 -84 430
4349 430 639 -217 306 1073 22 311 627 189 19 718 599 -395 544 552 -332 113 409 -119 171 393
4369 393 -478 -263 575 199 -658 -413 -109 -741 -187 -3 -721 -949 161 -557 -919 -209 -756 -1461 -497 -479
4389 -479 -1316 -1068 -251 -1212 -1118 -733 -1117 -1302 -734 -604 -1076 -692 -616 -1002 -1019 -436 -974 -765 -114 -617 -924
4410 -924 -238 -40 -882 -166 209 -363 -126 377 -294 -165 683 415 -60 865 1048 141 738 718 432 656
4430 656 1415 638 518 843 953 494 1283 853 469 867 980 371 590 1015 280 650 1201 543 228 682
4450 682 906 -135 481 715 36 300 623 -28 -88 562 400 -335 475 582 -296 316 333 -450 -113 618
4470 618 -200 -279 165 -212 -241 484 235 -758 247 723 -325 -143 531 -65 98 663 102 -170 302 455
4490 455 -407 21 276 -482 -407 337 -434 -602 342 -951 -844 -203 -253 -1067 -566 -374 -1253 -817 -435 -1222
4510 -1222 -1103 -296 -1012 -1428 -700 -1265 -1204 -682 -369 -1454 -1211 -537 -1333 -912 -535 -681 -1038 -44 -311 -1176
4530 -1176 -361 130 -602 -221 486 195 66 1063 317 -422 643 837 336 903 1113 355 866 1542 937
4549 937 329 1740 1033 571 1470 1160 361 1065 1361 715 861 1305 841 308 1268 431 234 983 825 152
4569 152 260 395 -209 65 446 -277 -295 252 65 -717 -65 -469 -649 49 -214 -508 -408 -53 -719 -525
4589 -525 -27 -554 -580 80 -373 -965 -33 109 -757 -399 -18 -201 -161 229 -377 -991 299 240 -836 61
4609 61 417 -288 -19 336 -267 -244 429 -141 -288 230 132 -522 -94 238 -700 -472 -164 -512 -765 122 -676
4630 -676 -839 -258 -542 -1001 -778 -520 -1158 -682 -362 -1112 -852 -143 -714 -862 -52 -311 -654 -122 17 -481
4650 -481 -99 473 -174 54 713 447 -44 536 519 -53 777 890 433 831 1296 589 888 837 1136 561 1091
4671 1091 952 619 1074 1165 848 849 1470 580 619 1063 844 407 717 717 212 597 405 -144 297 591 -79 -539
4693 -539 192 -423 -509 159 -60 -695 -504 -103 -1044 -803 -260 -756 -951 -174 -966 -1094 -397 -377 -900 -389 -355
4714 -355 -1016 -497 -83 -808 -242 127 -266 -715 312 103 -542 213 157 -405 -316 500 -50 -350 508 33
4734 33 -342 542 308 -240 118 -51 -400 285 382 -260 -157 66 -153 -609 -201 -317 -395 -21 -76 -482 -300
4755 -300 -53 -451 -616 -17 -325 -703 -70 -83 -531 -155 -56 -373 -32 484 -422 -119 451 14 -128 291 -82
4776 -82 180 369 423 -117 234 821 143 137 674 348 -102 1031 590 215 735 1034 225 645 759 154 183
4797 183 849 352 -62 856 523 -64 492 408 -302 121 539 -357 61 495 -150 -351 -157 -75 -611 196 75
4818 75 -620 -464 225 -537 -471 201 -455 -484 -67 -444 -378 -12 -30 -659 -308 -166 -570 -611 56 -452 -367 -124
4840 -124 -79 -710 212 170 -521 -172 386 -58 -106 674 -242 -707 -50 354 -465 -29 216 -385 -255 376 -200
4861 -200 -322 316 -426 -641 187 281 -304 152 1 -258 196 148 -373 -62 213 6 -303 470 186 -567 265
4882 265 293 -219 107 522 -153 -83 482 75 -170 372 693 -154 416 279 -441 354 270 -123 -32 551 29
4903 29 -160 229 302 -357 516 544 -383 97 558 -110 175 392 14 -303 280 246 -379 35 410 -622 -46
4924 -46 529 -8 -275 318 -38 -417 214 -60 -204 3 357 -190 118 507 -344 -416 460 -158 -297 -42 228
4945 228 2 149 390 -344 123 229 -116 73 707 -2 -561 288 -58 -215 582 88 -538 -263 333 -9
4965 -9 -264 277 -90 -367 182 -223 -281 -23 1 -282 -110 210 -359 -112 91 -132 -301 134 8 -519 149
4986 149 149 -189 -10 804 81 -146 572 126 -51 256 440 -207 725 566 117 356 400 -1 359 517 -52
5007 -52 -128 518 723 -20 378 398 -343 79 437 -397 -66 342 -284 -179 50 -243 -620 -206 -50 -646 -374
5028 -374 -251 -859 -595 -163 -722 -904 -347 -297 -418 -369 -317 -723 -286 -256 -839 -701 -101 -293 -232 -57 -67 -259
5050 -259 81 202 -262 -152 491 -112 103 361 268 32 511 721 95 271 128 339 211 844 -2 195
5070 195 713 260 31 432 676 -98 236 412 -113 99 424 -197 -28 328 -72 -49 311 79 -609 98
5090 98 88 -507 115 75 -472 -453 200 -220 -286 178 22 -401 314 264 -361 -5 256 124 -212 588 211 50
5112 50 532 150 -93 364 586 -95 35 368 275 111 823 159 -79 670 312 165 191 239 -9 302 267 -132
5134 -132 -275 366 -265 -366 -148 -349 -564 -437 -449 -1022 -107 -417 -872 -435 -141 -764 -738 -42 -406 -915 -246
5155 -246 -434 -536 -179 -176 -504 -557 -173 -307 -554 92 -570 -477 269 258 -31 96 355 185 332 295 293 -43 539
5178 539 536 248 502 406 207 680 901 455 600 566 361 324 641 591 104 492 421 -85 278 626 501 -126
5200 -126 265 -5 -88 499 112 -248 -135 150 -60 158 119 -440 -251 184 -120 -330 78 -24 -320 234 -138
5221 -138 -701 16 -86 40 -228 188 -128 -294 204 -12 -283 163 268 -13 -263 181 -452 -24 269 304
5241 304 -201 270 -41 -283 24 152 -305 262 381 -149 -80 -18 -269 -145 276 -217 -462 314 -54 -287 -75
5262 -75 -79 -480 -409 25 -491 -645 -284 -19 -635 -210 -446 -592 -168 -40 -695 -139 -130 -679 -392 96 -48 -382
5284 -382 -265 319 -405 -140 218 -76 -66 215 126 -54 695 367 -128 280 650 -1 508 1052 461 423 901
5305 901 556 417 705 253 358 491 962 227 470 694 -65 518 876 445 319 664 487 -125 440 332
5325 332 270 325 476 9 34 375 38 -402 70 -115 -170 -98 -80 -361 -268 146 -458 -554 -154 -160 -187 91 -28 -613
5349 -613 -109 20 -400 -220 -20 -676 -602 177 -334 -673 -169 -428 -489 115 21 -550 -230 -76 -335 -67 88
5370 88 -139 18 261 -64 -796 -23 -80 -557 -176 79 -122 21 198 -219 -446 148 -329 -126 221 -188 -490
5391 -490 15 561 -164 -41 -184 -14 -71 -217 216 -89 141 281 -133 215 488 -124 398 340 35 -140 248
5412 248 17 -109 169 590 196 152 551 -150 317 842 648 409 566 294 524 468 550 292 642 941 274
5433 274 471 667 180 -116 674 352 -24 338 369 -223 214 246 -404 -126 187 59 -78 50 -149 37 -132
5454 -132 -82 -366 10 200 -294 -241 -100 -360 -274 -51 -441 -496 26 -268 -460 -312 55 -464 -184 0 -620
5475 -620 -342 -158 -403 -425 51 -282 -590 -688 -127 -316 -349 -18 -759 -567 98 -299 -352 -392 -28 -370 -104 145
5497 145 -293 9 103 165 -17 87 119 -100 238 143 -119 27 454 -91 121 411 17 16 381 109 -62 480
5519 480 132 47 262 229 76 65 423 168 127 476 92 -9 161 318 -326 27 542 -19 57 268 235 -5
5541 -5 572 81 -138 566 58 -296 43 158 -236 -65 234 194 -101 327 -42 -52 444 -37 -20 139 16 -245
5563 -245 -179 40 -285 -281 63 122 -61 335 -71 -350 -195 -63 -458 -94 108 -169 -254 -67 -306 -293 -43 49
5585 49 -338 4 -128 -557 -332 64 -386 -574 -70 -323 -375 -210 -81 -530 -224 -296 -198 -223 -156 -248 -320 -150 -163
5608 -163 -505 -155 -106 -216 -279 203 -466 -72 535 -68 94 63 -95 -16 -15 83 -22 81 229 -6 41 578 204
5631 204 167 611 372 -9 457 354 363 614 581 300 279 724 194 -152 423 38 -88 419 84 -164 297 415
5653 415 -412 309 232 -56 138 263 -73 -469 424 -211 -331 1 62 -436 -237 236 78 -285 304 -104 -436
5674 -436 -48 44 -306 -178 -31 -167 -104 416 -246 -146 216 59 84 24 178 -532 -356 89 26 179 153 -61
5696 -61 -107 327 -81 -113 335 23 -201 165 151 -140 -75 -127 -396 101 -114 -245 -151 137 -112 88 -167 -30
5718 -30 -525 -348 -126 -202 -118 -209 -247 -515 39 -284 -355 -254 -197 -399 -304 -23 -374 -92 221 -44 -66 215 208 -198
5742 -198 130 162 -94 -37 579 -107 171 524 247 74 417 599 323 523 359 83 331 652 287 505 607
5763 607 311 104 405 138 -229 416 267 -7 -51 247 -93 -169 232 -225 -56 -126 129 -324 -218 -108 -395
5784 -395 -134 -135 -277 -525 -176 -390 -310 85 -70 -497 -375 -85 -537 -232 -18 -185 -264 -275 -300 -484 270 154
5806 154 -535 25 310 -64 -159 423 -215 -132 77 -185 -47 217 146 80 225 162 41 -65 224 272 -143 467
5828 467 25 -380 -19 47 -214 70 120 -367 -38 -66 -210 -142 155 -77 -98 -314 -207 -281 132 57 -79 -87 254
5851 254 -147 3 125 149 -276 74 338 -186 122 528 102 211 578 -65 -120 325 214 -49 508 401 222
5872 222 285 232 -38 61 386 187 89 459 302 15 268 661 -26 194 429 -165 186 164 -4 -366 155 -7
5894 -7 -196 10 -203 -159 -167 -128 -367 -51 16 -337 -411 -31 -368 -489 183 -57 -504 -333 -135 -492 -169 -1 -450
5917 -450 -406 55 -166 -688 203 180 -186 74 -34 -328 71 214 -147 -224 153 110 -65 137 155 -221 -182 706
5939 706 -51 69 361 -46 1 144 114 -156 212 207 -258 75 229 -315 87 253 -20 222 236 153 -46 37
5961 37 272 -4 284 245 -550 -72 220 -133 -72 26 193 43 223 -46 -234 -239 210 241 -32 276 7 -29 312
5984 312 12 -200 225 190 -554 -73 344 44 -266 398 32 -55 427 -110 -290 214 17 -2 99 111 -60
6005 -60 93 20 -180 32 69 -140 -46 316 38 -273 -151 107 -99 -89 -195 -263 -376 39 -115 -37 -171 -40
6027 -40 -262 -103 123 -312 -214 19 -349 -277 331 -415 -117 69 -287 -367 -119 179 -414 -61 281 -393 -7
6048 -7 425 22 -162 356 207 -163 -141 427 -177 -14 355 2 113 230 219 -14 240 274 43 249 153 62
6070 62 231 425 -11 136 427 -144 156 419 329 64 494 -27 -40 305 250 18 199 282 176 -195 54 222
6092 222 40 264 -6 -192 86 357 -295 -304 239 -58 -314 94 -308 -247 -298 130 -331 -93 109 -310 -303 186
6114 186 -127 -235 251 -178 -438 108 -108 -90 -351 108 -143 -319 -73 -75 -218 -79 166 -273 -169 63 -406
6135 -406 -127 146 -285 -373 354 -4 -269 119 145 -42 224 -75 -370 -238 -45 -367 -97 144 -318 98 -40
6156 -40 -322 -271 90 -72 -447 -227 368 -338 25 54 -74 -34 392 76 -268 -67 134 114 427 132 -516 -179
6178 -179 67 386 -28 156 502 -149 367 106 -36 12 684 116 203 712 203 245 204 372 -1 383 171
6199 171 58 -3 202 11 211 300 83 -120 52 355 -219 159 344 -293 51 -69 -118 -233 30 -54 -240
6220 -240 -76 -104 -174 279 230 -345 -10 -185 -191 -26 -59 -149 -451 194 -184 -68 81 4 -299 -95 52 -24 -311
6243 -311 185 -159 -180 -78 56 -233 -126 -66 -181 72 147 -112 -107 111 -75 49 23 82 -309 25 222 -193
6265 -193 158 240 -222 -244 380 116 -180 364 94 -122 -80 -122 -114 -20 -142 -178 52 -37 -216 -242 205 97 63 288
6289 288 343 -131 -269 55 237 -90 83 -137 52 391 163 -344 170 -306 17 -77 253 -235 -30 291 -84
6310 -84 297 287 124 -65 89 8 -11 179 -30 -124 -145 130 -310 326 217 48 -104 97 9 -127 262 4
6332 4 21 -373 242 72 -142 25 -268 -250 179 -135 -349 121 4 -134 -336 -336 -24 -31 64 -388 -274 -103 -184
6355 -184 -193 -124 -36 -23 -470 -35 85 -184 -12 -91 -253 162 139 33 -9 9 -294 -422 272 20 112 130 96 -173
6379 -173 176 93 -64 261 -58 -206 404 110 143 -97 515 92 -230 348 -94 -345 -165 238 -177 21 -153
6400 -153 226 204 348 -218 -214 251 158 -67 23 -102 43 150 17 89 -153 93 171 -179 -271 -66 -111 214 1
6423 1 -278 -255 279 19 -314 78 -116 109 1 -1 -22 184 294 -204 98 104 -207 -101 199 106 -367 63 70 -71
6447 -71 -73 195 -339 -305 13 18 -76 136 63 -237 151 243 -141 341 163 210 193 -29 -231 -65 337 109 -417 328
6471 328 201 51 -48 -138 -267 -256 121 -140 -256 155 -50 107 315 1 -196 -323 397 -12 -199 232 127
6492 127 -174 242 92 -393 295 123 -5 27 16 -155 -158 547 -431 -34 100 -58 -247 262 167 -89 147 169
6514 169 87 -161 116 339 -91 384 432 -5 245 -7 -304 -131 66 -65 -70 176 -67 -215 212 170 78 -76
6536 -76 177 -145 -69 372 -412 -29 -211 -355 -159 -148 -93 -208 33 116 -396 -151 262 -221 8 -26 -128 -186
6558 -186 -29 -244 -426 202 197 -89 147 -118 -242 -14 395 -253 -294 158 -69 -29 122 -55 -369 213 308 84
6580 84 -180 350 -165 -154 -258 -247 -187 12 114 59 -65 92 -311 -16 -7 -117 -8 -134 125 -112 138 -40
6602 -40 -17 -229 -14 -64 262 125 -92 174 162 -350 -111 245 33 -153 166 81 -284 30 95 -144 3 12 203
6625 203 -295 91 -172 -145 -103 -147 -140 -161 148 -79 50 100 36 -127 104 164 171 19 131 20 62 240 -180 -68
6649 -68 135 -29 -243 151 425 -270 -25 26 123 -198 62 -154 59 -42 -191 -115 189 117 -58 88 -96 16
6671 16 -258 -183 65 -164 164 -196 -304 7 -252 -26 -339 414 -337 -109 295 -54 94 -6 -288 -101 53
6692 53 -44 -148 10 216 29 -115 253 158 1 102 -52 -323 370 228 -6 30 -59 -57 32 93 -26 180 270
6715 270 -3 29 218 -206 -148 -16 138 195 -5 264 -197 -24 96 3 123 -22 -96 -86 50 238 -224 8
6737 8 136 -172 -25 108 103 -52 39 79 -260 206 101 -163 -214 143 43 -122 22 125 6 323 224 9 245
6760 245 -55 1 -33 194 -200 -112 163 -264 -258 -211 183 -120 -8 -56 -236 -304 357 37 -127 100 -98 -129 64
6783 64 -47 109 243 232 -195 -305 -132 -144 -72 18 103 -333 306 93 -186 367 -115 -79 -130 -97 -63 -16 106 114
6807 114 -17 95 -202 -80 -243 99 8 -204 241 31 -81 291 -65 168 339 64 -207 71 -26 -90 -164
6828 -164 89 -115 11 213 173 -374 294 103 -260 45 278 -196 -104 209 -133 -245 283 -40 -44 418 327 -42
6850 -42 -22 -37 -345 -87 -45 -221 -171 53 -59 -195 107 -124 -252 230 109 126 -12 -8 -152 -17 -133 209 -24
6873 -24 214 195 -152 281 118 -8 -372 -52 27 159 40 126 120 -70 228 181 307 10 6 14 -135 -285 -162 -13
6897 -13 -300 -140 323 -34 -407 -15 79 -43 141 241 -239 -245 86 105 -47 -163 186 204 1 352 -77 -105
6919 -105 236 198 -11 260 -24 -133 358 -64 187 36 98 -219 -59 201 -79 23 -6 -26 -67 221 30 41
6941 41 287 -26 -210 -170 -11 -150 -42 133 -133 -364 1 182 -376 -98 175 -108 -142 -49 -127 16 79 -188
6963 -188 -306 313 -46 -270 63 76 -259 -249 149 -114 288 396 -176 111 -10 -54 -485 124 198 64 115 145
6985 145 -158 -9 329 42 -87 134 139 -275 45 -18 -121 -104 -175 -203 -194 6 192 -162 54 -70 -131 -63 -297
7008 -297 -4 120 115 -328 59 121 -33 93 120 21 -325 242 -31 -6 79 134 -235 2 -76 -72 66 -35 -21 -209
7032 -209 -61 -32 -249 293 -165 -137 -166 180 -110 60 -77 -155 -245 -16 -216 -228 -81 -6 -213 161 331 -66
7054 -66 -237 37 209 9 42 -91 -288 413 45 -171 32 -46 -272 52 27 -283 -149 53 38 57 -4 240
7076 240 -365 -113 -199 -153 10 7 -133 -273 78 -19 -104 82 -217 -208 -47 -182 -257 -229 177 3 -497 105 265
7099 265 -99 -155 159 132 -152 206 27 -415 197 175 -141 249 141 -102 -8 239 96 102 232 -189 324 299
7121 299 219 -83 55 189 62 -21 59 -321 -113 -141 151 -162 139 -45 -39 -19 -121 -32 -43 144 -165 -215 483
7144 483 -68 37 84 -63 23 236 51 22 137 -66 68 234 -124 -137 -170 73 269 -390 151 -70 -346 -14
7166 -14 23 -127 147 -117 -9 -63 -202 -111 -125 76 166 -89 127 26 205 -29 169 28 114 58 -49 -178 116
7189 116 132 -114 200 137 -52 -98 240 72 -48 -3 -116 15 -48 -97 -314 -46 -232 -242 -263 181 -347 32 -103
7212 -103 26 -309 27 284 7 1 -207 -395 -2 109 -122 -39 -46 -83 -27 212 301 192 -251 242 -151 7 183
7235 183 -66 121 160 -389 74 284 6 -214 245 197 278 219 246 60 197 215 -104 331 -53 -131 -330 45
7257 45 -4 -109 -331 95 90 -51 -416 -167 23 -108 -2 108 -197 -124 1 -109 165 -150 -288 98 -90 -102
7279 -102 -170 -78 -307 27 -38 -162 -410 37 -350 -180 33 310 228 -67 153 37 -155 222 19 119 174 162
7301 162 -484 -281 -189 -192 -147 -75 -159 -33 55 -110 26 6 248 -279 259 35 -487 -102 107 98 146 71 -126 -279
7325 -279 -64 196 -236 51 163 -95 -15 -182 -95 75 -1 -369 44 -78 21 -123 86 260 34 356 12
7346 12 207 147 71 282 -12 -47 121 55 224 -196 -219 180 216 -55 303 575 -164 -48 244 48 267 539
7368 539 -126 -16 106 -154 -53 119 201 -115 -1 -56 -198 -81 -74 -88 -421 72 -211 -327 -194 -1 -116 -128
7390 -128 353 -390 -288 -186 124 46 291 -303 -271 -153 69 -141 -196 14 -242 -35 222 68 -325 -210 305
7411 305 -204 108 123 22 8 271 100 -368 184 228 -138 147 201 115 -48 -280 20 -197 271 -252 -37 102
7433 102 228 90 408 229 -346 84 317 22 91 280 -91 -322 79 -53 221 108 46 -151 115 -216 -333
7454 -333 52 -91 167 -188 251 53 266 226 215 -84 97 106 -83 187 -5 166 211 346 62 -81 335 393
7476 393 -79 228 169 84 -241 89 23 -228 73 151 -79 217 125 -241 60 49 -242 -22 -45 -109 8 212 -97
7499 -97 -82 219 76 -358 -28 75 -312 -329 145 -230 -89 182 84 63 41 -188 157 -247 8 -131 190 247
7521 247 -107 12 154 -223 47 64 38 -358 82 66 -28 66 -74 -22 -398 -398 -160 -221 -108 -74 -276 -50 287
7544 287 -331 -128 -19 137 -73 119 -32 -75 206 -108 23 111 209 -188 286 290 2 -79 76 -478 2 77
7566 77 404 -100 289 241 63 278 164 162 63 316 -1 -142 140 359 -424 183 91 46 142 233 162 11 135
7589 135 -9 -108 182 -109 -23 -8 218 -54 -208 -171 -244 -546 78 -61 -194 -136 -232 -159 58 92 -348 128 410
7612 410 85 1 488 -31 -128 -57 187 -77 -185 154 -258 -28 14 -202 -40 260 -173 -191 83 165 -106 -54
7634 -54 -42 -140 87 2 -98 -222 -23 -193 223 279 107 -296 -166 55 -211 -73 31 -231 -235 350 -130 67
7656 67 -120 -255 -124 138 -72 -68 -90 41 -47 14 257 -390 -126 42 83 -147 -105 85 30 257 222 -100 354
7679 354 371 -340 -8 211 165 -237 56 348 -118 142 144 301 -65 397 -101 180 121 143 256 342 159 -75
7701 -75 -246 -122 106 106 153 53 -181 -70 152 -89 189 -28 -221 50 -106 98 -113 72 -190 -297 267
7722 267 -60 -253 34 -211 -24 515 -88 -179 -69 -292 -64 -26 53 -137 -248 43 73 154 -94 221 150 -281
7744 -281 281 178 39 65 94 -252 -50 -56 -111 4 -116 -196 108 226 -150 -82 1 -165 -324 -120 -261 50 -338
7767 -338 92 14 -147 -8 -95 -32 193 -110 -109 -154 212 218 309 -54 93 -95 -41 -232 -107 206 -66 93 121 175
7791 175 -194 -46 194 -172 35 59 49 -181 -204 191 -172 81 69 -152 -277 96 -66 163 206 44 -134 1
7813 1 264 -15 213 133 9 130 94 -61 -303 195 42 234 -116 34 -16 -198 24 -101 353 240 0 244
7835 244 209 -230 -388 85 -305 -285 394 -45 -13 -279 -20 -220 84 54 21 63 -140 34 -358 206 73 -228
7857 -228 36 16 -146 132 335 -176 220 124 64 31 55 7 -314 -90 135 -1 -9 -28 18 90 -33 146 -183 32
7881 32 205 -92 -4 -126 -110 -44 -89 -105 -97 258 54 124 174 -157 -334 188 -538 -46 32 -3 127 -172 2 -299
7905 -299 -222 -88 -278 -292 -110 17 101 -49 131 -89 -197 11 303 -226 170 46 -115 -70 -88 -206 145 329
7927 329 -129 37 91 -38 32 211 -17 -40 3 109 -521 -196 119 -89 -160 123 -220 533 232 132 -197 93
7949 93 135 -45 14 6 -68 -142 112 107 62 356 68 135 94 127 -405 37 378 113 -59 179 -112 -78 310 194 -130
7974 -130 -37 -3 36 122 136 160 231 543 -41 -63 -178 441 -43 337 -2 -7 87 78 -50 17 -62 -96 -80 -38 351 -130
8000 -130 297 96 -610 -109 188 -104 -231 -63 -225 -195 76 -12 -82 -51 -134 -338 -94 205 -390 -275 137 -139
8022 -139 -257 -24 -80 42 4 115 -316 -38 -138 -60 -196 -158 234 -196 -131 -335 115 193 12 -255 4 133
8044 133 -48 -36 521 -192 104 190 150 -17 126 -56 -38 -138 37 58 153 215 39 -303 383 -97 -383 -270
8066 -270 171 -251 -76 323 -280 -194 20 82 208 -85 30 -35 92 119 78 -106 -79 -90 -15 204 -285 4 -163
8089 -163 214 -11 50 228 292 9 378 -55 74 65 121 -106 236 217 112 152 223 84 274 46 -143 -87 39
8112 39 22 -207 13 161 74 -82 137 -188 -306 169 151 61 129 79 -161 15 61 -21 -21 45 -124 -311 211 123
8136 123 -258 0 -91 -120 -72 220 -56 -53 -102 81 -40 118 -35 123 150 -35 -114 -149 53 2 -75 287 -65 -87
8160 -87 18 -238 -271 -25 -40 -40 -126 -12 -172 -14 140 -228 54 155 -113 -46 87 -125 46 321 266 -490 360
8183 360 -232 53 28 84 131 -189 133 75
8191G5
##END NTUPLES=NMR FID
##END=
