##TITLE=1H_TG-2251
 CDCl3, 8 sc, 
 22.8.2019
##JCAMPDX= 6.0         $$ Bruker NMR JCAMP-DX V2.0
##DATA TYPE= NMR FID
##DATA CLASS= NTUPLES
##ORIGIN= UXNMR, Bruker Analytische Messtechnik GmbH
##OWNER= root
$$ XWIN-NMR		Version 3.5
$$ Thu Aug 22 14:23:26 2019 Russian Standard Time (UT+4h)  she@DPX200
##.OBSERVE FREQUENCY= 200.13155
##.OBSERVE NUCLEUS= ^1H
##.DELAY= (6, 6)
##.ACQUISITION MODE= SIMULTANEOUS
##.ACQUISITION SCHEME= undefined
##.AVERAGES= 8
##.DIGITISER RES= 18
##SPECTROMETER/DATA SYSTEM= spect
##.PULSE SEQUENCE= zg30
##.SOLVENT NAME= CDCl3
##.SHIFT REFERENCE= (INTERNAL, CDCl3, 0, 15.7039)
##AUDIT TRAIL= $$ (NUMBER, WHEN, WHO, WHERE, WHAT)
$$ ##TITLE= Audit trail, XWIN-NMR		Version 3.5
$$ ##JCAMPDX= 5.01
$$ ##ORIGIN= Bruker BioSpin GmbH
$$ ##OWNER= she
$$ F:/spectra/data/she/nmr/H-F/1/audita.txt
$$ ##AUDIT TRAIL=  $$ (NUMBER, WHEN, WHO, WHERE, WHAT)
(   1,<2019-08-22 14:22:08.70 +0400>,<she>,<DPX200>,
      <created by zg, POWCHK disabled, PULCHK disabled
       configuration hash MD5:
       00 E9 B6 7A A2 85 ED C7 34 08 36 98 17 FE 4E 26
       data hash MD5: 16K
       0F 01 4E 1D 57 2D 4C 34 1D EA 67 60 A0 D5 7C 04>)
$$ ##END=
$$ 
$$ hash MD5
$$ 35 F8 05 12 D9 D7 2B F7 90 FD BD 48 5F D9 D2 6D
##$RELAX= 
##$RELAX= 
##$RELAX= 
##$RELAX= 
##$RELAX= 
##$RELAX= 
$$ Bruker specific parameters
$$ --------------------------
##$DU= <F:/spectra>
##$EXPNO= 1
##$NAME= <H-F>
##$PROCNO= 1
##$TYPE= <nmr>
##$USER= <she>
##$AMP= (0..31)
100 100 100 100 100 100 100 100 100 100 100 100 100 100 100 100 100 100 
100 100 100 100 100 100 100 100 100 100 100 100 100 100 
##$AQSEQ= 0
##$AQ_mod= 1
##$AUNM= <au_zg>
##$AUTOPOS= <>
##$BF1= 200.13
##$BF2= 200.13
##$BF3= 200.13
##$BF4= 200.13
##$BF5= 200.13
##$BF6= 200.13
##$BF7= 200.13
##$BF8= 200.13
##$BYTORDA= 1
##$CFDGTYP= 0
##$CFRGTYP= 5
##$CHEMSTR= <none>
##$CNST= (0..31)
1 1 145 1 1 1 1 1 1 1 1 1 1 1 1 1 1 1 1 1 1 1 1 1 1 1 1 1 1 1 1 1 
##$CPDPRG= <>
##$CPDPRG1= <>
##$CPDPRG2= <>
##$CPDPRG3= <>
##$CPDPRG4= <mlev>
##$CPDPRG5= <mlev>
##$CPDPRG6= <mlev>
##$CPDPRG7= <mlev>
##$CPDPRG8= <mlev>
##$CPDPRGB= <>
##$CPDPRGT= <>
##$D= (0..31)
0 1.2 0 0 0 0 0 0 0 0 0 0.03 0 0 0 0 0 0 0 0 0 0 0 0 0 0 0 0 0 0 0 0 
##$DATE= 1566469327
##$DBL= (0..7)
120 120 120 120 120 120 120 120 
##$DBP= (0..7)
150 150 150 150 150 150 150 150 
##$DBP07= 0
##$DBPNAM0= <>
##$DBPNAM1= <>
##$DBPNAM2= <>
##$DBPNAM3= <>
##$DBPNAM4= <>
##$DBPNAM5= <>
##$DBPNAM6= <>
##$DBPNAM7= <>
##$DBPOAL= (0..7)
0.5 0.5 0.5 0.5 0.5 0.5 0.5 0.5 
##$DBPOFFS= (0..7)
0 0 0 0 0 0 0 0 
##$DE= 6
##$DECBNUC= <off>
##$DECIM= 24
##$DECNUC= <off>
##$DECSTAT= 4
##$DIGMOD= 1
##$DIGTYP= 9
##$DL= (0..7)
0 120 120 120 120 120 120 120 
##$DP= (0..7)
150 150 150 150 150 150 150 150 
##$DP07= 0
##$DPNAME0= <>
##$DPNAME1= <>
##$DPNAME2= <>
##$DPNAME3= <>
##$DPNAME4= <>
##$DPNAME5= <>
##$DPNAME6= <>
##$DPNAME7= <>
##$DPOAL= (0..7)
0.5 0.5 0.5 0.5 0.5 0.5 0.5 0.5 
##$DPOFFS= (0..7)
0 0 0 0 0 0 0 0 
##$DQDMODE= 0
##$DR= 18
##$DS= 0
##$DSLIST= <SSSSSSSSSSSSSSS>
##$DSPFIRM= 0
$$ [...]
##$SUBNAM2= <"">
##$SUBNAM3= <"">
##$SUBNAM4= <"">
##$SUBNAM5= <"">
##$SUBNAM6= <"">
##$SUBNAM7= <"">
##$SUBNAM8= <"">
##$SUBNAM9= <"">
##$SW= 24.9336996594482
##$SWIBOX= (0..15)
0 0 2 0 0 0 0 0 0 0 0 0 0 0 0 0 
##$SW_h= 4990.01996007984
##$TD= 16384
##$TD0= 1
##$TE= 0
##$TE2= 300
##$TE3= 300
##$TEG= 300
##$TL= (0..7)
0 120 120 120 120 120 120 120 
##$TP= (0..7)
150 150 150 150 150 150 150 150 
##$TP07= 0
##$TPNAME0= <>
##$TPNAME1= <>
##$TPNAME2= <>
##$TPNAME3= <>
##$TPNAME4= <>
##$TPNAME5= <>
##$TPNAME6= <>
##$TPNAME7= <>
##$TPOAL= (0..7)
0.5 0.5 0.5 0.5 0.5 0.5 0.5 0.5 
##$TPOFFS= (0..7)
0 0 0 0 0 0 0 0 
##$TUNHIN= 0
##$TUNHOUT= 0
##$TUNXOUT= 0
##$USERA1= <user>
##$USERA2= <user>
##$USERA3= <user>
##$USERA4= <user>
##$USERA5= <user>
##$V9= 5
##$VALIST= <valist>
##$VCLIST= <CCCCCCCCCCCCCCC>
##$VD= 0
##$VDLIST= <DDDDDDDDDDDDDDD>
##$VPLIST= <PPPPPPPPPPPPPPP>
##$VTLIST= <TTTTTTTTTTTTTTT>
##$WBST= 1024
##$WBSW= 4
##$XGAIN= (0..3)
0 0 0 0 
##$XL= 0
##$YL= 0
##$YMAX_a= 370530
##$YMIN_a= -464837
##$ZGOPTNS= <>
##$ZL1= 120
##$ZL2= 120
##$ZL3= 120
##$ZL4= 120
##$ABSF1= 10
##$ABSF2= 0
##$ABSG= 5
##$ABSL= 3
##$ALPHA= 0
##$AQORDER= 0
##$ASSFAC= 0
##$ASSFACI= 0
##$ASSFACX= 0
##$ASSWID= 0
##$AUNMP= <proc_1d>
##$AZFE= 0.1
##$AZFW= 0.1
##$BCFW= 1
##$BC_mod= 2
##$BYTORDP= 1
##$COROFFS= 0
##$CY= 11.3945322036743
##$DATMOD= 1
##$DC= 2
##$DFILT= <>
##$DTYPP= 0
##$F1P= 20.1720416913024
##$F2P= 0.152960286110954
##$FCOR= 0.5
##$FTSIZE= 0
##$FT_mod= 4
##$GAMMA= 1
##$GB= 0.15
##$INTBC= 1
##$INTSCL= 1
##$ISEN= 128
##$LB= 0.24
##$LEV0= 0
##$LPBIN= 0
##$MAXI= 10000
##$MC2= 0
##$MEAN= 0
##$ME_mod= 0
##$MI= 1.114404
##$NCOEF= 0
##$NC_proc= 0
##$NLEV= 6
##$NOISF1= 3.799351
##$NOISF2= 2.8
##$NSP= 1
##$NTH_PI= 0
##$NZP= 0
##$OFFSET= 15.70392
##$PC= 1
##$PHC0= -9208.613
##$PHC1= 8.400961
##$PH_mod= 1
##$PKNL= yes
##$PPARMOD= 0
##$PSCAL= 0
##$PSIGN= 0
##$REVERSE= no
##$SF= 200.130013532006
##$SI= 16384
##$SIGF1= 3
##$SIGF2= 2
##$SINO= 400
##$SIOLD= 16384
##$SREGLST= <1H.CDCl3>
##$SSB= 0
##$STSI= 0
##$STSR= 0
##$SW_p= 3612.71676300578
##$SYMM= 0
##$S_DEV= 0
##$TDeff= 0
##$TDoff= 0
##$TI= <>
##$TILT= no
##$TM1= 0
##$TM2= 0
##$TOPLEV= 0
##$USERP1= <user>
##$USERP2= <user>
##$USERP3= <user>
##$USERP4= <user>
##$USERP5= <user>
##$WDW= 1
##$XDIM= 8192
##$YMAX_p= 0
##$YMIN_p= 0
$$ End of Bruker specific parameters
$$ ---------------------------------
##NTUPLES= NMR FID
##VAR_NAME=  TIME,          FID/REAL,        FID/IMAG
##SYMBOL=    X,             R,               I
##VAR_TYPE=  INDEPENDENT,   DEPENDENT,       DEPENDENT
##VAR_FORM=  AFFN,          ASDF,            ASDF
##VAR_DIM=   8192,          8192,            8192
##UNITS=     SECONDS,       ARBITRARY UNITS, ARBITRARY UNITS
##FACTOR=    0.0002004,     1,               1
##FIRST=     0,             0,               0
##LAST=      1.6414764,     0,               0
##MIN=       0,             -464837,         0
##MAX=       1.6414764,     370530,          0
$$ Real data points
##PAGE= N=1
##DATA TABLE= (X++(R..R)), XYDATA
$$ [...]
3277G79l194j14M823J564n149k365M955K592l614k297J841K531M99l350k539L928
3293H90L785l933m224L143L815j923k965q17K190L473j971n485J804N831j927
3308A686m953L73L262J596j670l660M39N033L24n872p53N149R58l318j841J921
3324a326K697O58l917k323N201K989n002k541L920K671j236k867j324L657L385
3339D642l387m835L158M853k329m079Q60K968J642j723m287J150N590j311n249
3354b337O3M826J21l250k007J113L616mn298j138N953J857n642k327L675K620
3370A841j359l254j154L916L133m387l989L849M618k867l784Q72L006K220k492
3385A69m439K737N554k145n476J202M638L29k795k406J866M301n38o057J86N815
$$ plain form
3277 779 -2415 -2529 2294 3858 -1291 -3656 1299 3891 277 -2020 -179 2352 2851 -499 -3038 890
3293 890 4675 742 -3482 -339 3476 1553 -1412 -2229 -39 3434 1463 -4022 -2218 3613 1686
3308 1686 -3267 -2894 368 1964 294 -3366 -2927 2106 2430 -3442 -4195 954 1912 -1406 -3247 -1326
3324 -1326 1371 2029 -1888 -4211 990 3979 -1023 -3564 356 3027 1791 -1076 -2400 1257 4642
3339 4642 1255 -3580 -422 4431 2102 -1977 -1117 1851 3493 1770 -2517 -1367 4223 2912 -2337
3354 -2337 -2274 2552 2673 -577 -2584 -1471 2145 2141 -3157 -4295 1658 3515 -2127 -4454 -779 1841
3370 1841 482 -2772 -3926 -10 3123 -1264 -5253 -1404 3214 347 -3437 -2565 441 2661 169
3385 169 -4270 -1533 4021 1876 -3600 -2398 2240 2569 -226 -2632 -766 3535 2997 -3060 -2874 2941
3401B941J013n453j605L412K828j274m124j082M937L050n817l697M885L476k813
3416F77l547j0L597K637l465n121L630N628k741n518J825M182L87l155k796J701
3432b089N292j111o124M25O358N76n183j983L040L594l81n127j152O076K585o092
3448a296l275M739L582k129l836l41L936L178m426m919M485N018l128m916J206
3463b122L896J055k869l621K104N505j492o657Q77O028J09m073k409K395L891
3478B617o80n760j078O690J948n863k657L841L427j923l550j517M991L339m818
3493i93m594M382M829l274l905O81L528K456l259m535L060O222k534n820J289
3508b467N040O13l871k128J853M635n32o078m27O370J568n474k252L086L219o39
$$ plain form
3401 2941 3954 -1499 -3104 308 3136 1862 -2262 -3344 1593 4643 -1174 -4871 14 3490 677
3416 677 -2870 -2880 717 3354 -111 -5232 -1602 4026 1285 -4233 -2408 1774 2161 -994 -3790 -2089
3432 -2089 3203 2092 -4032 -3607 2751 3327 -1856 -3839 -799 2795 2414 -2713 -3865 2211 4796 -1296
3448 -1296 -4571 168 3750 1621 -2215 -2556 1380 4558 132 -4787 -302 4716 1588 -3328 -2122
3463 -2122 1774 2829 -40 -3661 -1557 3948 2456 -4201 -3324 2704 2813 -1260 -3669 -1274 2617
3478 2617 1937 -3823 -4901 1789 3737 -2126 -4783 -942 2485 562 -2988 -4505 486 3825 -993
3493 -993 -5587 -1205 3624 350 -3555 -2874 654 3110 -149 -4684 -1624 4598 2064 -3756 -2467
3508 -2467 2573 3186 -685 -2813 -960 3675 3143 -2935 -3362 3008 4576 -898 -3150 -64 3155 2516
3524B516m354j831N355K990n407l728M493L623k219m113k59L798K451l143m886
3539d714L333N338k778n400J105M406R73l007l263J696N366q58o195L4O039P36
3555B811m247k257K525L386j81m296j837N350K758n334k792M393L207k178l389
3570b081l42L382K883l872m290L949M696k934m471R43L511J175k616l676J876
3585a867N132j249n451K38N203L05l469k098J714L918m69m788j458N819J724n235
3601b031j988L491K606j485k668j156L870K994m165m019M143L854k696l070N38
3616a782L238J303k428l799K475N218k261n188J484M138n0k567j907J203L367
3631B444j08m644n36M932J153m621j372K535J957k17l592q68L718K639m799k845
$$ plain form
3524 2516 -1838 -3669 1686 4676 -731 -4459 34 3657 1438 -2675 -2934 864 3315 172 -4714
3539 -4714 -1381 3957 1179 -4221 -3116 1290 2263 -744 -4007 -2311 3055 2197 -3998 -3964 2075 2811
3555 2811 -1436 -3693 -1168 2218 2037 -2259 -4096 1254 4012 -1322 -4114 279 3486 1308 -2081
3570 -2081 -2423 959 3842 -30 -4320 -371 4325 1391 -3080 -2137 1374 2549 -67 -3743 -1867
3585 -1867 3265 2016 -3435 -3197 2006 2311 -1158 -3256 -1542 2376 1907 -2881 -4339 1480 3204 -2031
3601 -2031 -4019 -528 2078 593 -2075 -3231 639 3633 -532 -4551 -408 3446 750 -2320 -1782
3616 -1782 1456 2759 331 -3468 -993 4225 1964 -3224 -1740 2398 2348 -219 -2126 -923 2444
3631 2444 2336 -2308 -2844 2088 3241 -1380 -2752 -217 1740 1523 -2069 -2937 781 3420 -1379 -4224
3647d224M026K587k274l140N51K567J953k596l836K802M442k242m137J267L223
3662I69M82k347k000J417L750o15m948P46M990k6l941n27K413J765k72l533o38
3679b315M345J495m613j744L468J722j512k466L2L023J786l260l357L310L740
3694C654k830l549J528K766K87k262k159J818L579j689m611J599M230q91l287
3709a817l45J692K233j211l479l2M749O57m960r70M113J145j856k320K09L090
3725H98J366m178j882M042K615l386k452J915K030P17k614j904K412L984k797
3740G66m109K218L774j211k495p87J911K621j446l914J220M733j029m154j52L214
3756A160J218j719k361RM096Q42m424k018M489K254l960j879J490K925J77l322
$$ plain form
3647 -4224 -198 2389 115 -3025 -2474 93 2046 -550 -4386 -1584 2858 616 -3521 -2254 969
3662 969 1451 -896 -2896 -1479 2271 1656 -3292 -2546 2444 2418 -1523 -2050 363 2128 1856 -1677 -2315
3679 -2315 2030 3525 -1088 -2832 636 2358 846 -1620 -1588 1435 3221 -39 -3396 -86 3654
3694 3654 824 -2725 -1197 1569 1856 -406 -2565 -747 2832 1143 -3468 -1869 2361 1470 -1817
3709 -1817 -2162 -470 1763 552 -2927 -2959 1790 2447 -2513 -3483 630 1775 -81 -2401 -2192 898
3725 898 2264 -1914 -3796 246 2861 -525 -2977 -1062 968 1685 -929 -2833 -421 3563 766
3740 766 -3343 -1125 2649 1438 -1057 -1844 67 2688 1242 -2672 -1452 3281 2252 -1902 -2054 1160
3756 1160 2378 659 -1702 -1693 2403 3245 -1179 -3197 1292 3546 -414 -2293 -803 2122 2299 -1023
3772a023j786L033L587l558l640K640L211j026l114p67K252L100k244m006J552
3787a789M654j077m488J95K979J477j589k919L30M634J75n002r00M273J511k655
3803a91k413J255L063Q55l729k282L981L019l779l377L042K833o43l192q36K424
3819C0L332k767m566K644M603j324m263n2L100J814j563m476J341N210r1n712
3835b740k16M271J436k422k628N76M204M19m087k254M697K590m052k720K331L009
3851B414l04k966k222L634L431l072m683K878M231j208l703p00K997K365j892
3866A200m181J045N342p60n009n66L717J977k492l079K58M233J193n196j977N246
3882I51J977l686k481J786L103M67l526k500M110L533l754m196K954L655p46l002
$$ plain form
3772 -1023 -2809 224 3811 253 -3387 -747 2464 1438 -1676 -2443 -191 2909 665 -3341 -1789
3787 -1789 2865 1788 -2700 -2505 474 1951 362 -2557 -2227 2407 2582 -2420 -3320 953 2464 -191
3803 -191 -2604 -1349 1714 2569 -1160 -3442 539 3558 -221 -3598 -556 2277 1634 -1558 -2394 30
3819 30 3362 595 -3971 -1327 3276 1952 -2311 -2363 737 2551 988 -3488 -2147 3063 2972 -2740
3835 -2740 -2956 1315 2751 329 -2299 -1723 2481 2900 -1187 -3441 1256 3846 -206 -2926 -595 2414
3851 2414 2110 -856 -3078 556 3987 915 -3768 -890 3341 2133 -1570 -2270 727 3092 1200
3866 1200 -2981 -1936 3406 2646 -2363 -2929 788 2765 273 -2806 -2548 1685 2878 -2318 -4295 951
3882 951 2928 -758 -3239 -1453 1650 2117 -1409 -3909 201 3734 -20 -4216 -1262 2393 1647 -1355
3898a355j394K574L277j852m425J371N369p95m578j77L352J880j719l429J64M717
3914B980R94n570j060M348J940l160k377R56L293O83l696k784M309L140l695l507
3930c206K223L226m29k795k077K261L940k346m787K097M643j242l945k73K723
3945A3K020j219m113P43M712K30m624r52M156J319j922k472Q30K891J216m152
3961a324j993M488K661l482k399J898K332L04k215k408K790L192k439m032J924
3976g03L752j023k773p13J911K492j360m210P96M595n64m014k42K919R23j675
3992A11k358M49K956J062m150j768M559J496k889j904J409K141O29k715k140L373
4008B61L065l061l056K486L004j130k296q49J443L179j351m161J622M015r58l531
$$ plain form
3898 -1355 -2749 -175 3102 1250 -3175 -1804 3565 2770 -1808 -1985 1367 3247 1528 -1901 -1737 2980
3914 2980 3974 -1596 -2656 1692 3632 472 -1905 -949 2344 3027 -669 -3453 856 3996 301 -3206
3930 -3206 -983 2243 1814 -981 -3058 -797 3143 797 -3990 -1893 2750 1508 -2437 -2710 13
3945 13 2033 814 -3299 -2556 2156 2386 -2238 -3190 966 2285 363 -2109 -1279 1612 2828 -1324
3961 -1324 -3317 1171 3832 350 -2049 -151 2181 2485 270 -2138 652 3844 1405 -2627 -703
3976 -703 3049 2026 -747 -1460 451 2943 1583 -2627 -1831 2764 2200 -1814 -2056 863 1786 111
3992 111 -2247 -1798 1158 2220 -1930 -3698 861 2357 -532 -2436 -1027 1114 1743 -972 -3112 261
4008 261 3326 265 -2791 -305 2699 1569 -727 -1576 -133 3046 1695 -2466 -844 3171 2213 -1318
4024a318M44K312R86j542k274L35L834j56m271o90M068P62k886j418J087K014
4040A287P36k966k091L208K351l079k541K593J990r56k172o61J871K432k091l071
4056c160J645L593j505k923P15K186J197j426k660R34L742n6m206L49L363N27
4072B315k403j234J227K059Q88l888q94L727J586l443j821K473J803q11j801j246
4088a463K579K145k924l065L116K467j800k372L43J671J449j803k792J493L595
4103B639j211m002M24L636k0k231j222P53L070l17l816l56L686J105l298j075
4119b235J960J704l44k348r54L189J969l520k296L059K357j912k069J10K042J507
4135B219j528l251K182L760k090l687J212K931K83j803k024J079L247n00m158
$$ plain form
4024 -1318 -874 1438 2424 882 -1392 -1057 2777 2621 -1650 -2340 1728 2490 -396 -1814 -727 1287
4040 1287 2023 -943 -3034 174 2525 -554 -3095 -502 1488 532 -1640 -2301 -430 2002 -89 -3160
4056 -3160 -1515 2078 573 -2350 -1635 551 1748 322 -2338 -1404 2338 2282 -1924 -1575 1788 2315
4072 2315 -88 -1322 -95 1964 2852 -1036 -1930 1797 3383 -60 -1881 592 2395 1584 -217 -1463
4088 -1463 1116 3261 337 -2728 388 2855 1055 -1317 -974 697 2146 343 -2449 -956 2639
4103 2639 1428 -2574 -2150 1486 1466 -765 -1987 -1234 1836 1519 -2297 -2653 1033 2138 -1160 -2235
4119 -2235 -275 1429 1085 -1263 -2217 972 2941 -579 -2875 184 2541 629 -1440 -1330 712 2219
4135 2219 691 -2560 -378 3382 1292 -2395 -1183 1748 2031 228 -1796 -717 2530 2030 -2128
4150b128K43M034K34l144j377K484J645n42k816r47L595K063m530k048L318K461
4166B545k477j864j73K556K038k772l114K716L783k576l286J233K698M98j997
4181a92k372J388L914o98m518P33M196k55l206p81J619K303k82l403o39M275R41
4198C023l803j350K740J727q11l151J07K732J862k961l001L078L299k872k596
4213a977Q65K241J135k252k814J767L441j232m156J189L347J9k388j537J197L015
4229A860m17m008j14M151J031m149j156L100J596j114k379r59L555K162l808k731
4245c380L383K862k364k284O02J941J535k313k813K663L357k189l446J285K513
4260A352K50j872j617J226L079o60l860n7L906M08l248q55J826J897n28k773j250
$$ plain form
4150 -2128 -1885 2149 2383 -761 -2138 346 1991 1449 -1367 -2314 1281 3344 -1186 -3234 84 2545
4166 2545 68 -1796 -1969 587 2625 -147 -3261 -545 3238 662 -2624 -1391 1307 1805 -192
4181 -192 -2564 -1176 2738 2040 -2478 -1745 2451 2196 -1010 -1791 -172 2131 1849 -1554 -2193 2082 3023
4198 3023 -780 -2130 610 2337 1526 -1625 -1518 1214 3076 115 -2886 192 3491 619 -1977
4213 -1977 -1112 1129 2264 12 -2802 -1035 2406 1174 -2982 -1793 1554 1573 -815 -2352 -1155 1860
4229 1860 1443 -2565 -2679 1472 2503 -1646 -2802 298 1894 780 -1599 -2558 997 3159 -649 -3380
4245 -3380 3 2865 501 -1783 -1181 760 2295 -18 -2831 -168 3189 1000 -2446 -1161 1352
4260 1352 1602 -270 -1887 -661 2418 1758 -2102 -2159 1747 2155 -1093 -1948 -122 1775 1247 -1526 -2776
4277b776M295J361m285j621L249K046j730k206J67K209J839k506l211K743L402
4292B976k319k891J022K534M59j380k573J299L769p13m696O73M162l22k715p31
4308a446J124K282j1l434r14M141J195m043j493L241J395j305k067p56K672K235
4324B816l130l126L486K487k211k689J040J808J028j596k938J750L597j525l736
4339b939J023L080Ok096p81Q03K648k50l293m40L922O49l715p54K512J456n83
4356A248k165r87L124J745l264k457K807K320j934j893P93J437J235j883k666
4371b540K146L366j897l454J510K579m68j638j537J030K540k55l678J73L769O
4387A652k985n68J512J583k60k422r20L018J764l407j611K958J802k104j271j48
$$ plain form
4277 -2776 1519 2880 -1405 -3026 223 2269 539 -1667 -1500 709 2548 42 -3169 -426 2976
4292 2976 657 -2234 -1212 1322 1781 401 -2172 -873 2896 2183 -2513 -1840 2322 2000 -715 -1446
4308 -1446 -322 1960 1949 -1485 -2399 1742 2937 -1106 -2599 642 2037 732 -1335 -2091 581 2816
4324 2816 -314 -3440 46 2533 322 -2367 -1327 481 1509 -87 -3025 -1275 2322 797 -2939
4339 -2939 -1916 1164 1170 -926 -1707 -904 1744 1494 -1799 -2239 1683 2332 -1383 -2137 375 1831 1248
4356 1248 -917 -1904 1220 2965 -299 -2756 51 2371 437 -1456 -663 774 2009 126 -2540
4371 -2540 -394 2972 1075 -2379 -869 1710 1242 -396 -1933 -903 1637 1382 -2296 -2123 1646 1652
4387 1652 -1333 -1901 -389 1194 934 -1488 -2408 610 2374 -1033 -2644 314 2116 12 -1259 -1407
4403a407J828J435k167k620K897K943k569k458J675K022j68j150j712R82K798
4418B329r51l566J027K986j05k345l29P92J939o23k100p66L323J074m069l09K380
4435F87P59j271r08o19K226J191k669k257L087K229k706j761J189J498L55j475
4451d45k103J680K919j732l107J517K731q03j792k56Q57K044n98k873J50L282
4467A471K78l187l27K667O58q44j640n59K792J005l080j292K764K083k778j541
4483a530J244J389O42j801k159K234K950k319k831J718K233p55j609q94J305K211
4499B028p74l782J077L597o79l129J94J998P23r81j774o33L357M60l448q27L380
4516G87J358k294j715J251J469N81k221j798K852K367k823k182K082K178o44j519
$$ plain form
4403 -1407 421 1856 -311 -2931 -34 2909 340 -2118 -443 1579 1411 261 -1451 -469 2329
4418 2329 1378 -2188 -1161 1825 1720 -625 -954 -162 1777 1154 -946 -1712 1611 2685 -1384 -1693 687
4435 687 1446 175 -733 -1352 874 2065 -604 -2861 226 2455 -251 -2012 -823 675 1030 -445
4451 -445 -2548 -868 2051 319 -2788 -1271 1460 657 -1135 -1391 -534 1510 912 -1961 -1811 1471
4467 1471 1749 -1438 -1765 902 1560 716 -924 -1483 1309 2314 -766 -2058 706 2789 11 -1530
4483 -1530 -286 1103 1745 -56 -2215 19 2969 650 -2181 -463 1770 1015 -594 -1488 -183 2028
4499 2028 1254 -2528 -1451 2146 1467 -1662 -1468 530 1253 272 -1502 -2135 1222 1682 -1766 -2593 787
4516 787 2145 -149 -1864 -613 856 1437 -784 -2582 270 2637 -186 -2368 -286 1892 1248 -271
4532b71j461J661K560j419l277J180L448r41k684L34J568Q91n84k233k39L620
4548B153k4l781J05K882M68j876j306K52K173N18k533j912L118K249l044j978
4564b536K023J883k95j657j588J633K953j997l428K179L125j269k701K11J832
4579C68J326o27l069M26L976n60l687L22K509O82j351j674J81K796P81l765r93
4596b359L655J408k824j764J693J688k1j843j903K304K784k609k858J933K606
4611A890j164j901m40J246K251j117l344J107L444q05l406L50K216Q20p77k159
4627a789J35K854R93l518j052L515J088k759p26N57K080Q18k602j903L060K483
4643C234l093k277J848K115l75j430j414J572K493j640l451J669L333j300k610
$$ plain form
4532 -271 -1732 -71 2489 1070 -2207 -1027 2421 1480 -1204 -870 698 1589 1005 -1228 -1467 2153
4548 2153 2129 -1652 -1547 1335 1803 -73 -1379 -1127 1046 1564 -969 -2881 237 2486 -558 -2536
4564 -2536 -513 1370 1075 -582 -2170 -537 2416 419 -3009 -830 2295 1026 -1675 -1464 368
4579 368 1694 1067 -2002 -1576 2400 1840 -1847 -1525 984 1666 315 -1359 -1178 1618 2399 -1366 -2359
4596 -2359 1296 2704 -120 -1884 -191 1497 1476 -367 -2270 34 2818 209 -2649 -716 1890
4611 1890 726 -1175 -1615 -369 1882 765 -2579 -1472 1972 1167 -2239 -1889 327 1147 370 -1789
4627 -1789 -1654 1200 2193 -1325 -2377 1138 2226 -533 -1259 -702 1378 2196 -406 -2309 751 3234
4643 3234 141 -2136 -288 1827 1452 22 -1392 180 2673 1033 -2418 -749 2584 1284 -1326
4658a326M12J866N90o30k543j06L818j02l935j26L081N59j792j516N77K385L55
4675A567k418j728K963J985k905k015J934J672l22j619j336K013K259j788l055
4690b793K264K658j354k442M89J273J781q20k935N38L662m81l206P4K718k6q37
4707E63j507L44K441M94l359r12L354J173k661j446J515J195K38k097j092K229
4723D72K191k457k703K189K080r07j996K90L11K211j049k973J310L198q01l398
4739b032M92K260L72j124j256J57K540O36l770l75L651J36k298q61J248J187O61
4756A624k388j229K678K309l265j555J849K013j159j487l28J454K057j710l474
4771b611J880L125j587k070Q18J132M32m64k160L82K954l72l362N7K946Qj575
$$ plain form
4658 -1326 -914 952 1542 912 -1631 -1737 2081 1979 -1956 -2082 999 1558 -234 -1750 -1173 1212 1567
4675 1567 -851 -2579 384 2369 -536 -2551 -617 1055 733 -886 -2222 -209 2050 262 -2793
4690 -2793 -529 2129 775 -1667 -1178 95 1876 1056 -1879 -1341 2321 1840 -1366 -1292 1426 1400 563
4707 563 -944 -600 1841 2335 -1024 -1936 1418 2591 -70 -1516 -1 1194 1432 -665 -1757 472
4723 472 2663 206 -2497 -308 1772 865 -1131 -841 -530 1681 632 -2341 -1031 2167 1366 -2032
4739 -2032 -1540 720 1092 -32 -1288 -1131 1409 2045 -1725 -2100 1551 1687 -611 -1472 -224 963 1624
4756 1624 -764 -1993 685 2994 -271 -1826 23 2036 877 -610 -938 516 2573 863 -2611
4771 -2611 -731 2394 807 -1263 -445 687 1119 655 -1505 -1123 1831 1459 -1903 -1846 1100 1108 -467
4788d67o32N10J344O28k535q51L142R59k949j192K358R36n54j068r04J598J887
4805B210j948k663K400K287j563j749L84J275J135j175k129N59L048m54l035Q95
4821e23K115O4j933o82P44J511M18k843p08L087O33k438j073J562J099m6j837
4838h50j191K416J622k643k003K431J914j637j313J58J147J313r35k333J510K771
4854B377j639k845J146K130J39j373j030M31K692n68l151M42L101l3k663r6J352
4871D12J043l58j892o01K427J477k777j664K481J370j548j348K15J088J657k339
4887c57j773J877K407j765k428J249J667kj257j043P72K298r51l359J233L057
4903A625o44k104J5Q84J213N4k708n08L239Q48k803j000K022J388r10j276m75
$$ plain form
4788 -467 -1099 -589 755 1383 -1152 -2003 1139 2098 -851 -2043 315 1251 697 -371 -1275 323 2210
4805 2210 262 -2401 -1 2286 723 -1026 -642 633 1768 593 -1536 -977 2071 1617 -1418 -523
4821 -523 1592 1656 -277 -959 -215 1296 1714 -1129 -1837 1250 1883 -555 -1628 -66 1033 987 -850
4838 -850 -2041 375 1997 -646 -2649 -218 1696 59 -1254 -1096 51 1364 429 -1904 -394 2377
4854 2377 738 -2107 -961 1169 1308 -65 -1095 -664 2028 1460 -1691 -1249 1852 1819 -844 -940 412
4871 412 1455 1097 -795 -1396 1031 2508 -269 -1933 548 1918 370 -978 -763 325 1982 -357
4887 -357 -2130 -253 2154 389 -2039 -790 877 875 -382 -1425 -653 1645 694 -2665 -1432 1625
4903 1625 981 -1123 -1108 -224 989 1043 -1665 -2173 1066 1914 -889 -1889 133 1521 611 -665 -1140
4920a140J464J891k088k008K350K114j960j976J352Q05P02j331j541J011K844
4935B489j304k829Q76K598n57k057l21J005J591q95j980l11L494p8k917n91K154
4952C67M91J1k067j88J815J557k544k133L006J634k060j408Q89R11J262j545j925
4969a927J588K798j905k600J538J970m71j185j031R17K059k19l205L61L156J55
4985A999k766l09J346J298m06j867p17K780J282l411j152K768R14j504j129N1
5001h23J287J293j957k146K284K363j841k405J368J681m79r57j203Q81K574j138
5017G82l180J167K789m31k277j86R55J335q0k361j60L105M66k765q97K494Q01
5034A557j149j553k8K187J252k278k209K765J790k213j618J282J317K84j494j317
$$ plain form
4920 -1140 324 2215 127 -1881 469 2583 623 -1353 -1 804 1506 175 -1366 -355 2489
4935 2489 1185 -1644 -768 1830 1273 -784 -1105 -100 1491 596 -1384 -1695 1799 1721 -1196 -1787 367
4952 367 858 869 -1198 -1386 429 1986 -558 -2691 315 1949 -111 -1519 -630 281 1543 -2 -1927
4969 -1927 -339 2459 554 -2046 -508 1462 991 -194 -1225 -308 1751 1532 -1673 -1312 1844 1999
4985 1999 -767 -1076 270 1568 1162 -705 -1422 1358 2640 -771 -1923 845 1759 255 -874 -823
5001 -823 464 1757 -200 -2346 -62 2301 460 -1945 -577 1104 625 -332 -1535 -654 1920 782
5017 782 -2398 -1231 1558 1127 -1150 -1336 -381 954 874 -1487 -1647 1458 1924 -841 -1738 756 1557
5034 1557 408 -1145 -1173 1014 2266 -12 -2221 544 2334 121 -1497 -215 1102 1386 -108 -1425
5050a425J336K577j874k543J256K459n26k097k56P06J855n10k725R7L164L96l113
5067a223n96J849J056n48j652l19K093R93k623j401K848J144k150p95O73J321
5083F70Q10j606k005J843K548j604k554J405K149p74j530l85R21K277j135k661
5099a631N37L078m29k517k91J699Q17k76k083n81K965P08l010j349K904N10j097
5116d6j347M92J387Q54j386k536K479K131k523j451J149J728k56j305q52O19K432
5133A569q97l270J608K609o89k261J56J085J448n04j915o60K996O37k927l32K153
5150H06O15j598p48M2J533J428k309j625K333J591k316j002J426P39O8j147j182
5167a346J068K142j422k461J350K243r03j645M5R08J450o91k794M50L011o4k989
$$ plain form
5050 -1425 -89 2488 614 -1929 -673 1786 1260 -837 -1093 -387 1468 958 -1767 -1670 1494 1890 -1223
5067 -1223 -1819 30 1086 538 -1114 -1433 660 1653 -970 -2371 477 1621 -529 -1324 -651 670
5083 670 1480 -126 -2131 -288 2260 656 -1898 -493 1656 882 -648 -1033 -112 2165 1030 -1631
5099 -1631 -1094 1984 1555 -962 -1253 446 1263 987 -1096 -1677 1288 1996 -1014 -2363 541 1051 -46
5116 -46 -1393 -901 486 1340 -46 -2582 -103 2028 -495 -1946 -797 931 675 -630 -1482 -863 1569
5133 1569 672 -2598 -990 1619 930 -1331 -1175 -90 1358 854 -1061 -1721 1275 1912 -1015 -1347 806
5150 806 1421 -177 -925 -883 650 2078 -231 -1856 477 2068 -248 -1250 176 915 983 -164 -1346
5167 -1346 -278 1864 442 -2019 -669 1574 671 -974 -929 -21 1429 738 -2056 -1606 1405 1341 -1648
5184a648J26J768O08p61j337j50K032J158k878r31K471J094j975r47Q70J277M26
5201A203j323j612K003J927j766k414J929J579p29j528k71J179J495r71k450O52
5217a097L187o71k570K42J536O41o66j485j68K012O54k532q48K582O22j960o85
5234a206N14J125O24j572j313J938J648k177j442J742J185q74p94n11P40K133
5250A760j578k321J141K622r29j717M07Q89M72m10j630L5K818p7k561j66K131
5267H86L67j342o02P2J075O04j491j607K979J190k791o54J402J076p07r44p03
5284a190J062K225j852k481J855K087j341j497M06Q83R07p38k091N83K749m50
5300A117k874N07K042J62r26q85J21J632R49l219m69K671Q54k349j123J804R47
$$ plain form
5184 -1648 -1522 246 854 93 -1244 -1394 638 1796 -1082 -2013 458 1552 -423 -1370 -500 777 1203
5201 1203 -120 -1732 271 2198 432 -1982 -53 1526 797 -731 -1002 177 1672 701 -1749 -1097
5217 -1097 2090 1419 -1151 -909 627 1268 602 -883 -1051 961 1615 -917 -1765 817 1439 -521 -1206
5234 -1206 -692 433 1057 -515 -1828 110 1758 -419 -1861 -119 1066 192 -602 -1113 -373 1760
5250 1760 182 -2139 -998 1624 695 -1022 -615 274 746 336 -1294 -1259 1559 1482 -1079 -1245 886
5267 886 1253 -89 -691 -619 456 1060 -431 -2038 941 2131 -660 -1314 88 1164 457 -487 -1190
5284 -1190 -128 2097 245 -2236 -381 1706 365 -1132 -726 157 1064 326 -1765 -1182 1567 1117
5300 1117 -1757 -1250 792 954 28 -857 -736 896 1845 -1374 -1843 828 1682 -667 -1790 14 961
5317I61L9j381j067J913J474j814k363K360J477r38j607k90J492J207j057k166
5333a760J134K631r91k632P12J605L6o75j174K02J936K64k824k01K913j11j730
5350f65m11N25Q34P46k045p58K002J355k207j471K098J241j183q06m01J050J861
5367A765j778k045J434K711j555k136P86J561L70o07j821N35K685n77k837J82
5383a327K662l13j402k70L31J338L17k133m01K265P95k433j018J824P45o26j301
5400i47k84J607J186j887k036K512J464j608j306K36J277Q50j001j840O36K941
5416A800j252k284O46J756K12j145j187N22J608M02k344m06K720L13k333j86J436
5433B78L91P9j569k87J677J373k471j486K596J346j488j482P45O13J368j265j864
$$ plain form
5317 961 1000 -381 -1448 465 1939 125 -2238 122 1599 661 -946 -1236 256 1463 406 -1760
5333 -1760 -626 2005 1014 -1618 -906 699 735 60 -1114 -912 1024 1288 -1536 -1737 1176 1065 -665
5350 -665 -1076 -551 283 1029 -1016 -1774 228 1583 -624 -2095 3 1244 61 -745 -1146 -96 1765
5367 1765 -13 -2058 -624 2087 532 -1604 -818 743 1113 506 -1315 -780 1905 1328 -1509 -1327
5383 -1327 1335 1022 -380 -650 -319 1019 1336 -797 -1198 1067 1862 -571 -1589 235 980 354 -947
5400 -947 -1231 376 1562 -325 -2361 151 1615 7 -1299 -1063 214 1064 63 -1777 -1141 1800
5416 1800 548 -1736 -1090 666 878 -267 -1454 -932 676 1078 -1266 -1672 1048 1361 -972 -1158 278
5433 278 669 748 -821 -1108 569 1942 -529 -2015 581 1927 439 -1043 -298 315 1683 418 -1446
5450a446J087K604j350k198J005J286o1o75r88L3J616M21k762l2K802l56j958
5467i72j32O77R25L16j783r03K430J015k314j151K122R59j208p06j79P79J685
5484A560j829k012K004K200j536j914R18J374M03r22j652N39K581m84k656K29
5500a197K761l97j584n9M56Q97K19j946p17K495P37k592n90J970M52o70j070m50
5518a285J521J372j984k038K509J607j798j631J006R66N91o39j820R04K270o37
5534I14k584R37J992m96j043m32PJ601L48k593p2K712k9k036j4J117N35k62j233
5553f31m61J870J259k410j501K815N29j685n44J99J155P30j112j951J338K174
5569A774j282k302J258J185Q4j005r40L70J876l42k468M20K308k87j771L46R28
$$ plain form
5450 -1446 -359 2245 895 -1303 -298 988 927 252 -736 -703 913 1334 -1428 -1460 1342 986 -972
5467 -972 -1104 -427 498 814 -969 -1872 558 1573 -741 -1892 230 1189 -19 -725 -904 -125 1560
5484 1560 -269 -2281 -277 1923 387 -1527 -609 765 1168 246 -1406 -867 1714 1230 -1426 -1197
5500 -1197 1564 1167 -417 -476 -20 877 1096 -850 -1567 928 1665 -927 -1517 453 905 235 -835 -1285
5518 -1285 236 1608 -376 -2414 95 1702 -96 -1727 -721 245 836 197 -1623 -719 1551 914
5534 914 -1670 -733 1259 763 -280 -712 -705 896 1244 -1349 -1421 1291 1262 -774 -788 329 864 602 -631
5553 -631 -1092 778 2037 -373 -1874 941 1470 -215 -759 -560 595 1325 213 -1738 -400 1774
5569 1774 492 -1810 -552 633 717 -288 -1228 -858 1018 676 -1792 -1372 936 649 -1122 -776 152
5586A52K75J34j120p01K093P98k764n96K884M7j251m57j72J357R96j895j504J718
5604fK319k002j618J110R59L85r29j035N80J878k00k738N53K382n39j722K07N55
5622A39O52J25j893m76K711K58k637q7J851jq10o55l28J624R76k121j447K289
5640A70J378j876q90Q33O37O36r75j543J037K151p74k547J358J320m23r19j09
5657e36K01J385l39j863K23K508k31k294R9J796K59p83q65n01J838Q19k276j260
5675a820K549J025j983m81N84Q38L21j186j716J841J837j838j540J385J029n48
5691B97p73l59N9J650n44j886O52K307o53j987P89M08O55m69r02l52K298J07k398
5710a101m74K554J33j479l49L43Q34J137j960j128K028J547k253q77J212Q33k48
$$ plain form
5586 152 427 561 -559 -1260 833 1631 -1133 -1729 1155 1202 -49 -506 -678 679 1675 -220 -1724 -6
5604 -6 2313 311 -1307 -197 762 1147 218 -817 -237 1641 1441 -1297 -744 1638 1099 -623 -416 139
5622 139 791 916 -977 -1453 1258 1516 -1121 -1208 643 642 -168 -823 -1151 473 1449 -672 -2119 170
5640 170 1548 -328 -1218 -385 252 888 -87 -1630 -593 1558 784 -1763 -405 915 492 -427 -536
5657 -536 -335 1050 711 -1152 -929 1579 1348 -946 -847 949 1208 425 -440 -941 897 1716 -560 -1820
5675 -1820 729 1754 -229 -710 -126 712 1033 -153 -1869 -28 1809 -29 -1569 -184 845 297
5691 297 -476 -835 -776 874 330 -1556 -904 1403 750 -1237 -448 -40 615 146 -756 -1108 1190 1297 -1101
5710 -1101 -1575 979 1112 -367 -716 -373 461 1598 -362 -1490 538 2085 -168 -1045 167 1000 752
5727G52m80q93K95J774r55k200J492J808j017j403K38O34P98l76j643J02K511
5744A437n04k264J52K162j77j303k03q7J174R75j801j442K501Q12j824j169J632
5761G1M89J9j093j096J727J905j561k320J927J451j488p83M41N44R04l98k013
5778a274K10L126j038k268O88J339J51o90q12k47J857O71k673o07K532L93k047
5795f89j65M32Q50N07j076j658J595J898j530j647J278J163q02q36j1K90J627
5812A226n82k230Q38K144p89j813O58J042L7m4j359j33K329j0k451k49K493q2
5830A025j355j64L76J023K01j371j402K341J325k049j238J268R33k60j241n39
5846a127R08J701j091k205J428J971j188j413L35O11R01o02j420j21K550m33k416
$$ plain form
5727 752 272 -621 -326 1448 493 -1707 -215 1593 576 -827 -589 45 843 467 -1176 -1074 1437
5744 1437 933 -1331 -1179 983 806 -497 -700 -787 387 1362 -439 -1881 620 1432 -392 -1561 71
5761 71 560 579 -514 -1610 117 2022 461 -1859 68 1519 31 -752 -311 233 1137 739 -1274
5778 -1274 -1064 2062 1024 -1244 -556 783 934 244 -568 -815 1042 1713 -960 -1567 965 1358 -689
5795 -689 -854 -422 428 935 -141 -1799 -204 1694 164 -1483 -205 958 156 -680 -691 -401 1226
5812 1226 644 -1586 -748 1396 607 -1206 -548 494 531 487 -872 -1005 1324 1314 -1137 -1386 1107 1025
5830 1025 -330 -494 -118 905 1106 -265 -1667 674 1999 -50 -1288 -20 913 653 -588 -1127
5846 -1127 -219 1482 391 -1814 -386 1585 397 -1016 -681 -70 831 229 -1191 -1312 1238 805 -1611
5863a611O05J977q9j555N1j8J002P50j840j019K270J109k231p93J544N50P1r81
5881b08r59J235J710j490j861J493J478q08r14Q7o5J324j14j948L31K457q75k358
5899a485R69J639m08o29r86L0J871L09k661k62K839P9k099%R69K10K38j364p68
5918a509J849J094j872r94J343R29j180j09j47K73J487r06j833R72K267j434j583
5935a353P26J568k50l10j005q2J919j7k381K85K220l85j465j09O57P07M18j218
5953g5j316J949J367k344q62J473O00l05n52n88L39J819j412j502J504J559j412
5970B42j434R92N19L80j97j494N6J959o98k014J100J563m09j208M3Q8R16P16j906
5989g86r49K484N11j806p49J409N71n17m33p47J019J558j873j323K116P90j377
$$ plain form
5863 -1611 -1006 971 882 -673 -622 -640 362 1112 -728 -1747 523 1632 -599 -1392 152 702 773 -208
5881 -208 -1167 68 1778 288 -1573 -80 1398 590 -324 -237 -302 1022 908 -1040 -709 1748 873 -1485
5899 -1485 -516 1123 715 86 -900 -870 1001 1310 -1351 -1613 1226 1305 -794 -794 175 385 623 -741 -1509
5918 -1509 340 1434 -438 -1432 -89 840 -340 -449 -596 -323 1164 258 -1575 -603 1664 230 -1353
5935 -1353 -627 941 691 381 -624 -706 1213 1196 -1185 -900 1320 935 -530 -639 18 725 1143 -75
5953 -75 -1391 558 1925 -419 -1281 192 792 487 -65 -653 -314 1505 93 -1409 95 1654 242
5970 242 -1192 -200 319 699 502 -992 -936 1023 325 -1689 -589 974 565 -643 -600 -512 404 1120 -786
5989 -786 -1735 749 1260 -546 -1295 114 685 168 -265 -1012 7 1565 -308 -1631 485 1275 -102
6006a02k66J32M12O85k35j648P01K118j142k093J248J109l92p77k00p5J454K93
6024A222k592K56K530j90k139J92J064N54j98r03j260J715J104j944j041J983
6040C53R45j513l31J84J01J381j134j431J389J484j443j702J476Q40j23k69r55
6057g48K63J857k13k650P84J961m60j401j43P19N90L02j554p04K327P18k324k14
6075h90J267O62j162m4k70M96J318j203j832J626J453j894n93J173J57L35m43
6092A56j134M97K153j198k017Q98J726o58j182J26L76Q21N97k376j38K425M71
6109A543k797L40J444q4k67l57q39J344J277j891r73J785R60j860o00J171K36
6126D32O3n4j574N68K133r64k428J695J367j030o58l57N04J440k69j961l46K800
$$ plain form
6006 -102 -368 -236 176 861 626 -1022 -321 1797 655 -1438 -190 919 527 -250 -450 -525 929 1222
6024 1222 -1370 -1114 1416 1226 -913 -721 343 897 699 -204 -1464 251 1355 -589 -1630 353
6040 353 1298 -215 -546 -362 -261 1120 -14 -1445 -56 1428 -15 -1717 -241 599 476 207 -748
6057 -748 -485 1372 1159 -1491 -707 1254 794 -607 -750 -31 559 861 -693 -1397 930 1648 -676 -890
6075 -890 377 1039 -123 -167 -437 59 1377 174 -1658 -32 1421 -473 -1066 107 264 599 156
6092 156 -978 -481 1672 474 -1543 -645 1081 423 -759 -633 -257 564 1161 -1215 -1353 1072 1543
6109 1543 -1254 -914 530 446 179 -178 -1017 327 1604 -287 -1260 525 1485 -375 -975 196 432
6126 432 495 441 -1133 -565 1568 604 -1824 -129 1238 208 -450 -807 -303 1137 868 -1093 -1439 1361
6144A361m52j923K25J036L45l67j003l56J766Q54j685j290J934O36j322o0J7K40
6162d4J010j092j212J430J760j658j489J252P22j54k35p74R9J980p48k264N84
6179h33K318m90j516r9Q40K92M44j489p33K001O40k073k79J734Q8j083J78q22
6197h82P03J404j525j231J602J234j754q50J140M51O0n11j136P31K039j166j896
6214a587J202J614p21j474L28M58J068P2j886l98K786l96j966K16R31M27m35o79
6232d40l38J236J165j786j199K247O75j837m21O23N38K71o46j151Q79J726j733
6249a91j508J295J347r67m30j51L77J080Qk340Q7K788n29k129N88J136K2k57q80
6268f54m20J595P93j957o02J973M80j594j33M97O7Q18q87j155J397J660k086r55
$$ plain form
6144 1361 909 -1014 -789 247 592 225 -778 -1134 632 1486 -199 -1489 445 1081 -241 -301 -284 -44
6162 -44 966 -126 -1338 92 1852 194 -1295 -43 679 525 290 -484 -385 1595 847 -1417 -833
6179 -833 1485 995 -521 -620 220 512 956 -533 -1266 735 1375 -698 -977 757 845 -238 -60 -882
6197 -882 -179 1225 -300 -1531 71 1305 -449 -1299 -159 292 352 -159 -1295 -564 1475 309 -1587
6214 -1587 -385 1229 508 -966 -638 -180 888 960 -926 -1324 1462 1066 -900 -684 247 674 239 -440
6232 -440 -778 458 1623 -163 -1362 885 1560 -277 -698 -75 463 734 88 -1063 -184 1542 -191
6249 -191 -1699 -404 943 -24 -454 -605 -228 852 860 -1480 -1393 1395 866 -1263 -675 461 483 226 -654
6268 -654 -1074 521 1314 -643 -1245 728 1208 -386 -519 -22 45 863 -24 -1179 218 1878 -208 -1163
6286a163J445P08q26k34m10K82J767j077j953O97K400j087j399N58R48L7J05j496
6304f98n17K284K27k018l64J717J38j027j11j26K67J370j515r90J639J097j903
6321e30n19R09N01l44j09j021P69J716j353j766J241J701j213n28OM32N68L99
6339H59k081K35K223j10j953L71R58J82m35m31q61J463Q24j573r54J908Q47j963
6357d91k24J034J25j03n70j057J640J195j678j521J439J279q88r30K82J03J083
6374G18l95j655L56K554q89j859L32Q00L76j06n21o48J427O81j808o42J777L12
6392H10j291K9L91M60M15r67j185J850R18j951q67J777M99m42r61o3L27J448n73
6411F24j918Q80J879q64j667O20P59R4J26j085m87J762M44k222j08J713or29J23
$$ plain form
6286 -1163 282 990 164 -70 -480 -198 1569 492 -1461 -764 1636 549 -850 -292 656 693 798 -698
6304 -698 -1215 1069 1296 -722 -1086 631 769 -258 -369 -495 -228 1142 -373 -1363 276 1373 -530
6321 -530 -1049 -140 361 17 -92 -1113 -344 1372 19 -1747 -506 1195 -18 -546 -540 -108 460 859
6339 859 -1222 -987 1236 1126 -827 -456 502 684 249 -182 -1043 420 1244 -329 -1283 625 1472 -491
6357 -491 -715 319 444 341 -229 -1286 354 1549 -129 -1650 -211 1068 180 -750 -468 -365 718
6374 718 323 -1332 -976 1578 689 -1170 -838 -38 338 232 -289 -937 490 1171 -637 -1279 498 810
6392 810 -481 -452 -61 399 814 -153 -1338 512 1430 -521 -1388 389 888 446 -515 -578 -251 1197 624
6411 624 -1294 -414 1465 601 -1066 -446 313 407 533 -552 -1039 723 1167 -1055 -1163 550 544 -385 -262
6430b62m05R75O00j461o70J420J013j981m85J296K62j70j62p74P59J455q28k177
6448a595J396J624r80j198M67L97N82k33j323j3K260n02j771O06J530p55n68J80
6466A04o89R20P19j618r35K108O74j951l70J075J60J02n53q65J036J595j856j362
6484a706J591R65p47o70Q4J79J187o50j390J54K307p67j959R08R52k00j08o98
6502e68k24J451M09j888k73K016l4j524L85N70K2J83n58r12J433J062k051m14
6520i15J399N70r09m73l3J41J257q40j652J339J602j244j243N65Q65j26k4r71
6538f92o53K074J82k151P15J336l26j038k1K24P69M86j684q43K229N17k039l15
6556a230J658J04m77l84l80O32J559j472j608J665J391j394q74P95N34K7m1j308
$$ plain form
6430 -262 -667 308 908 -553 -1223 197 1210 -771 -1256 40 302 132 -30 -804 -45 1410 582 -1595
6448 -1595 -199 1425 445 -753 -286 111 693 460 -863 -876 1384 882 -889 -283 1247 492 -76 104
6466 104 -585 335 1054 -564 -1499 609 1283 -668 -1038 37 197 299 -254 -1119 -83 1512 -344 -1706
6484 -1706 -115 850 103 -567 -483 -304 883 233 -1157 -1003 1304 537 -1422 -514 438 238 130 -568
6502 -568 -792 659 1068 -820 -1093 923 889 -635 -250 320 342 525 -33 -945 488 1550 -501 -915
6520 -915 484 1054 145 -328 -361 -220 1037 197 -1455 -116 1486 242 -1001 -436 429 303 279 -692
6538 -692 -1345 729 911 -1240 -525 811 485 -553 -574 -350 419 905 -779 -1622 607 1124 -915 -1230
6556 -1230 428 532 55 -329 -709 -77 1482 10 -1598 67 1458 64 -810 -15 519 546 505 -803
6574h03L58J834m98j772O23J188l92l35m72q6N84P09j627p74K375J11j840K74
6592e43Q89l2r4m19n77Q19J102j005j741J930N18j121n03K16J12J519q40j513
6610a283O56J832n78k209R74J212l39j38n53m00J549J36j808J44J713o8j427M77
6628a10J67J42L57p99o31J155J231k218j64J368N30j042k06k20P04J044j083j401
6646a176J201J297j020j305P28O53m4L4j108k06J880q8j936K44K123r33p22K35
6664a43m8M48K61j048l73J527O30k099j53J642j53l58n56k94Q76J217j541j451
6682a616J812J048j414r63R04O75K34n14j091M46J449l09j737Q81J192n20p53
6699b76n1k85J250j4j283j28J961j69j759J55J057m36J66l75o28Q24J251j817
$$ plain form
6574 -803 -445 1389 891 -881 -258 930 538 203 -269 -355 229 938 -689 -1463 912 1023 -817 -543
6592 -543 346 314 220 -199 -776 43 1145 140 -1601 329 847 -274 -777 -561 -449 1070 230 -1283
6610 -1283 -627 1205 627 -1582 -608 604 265 127 -426 -826 723 859 -949 -805 908 840 -587 -110
6628 -110 57 199 556 -243 -874 281 1512 -706 -870 498 1028 -14 -220 -440 264 1308 225 -1176
6646 -1176 25 1322 302 -1003 -275 378 334 368 -740 -946 934 846 -1090 -846 1277 344 -378 -143
6664 -143 -191 257 518 -530 -903 624 1254 -845 -998 644 491 133 -423 -717 159 1376 -165 -1616
6682 -1616 196 1244 -170 -1133 -229 446 680 166 -925 -479 970 661 -1076 -195 997 477 -276
6699 -276 -327 -612 638 624 -659 -787 1174 1005 -754 -599 458 22 188 -187 -815 9 1260 -557
6717e57j070J694J167j556k03M8O00Q39o55j574Q89J837j067j405P15J172p36
6734A38r9m96J58R61M52j865K2J876p66r55N18P37k69j95n85l32J355N53j855
6753f47l71J909K69j193n96J83N71P91p72j510J202J614j311j088Q01L89J67k54
6771A54q95J31J277j31j568J68J671k48j497Q92j13M76M53j274m86J818M45k137
6789h64k2J399K07o79o2m23Q18R70j223j438J384J452j602m21N34L40K23j86j202
6808g95M09J663p25j677R58J163n00q24K03p9O86N9j509K11J545j44j790O59R75
6827D88o5m20l83l75J076R81j886q52J790P32j634J54L85J8P33m67j666J257J408
6846A274r59j511R19J020o58j23l52K97R31j06j426j49K118n28j790R19M33k9
$$ plain form
6717 -557 -1627 67 1234 -322 -525 -477 123 962 307 -1267 -378 1459 392 -1013 -298 874 138
6734 138 39 -457 -299 662 1114 -751 -729 1147 381 -574 -56 681 412 217 -368 -700 655 1208 -647
6753 -647 -1018 891 1160 -33 -629 -446 125 916 144 -1366 -164 1450 139 -949 -148 241 408 154
6771 154 -741 -610 667 536 -1032 -864 807 559 -938 -46 -159 317 770 -504 -990 828 1273 -864
6789 -864 -886 513 720 41 -21 -444 374 1344 121 -1317 67 1519 -83 -504 30 370 593 407 -795
6808 -795 -386 1277 552 -1125 -167 996 496 -328 -125 -204 482 541 -968 -757 788 644 -1146 -487 488
6827 488 423 3 -380 -755 321 1302 -584 -1436 354 1086 -548 -394 -9 9 742 275 -1391 -134 1274
6846 1274 315 -1196 -277 743 85 -38 -390 -93 838 732 -694 -843 1275 747 -1043 -124 309 280
6864B80R4p25o13J511P44j872m39J569K95j219o0K86K74Q51j129j070J322J208
6882A307j555q09J047K25J03o16j76k30J644m68j770Q10J530p50r20P45k26O38
6900E29j7j200P3J376L31j979Q5J771l36n82r1l95N28J316j563j065K008J063
6918A852k058m80Q94M20k52k81j074N40J705o51j907R34J279r28k63m1R9N56J86
6937E30j176k76J758m37j740R14R54j47p96N1l51J028O90j579o36J636O29j266
6955b14m98M20O47M9m58q32O61J803j421j451J755L30o65m9j79r2Q29J03j502
6974g64N40J142n76j163Q36O74k70k59n95J41J061M88k149m1J744R4j248k93M21
6993b17K99N08n94j160J184J349j449p93P96O71m41j6p40o0J570N9k185P03J771
$$ plain form
6864 280 374 -351 -964 547 1291 -581 -1020 549 844 -375 -435 -149 125 976 -153 -1223 99 1307
6882 1307 -248 -1057 -10 215 318 -298 -474 -704 940 472 -1298 -488 1042 292 -628 117 -109 529
6900 529 512 -688 -615 761 1092 -887 -802 969 633 51 -40 -435 93 1409 -154 -1219 789 1852
6918 1852 -206 -686 208 628 376 95 -979 -439 1266 615 -1292 -358 921 -7 -270 -311 -212 344 530
6937 530 -646 -922 836 399 -1341 -427 527 380 -416 -365 -716 312 1002 -577 -1213 423 1052 -214
6955 -214 -712 -292 355 404 -54 -886 -225 1578 157 -1294 461 791 126 77 -102 -194 635 738 -764
6974 -764 -224 918 342 -821 15 689 419 160 -435 -294 767 1255 -894 -935 809 903 -345 -638 -217
6993 -217 82 590 -4 -1164 20 1369 -80 -873 -77 594 153 137 -603 -663 907 966 -1219 -516 1255
7012A255j196p86P17L66j07o6o61l4J341J19k061L47J665m16j006K72j77Q06P36
7031A114j251r85J466P41j269o58J173M07l3m16j100M25J616o78j518Q17J120
7048I71j231j00L03QO91J7j496J97J774p42j510N86J229l99m72m18p5J195K34
7067G62j624m31J748K84j163k56O18N6P33p14j075R28J604j152j255J228K95p02
7085a16k23L65J13M75J13j614O29J528r78j199Q79P79k27j55o49j54J188L68j832
7104g10l06J889q6j202O4pM84Q48j176p26J024J097j609o02J511l8p74N7l20K21
7124c61J050l04j777J254J403j306n26M80N22l40K35j076O7J560j95j690N34J280
7142H10j79p61o5NM75O36q67j163J816P01j734l06Q42o5K04l78n17N28J006p90
$$ plain form
7012 1255 59 -727 -10 356 249 183 -478 -512 829 948 -1113 -766 899 483 -523 -251 -428 378 1114
7031 1114 -137 -1122 344 1085 -184 -842 331 738 705 289 -811 -386 1230 552 -966 -149 971
7048 971 -260 -360 -57 -49 642 659 -837 -640 1134 392 -1118 -532 697 298 -174 -592 -667 528 762
7067 762 -862 -1293 455 739 -424 -680 -62 -6 727 13 -1062 -134 1470 318 -937 291 586 -116
7085 -116 -339 26 139 614 727 -887 -258 1270 292 -907 -28 751 524 369 -280 -434 754 1122 -710
7104 -710 -1016 873 787 -415 -351 -358 126 974 -202 -928 96 1193 -416 -1018 493 455 -319 -262 -582 -361
7124 -361 689 385 -1392 -138 1265 -41 -567 -87 435 95 330 -746 -679 881 686 -1004 -470 810
7142 810 631 -130 -195 -190 285 921 54 -1109 707 1408 -326 -632 210 145 349 -29 -546 -18 988 198
7162A98j145J172M20q93l1P1K37K53k17r33L81J550o35j636J066O20l18k23o6
7181a29m73J214N49j670l78J801K48j620r9Q54LJ53m76j078R30J399j325j233
7199a330J470N54p03m62N60k78J224p34j373O87J386p63j325P62Q59m70J61m61
7217b36n42J763k24j766L34J458j73j249J76N42q2P45j205n66J348Q04j669n26
7235a068J411K73o70j0l91k03J321k74j427O97J289j003o83P62K63j14N6p24J60
7254c35J070O7j849O53J450m54q56k54K33P75Q9j031o26J876R2j250l45J165J0
7273D80l00k46q31P47J173j120j321J525O36j184j79O33r7K31K97j103J0J861
7291A212q58j568R63J177p77m37n7K02N67M40j546j39K048k86j833L89N88K56
$$ plain form
7162 198 -947 225 645 -248 -279 -208 29 282 65 -868 -487 1063 428 -1208 -142 478 160 -63 -129
7181 -129 -602 612 1161 -509 -887 914 1162 -458 -557 297 300 453 -23 -1101 -171 1228 -97 -1330
7199 -1330 140 694 -9 -471 89 -189 1035 301 -1072 -385 1001 238 -1087 -325 534 64 225 -236
7217 -236 -778 985 761 -1005 -671 787 614 -635 -459 83 1 746 -459 -1025 323 1127 -542 -1068
7235 -1068 343 616 -54 -64 -455 -658 663 389 -1038 -341 948 -55 -738 24 287 173 229 -495 -335
7254 -335 735 802 -1047 -394 1056 602 -254 -508 -275 500 589 -442 -1068 808 900 -350 -695 470 480
7273 480 180 -66 -897 -150 1023 -97 -1418 107 743 -441 -620 13 -84 147 444 -659 -649 1212
7291 1212 354 -1214 -251 926 149 -288 -345 -143 424 864 -682 -821 1227 941 -892 -503 85 341
7309C41K78m67j010J061J205j528o11J345J04r59l1J62J3N77l60j245O71J412
7327I58j009r79P79P07k19n62l36L3J605p03j546K99J753l56j244M50J44O12M19
7346H05j019j067J603O44j639n1J025L9q74N80p01N27R22l09j441J067J042j800
7364f47j55J000K83k91o2j057J55K081j117j166O18J506r43o40J85k5M01N54j023
7383c43p65J962K63j804J33N77K33j09j89m85K67J111o88j216J359M63j319J17
7401d33P7M74J84m17p79N99J384r85j557J543Q16r87r9o6OQ14K95j557m34J863
7421G41n3j144M98N47n63M23m64r03J081M40j310r7J489k51q95J39M11p4N78n73
7441B0j151R44J403j453p82Q71N86l67k18j23k87J456k72k024O64J710o79p88
$$ plain form
7309 341 619 152 -858 203 1408 -120 -731 614 718 -241 -272 -110 -97 480 120 -1125 -454 958
7327 958 -51 -1030 -251 456 237 -325 -661 -628 977 274 -1272 -973 780 424 -820 -370 -226 386 805
7346 805 -214 -1281 322 966 -673 -724 301 340 -534 46 -655 -128 794 485 -956 111 1153 -647
7364 -647 -802 198 481 190 128 -929 -774 1307 190 -976 -358 1148 205 -435 -250 -275 126 680 -343
7383 -343 -1108 854 1117 -687 -554 23 256 147 -42 -527 -260 851 163 -1053 306 769 -550 -433
7401 -433 -356 118 302 -115 -894 -295 1089 104 -1453 90 906 -81 -180 -246 -240 574 869 -688 -1122 741
7421 741 688 -456 42 589 26 449 -15 -918 163 603 -707 -804 685 434 -461 -322 89 15 593 20
7441 20 -1131 -187 1216 -237 -1019 -148 438 71 -147 -270 -557 899 627 -1397 -733 977 298 -490
7459d90J50K69J31N27j105m45J428K53j503k09J605m63j46r0Q2j9P55q08r66J585
7479E41O74j762l83J103J36P0j99q83L46J459o71j547P71J333q07m98K76j28J06
7498f3M77r79l49J645k02j427K01J145l63l12o9l75N60J005j290r85J764L91j375
7517f01j91Q27n6L32k36j007Q31J404j183j247J173P35r26o3P4r5J026j78j297
7536f78J66J579j75j438M15O64r3j37m31p66J039P94j415n35J438J79j185M37
7554a42J57n1O41q03q00J171P50j466n44J505M81r41j19k06j2J254q20j070M38
7573e77J316m19j197O16N59j75L93q62n50J347M07j538J2J428o41l27K94k14K54
7592A26Q53j174o64J183Q33j703k11J142j23j94O2m33K0J563q47j824J625Q69
$$ plain form
7459 -490 -340 -71 60 587 -518 -963 465 718 -785 -994 611 148 2 -88 -6 -25 730 -78 -1044 541
7479 541 1215 -547 -930 173 309 379 180 -703 -357 1102 431 -1116 -345 988 181 -317 -41 -169 -63
7498 -63 414 -565 -914 731 529 -898 -697 448 85 -227 -296 -671 -111 894 -396 -1381 383 774 -601
7517 -601 -792 35 -21 311 75 -932 -101 1303 120 -1127 46 781 -145 -208 -134 -229 797 619 -678
7536 -678 -512 1067 892 -546 -131 533 440 303 -128 -894 145 939 -476 -1011 427 606 -579 -142
7554 -142 15 -36 605 -198 -998 173 923 -543 -1087 418 899 -42 -161 -367 -379 875 55 -1015 -577
7573 -577 739 320 -877 -261 298 123 516 -346 -896 451 858 -680 -668 760 119 -208 86 -128 126
7592 126 979 -195 -859 324 1157 -546 -757 385 262 68 130 -303 -283 1280 433 -1391 234 1103
7610A103j233m64M60PQ66J03j431l58J695K37j403k35J263o08j15j06m90Q26O19
7629G36r28p23J522J11j549M47K23L32l46J9k98O71P98j088j228J224R42j236
7647c71l7M37k70P29j1j569L17J792n38j397Q16L94m46M75k20p89J049P73j653
7666e19m27J696r2j411Q96k18J94L26n64o53P29J350j956n59J425K55n55j33j89
7685d05J95J239n26j530O25J449m09j320K49P26j3L97j147l14J671k42j218P3
7703e00J316n32p12N82j36n4R35r19q57J485L33j328n60J388j76m11K03o43K30
7722c56J644j136j351J196P71j022m61R13l93K98M38j330j99J610k5j443K55R55
7740C64k08l02k08n4M81O43j112n17J503J61j141J11P01m90J75R4j111R73J230
$$ plain form
7610 1103 -130 -594 -134 -127 739 842 -589 -947 748 985 -418 -653 610 2 -113 -219 -709 117 736
7629 736 -192 -915 607 718 -831 -384 -161 171 -175 -156 -454 217 1015 -73 -1301 -77 865 -371
7647 -371 -408 29 -241 488 477 -1092 -775 1017 479 -918 -102 292 -154 321 101 -688 361 1134 -519
7666 -519 -946 750 658 -753 143 -75 119 445 -119 -772 -43 1307 -649 -1208 217 472 -83 -216 -405
7685 -405 -210 1029 503 -1027 -402 1047 638 -682 -433 293 280 677 -470 -784 887 645 -573 -500
7703 -500 816 284 -428 154 18 -36 899 -20 -877 608 941 -387 -947 441 265 -146 57 -586 -356
7722 -356 1288 152 -1199 -3 768 -254 -715 198 -195 103 541 -789 -988 622 597 -846 -591 364
7740 364 156 -146 -354 -408 73 716 -396 -913 590 751 -390 -279 422 -68 107 201 -910 63 1293
7759A293j461p22J120O36r06k01J18m5P46j54j563Q28J601q77j013N39O64m06
7777A97o4l43n3M47M45j147l28J516l00j059J94Q62l01J72o28n25J233P69j895
7796h08k77J284J84n05J34l75J8J113n68j349P68J367r68n48O25K43r2K96p39
7815a97j60J312j66j518K83J221m58o39L27J56o8O16j066m47J222O09j594M5J227
7834G05n29l56K26m18J60J301j165r92J240N69r77m84O58k74M67J37j124N25J234
7853I03p73r80P01Q15o44k93L84p03R28R6q70n4J237O6j478L75Q17p39N52o57
7873c17p4O23Q91j450o47J573Q2o65m77M02r2P74K6j423N68J707j326p99O76M95
7893E47n33j17j1n34R79L79j333N2J363n28q55J25P79m26J69m09l91Q55Q53j376
$$ plain form
7759 1293 -168 -890 230 866 -40 -241 -123 -168 578 424 -1139 -311 1290 413 -600 -61 603 197
7777 197 133 -210 -263 184 629 -518 -846 670 370 -689 -495 367 66 238 -390 -915 318 1087 -808
7796 -808 -1085 199 383 -122 12 -363 -345 768 200 -1149 -381 986 18 -530 95 338 246 542 -197
7815 -197 -357 955 789 -729 -446 775 317 -322 5 161 93 709 -357 -804 418 1027 -567 -522 705
7834 705 176 -180 46 -372 -212 1089 -76 -1068 172 741 -236 -720 -62 -336 131 268 -856 -331 903
7853 903 130 -850 -149 666 22 -271 113 -590 338 434 -436 -490 747 813 -665 -290 527 -212 340 -317
7873 -317 -391 232 1123 -327 -974 599 681 16 -461 -59 -151 623 649 -774 -206 1501 175 -624 52 547
7893 547 14 -103 -114 -648 331 710 -623 -571 792 264 -591 -466 313 -113 56 -353 -744 111 964 -412
7913d12p24J423N64j239K57j79k18J357p13j289J015J133q78j128J156K50j52
7930B23J86p69j32J247l42j051J20J422q11l20L88j79J93K94o75l53J138j19j197
7949g37M6J583o64n59J07J70K11R26j607n52R76J198j189m97N19K57N0Nr54K70
7969d41J357p44p41L92Q34n94m30K55j34N31o0p50j44J452k17j259N82O22j15
7988C96m31r5l61P06R92j449o40J214O45j086k48L60N1L51l9j304O03J307q73
8007I9p25P92K26m09J60l29K8L16L53j378J90J360n12r01N95L85l48M47m03n46
8027f00J028L57j406q12K009q8p69K48k81L7J135p48j217J241J038j558j94Q65
8045B85J6m50M22n15q8Q29J61j177O74Q76q30n76N19J38r7R8l76o33J177L24j513
$$ plain form
7913 -412 -1136 287 851 -388 -131 -310 -528 829 116 -1173 -158 975 97 -1031 125 375 223
7930 223 409 -360 -492 755 413 -638 -518 904 93 -227 161 -18 175 469 -206 -559 579 460 -737
7949 -737 -691 892 228 -331 -224 -54 157 1083 -524 -1076 -100 1098 -91 -588 -69 188 238 243 -711 -441
7969 -441 916 172 -569 -177 657 63 -367 -112 -246 285 225 -525 -669 783 566 -693 -111 511 396
7988 396 -35 -130 -491 215 1207 -242 -882 332 977 -109 -357 3 54 405 366 -938 -335 972 99
8007 99 -626 166 392 -17 143 -186 -158 158 511 -867 -677 683 171 -730 -135 250 -98 349 -54 -600
8027 -600 428 785 -621 -1433 576 488 -281 -33 -314 -277 858 110 -1107 134 1172 -386 -580 285
8045 285 301 -149 273 -242 -330 499 660 -517 157 1033 203 -373 146 284 187 285 -91 -724 453 777 -736
8066g36K78J127l29n86m4m59P71O50p60j073J127O53j153m86J126Q0j58J90r83
8085g65K21J131n48j118J485L40q69l32M70K82J53rj293J18J452l31j353O86P55
8104D75l21N6k57m85P67N38j224l28J192K90r80J21M22l80M79M0j046O43J068
8123A070j171p64J101J29q72L99K45k81P25j94j188K53J490r85p77M94K85j21
8141a62M11k88p86J198L18j455K45J174p6p64j4M17q6O53o05q30R27R03j364k11
8161c95R35j19n63P8m74L20R47m51j084N83J228j025m48O22K62j65J73j117J1
8180f82J391j78j302J91J306l81q31L71J78J63M30
$$ plain form
8066 -736 -458 669 340 -246 -290 -749 22 672 -88 -1161 -34 619 -534 -1020 106 186 28 218 -765
8085 -765 -544 587 39 -1079 406 746 -123 -455 15 297 450 441 -852 -734 718 387 -966 -280 475
8104 475 154 210 -47 -532 235 773 -451 -779 413 703 -277 -156 266 -114 365 405 -641 2 1070
8123 1070 -101 -865 236 365 -507 -108 137 -144 581 387 -801 -548 942 -43 -820 -326 -41 -162
8141 -162 249 -39 -825 373 691 -764 -519 655 579 -185 -199 218 132 785 180 -650 277 1180 -184 -395
8161 -395 540 421 -142 -64 -538 -218 729 278 -806 -223 1005 -20 -468 154 416 251 424 -693 -682
8180 -682 709 531 -771 -580 726 345 -486 -115 63 226 656
8191F56
$$ Imaginary data points
##PAGE= N=2
##DATA TABLE= (X++(I..I)), XYDATA
0@%%%%%%qJ6j6J6j6K4l2L3m1N3o2P3q8J04j24J45j67J92k20K54k92L31l74M23
30B24m75N33n98O71p50Q34r27J030j144J268j404J554j720J905k109K339k602
47a371K900l239L635m104M665n351O221p358Q912j1185J4830k1631L8590j55266
61a29752l35085J97661K50019L1194j58350r1872L1585P0954o6642q5438Q9301
72a96425J56441m1820j37158k0556Q5596O7345J7977j9645K8825O2251m1803j08789
84a47761N5109J65723K7959r5836k0564P6569O9778l1679j09786r384J46628O4199
96A90955j23856p6625R3716Q6145m4014j07848m2841R6948J10167p2803j54563
107d4619L779J02526J2828m5315o980J3588l615n0925p6347K1384J11194J5544
$$ plain form
0 0 0 0 0 0 0 0 -8 8 -8 8 -8 16 -16 17 -24 29 -33 40 -48 56 -68 77 -90 102 -118 136 -156 175 -199 224
30 224 -251 282 -316 355 -395 439 -488 542 -602 666 -738 816 -904 1001 -1108 1231 -1371
47 -1371 1529 -1710 1925 -2179 2486 -2865 3356 -4002 4910 -6275 8555 -13076 25514 -129752
61 -129752 -464837 -267176 -17157 14037 -144313 -236185 -204600 -133646 -200288 -285726 -196425
72 -196425 -39984 -81804 -218962 -239518 -153922 -86577 -68600 -88245 -59420 2831 -38972 -147761
84 -147761 -92652 73071 101030 5194 -15370 61199 130977 99298 -10488 -19872 126756 190955
96 190955 67099 -9526 84190 170335 126321 18473 -24368 72580 182747 109944 -44619
107 -44619 -40840 61686 74514 29199 22219 35807 32192 -18733 -95080 -73696 37498 53042
119E3042q3330j2688L9854k8923n5382O258O1833O7550k2614j25440m1296J19822
131b1314P7659o2697m8415L8171L6018k1448o6227k6195J02942J11685n6850j18398
143e5069R391P2890J1223k4206j7600R607M2061r09o3126K0O8293l126n6959L685
157c825K7144j2354k2756j7539N699M7934N938p2995j8698O5289L566p3014l1079
170i6690L3181N0711K6619m7724o4595L0083N2853l6887m1280L8441L7845j0970
182b8413k6098k5524J1224O1882J9378m5558p031K3043k5880j8889M2889M1580
194B2603J0476q086l9716k2521L8501J8175l1345J4321M7883j5882m3443k354
206a1388J8033K6787K0876l6265m2914K6144K3555k9928k140L6459K675j7817
$$ plain form
119 53042 -30288 -42976 -3122 -32045 -87427 -81169 -19336 48214 25600 -99840 -141136 -21314
131 -21314 56345 -6352 -54767 -16596 19422 -2026 -68253 -94448 8494 120179 63329 -55069
143 -55069 -45678 27212 38435 14229 -3371 6236 48297 47388 -15738 -15718 52575 49449 -7510 -3825
157 -3825 23319 10965 -11791 -29330 -23631 24303 30241 -42754 -61452 3837 7403 -65611 -96690
170 -96690 -63509 -12798 13821 -33903 -98498 -68415 -15562 -52449 -93729 -55288 -17443 -28413
182 -28413 -54511 -80035 -68811 -6929 12449 -33109 -40140 -17097 -42977 -61866 -18977 22603
194 22603 33079 24993 -14723 -37244 1257 19432 -11913 2408 50291 34409 -9034 -11388
206 -11388 6645 33432 54308 18043 -24871 1273 24828 -5100 -7240 29219 31894 14077
218A4077r647k1968j447K8107j0708k7680L1344K8090l3046k0925J5227m46l364
231a2386L459j7193K591L3492j0766l8749J7884L0554j5337q340Q158j5129r503
244c1265J0451o037J3024M3194r584n1974l18K3774j0934m030J6857P817J1514
257A2489l133m6344j3011N9381K5520m0113k0730Q180r71Q219P373r570J7483
270D773K6410l4695m1856K0920K2496q953R324J4540j0563p404o771j4037K5090
283g26L5793l4286m3306L1895L8204j7574k4004k191J8692L5394r194o3572o822
296d1697O3408J1774m4588q768K5464K1789M603l5611l8449K9352M1349k2620
308F006j8955K6536J886k7632q38J3847J0355J0304k2324l0281K7562K9823l8219
$$ plain form
218 14077 4430 -17538 -18985 9122 -1586 -29266 2078 30168 -2878 -23803 -8576 -9022 -12386
231 -12386 -8927 -26120 -23529 9963 -803 -39552 -21668 8886 -6451 -14791 -6633 -21762 -31265
244 -31265 -20814 -26851 -13827 29367 19783 -32191 -32509 -8735 -19669 -23699 -6842 975 12489
257 12489 9356 -36988 -49999 9382 34902 -5211 -25941 -17761 -18732 -10513 -3140 -12710 4773
270 4773 31183 -3512 -45368 -24448 -1952 -10905 -1581 12959 2396 -5008 -11779 -25816 -726
283 -726 35067 781 -42525 -10630 27574 10000 -14004 -16195 2497 37891 28697 -34875 -41697
296 -41697 21711 33485 -11103 -19871 5593 27382 31985 -3626 -42075 -12723 28626 6006
308 6006 -12949 13587 15473 -12159 -12997 850 11205 21509 -815 -31096 -3534 26289 -11930
321a1930k2590N1437L5747l0983n0598k6228L4340O6775q282p1801J140O4131
333C1158J595n2209j9796K3787M1374J0293n5760m0402M7750M4760k9706k2301
345a9457J8198J697j5942p802l103J7113K1498k3713k3121M1492K3006n4233l5447
358e9814L7562M0650k613l8217l1294M0242O4612l2890q3384J4644Q0893J4596
370D4987n2616m4716J1549O3129K8561n4868l3390N0199K5671m7857k7793K5092
382a2052L1730J5742j5656k8851J1775J9480l2481j7393N3219K7585m9730l8095
394c4727J8842M0251J8546l5353m5299L4664N9303m1266p9441J9702P8599K6353
406F0174m4010o1584j397O7899K2206p0027l1310O0366L5528l3730l3746K063
$$ plain form
321 -11930 -34520 16917 52664 21681 -28917 -55145 -20805 45970 37688 -34113 -32973 31158
333 31158 32753 -19456 -39252 -15465 25909 36202 -19558 -59960 -12210 32550 2844 -19457
345 -19457 -1259 438 -15504 -23306 -26409 -9296 12202 -11511 -34632 6860 29866 -24367 -59814
358 -59814 -22252 18398 15785 -22432 -53726 -13484 51128 18238 -65146 -50502 30391 44987
370 44987 -7629 -52345 -40796 22333 50894 -3974 -37364 12835 38506 -9351 -37144 -12052
382 -12052 19678 35420 19764 -9087 2688 22168 -10313 -27706 25513 53098 3368 -34727
394 -34727 -15885 24366 42912 7559 -37740 -3076 56227 14961 -64480 -44778 33821 60174
406 60174 16164 -45420 -46817 21082 43288 -26739 -58049 2317 37845 4115 -29631 -27568
418b7568K7107K1420k4533l2101K8355L0344l8183k5563M0686K7724k2798k4809
430a9919J324K7447J9422m2338m7206N0646P5940k6785p3191l884M8604K8800
442C8860k5391n1355J0748P6389R244q3015k9802O3426M5555j9182m1196j8095
454b3814K8137K8436k9239k6762M5493L5397m1924l7232J8393K3346j545j6384
466B302j0579K8837K9660m4297n2635M1316O3728k1183n7089j1332L4353L5640
478C8721j7528n6569O448P3903Q442p2737k8314M2026L2814r342l4060j3781M1479
491A1502L1574m4991m0636L5537L2074k4227k0045J1221J7416N585k2373k4775
503c2138L2070M2735l3289m9948K1593M0335q204k6928o421K6836L7409j9372
$$ plain form
418 -27568 -461 20959 -3574 -35675 -7320 23024 -15159 -40722 -36 27688 4890 -19919
430 -19919 -18595 8852 28274 -14064 -61270 -10624 65316 38531 -34660 -38544 10060 38860
442 38860 13469 -37886 -27138 49251 58495 -24520 -54322 9104 54659 35477 -5719 -23814
454 -23814 4323 32759 3520 -23242 22251 57648 15724 -21508 -3115 20231 18686 2302
466 2302 -8277 20560 50220 5923 -46712 -5396 58332 37149 -19940 -31272 3081 38721
478 38721 21193 -35376 -28928 44975 53417 -19320 -47634 -5608 27206 17864 -16196 -29977 11502
491 11502 43076 -1915 -42551 -7014 25060 833 -19212 -7991 9425 15010 -7363 -32138
503 -32138 -68 42667 9378 -40570 -18977 21358 13154 -13774 -20195 6641 44050 24678
515B4678o5511j450O6918J5928m3541j5988K4430K2006n679l4258j2075M7194
527B2652K8891m6618l4353L1917K8112j2202j3467L37J5192J3311k8227l5268
539b9723K8713M3970k0823l5259J3268K3355k604k0536k2048J1522L9749p505
551B2079m9031J837M2773m0l0080p218J1565J5619p3l2497j4683L9408K0087l4419
565a4673j3440K6870Q146j6802j7133m389K4387K7603k2750l1778K4312K7554
577A7907k1279k0137J1792J5791Q381p299k5357M332L5990J486k6201P418J7410
590B0234j2392j1702N253P772J5671N359k3057m223K7969k633l0778O189K8297
603C1959K405j3677j3508m898K4582J9456k7372k2754K4189J4244k0763j1184
$$ plain form
515 24678 -40833 -42283 24635 40563 -2978 -18966 5464 27470 21791 -12467 -24542 22652
527 22652 51543 4925 -29428 2489 30601 18399 4932 5269 20461 33772 5545 -29723
539 -29723 -1010 42960 22137 -13122 146 23501 20897 361 -21687 -10165 29584 22079
551 22079 -26952 -25115 17658 17618 -12462 -19680 -8115 7504 7431 -25066 -39749 -341 19746 -14673
565 -14673 -28113 -1243 6903 -9899 -27032 -31421 -7034 20569 -2181 -33959 -9647 17907
577 17907 -3372 -23509 -11717 4074 12455 5156 -20201 -15869 20121 21607 -4594 2824 20234
590 20234 7842 -3860 1393 9165 24836 30195 7138 2915 30884 28251 -2527 3662 31959
603 31959 34364 20687 7179 2281 26863 46319 18947 -3807 20382 34626 13863 2679
615B679M628Q289J3928k583k5835k561J7721j0242j3320J5175N087j5267N70N718
629C987n680m19m548j2757J3180K0171k4364k8192J9510K5209m318j2974j2963
642b4158q23K2871L201l3125m323L6331J0706j7999p906j995K480J5140n17j3380
656a3497J0053J2348j4211m47K1424l272j4394Q597J1650m14l563j4261m078L5636
670C1571K1987l4690k6332K4350K2838q704j9139j1643J6955L4740r764m4926
682b757n29L4625L957k0133r167q61Q697P852j5729j0850K1003N516k6058j332
696e766J7516j0045j8886N587J5666J2377n714l2654j0004M0074J6294m0463k0739
709c6757K9817K6780n356k9290k0868K9015M4222j9801m9947P731L9572L554j9560
$$ plain form
615 2679 7307 15596 29524 26941 1106 -1455 16266 6024 -7296 7879 12966 -2301 -1731 3987
629 3987 -1693 -2112 -6660 -19417 -6237 13934 -10430 -38622 -19112 6097 1779 -11195 -24158
642 -24158 -24981 -2110 1091 -32034 -36357 -26 10680 -7319 -15225 -17220 -14740 400 -117 -13497
656 -13497 -3444 8904 -5307 -5754 15670 12398 -1996 6601 18251 17837 14274 13 -4065 31571
670 31571 53558 18868 -7464 16886 39724 31020 11881 238 17193 51933 42169 -2757
682 -2757 -3286 31339 35296 15163 5996 5135 13832 21684 5955 -4895 16108 21624 -4434 -5766
696 -5766 11750 1705 -17181 -11594 4072 16449 10735 -21919 -31923 8151 24445 -16018 -36757
709 -36757 -6940 19840 14484 -14806 -35674 -6659 37563 17762 -32185 -24454 15118 18672 -888
722h88r203Q692K2516K985l0472q679K9874M755k2494M379K0449m297j4156o497
736c036N486K1726J189l7839r174M4255J4928m0983k2727K4922L1257K01l9832
749i627l1684L3196M5216k4689m5294J3099L7200K552k6126k3256Q132L5971L841
762A8531l8080n059L4918L727k5299m27J8134P166r191j9212J992L3143O519l8353
776a1491m877M3998J3353l5409k4832J3679L5129J3583l7112l1456L6628M2160
788E3353k7752m4562R613L5865J0892k4473l2082J0367M3768j493m2607k665L2828
801B1052J625k5817r513J0619J8132Q37k6053n275L3752N207m0571j0287L4281
814G989J6759j9006k4633l1L2616J9269l7414l2658L4161L7043k4667l6877M818
$$ plain form
722 -888 -10091 -1399 21117 24102 -6370 -15049 14825 19580 -2914 1465 21914 17617 3461 -3036
736 -3036 2450 24176 25365 -12474 -21648 22607 37535 -3448 -26175 -1253 30004 30205 -9627
749 -9627 -41311 -8115 37101 12412 -32882 -19783 17417 19969 -6157 -29413 -21281 14690 18531
762 18531 -19549 -24608 10310 14037 -11262 -11689 6445 13611 4420 -14792 -12800 20343 26862 -11491
776 -11491 -16368 27630 40983 5574 -19258 -5579 29550 43133 6021 -25435 11193 53353
788 53353 25601 -18961 -9348 26517 37409 12936 -19146 -8779 34989 33496 -9111 -11776 21052
801 21052 22677 -3140 -12653 -2034 16098 16935 -9118 -14393 19359 24566 -16005 -26292 7989
814 7989 24748 5742 -18891 -18922 13694 32963 -4451 -37109 -2948 34095 9428 -27449 -22631
827b2631L0525J9701j8645l5946R845M1458p652m2392J071L3590P878j8509j6098
840a7805M577K4831K371l4085o461L7706Q359l4567j0653K4027J8780n722k4742
853a3384j0561L0017K1757l3383k7332L0959L1977j3976k6271k855K0990K0627
865B8565j6241l2649J3809L9311p403l3669L216K4438P571j2682j8947J300K8451
878B5070L878l4804n445L4757R059k5805j3519Q525J5534L199k3525j5502K8089
891I511K0895k8117k2882J8333J6646p695j5332q835J1946J9432j3650k7521J4816
904a2453K8404j2841k5453L030J5683O989q609j8960N217L1867m83l5335k401
917b5345K9656O433j6606j0627L562J9299J0945k2180j4814K4944J7158k0300
$$ plain form
827 -22631 7894 27595 8950 -26996 -17151 24307 16655 -25737 -24666 8924 16802 -1707 -17805
840 -17805 -13228 11603 13974 -20111 -26572 11134 19493 -15074 -25727 -1700 17080 11358 -13384
853 -13384 -23945 6072 27829 -5554 -32886 -1927 30050 16074 -10197 -13052 7938 28565
865 28565 12324 -20325 -6516 32795 25392 -8277 -5061 19377 26948 14266 -4681 -3381 25070
878 25070 28948 -5856 -11301 23456 32515 6710 -6809 1716 17250 20449 -3076 -18578 9511
891 9511 30406 2289 -20593 -2260 14386 6691 -8641 -17476 -5530 13902 252 -27269 -12453
904 -12453 15951 3110 -22343 -19313 -3630 3359 -5250 -24210 -18993 12874 12391 -22944 -25345
917 -25345 4311 10744 -5862 -16489 -12927 6372 17317 -4863 -19677 5267 22425 2125
929B125j3883J1551R860J198n475q352J0295J6750j5120k0128J6707J7102j4870
942G760j2979Q149J0653M797r616j9333P882K7236q116l0885K455K3460L761j0777
956D447j2119j414J8496P818k5113j3540K1506J0503j4106m670M880J533K923
969A144m009r801P907J0744j4614q220J8681O411j5695m432P483P007L504j2138
983f028j6129J5724K5458j3750k3486R797J8774K03j0000j2537M74K2543O172
996A7215k3497n315K0543L442j1041n91R92j95N683l095p177J0382M660j5393
1010c387N95J7948l436j7855j474Q909R064J864j6408j1654K1832J6536k2206
1023C28j9314J2808J4875l62r700j3371M761K2312j803k4117L87J6630k170q094
$$ plain form
929 2125 -11758 -207 9653 10851 5376 -2976 7319 24069 8949 -11179 5528 22630 7760
942 7760 -5219 2930 13583 18380 8764 -10569 -2687 24549 16433 -14452 -11997 11463 15224 4447
956 4447 -7672 -9086 9410 17228 -7885 -21425 81 10584 -3522 -8192 -3312 -1779 1144
969 1144 -2865 -12666 -4759 5985 -8629 -16849 1832 8243 -7452 -11884 -4401 2606 6110 -6028
983 -6028 -22157 -6433 19025 5275 -18211 -8414 10360 10563 563 -11974 -11500 11043 17215
996 17215 -6282 -11597 8946 12388 1347 756 1748 1553 7236 4141 -3036 7346 12006 -3387
1010 -3387 -2792 15156 11720 -6135 -7609 1300 10364 12228 -4180 -15834 5998 22534 328
1023 328 -18986 -6178 8697 8335 -1365 -14736 -9975 12337 10534 -13583 -13196 3434 1264 -6830
1037f830R97K6K548N082o582l003J1610l304j6865P236J7895o855j3571K045R077
1052d94R791j392k1597n960K7868J1585k5246j2985J5442J4114J361j2710j4448
1065a4671J0809K2039j0266k2898Q641J6676l291o124n21q99M969N11j1874L353
1079c546J5686q362j7484J0803J5910p997j2250k656P303J4079l857k6120j467
1092a9958L1932O563k6285j0975J2910J3667R70j7423j3970J9247K1525j6368
1104A835k0335J2184J4066n468p067k930L531J0939m066j5217Q347J8250j1379
1117B690j7037J0558J3269l920j1145p340Q468K1409m465k9445Q82K9194K292
1130A5410k3607q454J1561J6324K155k2722j2394K4138J7838k2485j7774J4708
$$ plain form
1037 -6830 -5833 -5807 -3259 1823 -4759 -7762 3848 544 -16321 -9085 8810 1955 -11616 -9571 -494
1052 -494 9297 7905 -13692 -19652 8216 19801 -5445 -18430 -2988 11126 12487 -223 -14671
1065 -14671 -3862 18177 7911 -14987 -6346 10330 7039 915 394 -505 4464 4975 -6899 -3546
1079 -3546 12140 3778 -13706 -2903 13007 5010 -7240 -9896 -2593 11486 7629 -18491 -19958
1092 -19958 11974 18537 -7748 -18723 -5813 7854 8824 -8599 -22569 -3322 18203 1835
1104 1835 -18500 -6316 7750 2282 -4785 -7715 -4184 6755 2689 -12528 -4181 14069 2690
1117 2690 -14347 -3789 9480 5560 -5585 -12925 -4457 16952 12487 -16958 -16076 13118 15410
1130 15410 -8197 -16651 -5090 11234 13389 -9333 -21727 2411 20249 -2236 -20010 -5302
1142e302J3273m020j0349o147R931J5996j1166k0631J2523J9279j2224j5809P842
1155f804J3373K896r807j4451Q143K4741o804l0140M517K8279J926j8631j0474
1168a3236Q030K0396L403k7118j1752K7970J4540k2939j4527J3994J4312q36j5158
1181b921j2186J5450J8585j6764k1829J5891K0236j0328j6869L50J2018J0257
1193A1890r990k1949Q087K7966o246k7838K387K2185M996j3440j4984L144K2951
1206I159M935k8177p962K8524J0478k1054j2862R430J5155L136j7774j3129K1003
1219H62J9907k0348k1375J5999J9559o062j6618o545J2500J9379j0227k6379Q641
1232a0707K8629n055k5148j952J5889J0053o543j7525m22K4665M691k7820o829
$$ plain form
1142 -5302 7971 3951 -6398 -12545 -2614 13382 2216 -18415 -5892 13387 1163 -14646 -6804
1155 -6804 6569 9465 -342 -14793 -6650 18091 11287 -18853 -14336 13943 15869 -2762 -13236
1168 -13236 -5206 15190 18593 -8525 -20277 7693 22233 -706 -15233 -1239 13073 12237 -2921
1181 -2921 -15107 343 18928 2164 -19665 -3774 16462 6134 -10735 -10385 1633 11890
1193 11890 1900 -20049 -11962 16004 9758 -18080 -15693 6492 11488 -1952 -16936 -13792 9159
1206 9159 14094 -14083 -22045 6479 16957 -4097 -16959 -7529 7626 10762 -7012 -20141 862
1219 862 20769 421 -20954 -4955 14604 8542 -8076 -14621 -2121 17258 7031 -19348 -10707
1232 -10707 17922 12867 -12281 -14233 1656 11709 5166 -12359 -12781 11884 16575 -11245 -18074
1245a8074K3836Q110j5974j1474N128J5995O557k0258j4642K3190J8477k1546
1257f75j9361J3348J8279n54j4641j2588J3299K2916j0792k7998P385K5813j684
1270A2747j7652m955R207J3135j039k0264l437K3940M155k3113m240J7322N817
1283A1623q831r269j50J4557O927k1511j2271K2627J3800j8660j4367Q718J3935
1296G128K931j4409j6468J3017K3624j1575k5454O797K0559k35j1971q696L501
1309a1251J5603J655k0839l236K1656L203j6599j349R414L187k289p427k644J4837
1323C921O047j8365o016K0499P468j5432p949O431J0912N436j3101j4569J5693
1336I75K0611j2982j9661P267J4272J355p225j0269J674J6861R32j8283j081J5273
$$ plain form
1245 -18074 5762 13872 -2102 -13576 -8448 7547 14104 -6154 -20796 2394 20871 -675
1257 -675 -20036 -6688 11591 11037 -3604 -16192 -2893 20023 9231 -18767 -11382 14431 12747
1270 12747 -4905 -9860 -653 12482 11443 -8821 -12258 11682 15837 -7276 -11516 5806 11623
1283 11623 2792 -6477 -6627 7930 14857 -6654 -18925 3702 17502 -1158 -15525 -6807 7128
1296 7128 10059 -4350 -20818 -7801 15823 4248 -21206 -14409 6150 5915 -6056 -14752 -11251
1309 -11251 4352 6007 -14832 -18068 3588 6791 -9808 -11157 -1743 1444 -845 -8272 -10916 3921
1323 3921 9968 -8397 -14413 6086 13554 -1878 -9827 -3396 7516 12952 -149 -14718 975
1336 975 21586 8604 -11057 -3790 10482 11837 4612 -5657 -3983 12878 13810 -4473 -5554 9719
1350I719j369r848J320K972P15R73n971k156J1343N73j6609J34J6038l56j2464
1365d986l200M596Q800L896j4262j1112J6120J3320j5066j2357Q284Q856J693
1378D582n039r667K468J4140k336j4343L837R923m552l437M174j1j51J445n530
1393d497O64J1126m371j4039P287J4067m390j0343n28M842Q383L78j5711m753
1407a1885J9725O165j6241o000Q931M954K72n262q418N989J1941p735j0701Q599
1421C34O950p947k411L496L68M91k105n605P099J0306j0908j2788J1979J1889
1435A1148q136q971k61N942R876k937j7356J816K0507k4j7336k914R472N855o87
1450E994q129o025J2085Q241j3863o823J2714L683r605k242M229L681J878p285
$$ plain form
1350 9719 8350 -1498 -178 2794 3509 4482 -1489 -3645 7698 8271 -8338 -8204 7834 7478 -4986
1365 -4986 -8186 -3590 5210 9106 -5156 -16268 -148 13172 -1894 -14251 -5967 2889 4582
1378 4582 -457 -10124 -7656 6484 4148 -10195 -6358 3565 -987 -4424 -250 -261 -412 1033 -4497
1393 -4497 -3833 7293 2922 -11117 -3830 10237 5847 -4496 -5024 -182 8201 8579 -7132 -11885
1407 -11885 7840 14005 -2236 -8236 695 5649 5921 659 -7759 -1770 10171 2436 -8265 334
1421 334 7284 -663 -3074 422 790 1281 -824 -6429 670 10976 68 -12720 -741 11148
1435 11148 3012 -5959 -6220 -278 9598 6661 -10695 -8879 11628 11604 -5732 -8646 826 6681 5994
1450 5994 -2135 -8160 3925 12166 -1697 -8520 4194 7877 -1728 -3970 259 3940 5818 -1467
1464a467p736J2171R906j4578j1564J2614J1142o391r598l530Q621J3625q017
1477E198k0536O236K1054l906j6534l39R430P230k781j3479k419J7629M572j8170
1491f815m597J5427M387q743n033J775Q758M081j3126r466J6964J1612j6408j0463
1505a1647J1182J0419k565j0464p580J0713J6103j0662k0324R037J9671m604j4456
1518e177k350P997J0399l704j7612J28K1310K052k0807l240J5253N226q222r514
1532h261l41J3988O995j8109r884J8130J1422j5190j1248O992J0955K796j1496
1545c251j2004J2790J7971j1991j9154R431J6789l709j2419m361Q016J4460m302
1558H266k0506K411K2593n88j9632k715J3612P997n174j3497k002J9172P540k1215
$$ plain form
1464 -1467 -9203 2968 12874 -1704 -13268 -654 10488 4097 -5501 -9031 -410 13215 5198
1477 5198 -15338 -9102 11952 8046 -8488 -8827 603 7833 5052 -8427 -10846 6783 11355 -6815
1491 -6815 -11412 4015 8402 -341 -5374 -3599 5159 9240 -3886 -13352 3612 15224 -1184 -11647
1505 -11647 -465 9954 7389 -3075 -10655 58 16161 5499 -14825 -5788 13883 9279 -5177
1518 -5177 -7527 470 10869 7165 -10447 -10319 10991 13043 -7764 -11004 4249 9475 1253 -8261
1532 -8261 -8602 5386 12381 -5728 -15612 2518 13940 -1250 -12498 -5506 5449 8245 -3251
1545 -3251 -15255 -2465 15506 3515 -15639 -6208 10581 6872 -5547 -9908 -1892 12568 8266
1558 8266 -12240 -9829 12764 12176 -7456 -10171 3441 11438 6264 -7233 -9235 9937 17477 -3738
1572c738j0554J8642J0485j1697j0975K126J1587P947j2859j4738J2272J7345
1584A5843j1621j6638P102J3015nr106q779N932J6399n806k0283L653K0695j727
1598H674j6795l047J0039J0342l141j7186k942K0927O582k0629q360J6251J0322
1611A1037o921j1870k889J2779J1961j3745j6075J3482J5963r407j2879M128R853
1624E417L459p081j1208N963J6570o047j7922N537J6938k634j2590l935O799J1185
1638A0451k090j8702j407K1922M498k0177p489J2717J0010l557j2672o275J4180
1651A409J2524j4604j4211J2099J2732o847r869j71O196P260m779j2104O186J4652
1665A0473o281j5084O453J1744j823q497m349N032J2681k638j7877O22K0252J390
$$ plain form
1572 -3738 -14292 4350 14835 3138 -7837 -5711 5876 13823 964 -13774 -1502 15843
1584 15843 4222 -12416 -5314 7701 7696 -1410 -10189 -4257 12142 6336 -13947 -10294 10401 8674
1598 8674 -8121 -11168 -1129 9213 6072 -11114 -14056 6871 13453 -7176 -15536 715 11037
1611 11037 4116 -7754 -10643 2136 14097 352 -15723 -2241 13722 4315 -8564 -4436 5417
1624 5417 8876 1795 -9413 -3450 13120 7073 -10849 -5312 11626 8992 -3598 -7533 -734 10451
1638 10451 8361 -10341 -11748 10174 14672 -5505 -12994 -277 9733 6176 -6496 -12771 1409
1651 1409 13933 -671 -14882 -2783 9949 3102 -6767 -6938 -742 6518 1739 -10365 -4179 10473
1665 10473 4192 -10892 -4439 7305 5482 -3015 -7364 -2332 10349 7711 -10166 -9544 10708 12098
1679A2098j6835n131R318R321o0j2552p592J5129J1032j4326j2247J0403R324
1692G882l999o598k921N372Q618n688j2211O957J1540p581j0133N923P030j271
1706B920m794n898M291J2202m438j7091L281J7119m69j2392l687N786R037Q28
1720F695j3792n855J5441Q277j3498p502Q660O392j407m473n307N248Q844o315
1734A408r610Q292Q254p701m916N041L339j51l497o485N387J1222o529j3231O240
1749b937J2353l506q755k511L544Q284P12j3817k706J4634L334j2499l269O751
1763c88K785o90m052m761O131P151q396o146Q696L706p706k153M542J578R42m025
1779b786n029P015Q578q720r589Q622Q497n457n753r62M120P903k284j2102K114
$$ plain form
1679 12098 -4737 -9868 -550 8771 8711 -3841 -11433 3696 14728 402 -11845 -1442 7882
1692 7882 3883 -2715 -5636 -264 8354 2666 -9545 -2588 8952 1371 -8762 -2839 4191 2920
1706 2920 -1874 -7772 -3481 8721 4283 -12808 -9527 7592 7123 -5269 -8956 -3170 5867 6695
1720 6695 -7097 -12952 2489 10766 -2732 -10234 -1574 4818 3411 -1062 -6369 -1121 7723 1408
1734 1408 -8202 90 8344 643 -4273 768 4107 3956 459 -6026 -639 10583 4054 -9177 -2937
1749 -2937 9416 5910 -2845 -5356 -1812 6472 7184 -6633 -9339 5295 8629 -3870 -7139 -388
1763 -388 2397 1707 -2345 -7106 -975 6176 -2220 -8366 330 4036 -3670 -5823 -1281 297 1239 -2786
1779 -2786 -7815 -800 7778 -942 -10531 -1909 6588 1131 -4622 -5584 -1464 6439 4155 -7947 -5833
1794e833J2989k018r857R04N115J780j16m754k539P958K917j0362j597J0457k21
1809D823p838J02L597K757L91o140m278R665N632j1810o084J0441N024n363m963
1824d044j417N064P332o239j1404O762J1541n616r106L093N394J593k665o217
1838e929J013R926r12j1961K161J1157j497p612m88L505M604L18r574j899J3152
1853E964L208j3586l666J0427M219m644n923j247P763O841j0329r527J0516R933
1867I949q707q686L418O608K228n271q649N119J1979n044j3604L964J1760j477
1881C587q457l233M588Q394o96j3581o01J4935K197j3632l573R567N594l000p876
1896e787k636J1436P041j2947q779J2334R052q191p780K340Q240N166q372j0955
$$ plain form
1794 -5833 7156 5138 -4719 -3815 1300 3080 2964 -1790 -4329 3629 6546 -3816 -5413 5044 4823
1809 4823 -3015 -2913 684 3441 3832 -2308 -6586 3079 8711 -3099 -9183 1258 6282 919 -4044
1824 -4044 -5461 -397 6935 696 -10708 -3946 7595 1979 -7127 -4034 1360 2953 288 -5929
1838 -5929 -4916 5010 4098 -7863 -5702 5455 3958 -3654 -4142 -637 3967 4285 -5289 -7188 5964
1853 5964 9172 -4414 -8080 2347 6566 1922 -4001 -5248 2515 9356 -973 -10500 16 9949
1867 9949 1242 -7444 -4026 2582 4810 -461 -9110 -3991 7988 2944 -10660 -6696 5064 3587
1881 3587 -4870 -8103 -3515 4879 4183 -9398 -9999 4936 7133 -6499 -10072 -505 5089 2089 -5787
1896 -5787 -8423 3013 10054 -2893 -11672 662 9714 1523 -6257 -3917 4323 9489 1117 -9838
1910i838Q390J4554p460j4396M678J1835O93q384p087M784J2835k174j6952m45
1924h967J6301K089j2622m745O802P546j142j1203m880J3655P384j4338q719J2059
1938g80P785o283q552k78R243O880j0887j2411J0909J5311q427j4169L569J1502
1952C412L650p982j1000M935J6665j690j7942j019J6230L727j0050p266M050J0377
1966F097K118j3024n776J4777P491j3397p633R295P540l005r283l589J0574R288
1980A1473j1463j2955J1205J3285p647j2763R10J0511O866p983j4039M849J7924
1993A0173k195j7777o82J3195M526p091q939J299J2216M031j4442n954J3654O636
2007H650j0621o041O071O829J56r022m830J1100R152j1565j1263J0554J1033n140
$$ plain form
1910 -9838 -1448 13106 5646 -8750 -4072 7763 8456 72 -7015 -2231 10604 8430 -8522 -8967
1924 -8967 7334 9423 -3199 -7944 -1142 6404 5262 -5941 -10821 2834 10218 -4120 -12839 -780
1938 -780 7005 722 -7830 -8108 1135 8015 -2872 -15283 -4374 10937 2510 -11659 -8090 3412
1952 3412 7062 -920 -11920 -6985 9680 7990 -9952 -10971 5259 8986 -1064 -8330 -4280 6097
1966 6097 8215 -4809 -10585 4192 11683 -1714 -9347 -52 7488 4483 -4800 -8389 2185 11473
1980 11473 10 -12945 -1740 11545 3898 -8865 -7955 2556 9422 1439 -12600 -7751 10173
1993 10173 7978 -9799 -10481 2714 7240 149 -8790 -7491 4725 8756 -5686 -11640 2014 8650
2007 8650 -1971 -8012 -1941 4888 5044 -3978 -8808 2292 11444 -121 -11384 -830 10203 5063
2021E063j0087j362Q804R002p755j4683N482J6773k704j5248j228J0242N411m303
2035C407j0046p71J3065K874j3606m413J1267M890p716m654K158N824K308q360
2049c773n719J0127P373j1072p742Q736P901l391p669l209P714R000p401j2755
2063a1880O492J3532l275j1154q60P017N890k153j0532p18J2690K051j1449k389
2077f738Q704K840m739l465K07O174K768q249m300R992M115r625l702O766M247
2092D995k172n456l476P454P592p818j0048O982R432m056p417p51M961N474k355
2107C341j0039J575J1091r64j0028N33O394P70k552l027K81N132J481p884j677
2122e573Q915J522q319j243N047K857o37n603k542P702N162r047o109Q232N708
$$ plain form
2021 5063 -5024 -6386 2418 11420 3665 -11018 -5536 11237 8533 -6715 -7943 2299 7710 3407
2035 3407 -6639 -7410 5655 8529 -5077 -9490 1777 6667 -1049 -5703 -3545 2279 4587 -3773
2049 -3773 -9492 635 8008 -3064 -10806 -2070 5831 2440 -5229 -8438 -724 8276 875 -11880
2063 -11880 -5388 8144 4869 -6285 -7145 -128 5762 3609 -6923 -7641 5049 7100 -4349 -6738
2077 -6738 1966 4806 67 -3398 -3191 2983 5751 -2498 -6798 3194 7309 -2316 -6018 748 4995
2092 4995 2823 -2633 -6109 1345 8937 1119 -8929 -1947 7485 3429 -3988 -4739 222 5696 3341
2107 3341 -6698 -5123 5968 5004 -5024 -4491 1903 2673 121 -2906 -2625 2507 3988 -3896 -5573
2122 -5573 3342 4864 -3455 -4698 349 3206 2569 -3034 -5576 2126 7288 -1759 -7868 364 6072
2137F072m734m727M58L697M657l610p960M056Q637m088o947K806M688j71k361
2152D73l056P84N946q70q713J625Q764j888p022M33M150K098j238o014j216Q853
2168C109K099j0098k749Q904K695n315l302N81M519L779o000o266O796P264o418
2183d02n652M546M322j060l453l221L898P006l865q821M529Q559l190o756J187
2198b373M405L152j969p622R81J0098k60j0171p71Q676J855n154l881P06O609
2213D281K148q598m631R650M581q666m988N603M506p76n649l954O266P501p545
2228b71r030O477Q952m024p100m57M976N455l590q840K395J1348j971j0535J010
2243e205P790K493m581n146J261Q314J617j1344k215J1597L572r314m824N432
$$ plain form
2137 6072 1338 -3389 -2931 766 5423 1813 -6147 -2091 6546 2458 -4489 -1683 3005 2834 473
2152 473 -2583 -1799 4147 3277 -5436 -3811 4953 3065 -3957 -3524 626 2724 1486 -4528 -5744 3109
2168 3109 5208 -4890 -7639 1265 3960 -1355 -4657 -4076 443 4222 -1778 -8044 -1248 6016 -402
2183 -402 -6054 -1508 2814 1754 -1699 -4920 -1022 5984 2119 -6702 -2173 6386 3196 -3560 -2373
2198 -2373 2032 5184 3215 -4407 -3426 6672 6412 -3759 -4530 4146 6001 847 -3034 -2328 4281
2213 4281 6429 -2169 -6800 2850 7431 -1235 -6223 -620 3886 3110 -2539 -6493 -227 7274 -271
2228 -271 -9301 -2824 6128 2104 -4996 -5453 -477 4978 1388 -7452 -5057 6291 4320 -6215 -5205
2243 -5205 2585 5078 497 -4649 -3388 4926 6543 -4801 -7016 4581 8153 -1161 -5985 -553
2257e53N951R0p699n198R495P708r227r152P083Q521k866p154k805N603P129m635
2273B291j0966L879J1339k367j0515N82O731L032m116p209J974J0087K54j2204
2287g208o73J1122K733q685m492L781P698J682r949n444J1304Q400j0390q473
2301h594O839Q414j280p136m356O846R280o503j0733M650J0910k533q914l75N568
2316B083M748l448q642J829J1181m64j2489q12J0379K402o904n708K481R105J394
2331G135j1967n035J2359O651j0076p637N211P700N76p917o419Q030R680o806
2345A485j1089N166R987k002p426k198M878O755l236j0308K425J1785j148j1251
2359f177Q4R012K497m965o351J163J0438J406j2072m145J2234N888q709o732L052
$$ plain form
2257 -553 5398 5488 -2211 -7409 2086 9794 567 -8585 -1502 7019 4153 -3001 -5806 -203 6926 2291
2273 2291 -8675 -4796 6543 4176 -6339 -5757 974 4006 -110 -7319 -5345 4742 4996 -7208
2287 -7208 -7881 3241 5974 -2711 -7203 -3422 4276 5958 -3991 -9435 1869 10269 -121 -8594
2301 -8594 -1755 6659 5379 -1757 -6113 733 10013 3510 -7223 -2573 8337 5804 -3110 -3485 2083
2316 2083 6831 3383 -5259 -3430 7751 7287 -5202 -6014 4365 6767 -137 -5845 -3364 5741 7135
2331 7135 -4832 -9867 2492 9143 -933 -8570 -3359 4341 4917 -3000 -9419 -1389 8291 1485
2345 1485 -9604 -4438 5549 3547 -3879 -6077 -1199 5556 2320 -7988 -5563 6222 5074 -6177
2359 -6177 -6093 2919 5416 451 -5900 -4737 5701 7107 -4965 -9110 3124 9012 303 -6429 -3377
2374c377Q279K527r013p436Q924R667p320r810M697Q144o09o352m165M534P707
2389F397l320j0312K766J0865k034r336j16O172L719l443p666Q68J0840R46j1354
2404e008l105J0663M336p168n970J618P827L846r304p038R247Q555p353q241L818
2419c277O933R86n368n704M846Q801l897r840L168R138j883p090q57M847M516
2434E319k795p860R67J0364M77j1029j485Q536L323m919n754M57P851L397r050
2449b201o331R156O273o624n858K298N098K066m803o128M718P917m325q679L998
2464c425O886j726n130j269L330M947j981q459J982R627r37q935J78O359K500
2479C947k787n151j29P664K684q732l532Q272L922n499l901J821M019K543n009
$$ plain form
2374 -3377 4902 7429 -1584 -9020 -96 9571 2251 -7559 -2862 5282 4673 -1679 -5844 -1310 6397
2389 6397 3077 -7235 -4469 6396 4362 -4974 -5090 1082 4801 1358 -6308 -5440 5400 6346 -5008
2404 -5008 -8113 2550 6886 -282 -6252 -4634 3193 7039 -2265 -9303 -56 8499 1146 -7095 -3277
2419 -3277 3656 4642 -726 -6430 -1584 7217 3320 -6520 -3352 5786 3903 -3187 -4044 803 5319
2434 5319 2524 -5336 -4369 5995 6472 -4557 -6042 2494 5817 898 -4856 -4399 3452 6849 -2201
2449 -2201 -8532 624 6897 273 -5585 -3287 1811 3877 -926 -7054 -2336 5581 1256 -7423 -3425
2464 -3425 3461 1735 -3395 -4664 -1334 3613 1632 -6827 -4845 4782 3845 -5090 -4912 1447 3947
2479 3947 1160 -3991 -4120 3544 6228 -2504 -6036 2236 6158 659 -3242 -1421 2598 5141 132
2494A32n412N788O576n987o300M882M607j993l505k071K745N285l151p350K824
2509b930Q040k673o848Q95M564J488j911n422M29P669L88q333j021P414J683n050
2525a618k274J339L662K195n904l217O980L835o690l709N315L052j437l298j941
2540c710L946M743m326o341N028O118l837n074J445L822J648k554m590J423P202
2555D943j555p998J629O002k19m248j574J730L960L70p118j471Q196J628p027
2570b752k428N400K436j706l581k132O119L620o316m738O215N111m455m207J767
2585a647L292K173l267n542L932P038l335p288K877N883q72l711k320K296N592
2600E101j319q237O03Q994k83p833j570N312L071k373n321j574P587L299q528
$$ plain form
2494 132 -5280 508 7084 1097 -5203 -321 4286 2293 -1212 -3283 -538 4747 1596 -5754 -2930
2509 -2930 5110 2437 -4411 -3516 1048 2536 625 -4797 -4368 3301 3689 -4644 -5665 1749 3432 -1618
2525 -1618 -3892 -2553 1109 3304 -2600 -5817 1163 4998 -1692 -5401 -86 2966 1529 -1769 -3710
2540 -3710 236 4979 653 -5688 -660 5458 1621 -3453 -2008 1814 3462 908 -3682 -2259 4943
2555 4943 3388 -4610 -2981 3021 2802 -1446 -3020 -1290 2670 3040 -4078 -5549 2647 4275 -2752
2570 -2752 -5180 220 2656 950 -2631 -4763 1356 4976 -1340 -6078 137 5248 793 -3414 -1647
2585 -1647 1645 3818 551 -4991 -1059 5979 2644 -4644 -1767 4116 3244 -467 -2787 -491 5101
2600 5101 3782 -4455 -3852 5142 4859 -2974 -4544 768 3839 1466 -3855 -5429 2158 5457 -3071
2615c071m210P296M082m678m067P48L939L339m884n810N303P427n514o618L784
2630b934N861r92m160l029L594O658k658q931K435R380n94q068j073N017M430
2645D936j631o966j328R586L088r813l758P848M393m130m761n38N651L835o601
2660a89o133P043O593n694o648L062N599L36m527m724M289P832m147r722L054
2675c976R222j138p579k361M669O039j541r676m53J0733K215r599l767O924M817
2690D529k569o552j011P287M857q100n905P506O278n193n967J880N506K343n365
2705d76n933N243Q794m863r337L369Q541n51o344l673M133P574k079j0298n6J0927
2721D971J491r307l208N294N377j437o864k692Q263N080q716n944P027N558l732
$$ plain form
2615 -3071 -7281 15 4097 -581 -4648 -3900 39 3378 -1506 -7316 -2013 5414 -100 -6718 -2934
2630 -2934 2927 1935 -2225 -5254 -1660 4998 2340 -6591 -4156 5224 4630 -3438 -4511 506 4936
2645 4936 3305 -3661 -4989 4597 7685 -2128 -5886 1962 6355 2225 -2536 -3074 2577 6412 -189
2660 -189 -6322 721 7314 1620 -5028 -1966 3633 3969 -558 -5282 -993 6839 2692 -7030 -3976
2675 -3976 5246 4108 -3471 -5832 -1163 4876 3335 -6341 -6794 3939 6154 -3445 -7212 -288 4529
2690 4529 1960 -4592 -5603 1684 6541 -1559 -7464 42 6320 1127 -4840 -2960 2546 4889 -476
2705 -476 -6409 -1166 7628 2765 -6572 -3203 5338 4787 -1557 -5230 -1097 6477 4398 -5900 -5956 4971
2721 4971 6462 -2845 -6053 -759 4618 3181 -3683 -6375 1888 6968 -1748 -7692 -665 4893 1161
2736A161n379R0N642L628n817o692O233Q185n125q143K878P009N92n160m964L596
2752b266Q845j979j0353M40R837J576p492l567L762N841M8p613l053Q863M013
2767F902q183m182N904M552k614m811j443N369M645o099o325O279O504n096o151
2782d749J711N539J932m330o271L667Q637k380r776J365Q636K83n576l577K849
2797b040O019R4q284j562Q815K655p651l196N053M005j605m442k187N751M431
2812E856o410n487O043N369m342m711J189M582K600m327o088M049P810l235q204
2827e306K120O285L95m084l490J482O515k03q076o77P995J284o240k209L611L237
2843B639m72m851k118O755L514p048l976N998M046l518l820P3M038L246m504n531
$$ plain form
2736 1161 -4218 -4128 1514 5142 -675 -7367 -1134 7051 1926 -6217 -3339 3670 4262 -898 -5862 -2266
2752 -2266 6579 4600 -5753 -5313 4524 6100 -1392 -4959 -1197 4644 4692 -2921 -5974 2889 6902
2767 6902 -1281 -5463 441 4993 2379 -2432 -3875 1494 6139 40 -6285 -6 6498 1402 -4749
2782 -4749 -3038 2501 4433 103 -6168 -2501 6136 3756 -6020 -4655 3981 4264 -1312 -4889 -2040
2797 -2040 3979 4073 -4211 -5773 3042 5697 -1954 -5150 -97 3908 2303 -2139 -4326 1425 5856
2812 5856 -554 -6041 2 5371 1029 -3682 -2493 2089 4689 362 -5726 -1677 6133 2898 -5306
2827 -5306 -3186 3099 3494 -590 -4080 -2598 3917 3714 -4362 -5039 2956 4240 -2000 -4209 -598 2639
2843 2639 2167 -2684 -4802 1953 5467 -1581 -5557 441 4487 969 -2851 -2778 1260 4506 2 -5529
2859e529M583O838l762o310K313M641Q71l203l603J820O232p87p730P97P077j25
2875D123n306j203K676L261j78n362j671O772K188o784k801N527K916l326k880
2890b048p94M435K850n430m508N284N140m422m853K647L215N80k636l959K568
2905a931N952k335p069K759O265j411m590p95K414L648r39n792q0P477N38o982
2921b871p99N326J796k274l169o03M793L499o172l838N949L712m528l180K125
2936b34K967P70l411l476L646N744m593n541L352N101j960l971r39K567L621j560
2952B083o258P81P625o54o993k97M905J607k189l825n34O185J776p325k005O404
2968A286K434m494k518J728L140J439l991l382M893M665n223m621M194M297j452
$$ plain form
2859 -5529 -946 5892 2130 -4180 -1867 2774 3645 442 -3161 -1341 4891 4104 -3626 -2829 4248 4123
2875 4123 -1183 -2386 290 3551 3373 -1989 -3660 3112 5300 -1484 -4285 1242 4158 832 -2048
2890 -2048 -2842 1593 4443 -987 -5495 -211 4929 507 -4346 -1699 1516 2096 -540 -4499 -1931
2905 -1931 4021 1686 -5383 -2624 3641 2230 -2360 -3155 -741 2907 1968 -3824 -3904 3573 4111 -2871
2921 -2871 -3670 1656 3452 1178 -1991 -2594 2199 5698 -474 -4312 1637 5349 821 -2359 -234
2936 -234 2733 3503 92 -3384 262 6006 1413 -4128 -776 4325 2365 -1606 -2545 22 3643 2083
2952 2083 -4175 -3394 4231 3577 -3416 -3713 1192 2799 610 -3215 -3749 2436 4212 -3113 -5118 1286
2968 1286 3720 -774 -3292 -1564 1576 3015 -976 -4358 535 5200 -23 -4644 -450 3847 2395
2983B395l859j390L616M260l202o404L057P266k688n929L93M161K616k548m666
2998b922M27O483J092p732j055O007K262m546k619J110M092J415n692l035O370
3013A657L668n907m245M796L458j694l801j874M390N019m670o694M353O606k598
3028B464n830N4L983L179k075o408J289P674j81p784l77O115J708l636l527J453
3044a899M942J073o455k567P159K955o081l195L161M085n45m547k570N119N724
3059F359n722o813N294O032k523n207j184M889L956l031p116K246Q282j215p375
3074c128m35N737J700k773m204P75N902J170p524j752P092K403n682l181K909
3089i91M111L95n213l319O452M926o067n905M819N666k002n275j228L922N328
$$ plain form
2983 2395 -1464 -2854 762 5022 1820 -4584 -1527 5739 3051 -2878 -2485 1676 4292 1744 -2922
2998 -2922 -2495 3988 5080 -2652 -3707 2300 4562 16 -2603 -1493 2599 4014 -1678 -4713 1657
3013 1657 5325 -582 -4827 -31 3427 1733 -2068 -3942 448 5467 797 -5897 -1544 5062 2464
3028 2464 -3366 -3312 671 3850 1775 -4633 -3344 4330 4149 -3635 -4012 2103 3811 175 -3352 -1899
3044 -1899 3043 4116 -2339 -4906 2253 5208 -873 -4068 -907 3178 2633 -1914 -4484 635 6359
3059 6359 637 -6176 -882 5150 2627 -2580 -3764 1125 5081 2050 -5066 -2820 5462 4247 -3128
3074 -3128 -3563 2174 3874 1101 -3103 -2328 3574 4744 -2780 -4532 2560 4963 -719 -3900 -991
3089 -991 3120 3515 -1698 -5017 1435 6361 294 -5611 -792 4874 2872 -2403 -3631 291 5619
3104E619l630p231K508Q222j859o942J0M740K761k854m846P31P207M35q053j441
3120d623P226J790m712l215J918M386J200o118l721P075M595o576m757L864N069
3135C401q35m660l202M510N997m201p174L211P291j813n766p60L987L817k440
3150A363n595P30P806J98p778m72N795J949l432l177N82N848J681o665l090P109
3166B852L868n569m223K982M238M08m568l748M740O034n047o689L777N959j407
3181C607n309j068L010M122k515o464J465P437j007p092l28M525K637k887m049
3196c916j27N971J827p181k381O657K789m627l344J835M108J323m789l587N363
3211g9N003m820n100L546M840q42l390j632K977M517k492o433K395O824j413n654
$$ plain form
3104 5619 1989 -5242 -2734 5488 3629 -3313 -3303 1437 4198 1344 -3502 -2771 4436 4871 -3182 -4623
3120 -4623 2603 4393 -319 -3534 -1616 2770 3970 -2148 -5869 1206 5801 -775 -5532 -1668 3401
3135 3401 2566 -2094 -5296 -786 5211 1010 -6164 -2953 4338 2525 -3241 -4001 -14 3803 1363
3150 1363 -4232 -3502 4304 4502 -3276 -3748 2047 3996 564 -2613 -2031 3817 5498 -1167 -4257 2852
3166 2852 6720 1151 -3072 -90 4148 4556 -12 -3760 980 7014 1967 -4722 -945 5014 3607
3181 3607 -1702 -2770 240 4362 1847 -4617 -3152 4285 3278 -3814 -4142 383 3020 133 -3916
3196 -3916 -4043 1928 3755 -3426 -5807 850 3639 -988 -4332 -2497 1611 2934 -1855 -5442 -79
3211 -79 4924 104 -4996 -1450 3390 2548 -842 -2474 503 5020 2528 -3905 -1510 5314 3901 -1753
3227a753j17L926K216j814m752M04N981R58p309j106N614J922m075k794J132L745
3243B178J389n182l135N304L571m541l884L057L183k51l265k358K917M798l702
3258G9n030K946N622k142m184L47L126K135j874m235J043O196q35n717p8M973
3274B372Q65k641k598R06L878J173n338j944N354K310m575k526K712K082P1k955
3290h54k153L568L584m447l923L732L709k341l413K52K264K429k105m789K040
3305b447O101k086n458J200M156P69k078k944J162M221L58n469p53O126L96m075
3321h21j224K579K223k07l337j543M486K650n220k583M439K939k960k611j98L027
3337A639K589l467m527L714M835l201n011J775L580L16k713k655J225M443o95
$$ plain form
3227 -1753 -1870 2056 4272 2458 -2294 -1890 4091 5049 -2260 -3366 2248 4170 95 -2699 -1567 2178
3243 2178 3567 -1615 -4750 554 4125 -416 -4300 -1243 1940 1689 -1576 -3934 -1017 3781 79
3258 79 -4951 -2005 3617 1475 -2709 -2362 764 2899 1025 -3210 -2167 4029 3194 -2523 -2601 2372
3274 2372 3237 596 -2002 -1096 2782 3955 -1383 -3327 2027 4337 -238 -2764 -52 2030 2101 -854
3290 -854 -3007 561 4145 -302 -4225 -493 3216 875 -2538 -2286 -22 2407 302 -4487 -2447
3305 -2447 3654 1568 -3890 -2690 1466 2235 157 -2787 -1625 2596 2954 -2515 -3268 2858 3254 -821
3321 -821 -2045 534 2757 2550 -787 -2330 2156 4806 -414 -2997 1442 4381 1421 -1190 -1388 1639
3337 1639 4228 761 -3766 -52 4783 1582 -3429 -1654 1926 2242 -471 -3126 -1901 2542 1847
3352A847n854N92N363k05l888j014K205K447o12m066o37N315J683n831j805M851
3368C91K370k339k809k7L692K263l956m134M825M923l679m322J782L507O74k460
3384G01l235K054N289k308n483J511N173n92m111r19K088L281j154n363J20O151
3400C203O69o098j615M889J925k466l195J38M341K011n495l644N625M108m244
3415A52l737J603L527J453l776l825L701N340k756n834K359M742l25l761j701
3430b838K117M465j321n903J145O304q6n442j357M158K513j711m048l65N565J883
3446E079o115l250N832L371m121l672J272L661K008m480l991M107N054l735n111
3461d091K192M231J97l853k689K768M965k178o370J332O407m43m858j214L214
$$ plain form
3352 1847 -4007 -3415 1948 1743 -2145 -3159 -954 1493 881 -3185 -3822 1493 3176 -2655 -4460 391
3368 391 2761 422 -2387 -2414 1278 3541 -415 -4549 276 5199 1520 -2802 -1020 2487 3161 701
3384 701 -2534 -480 4809 2501 -2982 -1471 3702 3110 -1001 -1920 168 3449 2295 -3068 -2948 3203
3400 3203 3872 -2226 -3841 1048 2973 507 -2688 -2550 1791 3802 -1693 -5337 288 4396 152
3415 152 -3585 -1982 1545 2998 -778 -4603 -902 4438 1682 -4152 -1793 2949 2624 -1137 -2838
3430 -2838 -721 3744 2423 -3480 -2335 3969 3883 -1559 -2916 1242 3755 2044 -2004 -2369 3196 5079
3446 5079 -1036 -4286 1546 4917 796 -2876 -1604 2057 4065 -415 -4406 -299 4755 1020 -4091
3461 -4091 -1899 2332 2529 -1324 -4013 -1245 3720 1542 -4828 -3496 2911 2468 -2390 -3604 -390
3476c90K968j276m868m09O415J787o760j706M840K893k569l446K0M328K597m768
3492c44m159M843N066m077m607K101L926P30l019l522L157N011k672o013J616
3507a963O056q01m133j545K812L619j433n352n26O660J069o172j965M524K525
3522C375k016m120l11M877K073n318l454N003L656l616l526J193L840J002l141
3537d83l819L189N253k785n817K287N192n50l356k118K496M673j417o034L72O522
3553C605J47n325j326L680K708j143m374n76M899J996n158k913M911K733k959
3568I05l370N60L560J897l746m054L776M859l489m565J856M057P9l086k920K308
3584a373M658j561n743J221N692r8m947q61K683L003j021m089j16M725J868n559
$$ plain form
3476 -390 2578 1302 -3566 -3975 2440 4227 -2533 -4239 601 3494 925 -2521 -2501 1827 4424 -344
3492 -344 -4503 340 5406 1329 -3278 -1177 2749 3479 460 -3062 95 5106 2434 -3579 -1963
3507 -1963 4093 3292 -841 -2386 426 4045 2612 -2740 -3266 3394 4463 -1709 -3674 850 3375
3522 3375 1359 -2761 -3072 1805 3878 -1440 -4894 109 3765 149 -3377 -2184 1656 2658 -483
3537 -483 -4302 -1113 4140 1355 -4462 -2175 3017 2467 -889 -3007 -511 4162 2745 -3289 -2917 3605
3553 3605 3752 -1573 -2899 781 3489 2346 -2028 -2604 2295 4291 -867 -3780 1131 3864 905
3568 905 -2465 -1905 1655 3552 -194 -4248 -472 4387 898 -3667 -1811 2246 2325 -761 -3681 -1373
3584 -1373 3285 1724 -4019 -2798 2894 2796 -2151 -3012 -329 2674 1653 -2436 -2552 2173 4041 -1518
3600a518j587M258K366k268k652k65L849J921l984l412M114L986l318l692J648
3615e54K789Q02k867k969K509M290j924n384J491M776o33l337j159J594K907o54
3631A677m312m53N287Q64n385q80L717J675j853k660l87L803K089m784k630M468
3647B36L111l441k713J608K673Q79k761l163L057M115k391m411J982L885n02l007
3663h43r02J551L502j076m502N41M766j29l907j074L263J417j572k460J12L640
3679B327J379m903j564M157J780k950j968N46K391J176k906k790L506L244l065
3694C60l594K233K970p37k464j112K114K559j395m663J873M635j271l766L24K434
3710E00J437j594k543L58M120K28m770o95M191J369k896j794R73K873Q32l701
$$ plain form
3600 -1518 -3105 1153 3519 1251 -1401 -1666 2183 4104 120 -3292 822 4808 1490 -2202 -554
3615 -554 2235 3037 170 -2799 -290 4000 2076 -3308 -1817 2959 2326 -1011 -2170 -576 2331 1677
3631 1677 -2635 -3088 2199 3063 -2322 -3202 515 2190 337 -2323 -2710 1093 3182 -1602 -4232 236
3647 236 3347 -94 -2807 -1199 1474 2353 -408 -3571 -514 3601 1210 -3201 -1219 2666 2164 -843
3663 -843 -1745 -194 3308 2232 -2270 -1729 3037 2908 -999 -2073 1190 2607 1035 -1425 -1313 2327
3679 2327 3706 -1197 -2761 1396 3176 226 -1742 -1196 1195 2371 -535 -3325 181 3425 360
3694 360 -3234 -1001 1969 1232 -1232 -2344 -230 2329 934 -3729 -1856 2779 1508 -2258 -1934 500
3710 500 1937 343 -2200 -1842 2278 2506 -2264 -2959 1232 2601 -295 -2089 -1116 1757 2589 -1112
3726a112j915M242K587l647k534K433K137j117j395j799K540L267k772m053K598
3741e40M048k020l043M36K226J567j335l937J334M422n86m641j2L961P02k870
3757b88j513M44L474N04m327j483M426K049l831k379K587K574o44k975j428L263
3773D53K864l487l283K667L638k020k911J43K348K109k047l624J604N051j814
3788A691m647O64L680Q25k244k756J217M109k0n128p44N306J323m065k022K450
3804c61K609m2m111j379M079L242m503l215L431L254k215k573m81L209K075k423
3820E96m235K561M706j765m444J044L381P20j901l219J161M741n31n398j02M940
3836B255R52l528k186K024K946K69m370j528M804K182m321k835L475K577j221
$$ plain form
3726 -1112 -3027 1215 3802 155 -2379 54 2191 1074 -321 -2120 420 3687 915 -3138 -540
3741 -540 3508 1488 -1555 -1119 1107 2674 1339 -2598 -1264 3158 2572 -2069 -2081 1880 2582 -288
3757 -288 -1801 -1357 2117 2621 -1706 -3189 1237 3286 -545 -2924 -337 2237 1593 -1382 -2810 453
3773 453 3317 -170 -3453 -786 2852 832 -2079 -1936 412 2521 474 -3150 -1546 3505 1691
3788 1691 -2956 -2292 1388 2213 -31 -2787 -1570 2539 2519 -2609 -3353 1953 3276 -789 -2811 -361
3804 -361 2248 2206 -1905 -3284 795 4037 -466 -3681 -250 3004 789 -1784 -2265 944 3019 596
3820 596 -3639 -1078 3628 1863 -2581 -1537 1844 2564 663 -2556 -1395 3346 2815 -2583 -2685 2255
3836 2255 3207 -321 -2507 -483 2463 2732 -1638 -3166 1638 3820 -501 -3336 139 2716 1495
3851A495l086r54L374K971l642l971K668M562k190l746N9L147J641k548l593J564
3867b249N229j189n203J74M533Q55l244k051J170L992K00m445j901N466K167m718
3883a214j963K617K821l07l325j683M059L177l978l709L143M326k322l330K89
3898a399K863K088k109m199J779N099j304n156J76M248J021k523l008R23M188
3913B687K65m988j291M978J510m144k030J853K688J46l574j944M039L006m139
3928i38l635L214L144j322l064l54K339K988k155m330K296M559j473m090L14L353
3944H46J117j915k842J328M381o4m934m62M742Q57l291j754J562K698K57l422
3960h96j824M181K938m273k680K756K641r74k775j332K817K726l014l989K568
$$ plain form
3851 1495 -1591 -2545 829 3800 158 -3813 -1145 3417 1227 -2519 -2460 687 2328 -220 -3813 -2249
3867 -2249 2980 1791 -3412 -3238 1295 2150 -1094 -3145 -1975 2017 2217 -2228 -4129 1337 3504 -1214
3883 -1214 -3177 -560 2261 1954 -1371 -3054 1005 4182 204 -3505 -362 3964 1642 -1688 -1399
3898 -1399 1464 3552 1443 -2756 -977 4122 2818 -2338 -2162 2086 3107 584 -2424 -1501 2687
3913 2687 2952 -2036 -3327 1651 3161 -983 -3013 -1160 1528 1674 -1900 -3844 195 3201 -938
3928 -938 -4573 -1359 1785 463 -2601 -2955 -616 2372 217 -4113 -1817 2742 1269 -2821 -2507 846
3944 846 1963 48 -2794 -1466 2915 2851 -2083 -2545 2197 3054 -237 -1991 -429 2269 2526 -896
3960 -896 -2720 1461 4399 126 -2554 202 2843 1869 -906 -2238 579 3305 291 -3698 -1130
3975a130L824j789l199K70K501J483j793l082M23M784p06m189j24L701M54k175
3991g47j785P63L343J21l507j398M124J614l340j880K497J766k02k362j551K858
4007C14K961k973l367K776L319k062k504K21J623K171j944l071J378L881j446
4022A277l900R88K784K96j923j848J077K783Nm105n64M194Q98l619j113J934K168
4039A332q27j936j186L076K153l523k198K910K141j645j846L21J871J428j840
4054B31k998K398L543j803l256J129K435M43j766j861R33L454j108l693j1M032
4070B102J20l157n91J680J596l22l037j010L666J268l665j665K974J740j928j672
4086a901k28K083J886k548l004K842L416k639k901J453J779N76j641k052J542
$$ plain form
3975 -1130 2694 905 -2294 -2024 477 1960 167 -2915 -2492 2292 1586 -2603 -2727 974 1428 -747
3991 -747 -2532 -1769 1574 1695 -1812 -3210 914 2528 -812 -2692 -195 1571 1369 -993 -2544 314
4007 314 3275 302 -3065 -289 3030 968 -1536 -1315 308 2479 535 -2536 -1158 2723 1277
4022 1277 -2623 -1635 1149 1445 -478 -2326 -1249 1534 1539 -2566 -3130 1064 1962 -1657 -2770 -836 1332
4039 1332 505 -1431 -2617 459 2612 -911 -3109 -199 1942 297 -1549 -1228 643 2071 231
4054 231 -2767 -369 3174 1371 -1885 -756 1679 2122 356 -1505 -572 2882 1774 -1919 -1930 2102
4070 2102 2222 -935 -1526 154 1750 1428 -1609 -2619 1047 2315 -1350 -3015 -41 1699 -229 -1901
4086 -1901 -2129 -46 1840 -708 -3712 -870 2546 -93 -2994 -1541 238 814 -827 -2879 -1337
4101a337L430j627l536J037L745m62k519q43J651J865r1l591J26L980Q70m422
4117a724p22L187J460j527j597n95K734J668l455k184L205K462k446k384R77K404
4133A463K87j920k467K116L406k201l571J388L350q76k075p69J154K438q54l563
4149b694Q9M453k08l902J3K077J683j285k256k72L479J099l891j668L625K084
4165B426k697j850Q00K387J282k827k308K566L334k525l610K068K731j04k150
4180d77j716J841K928r52m269J054L930k26l644l68K035J796r39k914m79L759
4196A359J313m553j166L530J781k587j699N05K051J559l170k584L521K740k981
4211c81l039J757K747J9k313j715K092L281j886m231J463M166o64k878n01J784
$$ plain form
4101 -1337 2093 466 -3070 -2033 1712 1250 -1269 -2112 -461 1404 1313 -2278 -2152 1828 2698 -1724
4117 -1724 -2446 741 2201 674 -923 -1518 1216 2884 -571 -2755 450 2912 466 -1918 -941 1463
4133 1463 1750 -170 -2637 -521 2885 684 -2887 -1499 1851 975 -1100 -1869 -715 1723 869 -2694
4149 -2694 -2605 1848 1640 -2262 -2249 -172 1511 226 -2030 -2302 1177 2276 -1615 -3283 342 2426
4165 2426 -271 -2121 -1321 1066 2348 -479 -2787 -221 3113 588 -3022 -954 1777 1673 -477
4180 -477 -2193 -352 2576 1624 -2645 -1591 2339 2113 -1531 -1899 136 1932 993 -1921 -2400 1359
4196 1359 2672 -1881 -3047 483 2264 -323 -2022 -1517 534 2093 -1077 -3661 -140 2600 -381
4211 -381 -3420 -1663 1084 1103 -1210 -2925 -833 2448 562 -3669 -2206 1960 1296 -1582 -2083 -299
4227b99K090q58l173l11M744M83m465p52L238J613j857k351M35K877J586l759
4243g59k510L798K570k854k477J319K401M34k199k500K127L695k193l878J486
4258a540L563m33k786j025J443K820q16l934M64M343j72l622j029L259J014r04
4274F45k466j56L174J479m295j470L488K381k780j608M37K395O45k513k321K871
$$ plain form
4227 -299 1791 933 -2240 -2551 2193 2676 -1789 -2541 697 2310 453 -1898 -1463 1414 3000 -759
4243 -759 -3269 529 3099 245 -2232 -913 1488 1922 -277 -2777 -650 3045 852 -3026 -1540
4258 -1540 2023 1590 -1196 -2221 -778 2042 1226 -2708 -2244 2099 1927 -1695 -2724 535 1549 645
4274 645 -1821 -1977 1197 2676 -1619 -3089 399 2780 0 -1608 -1171 1224 1869 -644 -2965 -94
$$ [...]
8191g8
##END NTUPLES=NMR FID
##END=
