##TITLE=1H_TG-2251-3
 CDCl3, 8 sc, 
 28.8.2019
##JCAMPDX= 6.0         $$ Bruker NMR JCAMP-DX V2.0
##DATA TYPE= NMR FID
##DATA CLASS= NTUPLES
##ORIGIN= UXNMR, Bruker Analytische Messtechnik GmbH
##OWNER= root
$$ XWIN-NMR		Version 3.5
$$ Wed Aug 28 13:48:03 2019 Russian Standard Time (UT+4h)  she@DPX200
##.OBSERVE FREQUENCY= 200.13155
##.OBSERVE NUCLEUS= ^1H
##.DELAY= (6, 6)
##.ACQUISITION MODE= SIMULTANEOUS
##.ACQUISITION SCHEME= undefined
##.AVERAGES= 8
##.DIGITISER RES= 18
##SPECTROMETER/DATA SYSTEM= spect
##.PULSE SEQUENCE= zg30
##.SOLVENT NAME= CDCl3
##.SHIFT REFERENCE= (INTERNAL, CDCl3, 0, 15.7039)
##AUDIT TRAIL= $$ (NUMBER, WHEN, WHO, WHERE, WHAT)
$$ ##TITLE= Audit trail, XWIN-NMR		Version 3.5
$$ ##JCAMPDX= 5.01
$$ ##ORIGIN= Bruker BioSpin GmbH
$$ ##OWNER= she
$$ F:/spectra/data/she/nmr/H-F/1/audita.txt
$$ ##AUDIT TRAIL=  $$ (NUMBER, WHEN, WHO, WHERE, WHAT)
(   1,<2019-08-28 13:46:44.28 +0400>,<she>,<DPX200>,
      <created by zg, POWCHK disabled, PULCHK disabled
       configuration hash MD5:
       00 E9 B6 7A A2 85 ED C7 34 08 36 98 17 FE 4E 26
       data hash MD5: 16K
       3E 7A 3E 03 3E FC 82 7C 7A E8 0F FE B9 26 18 15>)
$$ ##END=
$$ 
$$ hash MD5
$$ 41 6F 8F C4 D0 4E 71 90 5D 8F 60 6C 8E D1 87 C9
##$RELAX= 
##$RELAX= 
##$RELAX= 
##$RELAX= 
##$RELAX= 
##$RELAX= 
$$ Bruker specific parameters
$$ --------------------------
##$DU= <F:/spectra>
##$EXPNO= 1
##$NAME= <H-F>
##$PROCNO= 1
##$TYPE= <nmr>
##$USER= <she>
##$AMP= (0..31)
100 100 100 100 100 100 100 100 100 100 100 100 100 100 100 100 100 100 
100 100 100 100 100 100 100 100 100 100 100 100 100 100 
##$AQSEQ= 0
##$AQ_mod= 1
##$AUNM= <au_zg>
##$AUTOPOS= <>
##$BF1= 200.13
##$BF2= 200.13
##$BF3= 200.13
##$BF4= 200.13
##$BF5= 200.13
##$BF6= 200.13
##$BF7= 200.13
##$BF8= 200.13
##$BYTORDA= 1
##$CFDGTYP= 0
##$CFRGTYP= 5
##$CHEMSTR= <none>
##$CNST= (0..31)
1 1 145 1 1 1 1 1 1 1 1 1 1 1 1 1 1 1 1 1 1 1 1 1 1 1 1 1 1 1 1 1 
##$CPDPRG= <>
##$CPDPRG1= <>
##$CPDPRG2= <>
##$CPDPRG3= <>
##$CPDPRG4= <mlev>
##$CPDPRG5= <mlev>
##$CPDPRG6= <mlev>
##$CPDPRG7= <mlev>
##$CPDPRG8= <mlev>
##$CPDPRGB= <>
##$CPDPRGT= <>
##$D= (0..31)
0 1.2 0 0 0 0 0 0 0 0 0 0.03 0 0 0 0 0 0 0 0 0 0 0 0 0 0 0 0 0 0 0 0 
##$DATE= 1566985603
##$DBL= (0..7)
120 120 120 120 120 120 120 120 
##$DBP= (0..7)
150 150 150 150 150 150 150 150 
##$DBP07= 0
##$DBPNAM0= <>
##$DBPNAM1= <>
##$DBPNAM2= <>
##$DBPNAM3= <>
##$DBPNAM4= <>
##$DBPNAM5= <>
##$DBPNAM6= <>
##$DBPNAM7= <>
##$DBPOAL= (0..7)
0.5 0.5 0.5 0.5 0.5 0.5 0.5 0.5 
##$DBPOFFS= (0..7)
0 0 0 0 0 0 0 0 
##$DE= 6
##$DECBNUC= <off>
##$DECIM= 24
##$DECNUC= <off>
##$DECSTAT= 4
##$DIGMOD= 1
##$DIGTYP= 9
##$DL= (0..7)
0 120 120 120 120 120 120 120 
##$DP= (0..7)
150 150 150 150 150 150 150 150 
##$DP07= 0
##$DPNAME0= <>
##$DPNAME1= <>
##$DPNAME2= <>
##$DPNAME3= <>
##$DPNAME4= <>
##$DPNAME5= <>
##$DPNAME6= <>
##$DPNAME7= <>
##$DPOAL= (0..7)
0.5 0.5 0.5 0.5 0.5 0.5 0.5 0.5 
##$DPOFFS= (0..7)
0 0 0 0 0 0 0 0 
##$DQDMODE= 0
##$DR= 18
##$DS= 0
##$DSLIST= <SSSSSSSSSSSSSSS>
##$DSPFIRM= 0
$$ [...]
##$SUBNAM2= <"">
##$SUBNAM3= <"">
##$SUBNAM4= <"">
##$SUBNAM5= <"">
##$SUBNAM6= <"">
##$SUBNAM7= <"">
##$SUBNAM8= <"">
##$SUBNAM9= <"">
##$SW= 24.9336996594482
##$SWIBOX= (0..15)
0 0 2 0 0 0 0 0 0 0 0 0 0 0 0 0 
##$SW_h= 4990.01996007984
##$TD= 16384
##$TD0= 1
##$TE= 0
##$TE2= 300
##$TE3= 300
##$TEG= 300
##$TL= (0..7)
0 120 120 120 120 120 120 120 
##$TP= (0..7)
150 150 150 150 150 150 150 150 
##$TP07= 0
##$TPNAME0= <>
##$TPNAME1= <>
##$TPNAME2= <>
##$TPNAME3= <>
##$TPNAME4= <>
##$TPNAME5= <>
##$TPNAME6= <>
##$TPNAME7= <>
##$TPOAL= (0..7)
0.5 0.5 0.5 0.5 0.5 0.5 0.5 0.5 
##$TPOFFS= (0..7)
0 0 0 0 0 0 0 0 
##$TUNHIN= 0
##$TUNHOUT= 0
##$TUNXOUT= 0
##$USERA1= <user>
##$USERA2= <user>
##$USERA3= <user>
##$USERA4= <user>
##$USERA5= <user>
##$V9= 5
##$VALIST= <valist>
##$VCLIST= <CCCCCCCCCCCCCCC>
##$VD= 0
##$VDLIST= <DDDDDDDDDDDDDDD>
##$VPLIST= <PPPPPPPPPPPPPPP>
##$VTLIST= <TTTTTTTTTTTTTTT>
##$WBST= 1024
##$WBSW= 4
##$XGAIN= (0..3)
0 0 0 0 
##$XL= 0
##$YL= 0
##$YMAX_a= 514551
##$YMIN_a= -550765
##$ZGOPTNS= <>
##$ZL1= 120
##$ZL2= 120
##$ZL3= 120
##$ZL4= 120
##$ABSF1= 10
##$ABSF2= 0
##$ABSG= 5
##$ABSL= 3
##$ALPHA= 0
##$AQORDER= 0
##$ASSFAC= 0
##$ASSFACI= 0
##$ASSFACX= 0
##$ASSWID= 0
##$AUNMP= <proc_1d>
##$AZFE= 0.1
##$AZFW= 0.1
##$BCFW= 1
##$BC_mod= 2
##$BYTORDP= 1
##$COROFFS= 0
##$CY= 11.3945322036743
##$DATMOD= 1
##$DC= 2
##$DFILT= <>
##$DTYPP= 0
##$F1P= 20.1720416913024
##$F2P= 0.152960286110954
##$FCOR= 0.5
##$FTSIZE= 0
##$FT_mod= 4
##$GAMMA= 1
##$GB= 0.15
##$INTBC= 1
##$INTSCL= 1
##$ISEN= 128
##$LB= 0.24
##$LEV0= 0
##$LPBIN= 0
##$MAXI= 10000
##$MC2= 0
##$MEAN= 0
##$ME_mod= 0
##$MI= 1.114404
##$NCOEF= 0
##$NC_proc= 0
##$NLEV= 6
##$NOISF1= 3.799351
##$NOISF2= 2.8
##$NSP= 1
##$NTH_PI= 0
##$NZP= 0
##$OFFSET= 15.70392
##$PC= 1
##$PHC0= -9212.522
##$PHC1= 13.00096
##$PH_mod= 1
##$PKNL= yes
##$PPARMOD= 0
##$PSCAL= 0
##$PSIGN= 0
##$REVERSE= no
##$SF= 200.130013532006
##$SI= 16384
##$SIGF1= 3
##$SIGF2= 2
##$SINO= 400
##$SIOLD= 16384
##$SREGLST= <1H.CDCl3>
##$SSB= 0
##$STSI= 0
##$STSR= 0
##$SW_p= 3612.71676300578
##$SYMM= 0
##$S_DEV= 0
##$TDeff= 0
##$TDoff= 0
##$TI= <>
##$TILT= no
##$TM1= 0
##$TM2= 0
##$TOPLEV= 0
##$USERP1= <user>
##$USERP2= <user>
##$USERP3= <user>
##$USERP4= <user>
##$USERP5= <user>
##$WDW= 1
##$XDIM= 8192
##$YMAX_p= 0
##$YMIN_p= 0
$$ End of Bruker specific parameters
$$ ---------------------------------
##NTUPLES= NMR FID
##VAR_NAME=  TIME,          FID/REAL,        FID/IMAG
##SYMBOL=    X,             R,               I
##VAR_TYPE=  INDEPENDENT,   DEPENDENT,       DEPENDENT
##VAR_FORM=  AFFN,          ASDF,            ASDF
##VAR_DIM=   8192,          8192,            8192
##UNITS=     SECONDS,       ARBITRARY UNITS, ARBITRARY UNITS
##FACTOR=    0.0002004,     1,               1
##FIRST=     0,             0,               0
##LAST=      1.6414764,     0,               0
##MIN=       0,             -550765,         0
##MAX=       1.6414764,     514551,          0
$$ Real data points
##PAGE= N=1
##DATA TABLE= (X++(R..R)), XYDATA
0@%%%qJ6j6J6k4L9m7N6p2R0j13J40j68K02k40K85l39L97m63N37o22P17q22R40
27E01j072J215j373J549j744J959k194K451k732L042l382L753m162M614n109N655
43B971o263O938p692Q539r500J0599j1867J3357j5130J7279j9957K3404k8026
56a5348L4593m4748O2733j04222L73454K08089m19707P6350J25658J21055o5724
67C52183n5277n6956o737j23686r5263M1165J26946l2453j26891j22712l6410
78a36091J9953L6263k8329J525L2675o4395j60769k3946J11899O0906m6454m4576
90b41339J2389O3259J3697q5335m9058R5443Q0847m5690m4266N0854O7706J9704
102f1789m4174m6045O9933J38841N373j16569l6221P2058O2741K9999K2618K3035
$$ plain form
0 0 0 0 0 -8 8 -8 8 -16 23 -24 32 -40 50 -63 77 -91 111 -129 156 -183 214 -249 288 -334 383 -439 501
27 501 -571 644 -729 820 -924 1035 -1159 1292 -1440 1602 -1780 1973 -2189 2425 -2684 2971
43 2971 -3292 3646 -4046 4493 -5007 5592 -6275 7082 -8048 9231 -10726 12678 -15348
56 -15348 19245 -25503 37230 -66992 306462 514551 94844 171194 296852 417907 352183
67 352183 296906 239950 233213 109527 14264 55429 182375 149922 23031 -99681 -136091
78 -136091 -116138 -79875 -108204 -106679 -74004 -138399 -299168 -323114 -211215 -150309 -196763 -241339
90 -241339 -228950 -165691 -151994 -237329 -286387 -190944 -110097 -155787 -200053 -149199 -81493 -61789
102 -61789 -105963 -152008 -82075 56766 62139 -54430 -90651 -18593 44148 74147 96765 119800
114A19800J6009m9009j05735J907J48327Q8155n5835n7997L32K200p652p671J1789
127A04620O3854L0635j05009j15781L7947J13461M0678l6348n9462l4651N133
138D5077k1720m9140M5137J13479m700j13503n3387L6276M0499L572l7669k8819
150b4898M0747L1017n8603l7282O2125N1804k7005m5789k1774J8163M3616j1389
162B0732n5264K3439P7551m891o2923j4227J8614M405j2032k1034J6500O8621
174E9491J2207q3749m2678M6325K7794j7833j0288l439Q32N925k9003k4215N8460
187a71O5406m0567p9512j8236K4693L2422J9938q316O050L0650k9942p4206J1823
200e9968P8629J9292l5480k2461k825K0684K7413j4878j7839L5915J5519n6480
$$ plain form
114 119800 135809 86800 -18935 -17028 131299 219454 163619 105622 105954 108154 100502 92831 104620
127 104620 168474 199109 94100 -21681 16266 129727 170405 134057 74595 39944 45077
138 45077 23357 -25783 19354 132833 128133 14630 -38757 -2481 38018 41590 3921 -24898
150 -24898 15849 46866 -11737 -49019 13106 64910 37905 -7884 -29658 -11495 32121 20732
162 20732 -34532 -11093 66458 61567 -1356 -15583 3031 7436 -4596 -25630 -9130 59491
174 59491 71698 -12051 -54729 -8404 19390 1557 -8731 -12170 -11338 -5413 -34416 -58631 -171
187 -171 65235 24668 -54844 -73080 -48387 -15965 3973 -4343 1707 32357 2415 -71791 -59968
200 -59968 18661 37953 2473 -19988 -22813 -2129 25284 10406 -7433 28482 44001 -12479
212a2479l5277L1472L8138J6382j0991l2012N987L7669k4678n9916J7705N5124
224B7124k635k6887j604J1058J7495k550m2629j2907N1285J7721m3033j4336K3912
237B014J3557O407k702j7711J1290J9094m3122m3504M5126O3659k145k8967j9371
250C625r018J1673K664k1005J7056M9177j4603n5805k384L4872J8023N904j4965
263B5214l0609N298J6397k4166o405N2444K5861l5799l5765j0554Q019K4985Q32
276A5752k5809J3813L2873k6859l9873J9288K9297n657j5764k0245q609K8903
288b890J4824l3890o899L9897N433l3481j7150j408O491J8353o019j5847L1990
301e96K9409m1360m4468J5826K5821N948L594o956l413J6931p527k9620K1900
$$ plain form
212 -12479 -47756 -16284 21854 38236 27245 -4767 1220 38889 14211 -45705 -28000 27124
224 27124 24489 -2398 -4002 7056 24551 22001 -20628 -33535 17750 35471 -7562 -21898 2014
237 2014 15571 21978 19276 1565 12855 31949 -11173 -54677 -9551 54108 51963 22996 3625
250 3625 -5393 6280 8944 -12061 4995 54172 39569 -16236 -18620 16252 34275 40179 25214
263 25214 -5395 -97 16300 -7866 -14271 38173 64034 28235 -7530 -18084 -10065 14920 15752
276 15752 -10057 3756 36629 9770 -30103 -10815 18482 12825 -2939 -23184 -31793 -2890
288 -2890 11934 -21956 -28855 11042 16475 -17006 -34156 -35564 -29073 -10720 -16739 -32586 -596
301 -596 28813 -12547 -57015 -41189 -15368 -9420 -5826 -12782 -16195 736 -6791 -36411 -14511
314a4511M7434r482l9743j1641M707J8912L0307L76j3271J6248m252n0314j3991
327c9221M6300L3496j149j5657k4381k284K4952n452k2367K2113K3749l0912l1241
340b2054J0104J9025J8360Q378k6493k1888J7407O97l1038M033L3333N828j1381
353D311r468j2414O068J2871k4299k1015L4459K6309k6069j9247J0821O842L291
366g540j091j5636N636K4647j7775l6369J8229M1822Q699j0401j6943k0987N954
379b1755J6590j1403L746M3596Q512m2568k0635J3244J5366J5339j316k0847K198
392F7J5879j7707j2692L5281K4336k1223k5076j4083l562K4328J7699j7713k363
405C171K4668j0671l5931j385J8206P433P42j4682j4399K2850K0558k8853k2024
$$ plain form
314 -14511 32923 23441 -16302 -27943 -23236 -4324 25983 26359 13088 29336 25084 -25230 -39221
327 -39221 7079 40575 39426 23769 -612 -2896 22056 16604 -5763 16350 40099 9187 -22054
340 -22054 -11950 7075 25435 33813 7320 -14568 2839 3536 -27502 -23469 9864 15692 4311
353 4311 -5157 -17571 -11503 1368 -22931 -43946 -9487 16822 -9247 -28494 -17673 -10831 -7540
366 -7540 -8631 -24267 -18631 6016 -11759 -48128 -29899 11923 20622 10221 -6722 -27709 -21755
379 -21755 -5165 -16568 -12822 30774 39286 -3282 -23917 -10673 4693 20032 18716 -2131 67
392 67 15946 -1761 -14453 20828 45164 23941 -1135 -15218 -18780 5548 23247 5534 3171
405 3171 27839 17168 -18763 -20148 -1942 5491 6233 -8449 -22848 2 20560 -8293 -30317
418c0317K3326J1507j7318p504n2K233J5430j056k0663J2553K9081j6721l3776
431c3277J19J5519J2874J1909n410p843J7177n20l7865m376M2623J7167j7663
444A0434j2710m899P075J8574j962j3145J8924J2719l4526k6555K1681K9345J4063
457C9018k305k5782j3210J9519j22k9761Q188L7748M73k7263j3084L414J7607
470A4440J3411k2943k3106K0540J4103k7508j1097K4049J4295j564j2083k3032
482b0495o99K4135o964k6939J6768L3626m941k1367q526J251J2460M511k1690
495a8870J45L7570N752l8336q328K7964J5080k880j4328j6963J0593K1626j4430
508D595j5604L0950K7540k0217l0224j0276R560K4411P071k2786J539K8909j1039
$$ plain form
418 -30317 -6991 4516 -12802 -20306 -20358 -18125 -2695 -3751 -24414 -11861 17220 499 -33277
431 -33277 -33158 -17639 -4765 7144 1734 -6109 11068 10548 -27317 -31693 10930 28097 10434
444 10434 -2276 -7175 -100 18474 16512 3367 22291 35010 484 -26071 -4390 24955 39018
457 39018 36713 10931 -2279 17240 17118 -12643 -4455 33293 33766 6503 -6581 -3167 14440
470 14440 27851 4908 -18198 2342 16445 -11063 -22160 1889 16184 14620 2537 -20495
482 -20495 -21194 2941 -4023 -30962 -14194 19432 14491 -6876 -15402 -14151 -1691 2820 -18870
495 -18870 -18725 18845 24597 -13739 -22067 5897 20977 18097 3769 -13194 -2601 19025 4595
508 4595 -11009 19941 47481 27264 -2960 -13236 -3676 20735 27806 5020 6559 35468 24429
521B4429l8307N180L2577P384j5606k2642r503K3845J9769k1394j1280K7863P541
534B9856l4087k1501P564K3167K0573j0842l0401R951L1216j7213l5443R919K8392
547A1151K447j5238j6569L730K9771O140l4571p801L1374L211k7827r714J3082
560a0814J9271J4510j4709k2885J6107J9130k6352k3876K4949K8973j039j6351
572F914j5999P191K6571n235l1657P788L2712p408k9622J33K0499K0293L345k6910
586H615k0922K0980J4289k4479p714K9538J6710j4087k1797j2331J4939K4635
598B8376j5235l0533J4903K8366j4499k4591O277J7873Q785j1580l0492n036L1762
611D376P459k9090k745K8601P148j8096k0062o618K0035J9774j9785k0259K5285
$$ plain form
521 24429 -13878 -8698 23879 31263 15657 -6985 -16488 7357 27126 5732 -5548 22315 29856
534 29856 -4231 -25732 -18168 4999 25572 14730 -15671 -5720 25496 8283 -27160 -17241 11151
547 11151 13598 -1640 -18209 -14479 15292 21432 -13139 -20940 10434 13645 -14182 -23896 -10814
560 -10814 8457 22967 8258 -14627 1480 20610 -5742 -29618 -4669 24304 23265 6914
572 6914 -9085 -1894 24677 19442 -12215 -4427 28285 20877 -8745 -8612 11887 32180 35525 8615
586 8615 -12307 8673 22962 -1517 -9231 20307 37017 22930 1133 -11198 3741 28376
598 28376 13141 -17392 -2489 25877 11378 -13213 -6936 10937 19722 8142 -22350 -27386 4376
611 4376 11835 -17255 -20000 8601 15749 -2347 -22409 -29027 -8992 10782 -9003 -29262 -3977
624c977K3506k0591k0477Q531J6385Q359r262k1661P786L1952j920k4566J0705
637D770K6822l346k0596j2598N504K6992J6092k1908j2530K5941J0207k6348j3306
650E696J3353J6004N424j5438k0979J4137K8387j3668k7271R157J5243j1810j7122
663A113o385Q912K1905J296k9276q832K2109j778k5144l911J4835J0443m37j7144
677a2294j3041J8929J7129k4181k0659J9573J7803j0902j3174q14J3706K0549
689A2624o737k7501K583K4223n025j9322O026J7950J0057j458j7772r601K2491
702H538J3565k1851q528K2732J0868j1695p749J923J2773J3369j3690k2408J2229
715A0076K2167r825j2699J2316J3781J470r272j8266j944K4385N280k5184k458
$$ plain form
624 -3977 19529 -1062 -21539 -13008 3377 11736 2474 -19187 -11401 20551 18631 -5935 4770
637 4770 31592 28246 7650 -4948 556 27548 43640 21732 9202 35143 45350 19002 5696
650 5696 19049 35053 40477 25039 4060 18197 46584 32916 5645 14802 30045 18235 1113
663 1113 -5272 3640 25545 26841 -2435 -11267 10842 9064 -16080 -19991 -5156 5287 4850 -12294
677 -12294 -25335 -6406 10723 -13458 -34117 -14544 3259 -7643 -20817 -21631 -7925 12624
689 12624 5887 -21614 -19031 5192 167 -19155 -13129 4821 14878 13420 -4352 -13953 8538
702 8538 22103 252 -8276 14456 25324 13629 5880 7803 20576 33945 20255 -2153 10076
715 10076 32243 22418 9719 22035 35816 37286 28014 9748 7804 32189 37469 12285 9827
728I827K3352L168j5553j0083j30J1485Q104j9394j6689J8964J5780j6649j2654
741d72R307O132l060j0056j5900L375K2563k384k1655M635J7415o601j6557m148
755a7406M859J2291L595j8987p526K1826O376k0830n368J3751M062n307r259p497
769b5420J5164K1887j0692k0127J0384J4382r461j1027K061R032J3266j040j8373
782i964Q73K3330P78j8926J213J3553K619k495n052k367J5315J1270j8034j3998
796a885J5452R348j2157n553O750P648O710p944j7144O188J7412j1263j9359P465
810A668J2547j617o566q438k307J3906L343k1060p040J7873L348j3080j756O812
824b367N278K185j1645j3918J1485J4495j1422q533J3355Q288o833n060l287L280
$$ plain form
728 9827 33179 36347 20794 10711 10581 22066 30170 10776 -5913 13051 28831 12182 -472
741 -472 8835 14967 11907 1851 -14049 -10674 11889 9505 -12150 -7515 9900 3299 -13258 -17406
755 -17406 -12547 -256 3339 -15648 -23174 -1348 5028 -15802 -21170 -7419 -3357 -8664 -17923 -25420
769 -25420 -10256 11631 939 -19188 -8804 5578 -3883 -14910 -12849 -3817 9449 8409 -9964
782 -9964 -9091 14239 15017 -3909 -2696 10857 13476 10981 5929 3562 18877 30147 12113 -1885
796 -1885 13567 22915 10758 5205 11955 19603 26313 18369 1225 7413 24825 13562 -5797 1668
810 1668 14215 12598 6032 -2406 -4713 9193 12536 -8524 -15564 2309 5657 -7423 -9179 -2367
824 -2367 2911 5096 -6549 -20467 -8982 5513 -5909 -14442 -1087 7201 368 -4692 -7979 -4699
838d699J3048j740j8166L494J9095j882j2703K811P512L167k224j3327m771J9709
852I324R959j6928o201J4235K482r243n094j355N205J0426p937j4969Q844J4774
866A3522r421j1331M070M526j97l162j0105J301J7031k46j9095L0J3712k904r982
881a2251j869J909P961O481j0480q726J4182Q571j4530p028R267N631J621k529
895a790p239N527J5535n374j5484P453J3433n721p185K824N324Q401K149j4538
909C315m318J5657J514j5899k81J2687K644l626o768o498Q061J0756j2642j3838
923i236J0241R431q790o732K588L790M701m800j5786J246J6544k715j4534L873
937a0179J0272j155m665n248j971J0269N508j4193n050J7090O279j1109l676M480
$$ plain form
838 -4699 8349 6609 -11557 -8063 11032 9150 -3553 -742 6770 9937 7713 -5614 -10385 9324
852 9324 19283 2355 -3846 10389 12871 3628 -1466 -2821 2384 12810 4873 -10096 -1252 13522
866 13522 4101 -7230 -3160 1366 1169 -1993 -12098 -10797 6234 5988 -13107 -13077 635 -2269 -12251
881 -12251 -14120 -12211 -4250 2231 -8249 -16975 -2793 5778 -8752 -15780 -6513 -882 739 -1790
895 -1790 -9029 -3502 12033 6659 -8825 -1372 12061 6340 -845 1979 7303 15704 17853 3315
909 3315 -1003 14654 16168 269 -12 12675 15319 11693 4925 -1573 6488 17244 4602 -9236
923 -9236 1005 10436 1646 -5086 -2498 1292 5993 1193 -14593 -13347 3197 482 -14052 -10179
937 -10179 93 -1062 -5727 -10975 -12946 -2677 2831 -11362 -16412 678 6957 -4152 -7828 -3348
951c348M954M701o289j1264Q714J6348o755j2214Q262R074l222n248n776N99J2658
966A1194K764j4763r01J4414j117j2172q56L831K484J699p873q050J2031J0523
980A3208j3727j1011R311O111o507o281l746O426J2388m853j7066M197J5291m652
994i11j2451P04O225N365K604j0200m892J4966O528j5479o321J2103O201m685
1008b43m362j619Q699J1103q967j4746Q752J2802q130r685M970P469M434l106
1022G371j2467k48J5482Q06j7909k182J4035K896o269n908j312R135O653j5119
1036e036j2630J3304J1097j0092p706N999O491K065o605j1487N054J5935m845
1049A544j6531M629J5303P10p289n801J076J1272L323j5733m868J8718Q096j2713
$$ plain form
951 -3348 1606 6307 18 -11246 -2532 13816 7061 -5153 3109 12183 8961 3713 -2063 -1464 11194
966 11194 13958 -805 -1706 12708 11591 -581 -1437 2394 4878 6577 -1296 -9346 2685 13208
980 13208 -519 -11530 -2219 3892 -2615 -8896 -12642 -6216 6172 1319 -15747 -11550 3741 -911
994 -911 -13362 -12658 -6433 -1068 1536 -8664 -13556 1410 7938 -7541 -13862 -1759 4442 -243
1008 -243 -4605 -6224 2475 13578 4611 -10135 -1383 11419 3289 -6396 -1426 6043 10477 7371
1022 7371 -5096 -5344 10138 10944 -6965 -9147 4888 7784 1515 -4393 -5705 3430 10083 -5036
1036 -5036 -17666 -4362 6735 -3357 -11063 -5064 1427 3492 -3113 -14600 -9546 6389 1544
1049 1544 -14987 -10358 4945 5655 -1634 -7435 -6359 4913 8236 -7497 -12365 6353 14449 1736
1063A736n869P571O266j37q695q526J1011J4419j0435j3900J0594J3027m830j1236
1077I96n369M396J2244j611j7006J34J8369O22j6895m064Q257N234l204j1367
1091i264n901J5518J1519j4929j2320J0396Q537p657q619j316P567J0319n785
1104a935j5225O053J7439m574j5083J183R413M088l261q553J586J7467L676j8796
1118f522o367J5879P141q315o573J842J0859Q594j0046j2357J0668J3679r998
1131H484j3275N199J0840L671n334r745K592J4988k528j9152k34J5448J071j0146
1145A879m551L809R519K707j5337j0738J3531R319j2424q653Q317P940r23p974
1159c579q548P200J3246q097j7155N354J6036j017q722k420M495Q305j401j5042
$$ plain form
1063 1736 -4133 3438 9704 9567 872 -7654 3357 17776 7341 -6559 4035 17062 12232 996
1077 996 -4373 23 12267 10656 -6350 -6216 12153 12775 -4120 -8184 73 5307 2103 -9264
1091 -9264 -15165 353 11872 -3057 -15377 -4981 3556 -4101 -12720 -14036 -6469 3850 -1935
1104 -1935 -17160 -11107 6332 1758 -13325 -12142 -2729 1359 -1902 -10455 -8869 8598 12274 -6522
1118 -6522 -12889 2990 10131 1816 -4757 -2915 7944 16538 6492 -5865 4803 18482 8484
1131 8484 -4791 408 11248 14919 9585 -160 2432 17420 14892 -4260 -4494 10954 12025 1879
1145 1879 -2672 1137 10656 13363 -1974 -12712 819 10138 -2286 -10939 -2622 5318 4395 -3579
1159 -3579 -12127 -4927 8319 222 -16933 -11579 4457 3440 -5282 -7702 -3207 5098 3697 -11345
1173a1345k506J8325O441j3673n304R679O827j358q085o019R369J1230j0790j1475
1187h684J0843J3348n149r877j703M764P087l749j2915K227J6877j51j5113r32
1201c127R404K329n104q712k590J2835O978j2762q950J2623Q390r459q607L87
1215f365O880O266o082j1574P202J5837n059j4302J789Q386J331m602n232J714
1229c811J2891K594j5622l931J3933M627j0675n876K720P551M879q479q440J0374
1243B735J0594j1717j2681N675Q778P3m580o158K992J0833k766j5661N60J3685
1257B362K7r977l133M921P448K572j0630o414J2561P005j2266o893J0074P868
1271E525r39m970l662N807J0420o223j2569N999J3532j614p686j69N332N971j123
$$ plain form
1173 -11345 -13851 4474 10915 -2758 -8062 1617 8444 7086 -999 -7018 2351 13581 2791 -8684
1187 -8684 2159 15507 10358 481 -1222 3542 10629 6880 -6035 -3808 13069 12918 -2195 -3127
1201 -3127 6277 8606 3502 -5210 -7800 5035 12013 -749 -9699 2924 11314 1855 -6752 -6365
1215 -6365 515 6781 699 -10875 -3673 12164 7105 -7197 -5408 2978 4309 -293 -5525 -3811
1229 -3811 9080 11674 -3948 -7879 6054 10681 6 -5870 -3150 4401 9280 801 -7639 2735
1243 2735 13329 1612 -11069 -5394 3384 3457 -1123 -7281 -4289 6544 3778 -11883 -11323 2362
1257 2362 2389 -7588 -10721 -5800 1648 4220 -6410 -12824 -263 6742 -5524 -12417 -2343 5525
1271 5525 4586 -384 -4046 1761 12181 5958 -6611 -612 12920 11306 3620 3451 8783 14754 13631
1286A3631j0659j657J3965K501j3528l164J0875M568m287o354l644O063N510j0225
1300C595r708R724R689p141q848m91L793L929n028j0776J296J3296k718j3832
1314a3220J125J0350P58o503o072n87Q609L897j0628m636J3085O113r152n206
1328a2067L519N908L303m521o852P715J3304n359j0795N342J0147p46n120k776
1342A002L815R284J015j0714J37J2946J739j0946k967M882M696Q42o146m998Q893
1357A3480O566j1111r790P321O948m763o432k984L552O795m190j1944J877J0672
1371E997m556j0450k53O200K855j676p327k187R130K642j1746m251J0920M135
1385e67n096l956R92N909N148o501q652Q577J0759o200p782N019P427K255k758
$$ plain form
1286 13631 2972 1315 15280 17781 4253 1089 11964 16532 12245 5891 2247 8310 13820 3595
1300 3595 -6113 3611 13300 6159 -2689 -3180 613 4542 -486 -11262 -9966 3330 612 -13220
1314 -13220 -12095 -1745 -987 -7490 -13562 -14149 -5540 -1643 -12271 -16907 -3822 2291 -6861 -12067
1328 -12067 -8548 -2640 663 -3858 -10710 -2995 10309 4950 -5845 -503 9644 8898 3778 1002
1342 1002 4817 14101 15116 4402 4539 17485 19224 8278 5311 10193 14889 15731 9585 4587 13480
1357 13480 20046 8935 -855 6466 13414 8651 2219 -765 2787 9582 5392 -6552 -4675 5997
1371 5997 1441 -9009 -9262 -3062 -207 -1883 -9210 -11397 -2267 375 -11371 -15622 -4702 -567
1385 -567 -5663 -9619 -8627 -2718 2430 -4071 -12723 -4146 6613 413 -7369 -2350 5077 7332 4574
1400D574o555K398J0745l96j1727J284J1231K416o162k988Q88N426K801q397n426
1415A12R677O275r270n744M969M404j460n204o015L596P956n228j0792M384R357
1430G017l891p711k060K234M467n61q845k431J0795K746j0342l171O431L074j928
1445d176m506l231P020Q235p097p841P700P474m890n361J539L972M877j021p373
1460d679K670J0680j226r981Q20P076K226k478m112p25Q478M029j0661n058J0195
1475G254M900q463m764K978M605K970m710p831M743Q206n639r384K787O635J91
1490D478l852m786M11Q480J28j1364k198J0299J946q141k314M171M135P64p241
1505e084n620P879O944p522o405N994N987j636m145l087L756P733k937j0882K489
$$ plain form
1400 4574 -1981 417 11162 10766 -961 323 11554 13970 7808 4820 5708 11134 13935 5538 112
1415 112 9789 16064 6794 1050 6019 10423 8963 3759 -2256 1340 9296 4068 -6724 -2340 7017
1430 7017 3126 -4585 -6645 -4411 56 -505 -9350 -11781 -986 1760 -8582 -11753 -5322 -2248 -4176
1445 -4176 -8682 -11913 -4893 3342 -3755 -11596 -3896 3578 -1312 -6673 -5134 -1162 3715 2694 -4679
1460 -4679 -2009 8671 7445 -2536 -1716 5360 7586 5108 996 271 8749 12778 2117 -2941 7254
1475 7254 12154 3691 -1073 1905 6510 9480 4770 -3061 1682 9888 4249 -5135 -2348 4287 4478
1490 4478 626 -4160 -3749 4731 4859 -6505 -8703 1596 3542 -4599 -6913 -2742 1393 2157 -5084
1505 -5084 -10704 -2825 4119 -3403 -9808 -3814 2173 537 -3608 -6695 -2939 4794 1857 -9025 -6536
1520f536J1630m98q152o27M703L542j089p310k527J0452L932r488l947P871M126
1535F082l606n667j979N021O223n766r047O157J0135m760q682J090N054L039l155
1550A39p823J870J0549N05j0839o45Q158K041n163m234K48P551M779q591o463
1565g918R293P272p403o613L167N693J902m308o187M482J0151l079j1268J983
1579b833Q296K44n536l026K129P401R00j0026l495J0139L607r202m989M633N205
1594C447L86n754n213O272P360p118r595M797Q323k324n897k296L962O735k690
1609C95j0209N64J0777N40r855j394O988M897j596o817k193Q129N507r005n565
1624h837Q465O840l617n411l50N381N865m905q949M266J0364k383q920J222O724
$$ plain form
1520 -6536 5094 4596 -3556 -4183 520 4062 2973 -4337 -6864 3588 7520 -1968 -5915 1956 6082
1535 6082 2476 -3191 -5170 -149 6074 308 -8739 -2582 7553 2793 -5889 -4799 255 3294 139
1550 139 -7684 -5814 4735 5240 -5599 -6244 1914 3955 -1208 -5442 -5194 2357 7136 -1455 -7918
1565 -7918 1375 8647 1244 -5369 -2202 3491 5393 1085 -5102 -620 9531 6452 -4816 -2833
1579 -2833 5463 5707 171 -2855 -726 6675 7575 -2451 -5946 4193 7800 -1402 -6391 -1758 3447
1594 3447 3833 -1921 -7134 -862 6498 -620 -10215 -5418 2905 581 -5316 -7612 -3650 3085 395
1609 395 -9814 -9250 1527 2067 -7788 -9182 -2194 2703 1107 -5710 -7903 226 5733 -3272 -8837
1624 -8837 -372 6468 2851 -2560 -2910 2471 8336 3431 -5518 -1252 9112 6729 -2191 -969 5755
1639E755K487l742p072l7R143K072j0289l348R094L970o326n349K82N426L221
1654E287p418o989P047Q494o073q221K382N997Q22m506n761K148R542r87j0083
1669h319N25R435J205o856l663K544O264K027p444m184R580N742p828n538M641
1684a869O343n15n049m050N335Q369l981q997K691Q508j367o347k049L715N797
1699F534j25q904j317R566K101r412l554N728M448k216n178k588O324N587p208
1714b14q134N147P275l408n917m82M890M569k523q795J218J0170p29r186m71O914
1730C24L404k752m594q77P206L817q106m657P717N584m627m371J498M514L726
1745G806m666p124L914R095k969q385J774O654J165m223m951Q71P129R77r482
$$ plain form
1639 5755 8242 4500 -2572 -2609 6534 8606 -1683 -5031 4063 8033 1707 -3642 -3360 2066 5287
1654 5287 -2131 -9120 -2073 6421 348 -7873 -5491 506 1328 -3178 -8939 -6791 2751 1764 -8319
1669 -8319 -7794 1641 2846 -4010 -7673 -5129 1135 3162 -4282 -8466 1114 6856 -972 -6510 -1869
1684 -1869 4474 3959 -1090 -5140 195 8564 4583 -4414 -1723 6785 5418 -929 -2978 737 6534
1699 6534 6409 -2495 -3812 5754 7855 -1557 -5111 617 5065 2849 -2329 -4917 1407 6994 -214
1714 -214 -8348 -3201 4074 666 -5251 -5733 -843 3726 1203 -7592 -6374 3796 3067 -6119 -6590 324
1730 324 3728 976 -3618 -4495 2711 6528 -1578 -6235 1482 7066 2439 -1932 -434 4080 7806
1745 7806 3140 -3984 -70 9025 6056 -2329 -555 6099 7264 3041 -1910 -1039 6090 7067 -2415
1760b415k127P989L059n795m152J535M681J467o203n277O339P005n785p042L783
1775b938N481j88m801l601L190O900j320q477P18R038J94o161j924L349M031L43
1791C834n983l049Q771M715p288m905M905N106j306m827k065M667N896l783p764
1806c076L539P363k205n835j044L653L787j283o582p12P997J475q259k777N069
1821A110L405k640m744j401N348L784o004o295N434N776m023n287J209M569K473
1836B714l134n752J878P681p27p586K93O762J617k833l041O45O145K020o622l521
1852c461P479M650n002l740K954M222J145m078m204M011O175l619o667K781N588
1867H234o89l795k985J548N012j048p279q03P380J048o557k826L057K649n94m686
$$ plain form
1760 -2415 -4542 3447 6506 711 -3441 -1906 2775 4242 -1961 -7238 -899 6106 321 -6721 -2938
1775 -2938 2543 2355 -2446 -6047 -2857 4043 2723 -5754 -5036 4002 4196 -1965 -3889 -540 3491 3834
1791 3834 -2149 -5198 3573 8288 1000 -3905 1000 6106 4800 -27 -2092 2575 8471 4688 -3076
1806 -3076 463 7826 5621 -214 -1258 2395 6182 4899 -1683 -2395 5602 7077 -1182 -3959 1110
1821 1110 4515 1875 -2869 -4270 1078 4862 -1142 -7437 -2003 3773 -250 -5537 -4328 241 2714
1836 2714 -420 -6172 -4294 3387 2660 -4926 -4633 2129 3746 913 -2128 -1483 4662 6682 60 -3461
1852 -3461 4018 8668 3666 -74 2880 7102 8247 4169 -35 3976 10151 6532 -135 2646 8234
1867 8234 7545 3750 765 2313 7325 6277 -1002 -1805 5575 6623 66 -2760 297 2946 2352 -2334
1883b334l257N086L998n354n055M192M007j986l987j465K776M308k009o327J855
1898e552P083o80n520o34M012J904n29l642p67O772K123n805k401N700L024k989
1914B099k551N02L256L421l480m439L389N823k976n367J382L702J582k160m152
1929C1P28O141p03o865p76N891Q17l752k431Q78L197J175m839l107M794K673l782
1946G0l601K391L091K20k837l201K845M957k294n679J706N562n76l255p02K088
1962G85L221k68m689p81N766J679m807j356L720J877n98k947j855K884L940l759
1978B812m871L564M096k020l762m84J845K107k024m464P95N116j076n013m76L380
1994d75P26k009k723r64M181J901m436k960M487L251l901k544J389K800J922k744
$$ plain form
1883 -2334 -5591 -505 3493 -1861 -6916 -2724 1283 -703 -4690 -6155 -3379 929 -1080 -7407 -5552
1898 -5552 1531 851 -4669 -5303 -1291 613 84 -3558 -4325 2447 4570 -1235 -3636 2064 5088 2099
1914 2099 -452 50 3306 6727 3247 -1192 2197 8020 5044 -323 1059 4761 6343 4183 31
1929 31 759 6900 6197 -668 -1444 4447 5264 1512 -919 -41 3156 4331 -508 -3615 1179 3852 70
1946 70 -3531 -1140 1951 2171 -666 -3867 -1022 3935 1641 -4038 -2332 3230 2654 -601 -1303 785
1962 785 4006 3738 -951 -1732 4034 5713 906 -450 3270 5147 4549 1602 -253 2631 6571 2812
1978 2812 -2059 1505 5601 3581 -181 -665 1180 3287 1263 -3201 -2406 2710 1634 -3379 -3855 -475
1994 -475 251 -1758 -4481 -5445 -1264 637 -3799 -6759 -2272 979 -2922 -5466 -4077 -1277 645 -2099
2010b099k760K776N039j994m299J487L854K79j498j572J138M644M53m636j341
2025e29N594J524l739j762K229K615M76l221k340M029L099m099l900K725L158
2040E859j647j989j621J112L252j719n735J157M253o36m232r12K456J630j086
2055A42l766r09L635J991n031j836L979J963k020j868r3K529K749l332l803L257
2071b413M267j296l089J081L120J125j648l338Q04N205Q3m592o35M679P44k373
2087A724j722O04K475J072m165k686M399K815l407l080J612K082j51l138k559
2102d125K295M356k770m608J138M216j038l202j186J325K903r0m061o37M947J992
2118A455m412k191L120K283k71k552j041L946L462k987l407K718L445j313k435
$$ plain form
2010 -2099 -4859 -2083 2956 962 -3337 -1850 2004 2283 785 -787 351 4995 5448 812 -529
2025 -529 5065 6589 2850 1088 3317 5932 6408 3187 847 4876 7975 3876 -24 2701 5859
2040 5859 4212 2223 602 1714 4966 3247 -2488 -1331 2922 2286 -1946 -2858 -402 1228 142
2055 142 -3624 -4533 -898 1093 -3938 -5774 -1795 168 -1852 -3720 -3813 -1284 1465 -1867 -5670 -2413
2071 -2413 1854 558 -2531 -1450 1670 2795 1147 -2191 -1387 3818 3901 -691 -1326 3353 4097 1724
2087 1724 2 606 3081 4153 -12 -2698 1701 4516 1109 -1971 -359 1723 1572 -1566 -4125
2102 -4125 -1830 2526 -244 -4852 -3714 502 -536 -3738 -4924 -3599 -696 -786 -4847 -5484 -537 1455
2118 1455 -2957 -5148 -2028 255 -16 -2568 -3609 337 3799 812 -2595 123 3568 2255 -180
2133a80q3K544K563q10l749P14M783l46m617l85L119J308j288k828k01M078J246
2150E868n140k488L499K152l066k285J38K879J200l166m186K136M309k101m891
2165e142N83L553P90k180k111P37L553l12n000m32M652J662k742j492J330K871
2181C20O16k992k462M175L488l326k966K829L680j51k582j825K102L742j853m347
2197a552J068N080ll511j258J714K036q53l810j319M435K351m639k631K932J822
2213A862j267l587q76K490L057l297l755L039L531j795l352j56J868J682j109
2228a665l417P35N045R08m687j443L587K150j524k694O60L893K082l561k493L930
2244A506L310k965k527M98L002J660j544l020K101M664j302m993M81L514P19k510
$$ plain form
2133 -180 -263 2281 4844 4034 285 999 5782 5436 819 434 3553 4861 3573 745 544 4622 5868
2150 5868 728 -1760 1739 3891 825 -1460 -1322 1557 2757 -409 -4595 -2459 1850 -251 -5142
2165 -5142 -4559 -1006 -216 -2396 -4507 -3770 -217 -529 -5529 -5961 -1309 353 -2389 -3881 -2551 320
2181 320 936 -2056 -4518 -343 3145 -181 -3147 -318 3362 3211 629 -1196 906 4648 2795 -1552
2197 -1552 -484 4596 4593 1082 -176 1538 3574 2721 -1089 -2408 2027 4378 -261 -2892 40 1862
2213 1862 595 -2992 -3868 -1378 1679 -1618 -5373 -2334 1197 -598 -3950 -4106 -2238 -556 -1665
2228 -1665 -5082 -4347 698 1606 -3081 -4524 -937 1213 -311 -3005 -2345 1548 3630 69 -2424 1506
2244 1506 4816 1851 -676 -178 2824 4484 2940 -80 2021 6685 5383 390 871 4385 5104 2594
2260B594k003R68L449K92m418k069M301J464m044k412J645K322M19k763k758K547
2276d66K677k861m372J404L621m03k643j522J556L129p78m664k36M616P48l646
2292c840q75K833K199n79k781j391L770L142l716k760L310L492q68k406n07K342
2308A365K420j797l861J735M711p13l451l15K675J629j583k831n46M047O81m135
2324C1j438L502J938k274k934k15K308J611k948l451L365L464k213l717O40K500
2340A69N56j965k612J378L891K77m193k86L726J003k650j724Q69L211Q93k648
2356a05j958M100K255k713l106K274K830m1k028j697K374L692k048l859P51L559
2372D280j46l111r41J723K315k47l915n99L308Q85m475j713K279J790p41k571
$$ plain form
2260 2594 591 1559 5008 5300 882 -1187 3114 4578 534 -1878 -233 2089 2508 -255 -3013 -466
2276 -466 2211 -650 -5022 -3618 3 -400 -3043 -4565 -3009 120 -658 -5322 -5558 -942 -194 -3840
2292 -3840 -4715 -1882 317 -262 -3043 -4434 -664 2478 -1238 -3998 -688 2804 1936 -470 -977 1365
2308 1365 3785 1988 -1873 -138 4573 3860 409 94 2769 4398 2815 -16 -562 3485 4166 31
2324 31 -1407 2095 4033 1759 -1175 -1390 918 2529 -419 -3870 -505 2959 746 -2971 -2331 169
2340 169 725 -1240 -3852 -2474 1417 1694 -2499 -2785 941 1944 -706 -2430 -1561 1650 2543 -105
2356 -105 -2063 2037 4292 1579 -1527 747 3577 3536 1508 -189 2185 5877 3829 -30 721 4280
2372 4280 4134 1023 82 1805 4120 3873 -42 -641 2667 3552 -923 -2636 -357 1433 692 -1879
2388a879j134K439K055l170l576J823L423j515k438mJ736J954j374l148R49L753
2404a06n3l547n19L644J798j261j907J34L734R59l015j952L899K606j856j835
2420G23J146K210J283k438k419J955L676j622l295R00K784P2j799k540N69K521
2436C726j21l822o06L564P05k880k141Q17J596k3k521k052K947K536k860k794
2452c929J436J943m58k085j135J280K982j083l153R60L786J53l069p62J968K238
2468A072o88k247M9L763J603l543j401K800J836r02j648N0K026J988j518l087
2484A53J636K971j319k663p1J771J159r99k320R1L002k78l987p74K623N33j638
2501a10j752N45J784M68k958k030K594K190k341k206R46K305O16j358k321J461
$$ plain form
2388 -1879 -3013 -574 1481 -1689 -5265 -3442 -19 -1534 -3972 -3976 -2240 -286 -1660 -4808 -3859 -106
2404 -106 -159 -3706 -4225 -581 1217 -44 -1951 -1817 1917 2876 -139 -2091 1808 4414 2558 723
2420 723 1869 4079 5362 2924 505 2460 6136 4514 1219 2119 4903 4975 3176 636 1205 3726
2436 3726 3605 -217 -823 2741 3446 566 -1575 -758 838 815 -1706 -3758 -811 1725 -1135 -3929
2452 -3929 -2493 -550 -1008 -3093 -4228 -2948 34 -1049 -4202 -3242 544 697 -2372 -3134 -1166 1072
2468 1072 384 -1863 -1814 1949 3552 9 -1392 1408 3244 2342 694 744 2770 4758 3240 153
2484 153 1789 4760 3441 778 707 2478 3637 2638 318 409 3411 3133 -854 -1628 995 1528 -110
2501 -110 -1862 -1317 467 935 -2023 -4053 -1459 731 -1610 -3816 -2870 -565 51 -1307 -3628 -2167
2517b167L098r68l234Q10L378O02j565r67J115K457k36k645m72L630J046k305
2533A577j070J719J369K88k179j540K151K169k321k347J945K466q73k558p93J298
2549A301J447j426k881LL450j76l062j039J786R74j275k039k53K145J431k792
2565b406k087K389K008j724j831J27J426J446j230j825J955L044r93k710O19K733
2581I41N31j364j167J017L112K49k822l30L110R15j856j592J199K279O66k117
2597B771j672K551J761k051k805J187J562p5j435j187R50K233j402l556n4K630
2613A408j62k350j241J306J432m68k832r26K726J179l252j710K004J953j060j370
2629c363k90J652K180k430k405J615L287l83k528N38J767J500r09k048L19L506
$$ plain form
2517 -2167 931 -37 -3271 -2461 917 1519 -46 -1013 102 2559 2323 -322 -794 2836 3882 1577
2533 1577 507 2226 3595 3883 1704 164 2315 4484 2163 -184 1761 4227 3354 796 3 1301
2549 1301 2748 1322 -1559 -1556 1894 1718 -1344 -2383 -597 377 -898 -2937 -3190 -1045 386 -2406
2565 -2406 -4493 -2104 -96 -1820 -3651 -3524 -2098 -652 -1882 -3707 -1752 1292 299 -2411 -1792 941
2581 941 1472 108 -1059 -42 3070 3319 497 167 3277 4192 2336 744 1943 4222 4888 2771
2597 2771 1099 3650 5411 3360 555 1742 3304 3229 1794 607 1557 3790 2388 -1168 -1222 1408
2613 1408 1246 -1104 -2345 -1039 393 -75 -2907 -3833 -1107 72 -3180 -4890 -2886 -933 -1993 -3363
2629 -3363 -3653 -2001 179 -2251 -4656 -3041 246 -137 -2665 -2127 -360 1140 231 -1817 -1498 2008
2645B008K10k801p25L446J260j534j559Q3K484M70k193j539K677K106j605k440
2661C48J219J725P5k116j970J029L028r60l616P49K571K48k298j688M83J895P
2678G29l159m40K781J478k980j732J517J457R5j767j686K718K358j751k550J183
2694a749K572J22k274p80J855K491o64k681O22L539L51l331n60K270J330l70k068
2711F75j70K606J248l014k101K057K073j226k570l16K178J546j893l291J338K438
2727A578q85l362R4K442O77j504j947M51K601m3l135j258K933J753j847j798R43
2744b307K590M52j893k828K882K921j635k321J141K747L26j444j370J283K330
2759B874j64l279K05L429P14k079j285Q66J694L29k799j395K651J923k351k710
$$ plain form
2645 2008 2218 -583 -1308 2138 3398 1864 305 388 2872 3342 1149 -390 2287 4393 2788 348
2661 348 1567 3292 3367 1251 -719 310 3338 2378 -1238 -489 2082 2330 32 -1656 -1173 722 729
2678 729 -2430 -2870 -89 1389 -1591 -3323 -1806 -349 -254 -2021 -3707 -989 1369 -382 -2932 -1749
2694 -1749 823 945 -1329 -2109 -254 2237 1573 -1108 -486 3053 3404 73 -487 1783 3113 2743 675
2711 675 505 3111 4359 1345 -756 1301 3374 2148 -422 -738 1440 2986 1093 -2198 -860 1578
2727 1578 693 -2669 -2575 -133 544 -960 -2907 -2456 145 102 -3033 -4291 -1358 395 -1452 -3250 -2307
2744 -2307 283 735 -1158 -3986 -1104 1817 182 -2139 -998 1749 2075 631 -739 544 2874
2759 2874 2710 -569 -364 3065 3779 1700 415 1281 2975 3304 505 -890 1761 3684 1333 -1377
2775a377J774K127p05k621j347K034K276j849l806J288L367l61k937j152J735
2790a554J357m27k801l03L627J112k962j413K413J725j140j526k55K682J960k276
2806B19j768K046K908j056k425N49J877J572r02k601J055L495k51l606k49K535
2822C398J040j731k059J06K754Q00l483j872K098K121k678k263N10J642Q86j819
2838e50k980J768K418j748l154P20K252M06j985j338J152K219l2l429p34L574
2854a441J220k324q19J409K398J22k221j050K635K407j836k330J590L011Q2j834
2870A019m91J373J901m42k957L27L239M03k744q93J751J841r42k569p66K760J058
2887C868k868k039K616J743j421k135r27J473J395j587k810J183L048r05k889
$$ plain form
2775 -1377 397 2524 1819 -802 -2149 -115 2161 312 -3494 -2206 1161 800 -2137 -3289 -1554
2790 -1554 -197 -624 -3425 -3728 -101 1011 -1951 -3364 -951 774 -366 -1892 -2147 535 2495 219
2806 219 -1549 497 3405 2349 -76 473 2350 3922 3020 419 1474 4969 4718 1112 863 3398
2822 3398 4438 2707 648 754 3508 4308 825 -1047 1051 3172 494 -1769 -1259 383 1269 -550
2838 -550 -3530 -1762 656 -1092 -4246 -3526 -1274 -868 -2853 -4191 -3039 -820 -852 -4281 -5015 -1441
2854 -1441 -221 -2545 -3364 -1955 443 565 -1656 -2706 -71 2336 500 -1830 -240 2771 2853 1019
2870 1019 528 1901 3802 3360 403 730 3969 4372 1628 735 2486 4327 3385 816 50 2810 3868
2887 3868 1000 -1039 1577 3320 1899 -236 -1163 310 1705 118 -2692 -1509 1539 634 -2255
2902b255o87K049J383j732j972K76K951N31k946p92K818J330j612j757N73K052
2918B10J261j855j420J754L054j442k560L86K207P89j113j780J436L013o91l164
2934H5k61L000M89j998j601Q36K189J4k279j023K379J225k643j834P41J974M5
2951A338j724j707J572K467j706k967M28K841j22k419q40J406J941l11k726j91
2967b720K896O91k564o40J671J757l43j392q81K015K116k409k394K428K405j093
2983A543j366k77J496J455q10k276L28L005j88k822k9J975J247j572j820n22K283
3000A650P09k419j583K286J442j510k059P0J511O48j419k424J519K326j011k365
3016b629N37J555M81j295j597N94K156M99k700q1K437J252j902j189J044J781
$$ plain form
2902 -2255 -2942 -893 490 -1242 -3214 -2938 13 544 -2402 -3194 -376 954 -658 -2415 -1842 210
2918 210 1471 -384 -1804 -50 3004 1562 -998 -612 1595 2384 1271 -509 927 3940 3249 85
2934 85 -176 2824 3313 1315 -286 550 2739 2753 474 -549 1830 3055 412 -1422 -681 1293 1338
2951 1338 -386 -2093 -521 1946 240 -2727 -2299 542 420 -1999 -2839 -1433 508 197 -2529 -2720
2967 -2720 176 867 -1697 -2337 -666 1091 748 -644 -1525 490 2606 197 -2197 231 2636 1543
2983 1543 177 -100 1396 2851 2041 -235 93 3098 2910 88 59 2034 3281 1709 -111 -633 1650
3000 1650 2359 -60 -1643 643 2085 575 -1484 -1414 97 745 -674 -3098 -1579 747 -264 -2629
3016 -2629 -2092 -537 -56 -1351 -2948 -2354 -198 301 -2399 -2480 -43 1209 -693 -1882 -838 943
3032I43K62j489p06J969K014j435k182J771J940l68j179r22J342K114p18k452
3048I04N99K162j81j741p98J228J362q78j488q53J874R30k482j650J473J090o97
3065H54k221n08J444J177j527k315N58J879o16k271r8J477J103j060j805L44K103
3082a482K08k368m14K469J044j096q74J28K226N83j853q86K050K169q83j792J389
3099F18J416N71p42j438Q06K465k04k356L31K110J63j332j148O30J454J90k382
3116A152p58K423L21j875r76Q58O71m73j556q98Q47J374j306k213R70J880j171
3133g30j269q15O45J395l68j929j88K533L9k092k16J435R09j46j238l22J913J436
3151I92j703j346K224J779j161q75O8J225J493o30k206J178K188r62k043N21J471
$$ plain form
3032 943 1205 -284 -990 979 2993 1558 -624 1147 3087 2719 1540 618 1960 4074 3356 904
3048 904 1503 3665 3484 1743 945 2173 3535 2657 1169 316 2190 3120 638 -1012 461 1551 854
3065 854 -1367 -1875 -431 746 -781 -3096 -2538 -659 -1275 -3546 -3644 -2167 -1064 -2124 -3929 -3585 -1482
3082 -1482 -1274 -3642 -4056 -1587 -543 -1639 -2513 -2385 -159 424 -1429 -2315 -265 1904 1021 -771 618
3099 618 2034 2605 1863 425 1231 3696 3492 1136 1467 3577 3740 2408 1260 1890 3344 3534 1152
3116 1152 394 2817 3138 1263 287 1145 1816 1343 -213 -1111 -264 1110 -196 -2409 -1439 441 -730
3133 -730 -1999 -2814 -2169 -774 -1142 -3071 -3259 -726 -687 -2779 -2995 -1560 -651 -797 -2035 -2357 -444 992
3151 992 -711 -2057 167 1946 785 -90 -22 1203 2696 2066 -140 1038 3226 2264 221 742 2213
3168B213L73p60j056j70J809l5k010r27J847N36j638j300M93J417J60j727j642
3185b417J172J566j323j416Q55J312l59j130r51P55K191n72k491M89K381J12j422
3202a248R6R29R26K74j314p04K194J472j830q43J049J685k71j093p60J238J677
3219C477j527j727R37J887n60j660j4N53P13m91j707l98K145J81k678o79J653
3236A05N47j399j139k13J116Q78j658j772J764J575j577j151N17P60P12o52j016
3253b603K31K740p97j513L50J979K25p35q09P54K028L38j834q89K467R77j417
3270A492j104J165J285J21q51j250J147J815j270k360M94J660l82r90r72L23J566
3287A889n01k070q30K238K24k278m05Q70P45o93j224r99J779J400j520k098J784
$$ plain form
3168 2213 2586 1826 770 600 2409 2374 364 -563 1284 1820 182 -1118 -625 792 952 -775 -2417
3185 -2417 -1245 321 -1002 -2418 -1563 -251 -610 -1740 -2691 -1936 255 -317 -2808 -2319 62 174 -1248
3202 -1248 -1152 -223 703 977 -337 -1041 1153 2625 795 -48 1001 2686 2415 1322 562 1800 3477
3219 3477 1950 223 1160 3047 2487 827 813 1366 2079 1588 -119 -517 1628 1809 -869 -1548 105
3236 105 652 -747 -1886 -2099 -983 -105 -1763 -3535 -1771 -196 -1773 -2924 -2407 -1647 -935 -1587 -2603
3253 -2603 -2372 368 -429 -1942 -1592 387 612 -123 -932 -178 1850 2188 354 -535 1932 2909 1492
3270 1492 388 1553 2838 2959 2108 858 2005 3820 2550 190 684 2344 1962 972 0 323 1889
3287 1889 1388 -682 -1512 726 950 -1328 -1733 -863 -118 -811 -2035 -3034 -1255 145 -1375 -3473 -1689
3304a689J273n89j217J3P90J635m78k400R96K414q3j721L62J450N10j27j471P8
3322b54K128P72j784j186K036J221q99p97Q9Q71J145j497k270J625J987j152j613
3339D22O14N72J40p11j601J22J723J7k642j84K098j92q25j364J54P31R89j793
3357a730j057J661J522j293j837J040J176K3p07r65J190K169r59k142Q73K232
3373A196m8j262l76O36J252N66j873o45K695R30j942j338J252O47j24n98r08J006
3391A066J776j413j974Q02J745j033r43n19R78R37o74j860k69K313k32j930n30
3408a760J486M36k49j216j05J121J197k009j398K193J262j109r25K70Q90J027
3424A111p64j326M13K153l32j786Q08J403K39k44q76k37J460O78j893p82K373
$$ plain form
3304 -1689 -416 -1005 -2222 -2209 -1419 216 -262 -2662 -1666 748 665 -1056 -694 756 1266 1139 -332 -254
3322 -254 1874 2646 862 -324 1712 2933 2034 1237 1326 2197 3342 1845 -425 1200 3187 2035 422
3339 422 1036 1608 1748 1037 -564 -442 1281 1298 -1344 -1528 570 378 -447 -1811 -1657 -926 63 -1730
3357 -1730 -2787 -1126 396 -897 -2734 -1694 -518 -495 -1202 -2167 -977 1192 233 -1909 -1036 1196
3373 1196 1148 -114 -490 146 1398 1964 91 -554 2141 3071 1129 -209 1043 1690 1566 968 60 1066
3391 1066 2842 1429 -545 257 2002 969 26 -493 485 1422 748 -1112 -1381 932 700 -1230 -1760
3408 -1760 -274 162 -87 -1303 -1408 -287 910 -1099 -2497 -304 958 -151 -1076 -806 84 1111
3424 1111 347 -979 -566 1587 1255 -531 277 1680 1919 1675 799 562 2022 2700 807 25 2398
3441B398Q20j998m92O19O06P77j380j717J483J879j744j630Q78P24m39k79j142
3458f37O9J269j2k172j94K184l68j459n48N55J021j06j306o39J750J442j908p23
3476a782J025Q25k20l50l72L36K168q07j399K51K174j39j546NR42R27k2j280l86
3495C50J968O38k325n48J688O13m13o05p12Q81R29q72k313J166J646j231j145
3512b85L33M5O89m34j585M7J709l86k008L08J101K33p17m14k15P92J049j620r48
3531b306J557J076j267n92Q22N63O83m01j217J020J892p75j267Q07J572l6p04
3548A427p7r3J094O74j426n59K012M38j404l35N96N39kq12j117J038J153j685
3566A461q39P28P28q62n16n24j66R29l57j948J37J626n29j611Q9N55L5M4o70p71
$$ plain form
3441 2398 3218 1220 728 1347 1953 2730 1350 -367 1116 2995 1251 -379 499 1223 784 505 -637
3458 -637 -568 701 689 -1483 -1677 507 139 -1320 -1868 -1313 -292 -398 -1704 -2343 -593 849 -1059 -1782
3476 -1782 -757 68 -152 -502 -874 -538 1630 823 -576 -325 1849 1710 164 169 1111 2038 2016 736 350
3495 350 2318 2956 631 83 1771 2384 1971 1366 654 1535 2464 1592 -721 445 2091 860 -285
3512 -285 48 93 782 348 -1237 -1190 519 133 -1875 -1567 -466 -233 -950 -1364 -1579 -787 262 -1358 -2306
3531 -2306 -749 327 -940 -1532 -710 -147 536 135 -1082 -62 1830 1055 -212 595 2167 2131 1427
3548 1427 1350 1257 2351 3025 1599 1040 3052 3490 2086 1751 2347 2886 2884 2072 955 1993 3146 1461
3566 1461 622 1350 2078 1216 700 176 10 939 582 -1366 -1229 397 -132 -1743 -1654 -1099 -1064 -1020 -1690 -2461
3586b461J253R76j676m63R93N36k53k98j68L24J305l28j424R25J997q62j245P41
3604a28P59J61N14r37K22J385M86j765m4J707Lj114k27Q9M87R34j029j302J358
3623A559J202j900q80Q17L10K01k36j321K70J026m20j541L09J531j030l88L49
3640a42n16P36N83r94j168J817N88j471n96J375j02J53N3o42N38J276j096j021
3658f29J058J178m01p56J07J68M40L71j419j01J723L1j602l89R86k46j14k04p33
3677e32L84R76j558p94J373N48j412m09L40j80L63j27r16K09J685o05j168M71
3695a352O96r3M04k79n85J024P03j224O7J412M37j343P97J18n6P15%p23P56J390
3715B864j150p87R16N85l26k79k09L6N72K5j408M13R84o75j183M98O6l29L52n74
$$ plain form
3586 -2461 -1208 -232 -1908 -2371 -1378 -842 -1095 -1393 -1561 -1237 68 -260 -1684 -759 1238 376 -869 -128
3604 -128 631 792 1306 369 591 1976 2462 697 653 2360 2363 1249 1022 1111 1598 2532 1503 201 1559
3623 1559 2761 861 -19 798 1108 1309 1073 -248 22 1048 628 -913 -604 927 -103 -491 -142
3640 -142 -658 78 661 -333 -1501 316 904 -567 -1163 212 110 263 316 -326 212 1488 392 -629
3658 -629 429 1607 1206 450 557 725 1165 1536 117 16 1739 1770 168 -221 765 519 405 201 -532
3677 -532 -148 828 -730 -1524 -151 397 -1015 -1424 -1084 -1264 -901 -1028 -1944 -1735 -50 -655 -1823 -1352
3695 -1352 -656 -749 -345 -624 -1209 -185 518 -706 -639 773 1210 -133 664 782 726 1441 1441 718 1474 2864
3715 2864 1714 927 1843 2428 2102 1823 1614 1650 2222 2247 839 1252 2236 1561 378 876 942 613 965 391
3735C91j021R75N49k050k95R82o6p10M76p58o1P62m98j238Q93J373j521k14M64
3754a567N80j4K04n12l67J431J41j513K78J678l75k02K7O4K35Q79p58j076J356
3773D89J370j583m10P99J60K4N4j082J80J258o40j199Q93R40l99q42k36L22O4
3792A62L08r24o98J845K98j924J82Q73Q9l91j63k22L85J018p79j349J482M81m76
3811A97n11L32k53Q81M29j168K68J464k28j583L45O63M6j2m02m98P62Q83j173
3830D42j139J653L44j275k58J25p4O43q2j748N94J409j055j499R84O20k53j34
3848g03m67m52J157R0j588l33J887k01j058k05N42M02Q44o00j187J241J017j627
3866a241n13J389L18K36J2o37j20J654j56j577P84J582o82m61K58J83K44O13q93
$$ plain form
3735 391 -630 345 894 -1156 -1451 -469 -535 -1245 -769 -1527 -1588 -826 -1324 -2562 -1669 -296 -1817 -2031 -1567
3754 -1567 -987 -1001 -797 -1309 -1676 -245 -104 -1617 -1339 339 -36 -238 -211 -147 88 967 209 -867 489
3773 489 1859 276 -134 665 825 849 903 -179 1 1259 619 -580 313 1253 854 12 -224 98 162
3792 162 470 -454 -1152 693 991 -933 -751 122 211 -180 -343 -565 -180 838 59 -1290 192 673 197
3811 197 -314 18 -235 646 1075 -93 175 1639 1411 -172 173 836 882 870 468 -30 732 1615 442
3830 442 -697 956 1300 25 -233 -108 -182 461 379 -1369 -775 634 -421 -1920 -936 -316 -569 -703
3848 -703 -1170 -1622 -465 -375 -1963 -2296 -409 -610 -1668 -1873 -1331 -929 -85 -685 -1872 -631 386 -1241
3866 -1241 -1754 -365 -47 189 201 -436 -556 1098 942 -635 149 1731 1049 588 846 1029 1273 1886 993
3885I93q40J522N07j515j92J437k73p76L35o75L75N59l32j616R29J237j222q88
3903d35M75N0L7j8j073o21J458K67j875L61J071p7o51k52o17R58Q46o91j376J293
3923h70P48j119p19Q11L09N09L01j394J84K052m48j306R15P89j65l66j46l13J012
3942G84J179j194o35J513L03j169j21P11R4J90o7j275M83J633r68j573J051Q09
3960A748j030k09k55o3J145j41j663q7J132j37j348Q1P27J74q1o48j525J613J006
3979D39j545j014J564M24r74J09L15O8Q88K12k024L27K001n82r97N43J216k38
3997G32J42p46l39J750P78j700k79J384M45n14k97q2J50R84o04j632P17J576r90
4016A475q17K28K06Q0Lj149k86J290m1j623J18J176n52p32J82l30L21N32o82j411
$$ plain form
3885 993 153 1675 2182 667 475 1912 1639 863 1198 523 898 1457 1125 -491 438 1675 453 -435
3903 -435 40 90 127 109 -964 -1585 -127 140 -1735 -1374 -303 -380 -1031 -1283 -1900 -942 -96 -787 -2163 -870
3923 -870 -122 -1241 -1960 -1149 -840 -331 -30 -1424 -1240 812 364 -942 -27 762 597 231 85 -228 784
3942 784 1963 769 134 1647 1950 781 660 1371 1465 1655 1588 313 796 2429 1461 -112 939 1748
3960 1748 718 509 254 191 1336 1195 -468 -555 577 440 -908 -827 -100 74 -7 -655 -2180 -567 439
3979 439 -1106 -2120 -556 -132 -1106 -997 -682 -614 274 486 -1538 -1211 790 208 -789 -246 970 732
3997 732 874 128 -211 1539 2317 617 338 1722 2167 1653 1356 1274 1424 2408 1804 172 889 2465 1475
4016 1475 658 886 1092 1172 1175 26 -260 1030 989 -634 -516 660 108 -624 -442 -772 -451 81 -601 -2012
4036b012J362J103j305m33O43K56k65K30j021K95J725l36j640Q38J477j129K99
4053H7j3j56O41R23j414n00J809O16j492J92O73q1J71n3j174Q23J861j394j153
4072C66Q91P22q01k67K5r7O71M80j812k19J635k29j433o8Q36n62J82k2p35P80
4092C43Q49j719n88J518P1l93j56K42k03R81o4j300L59J655m70j103O66N08k21
4111I75J56l23k36J023J35r08q12J932l28j030N18K8J67ll98j257R56R41q83j015
4131c62J005L0m41K69o06n48J134J34j856J70J478o37m92M97l60j98O53m89o53
4150a272J213P52j180l65R20J56j91J31k97K50J130o32j066J146J273r56k21M19
4168A210o4j18P77o84k60J280K31j745J35J182o91J65L7m43j44J348j279j222
$$ plain form
4036 -2012 -650 453 -852 -1285 -642 -386 -651 -421 -1442 -1147 578 242 -1398 -560 917 -212 87
4053 87 74 -82 559 1482 68 -432 1377 1993 501 693 1366 1285 1456 1403 229 1052 2913 1519 366
4072 366 1257 1979 1178 911 936 839 1510 1990 178 -41 1594 1365 -68 -136 700 138 320 298 -437 343
4092 343 1192 -527 -1115 403 474 81 -75 167 -36 945 881 -419 -60 1595 1125 22 688 1196 975
4111 975 1131 808 572 1595 1730 822 10 1942 1614 584 1102 1130 1297 1294 896 -361 595 1536 653 -362
4131 -362 643 673 232 501 -105 -653 481 615 -1241 -1071 407 -230 -722 -225 -585 -783 -130 -619 -1272
4150 -1272 -59 693 -487 -852 68 224 33 164 -133 117 1247 615 -451 695 1968 1012 791 1210
4168 1210 1146 1028 1805 1121 861 2141 2372 627 762 1944 1253 1418 1455 1012 868 2216 937 -285
4186b85J379M54j104m24Q57n33j29L89j135K5J155o50j122O08Q62r55M87J35o80
4205f66N67O71r04o23J314O22j557M02O75p59Q75N13j342Q21J040p50q04J154
4223A249M39o66J83K56n89Q39L83j325o6J306j40j199L01O37o32M28l94q15O64
4242H59N73j509n42J209r6n43L9j9n56L01Q7j363N44J008p88r79O47N76p69J55
4262a166J6o80R76N99j466K04J398k36o79M98n4j07P71k59q91J063J059p08r44
4281f06J536k56k74O19n93R5J356l82j299N89J140q18m17P24l55m7O34q44l66
4300D36J047L49j236j64P67k11o59N27r10J18J179m81j301P25R06j255n92O64
4318i1J71j59R42j697j56J543Lj428M11R80n95Q4J70q20N03J161r06p25J317L89
$$ plain form
4186 -285 1094 1548 444 20 877 344 215 604 -531 -506 649 -1 -1123 -515 347 -608 -121 14 -666
4205 -666 -99 572 -332 -955 359 981 -576 -174 501 -258 617 1130 -212 609 1649 899 95 1249
4223 1249 1688 1022 1205 1461 872 1711 2094 769 703 2009 1869 670 971 1608 976 1404 1010 195 859
4242 859 1432 -77 -619 590 494 -49 -10 -29 -585 -284 -197 -1560 -1016 -8 -796 -1775 -1128 -552 -1321 -1166
4262 -1166 -1150 -1830 -854 -255 -1721 -1517 -119 -355 -1034 -536 -590 -697 74 -185 -1076 -13 1046 338 -606
4281 -606 930 674 400 1019 426 521 1877 1495 196 785 1925 1107 690 1414 1059 1012 1646 802 436
4300 436 1483 1832 596 432 1199 988 329 856 -54 64 1243 762 -539 186 1092 -163 -755 -91
4318 -91 80 -79 863 -834 -990 553 556 -872 -461 519 -76 8 178 -642 -139 1022 116 -609 708 1097
4338A097r86K13J36k7L23J13j366L37J456o40j580R35O86p57o9J88j097P03P93
4357D58j682m79J990p01q57J23M79n51M32o0j236M39J508r68p73R83L24n68k09
4376a348L92m57J097L75j322J43J568k80q74N26L33O9O28N5j040J226R88j219
4394H60p43J429K01m56J42r6J46R52l27j301N36J255j133o25O20k16l2L36j034
4413E14q63J345N14j855k82Q46k83p45m2m91K95Q14j011j203J070P76j434k42
4431b277Q04l76K55O61j062m23J484J92j566P30J184m38RN15p06R93J018j385
4449c88p39J838M57p97K7R04k12J78M64j179P7J511p70j260N21J064q68L99j53
4468A074p43M22L85j325m77J311nj420L98j26n40M80N3j442O37J319j253j155
$$ plain form
4338 1097 111 324 460 433 756 869 -497 -160 1296 656 -924 11 697 -60 -129 59 -1038 -335 458
4357 458 -1224 -1703 287 -414 -1271 -1148 -669 -1220 -788 -848 -2084 -1645 -137 -1105 -1878 -895 -571 -1139 -1348
4376 -1348 -956 -1413 -316 59 -1263 -1120 448 168 -706 -180 153 222 850 905 -135 1091 2079 860
4394 860 117 1546 1747 1291 1433 1337 1483 2435 2108 807 1343 2598 1465 840 1460 1244 1212 1548 514
4413 514 -349 996 1510 -345 -627 219 -64 -809 -851 -1342 -1047 -233 -1244 -2447 -1377 -601 -2035 -2277
4431 -2277 -1473 -1849 -1594 -933 -1995 -2418 -934 -742 -2308 -1578 -394 -832 -823 -308 -1014 -21 997 -388
4449 -388 -1127 711 1168 371 398 1302 1090 1268 1732 553 630 2141 1371 111 632 1696 828 1227 1074
4468 1074 331 753 1138 -187 -664 647 642 -778 -380 -506 -1046 -566 -513 -1955 -1318 1 -1252 -2407
4486b407R89O40p57P8J11k05O55M73j392L13J580o10p07Q74K34o5O97Q3j060J196
4506G20Q87j218m62J583J30p95L02j85k32J508l35j595O02J511r93r14N43O5n10
4525F12M13n73r12J047L56j996J50J188o44m20k20O5p51J271m60j242R15J092
4543a09j623m02Q65K85k54N84q97j20J786l49j271Q07J291n94j93M85j59n7J103
4562A178n42p75J405Q81j682P9R09l76L53L40r92J36J216p17j421R38N23r80l1
4581D42m4k49K6P60j258p56J555j54j737K86J105n66K30m12j001N27J262j060
4599a044j330J298N75j065N22K45n08R30K71r77J1J598j44j235Q15Q42l94L56
4617G66k66m14O82Q48j104j69J294j4j003L18N21o69J029j38j357M92Q48o70r69
$$ plain form
4486 -2407 -1418 -778 -1535 -1457 -1346 -1551 -896 -423 -1815 -1502 78 -532 -1239 -365 -131 -196 501 584 -476 720
4506 720 1607 389 -73 1510 1640 845 1147 962 730 2238 1903 308 910 2421 1428 514 1057 1122 612
4525 612 1025 452 -460 587 943 -1053 -903 285 -359 -779 -999 -934 -1685 -414 -874 -2116 -1201 -109
4543 -109 -1732 -2134 -1269 -984 -1238 -654 -1551 -1671 115 -234 -1505 -698 593 -1 -194 291 132 75 1178
4562 1178 636 -139 1266 2147 465 544 1453 1077 1430 1770 778 914 2130 1413 -8 930 1453 473 442
4581 442 398 149 175 935 -323 -1079 476 322 -1415 -1129 -24 -590 -360 -772 -1773 -1246 16 -1044
4599 -1044 -2374 -1076 -501 -1566 -1044 -799 -1307 -377 -106 -1083 -1072 526 382 -853 -38 804 410 766
4617 766 500 86 768 1616 512 343 1637 1623 620 938 1459 790 1819 1681 324 816 1664 994 25
4636B5R83j43m99j9k52j50M08O07j727J01J006k95q48N23l31k20R15n89r23N84
4656h44P64r01q3N58L05n48N44m62l65J651j58j089L54J251q01k81O78k70K3R91
4676A317r44n12J163K00j052J09J037n81J6M67o78m02J270m05j530P67Q40j098
4694a6j24O67o73J74J27p10n83J448k90j231K97P46q46J72P76r97o7J441q24r53
4714a466J173K66q03L7J092p73M76O54j162J24J627o37o63R18L55o14L62Q6k80
4733G72L23R39r11p01Q39m6l76L63N20j168P48N9j155N02O56q24p68Q63k74r11
4753e50L12k1n12O54L01j558K93J314r92m92L85M76q96Q64m63n66M96J270j194
4772h79k56R38j14k69K73L45p35J378j45r56P86Q95r11l16J094l33j54M89l33
$$ plain form
4636 25 1008 865 366 347 95 -55 353 960 -767 -666 340 45 -803 -280 -611 -831 84 -505 -1428 -844
4656 -844 -80 -981 -1064 -506 -201 -749 -205 -667 -1032 619 461 -628 -274 977 176 -105 573 303 326 1317
4676 1317 373 -139 1024 1224 172 281 1318 737 753 1220 542 140 1410 1005 -525 242 1082 -16
4694 -16 -140 527 -146 28 155 -555 -1138 310 20 -1211 -914 -168 -1014 -842 -66 -1063 -1130 311 -513 -1466
4714 -1466 -293 -27 -830 -793 299 -474 2 656 -506 -382 1245 608 -55 863 1218 604 966 1052 772
4733 772 1095 2034 1123 422 1261 1215 839 1202 1722 554 1302 1361 206 708 1364 540 -228 635 361 -550
4753 -550 -238 -259 -771 -117 184 -1374 -1081 233 -759 -1251 -866 -390 -1286 -422 -885 -1451 -955 315 -879
4772 -879 -1135 -197 -311 -580 -307 38 -697 681 536 -420 366 1261 350 34 1128 795 641 1130 797
4791G97l47J038L38j153J87Q92p17k13M23l68l08R08n81q77P10O70j186k98P28
4810F43o73m23Q28p00p90J067k7j457M58P63q55j1P29n55l11Q70o70n07J389J25
4830a07j079J34J064m51q3N89n93N07J183n89j021R28P16n85l2P14m28L98P02
4849A967q73m67J233R2j451P44M28m81J39J68j069M79P60j016p93J098R8j326
4867b70M51q2o80L44M06j220k13J499q34j087O17N69p08J01N00j194N84J048j276
4886a445K7R31k07n76P13K29o05J008m7j179J004R12o03l37Q50K64q08O21L11
4905A063n55O09L17j246J97R90m51o12R41m47j42N35l14o56N71N81j182m70Q18
4924E47l53m98M70l12n90N76o6j075l0J378q94k94O83n62k9M72l97o79R33O11
$$ plain form
4791 797 450 1488 1826 673 860 1752 1035 822 1245 877 569 1477 896 19 729 1399 213 -85 643
4810 643 -30 -453 375 -325 -1115 -48 -75 -1532 -1074 -311 -1166 -1177 -448 -1003 -1314 -444 -1114 -1621 -232 -107
4830 -107 -1186 -1052 12 -439 -522 67 -526 -19 1164 575 -446 482 1198 613 581 1295 867 1265 1967
4849 1967 1094 627 1860 1952 501 1245 1673 1192 1331 1499 430 909 1669 653 -140 958 1056 -270
4867 -270 181 99 -581 -237 169 -1051 -1264 235 -599 -1686 -1069 -500 -1208 -1107 -607 -1801 -1217 -169 -1445
4886 -1445 -1418 -487 -694 -1270 -557 -328 -933 75 28 -1151 -147 765 162 -175 675 939 131 752 1063
4905 1063 508 1117 1434 188 385 1375 924 312 1253 806 664 1199 885 229 800 1381 199 -271 547
4924 547 194 -304 166 -146 -736 -160 -226 -1301 -1331 47 -847 -1141 -458 -1020 -1049 -577 -974 -1653 -720 -109
4944a09j120N08O62m35K08L12l64k05R08q3r29J018J012j399N2R46n21K1O73n35
4964F20n83J339L1j595Q17P15o32k89M63p15p8J371j190o76J254Q1j176P9N27
4983C63p85J50L90p43rJ061n84j331J082K47p90L86R3k67J46P30j041n53J339
5002a16L24j250N48N60q95P79L30j038M80J184j014m22J136L38n54N9N9k61L98
5021F45L85j132J94J028p15q44J087kn87L91k97p58P12P55j588j08J363n95p45
5040h11M37l14J2J96L4j224Q03J020q66l82K35J42r1O39m36j048J458N22j596
5059a270M75J064o56j84P72K8k91Q83n68o68Q75O55j197M7R34l20m2M91m07n02
5079A19J177k19j228P79Q13r81k20L73j38l18L99k67p14J085Nr41M4Q62j070L42
$$ plain form
4944 -109 -1229 -721 -59 -494 -286 26 -338 -543 365 282 -647 371 1383 -16 36 982 461 482 1155 620
4964 620 37 1376 1407 -188 629 1344 712 423 886 171 93 1464 274 -402 852 933 -243 -164 363
4983 363 -422 -272 118 -625 -634 427 -157 -1488 -406 -159 -949 -563 -470 -737 -591 139 -902 -1455 -116
5002 -116 208 -1042 -494 66 -829 -50 280 -758 -278 906 -108 -530 606 944 390 449 508 247 645
5021 645 1030 -102 92 1120 405 -439 648 646 59 450 153 -605 107 862 -726 -834 529 -66 -811
5040 -811 -374 -688 -676 -480 -446 -1670 -867 153 -713 -1095 -860 -718 -809 -170 -606 -1654 -196 326 -1270
5059 -1270 -795 269 -387 -571 201 229 -62 821 253 -415 460 1115 -82 -35 899 579 537 1028 621 119
5079 119 1296 1077 -151 628 1441 460 240 613 475 157 556 289 -425 660 665 -276 -232 630 -440 -98
5099i8J64n23n06J125l03j015Q26L00o45n30O21k5k59R16j044l16J620m05q22
5118i19O67J86n05N19L17r40L00J265n82p97R18j48p48O82o5n26P70L26o80n40
5138e00J285l93q06O02K76n33L2L59o59J8R84j225j86J034l98p32L98L47o97K24
5158e70Q72j196P7R65q78l50J057l47m97P18m3n06N48K93j062N17Q28l20l21O87
5178D72j87l34M84J05j084J095M66j155K04O18k8k61O71j15q29O19K95j024K09
5197B21O51n91k62O49p45k73O82o98k04P42J4n01m08N30o03k5N02o08r8Q23l81
5218e83r13P37Q66j263M62K07m81K39P62o18m97J381l66n29O94L68m32O1L26O0
5238D81k70O77l26m66Q48k36p21O10M99o73L87N74r57k31J059p57o99N16K78p60
$$ plain form
5099 -98 66 -457 -963 162 -141 -1156 -330 -30 -675 -1205 -584 -609 -868 48 -996 -1312 308 -97 -919
5118 -919 -252 -66 -571 -52 265 -675 -375 890 308 -489 429 281 -467 215 150 -376 394 720 40 -500
5138 -500 785 392 -414 188 464 -69 -37 322 -337 -319 665 -560 -746 288 -110 -842 -444 -97 -794 -570
5158 -570 302 -894 -817 148 -730 -1080 -23 -370 -867 -149 -192 -698 -150 143 -919 -402 426 106 -215 472
5178 472 285 -49 435 540 -544 551 1017 -138 66 684 656 395 1066 951 122 741 1036 12 221
5197 221 872 281 19 668 -77 -350 332 -366 -570 172 186 -315 -723 -193 -796 -821 -319 -927 -1025 -202 -583
5218 -583 -1496 -759 107 -1156 -694 -487 -968 -729 33 -585 -1082 299 -67 -596 98 466 34 95 421 481
5238 481 211 888 562 96 944 708 -13 597 1096 423 810 1384 427 196 1255 498 -201 315 593 -167
5258a67K55N82j109J11Q45r13l13Q25m86p23K16N08p72q5P27o23j12Q53o84m30
5278a495Q90J72j026P56j1j44J18J005q13M8P31m15l39R09l57Q9M92K54o00N04
5298G68M42m79k28J034l20p50R79l86l34N83R5q46L38P44j154k62O03l03j81M78
5318H21m65q30O18M00j218n1Q49p04m63O47k45o80R25m42q35P47L85q28Q4N92
5338f93n56o9O82p2n58J268m4j051M23O68n06j05J062o06j83R04j54m73O98j05
5358E30m78M66O86r20M17M09j35o08P68j55j032Q36J73j040L24L92n28l37Q14
5377E82n64p59J098k22q98N52N23r94J89J97m66K61N24p33k90J024j7q07K52M11
5397a37n27L07N11o15o0Q65m87j34P70k11m30O18K93o58M97M57o84q5R71o96m59
$$ plain form
5258 -167 88 670 -439 -328 517 -396 -709 116 -370 -1093 -877 -369 -1141 -1226 -499 -1122 -1234 -381 -1065 -1495
5278 -1495 -605 -433 -1459 -703 -714 -858 -740 265 -548 -500 231 -184 -523 386 29 118 610 864 264 768
5298 768 1210 731 503 1537 1217 467 1446 1060 726 1309 1404 558 896 1640 486 224 827 524 343 821
5318 821 356 -474 144 544 -674 -725 124 -580 -1043 -396 -641 -1321 -396 -838 -1673 -926 -541 -1369 -1285 -693
5338 -693 -1249 -1318 -636 -708 -1266 2 -42 -1093 -670 -2 -508 -613 449 -157 -340 564 410 -63 635 530
5358 530 52 518 1204 284 701 1110 975 367 1135 980 -52 784 957 -83 241 633 105 -232 582
5377 582 18 -741 357 135 -763 -211 312 -682 -493 -296 -762 -501 23 -710 -1000 24 7 -800 -548 -137
5397 -137 -664 -357 154 -461 -521 344 -143 -277 493 282 -148 470 763 105 602 1059 375 290 1261 565 106
5418A06J055o9n27J81J71o62J61P12n44n42Q68l40n97O43m19m80M31ko96J14Q95
5439D59j054K25r3o5m44M74J16q87N93P40r20R5P33l04k92N27j56l43P75K9p67
5460e59P20Q65j050j92R92m78k55N25j31l11O74R9r69N13O98o46l63R40o22j45
5480C05N06j52p42N54M16j039K61M95p92O3J43m15j91R18k70p41J84N12o04j3
5500f02J95j59k33Q23n97l73Q47j66r24P18O56n81J01O46n01N0Q77q63m90J194
5520F18k41j75J61M06m96P26J86r27j13J269l54r81P00J11m76K18K03p17K23M73
5540H14q92J8M40r4p66K96K27o03M32J76r54L50P07n27p11P24l3p13O98j32m70
5561a013M75O23r10R5Q08l19o22R54l25j00M49Mo44N65O78o97k07O88J99p55Q42
$$ plain form
5418 106 1161 1092 565 746 917 255 416 1128 584 42 910 570 -27 616 197 -283 148 146 -550 -436 459
5439 459 -595 -370 -463 -528 -972 -498 -382 -1269 -676 64 -856 -761 -28 -332 -624 -97 -253 -596 179 208 -559
5460 -559 161 1026 -24 -216 776 298 43 568 437 126 800 899 -70 443 1141 495 132 1072 450 305
5480 305 811 659 -83 471 887 -152 109 604 -188 -125 18 -397 -588 330 60 -681 -497 15 -589 -602
5500 -602 -407 -566 -799 24 -573 -946 -99 -265 -1189 -471 185 -396 -295 351 -150 -100 777 -86 -576 618
5520 618 377 202 363 769 273 999 1185 258 145 1414 1060 79 779 890 414 632 835 118 341 814
5540 814 -78 -60 380 286 -480 -184 43 -560 -128 48 -906 -556 151 -376 -1087 -363 -396 -1109 -411 -543 -1013
5561 -1013 -538 85 -825 -730 78 -241 -863 91 -234 -334 115 119 -525 40 718 21 -186 502 701 -54 788
5582G88m94J08L41K29p73J66N07j91j59K05k59n18P04k93o30O35L23j090J19P79
5602D97o09n76P00k33m16O34k40n52L70L61o35J19M2q6j72N37n22m38J073N02
5622C56j215N47M84q16N51N59m20k11Q05l49m30R21L11r59J58M30p37O10M51p56
5642B90M1P67k89q43O69K38p88L1M02m14J01L98o30j23M92k17r10L90L81n05J94
5663c25J09m24j14P09l67r35R14L59j164M44K19j83J21N44p09%R25l83m26N26
5683a60j47R3K18P63j170O70O09n61n39J050k52m72O48K73q05L40n5p0k08P53
5703I78n62k39P26m99l38M67k29m55L52N73j244K7Q13l42m21N56l38l47M74r1
5723a39r43O20K73m63k09P38o20L5M55l46k25O84J36p92K98P14l76l11N52j58
$$ plain form
5582 788 294 402 743 972 199 365 872 681 522 727 468 -50 654 361 -269 366 689 -401 -282 497
5602 497 -112 -688 12 -221 -637 -3 -243 -795 -425 -64 -699 -580 -538 -624 -796 -259 -781 -1219 -146 356
5622 356 -859 -312 172 -644 -93 466 46 -165 640 291 -139 782 1093 134 292 722 -15 595 1046 290
5642 290 331 1098 809 -34 635 873 85 116 518 104 205 603 -27 -150 342 125 -785 -395 -14 -519 -325
5663 -325 -216 -640 -754 -45 -412 -1347 -433 -74 -1238 -794 -575 -758 -637 -93 -802 -802 123 -260 -686 -160
5683 -160 -307 -214 4 767 -403 267 876 315 -224 826 574 102 750 1023 218 558 503 433 225 978
5703 978 416 177 903 404 66 533 304 -151 201 774 -470 -443 370 28 -393 163 -175 -522 -48 -139
5723 -139 -1082 -462 -189 -652 -861 -123 -743 -708 -253 -599 -824 -140 -4 -796 -498 216 -160 -471 81 -77
5743g7l8O57j73o04N42O10q79K25N16m87J9O16q22m31J515n75m58L32L28o93j1
5764A12L01k24m11N15j09q22P22R6r69P11kq26Q7R23p93r4Q33o07p67R82k02m73
5786a017L31J00j83M1Q05n77k72Q61j52n26J053l82l4L54K0n66M17M19l91l7N33
5807G97J03q27N69J13o44M97K72o03R7P25o75m86R73m20n60M42K17q04N79O1q91
5828d65P7O40m12n56J76J81l44L15L0o99M44M53m95pR9o3j21P93m92n36O04L8
5850c40m93M39N35n05M8M26r9p2M83J32r98J091R4n41K14M70o85m6P96j41n29
5871B79O73M6r86O44M28q16K23J46m46n46R06n58o98Q39J57q38K36N83r72J33
5891e67J57k22j99P88m16p33P13K09o39J75N43o13K78N16m11j99P92k18l95M12
$$ plain form
5743 -77 -115 542 369 -235 307 917 38 263 779 292 311 927 105 -326 1189 614 156 488 816 123 112
5764 112 413 189 -222 293 184 -638 84 180 -789 -78 -80 -906 -819 104 -689 -783 50 -557 -1324 -342 -544 -1017
5786 -1017 -686 -586 -769 -728 77 -500 -772 89 -63 -589 464 82 48 402 422 -144 273 692 301 264 797
5807 797 900 73 642 755 111 608 880 277 374 1099 424 -62 911 491 -69 373 590 -214 365 426 -465
5828 -465 -388 252 -160 -716 -540 -359 -703 -388 -358 -1057 -613 -160 -655 -662 -563 -626 -747 46 -446 -982 -378 -340
5850 -340 -833 -394 141 -364 -316 110 11 -61 422 554 -444 647 741 200 414 884 199 153 949 808 279
5871 279 952 998 12 656 1084 268 491 637 191 -355 551 -7 -705 134 291 -547 -311 272 -700 -567
5891 -567 -410 -632 -831 -43 -459 -1192 -479 -270 -909 -734 -191 -804 -526 -10 -421 -620 172 -46 -441 -29
5911b9K82m26J61O77o93J55N57qo10J111k83p82P14J90n16J89M43p24r5M67k47
5932E33m58P32k85q62M66K38o92M23J32m84k26O53o36o00N74m3k52L39J07p73
5952a114L99O33p40k06Q77n99l05N92K07p25N40O99q89R0J028o89j80J020l31
5971C07m46Q38k92LM40J32n80o5N99M0o24L63j15k28N38m2q35K27M20m69k90N40
5993D61l22l46K79R3q98Q01r6r53L55L36l66m07O69j35n39R48o64j50P6O09p33
6014i82J88N97k94k84P40m81k84P56J8n00M78P24j046M63O04o50J19O07l44j57
6034B72Q62k30q58M24K23m36K54L98m57m93P22m09n64N07J52o24M78J38n96J31
6054a06L02p21nN23l14k90K30J54n25K79K73q22L09M94m21k76Q86q1m36M14J75
$$ plain form
5911 -29 253 -173 -12 665 -28 127 684 676 66 1177 894 112 826 1016 500 689 1132 408 313 780 533
5932 533 75 807 522 -340 126 364 -328 95 227 -257 -483 170 -466 -1066 -492 -535 -787 -448 -341 -1114
5952 -1114 -715 -82 -822 -1028 -151 -750 -1055 -463 -256 -981 -441 258 -631 -541 487 -202 -382 638 307
5971 307 -139 699 407 410 850 982 402 337 936 976 352 715 600 372 910 868 33 260 680 211 -79 461
5993 461 139 -207 72 165 -733 68 -28 -981 -626 -290 -656 -1063 -394 -529 -1068 -120 -784 -934 -858 -249 -982
6014 -982 -794 -197 -491 -775 -35 -516 -800 -44 -26 -526 -48 676 -370 93 697 47 166 773 429 272
6034 272 1134 904 46 470 693 257 511 909 452 -41 681 272 -292 215 367 -257 221 359 -237 -106
6054 -106 196 -525 -530 -7 -321 -611 -381 -227 -752 -473 -200 -1022 -713 -219 -640 -916 -30 -111 -547 -133 42
6075D2o05N39L07m35J59M77j46l64N64N4n00N58J83k78K10L68r30Q6R71o69K7
6096F18R2J13l72L48j77j066P84P35r73j14O91p59j75K76j42l30K41K06p88J20
6116f72M64m23l94P69k86m94M70N0n43O54M02j050J17P30m63O9P44k43k02N36
6136B35k33l79N42N25p94J07Q16n04J89K32j78n70J217l00l68K77K17o31M7M50
6156H97m01n35Q98n49k32K90J36k58J52R0q94L51L22q45o4Q83n95k91O5O25q33
6177g88K73L93q27K58O95n87l49O72p5p47R05K57n47K72L48m93P6R53p55j88J117
6198H63j44l49K13O5l78K68M13o43j76P26j00m32N04j11n75M47k1l88l04P06l51
6219B33l34M54l45j70P7Q0q66O15K60m26j11O11q11j89N56q6o37M83J54n51M23
$$ plain form
6075 42 -563 -24 283 -152 7 484 338 -26 538 592 92 650 833 555 765 1133 203 289 1260 591 618
6096 618 710 823 451 799 622 -444 340 1075 102 -12 679 -80 -255 21 -121 -451 -210 -4 -792 -672
6116 -672 -208 -631 -1025 -256 -542 -1036 -566 -516 -1059 -405 -3 -1053 -936 -206 -669 -600 144 -99 -301 235
6136 235 2 -377 165 690 -104 3 819 315 504 736 558 -12 1205 905 537 814 1031 400 447 897
6156 897 496 -39 859 310 78 368 504 246 398 488 -406 -55 267 -578 -642 241 -354 -645 -580 45 -788
6177 -788 -515 -122 -949 -691 4 -583 -932 -260 -335 -1082 -177 80 -467 -195 153 -340 -264 689 -66 -254 863
6198 863 719 370 583 648 270 538 951 308 132 858 758 326 830 719 144 591 570 182 -122 584 233
6219 233 -101 353 8 -162 -85 -5 -871 -256 4 -422 -533 78 -733 -922 -366 -452 -1089 -606 -452 -1003 -580
6240e80L12k59j75M90k40L66J61k09J15N31j87o95O12O9l36K60O81m75J45J02
6260F88l26p0N48P1o61K54M57p03J81M59o65P0O38k11p91M27J00n87MO95o80k9
6282a31J58m21J4P20m84p24P24l6m94L20K02l11j52N23m25j36P65m13k19L49M87
6303C16o84K76M18n43L4P19l70j23N51Lo08J68p5K60oL38j39k91J58j42j34N58
6325F84l09m46N36m3l86MO93p32l63O33o1o69K81L33m56K5L22m41k64Q75o88j97
6347f69M08k28l76P20J29q56P02M73q83J29P08n02J10L59Q5n94N28L96l11K26
6367E54K31o17mP77n77n9N48Pm98O66q6q28N60L50m94m31N57k56m12L01O0o84
6389c35L81J05q65M19K47k93l41N87k95l49N68k49m35K33L93o12J79L42m97RQ38
$$ plain form
6240 -580 -268 -527 -702 -212 -452 -86 75 -134 -19 512 325 -370 242 311 -25 235 916 441 586 688
6260 688 362 292 840 911 250 504 961 258 439 898 233 303 941 730 -61 366 466 -121 -117 578 -102 -131
6282 -131 27 -394 -380 340 -144 -868 -144 -180 -674 -354 -152 -463 -615 -92 -517 -653 112 -301 -520 -171 316
6303 316 -368 -92 326 -217 -183 536 166 43 594 597 -11 157 82 342 336 674 535 244 402 260 126 684
6325 684 375 -71 465 422 36 40 733 1 -362 271 210 -459 -178 155 -301 -276 46 -395 -659 216 -472 -669
6347 -669 -261 -489 -865 -145 -16 -872 -170 303 -580 -451 257 -245 -135 224 309 -285 243 639 328 554
6367 554 785 168 164 941 364 305 853 860 362 1028 942 114 674 1024 530 99 656 400 -12 289 349 -335
6389 -335 46 151 -714 -295 -48 -341 -682 -95 -390 -739 -171 -420 -855 -622 -229 -841 -662 -320 -817 -808 30
6410C0o18m9N27J72o35M31N00k63r6N54m57j3P96o15J35M49l25k65K82L93p82
6431A51K17M13J14n05L25J6l99N68k28n94l2L98n43K10M31o22k36M11J90p57n8
6452e30O36o15K11K13n20j94L97l07j9M01rp20N03K35n44P75j49m66J03N76J03
6473H0o36O70J41m98L11M64m47J85O49p55n4N81j74m13O32K00q80R73k70q27L69
6494C01O96q13j63N09o13l6J67P8o47P30J54n30l52K66k92J21K22l28j53j76J7
6515h42J41j4L12k81q1L69j34j50M09J17j80J14J45n09M07M30m07K92J25j67j12
6536a6M38j53j67Q51j79o64K26L86k26O5J90k03j21K47j46o46Q48k23n36K68K53
6557D92p34K38N51n25l23O83k64n80K90k0m03pN83p81J30N32m10m65P95j77m03
$$ plain form
6410 30 -588 -637 -110 62 -573 -142 358 95 -1 553 96 83 879 264 399 848 523 258 540 933 151
6431 151 368 781 895 390 715 731 332 900 672 78 46 444 -99 111 542 -80 -316 95 285 -472 -530
6452 -530 106 -509 -298 -85 -605 -799 -402 -709 -728 -327 -336 -1056 -553 -318 -862 -87 -236 -702 -599 -23 80
6473 80 -556 114 255 -243 68 532 85 270 919 164 110 691 517 104 736 936 56 1029 759 -68 301
6494 301 997 184 21 530 -83 -119 48 126 -521 209 363 -167 -519 -253 -545 -424 -202 -530 -683 -859 -842
6515 -842 -701 -715 -403 -684 -765 -396 -530 -680 -271 -154 -334 -220 -75 -584 -177 253 -154 138 263 96 -16
6536 -16 422 269 102 953 774 110 336 722 496 561 751 548 427 674 528 -118 730 507 -29 239 492
6557 492 -242 -4 547 22 -301 382 118 -462 -172 -192 -595 -602 -19 -800 -670 -138 -548 -1013 -218 -395 -798
6578g98L53L73l91R7L19m93j66O49j01l43N27J80l39M04k40k45L72M16m73j28
6598b7R11o61j54M95J93o78M52j63j02k21N43k72l71O56m22j07J84m3k92L27k13
6619C5k39J11L40n11J80K24m43J51J46J12m86K95L02m50J45N9k49K2K97o9o95
6640g23M74L26n72K61P31q00J67M04k81j84M54k67l59O12M5n48L14J70k28RL60
6661C65m64j06N52j87o19M17J09l63M3K72j36k71K39k60j59M01K10p17L13O12
6681B51p74J15N8J22j68M90l52j58M02N0l39J80R3l14L10L57l55k25P80m07j25
6702iL12j28l08N87K09n77L14K87k93j43M59k67m46L06K35m54M77j39n33J33O41
6723F63p74p2N61m78l18N50p4n88K48K69m12K02k7j8m64N68o4l91P3J30j58P3
$$ plain form
6578 -798 -445 -72 -463 -366 -47 -540 -706 -57 -158 -501 26 206 -133 271 31 -214 158 574 101 -27
6598 -27 884 223 69 564 757 79 531 368 266 45 588 316 -55 601 179 72 256 213 -79 248 35
6619 35 -204 -93 247 -264 -84 140 -303 -152 -6 106 -380 -85 217 -233 -88 -29 -278 -256 41 -28 -723
6640 -723 -249 77 -495 -234 497 -303 -136 268 -13 -197 257 -10 -369 243 288 -260 54 224 -4 5 365
6661 365 -99 -205 347 160 -459 -42 67 -296 -253 19 -117 -388 -149 -409 -568 -167 43 -674 -361 251
6681 251 -523 -408 -350 -228 -396 94 -258 -416 -14 36 -303 -123 -30 -344 -34 323 -32 -257 523 116 -9
6702 -9 303 175 -133 454 663 86 400 687 394 251 710 443 -3 303 538 84 561 422 -111 22 663
6723 663 -111 -183 378 -100 -418 132 58 -530 -282 -13 -425 -223 -250 -268 -732 -164 -228 -619 -546 -416 -574 -501
6745e01M24n09K43J41l16K5J95K97rr9J38l04K95K19k52R1M79l10m0N8K37P3r8
6768D77J07m51L5M14q5j92K86k49j93J58k9k82J93K81o01J33J57n30K66P7m16
6789d44j26N92r2l41MO9o1k9K89j72j8K83k01l95L30L29m74K07N66q65L07L17
6811G5l1L7J22k23k32O44k7j26j73K62J18j38K31k76j35M58J53o83N40P2l33N5
6833C90K09k60k69J90k70m0N22k96n77J51K34n60K14K03j49m13N67k9n57P66j66
6854a40o37L23K95k57j11L75r7k40O45n81M25J09J22m35L02J57m08M55K72l03
6874B71l78R46l44l93O05m18N7L81l05j85K98J22m89l0K83M1k32M01k28j78J6
6895B41O5n13o3M60o17n6L57k13n46P37k53l84M16Q1l21RP0M0J07K65j77j26R6
$$ plain form
6745 -501 -77 -586 -343 -202 -518 -493 -298 -1 -10 -109 29 -275 20 239 -13 78 557 247 207 265 502 575 477
6768 477 584 133 168 582 497 305 591 342 149 307 278 -4 189 470 -131 2 159 -371 -105 -28 -444
6789 -444 -570 22 -70 -411 -407 -338 -399 -428 -139 -311 -329 -46 -247 -642 -312 17 -457 -250 316 -549 -242 75
6811 75 44 81 203 -20 -252 392 365 239 66 328 446 308 539 263 128 586 739 56 596 668 335 390
6833 390 599 339 70 260 -10 -50 472 176 -401 -250 -16 -576 -362 -159 -308 -721 -154 -183 -740 26 -140
6854 -140 -777 -454 -159 -416 -527 -152 -249 -489 156 -425 0 109 231 -204 98 255 -153 302 574 271
6874 271 -107 839 495 102 707 289 346 727 422 237 535 657 168 138 421 462 230 631 403 225 241
6895 241 306 -207 -270 190 -427 -483 -126 -339 -885 -148 -401 -785 -369 -288 -609 -600 -530 -490 -383 -118 -295 -421 -325
6918c25N35o42J65M12l47JK55K6l05N25k84K76N8L29n48K33M96l63j97M97k65
6939E32j21N35k29m09J28J57j80K4K93j63k35J06j49l17J45r7m72N57K2n19J36
6960b56J15j67k91L52Nn88K67K74m98M95K64p64k8O36k89K40M89m15j39K63K38
6981B03m74O12k03l32M0O13l78K93J51J59l32M02j14l41L97R7o22L27L29m89q8
7002B50K43M6n6q2O1n70O3P48n85k73J09j32k81L17K56o28N13r6l44J43K38p80
7024h40N11O1m87K78J18K20m20N44j69n73Q93k58J55m91K02J88K1L59k44j16L58
7045C10J05m25J22N41j71k83P76m21k08j25P0M3J19J73o31L88l5l76J05K51j02
7066B26l99K08J88n26J49Q0l84K02M68m68k22K67P6m72N28k05k31j57P32l35p2
$$ plain form
6918 -325 210 -432 -267 145 -202 -201 54 80 -225 300 16 292 350 679 131 364 860 497 300 797 532
6939 532 411 946 717 308 436 593 413 437 730 567 332 438 289 -28 117 20 -452 105 127 -392 -256
6960 -256 -141 -308 -599 -247 -242 -830 -563 -289 -787 -292 -28 -792 -820 -184 -473 -233 256 -159 -298 -35 203
6981 203 -271 341 138 -194 -154 459 81 374 525 684 352 754 640 299 696 793 171 498 827 338 250
7002 250 493 539 483 401 462 -108 -45 703 118 -155 -46 -178 -459 -142 114 -514 -1 -97 -441 -298 -60 -840
7024 -840 -329 -268 -755 -477 -359 -139 -559 -15 -184 -757 136 -122 33 -458 -256 -68 -47 312 68 -48 310
7045 310 415 -10 112 653 482 199 975 554 346 221 291 334 453 626 -5 383 348 -28 77 328 226
7066 226 -173 35 223 -303 -154 -74 -458 -256 212 -256 -478 -211 -135 -607 -79 -284 -515 -672 60 -275 -347
7087c47L24k95K4K24j24k34K34m2j63K42M12k11o4L66o7l01L82j67k09L40K98
7108F22l84PM10n33J49K18j60k40L9L26m49L89l36j92O1n2l51L08J46j07n83O21
7130i1q0l45K10J27j71K18K22m05r1K63m8l28J51L6k5M06J38m98j05M64m41J6
7152c77M64J75n64K99J53k80M13O0J84P3j85k64R2K39k76j24P4J61o2L1j52m5
7174H9l04M82l50K06K93n72k43O67l64q02P51J31o30J74K15J15k32K5n5J79j28
7195c53j34M7N1M72n16Q2K25Qj68K20K34m16N60j97L2l29P29k4j14L60q1J20l0
7218G78k6l11n3L30o05J70M05l15j03L24n86j18L41K0o05R4L88l93K27l28k68
7239f34k3N64j16n21M59j23k88j21J58l00RL97m73k0O05L5k75K01P8j49M13j56
$$ plain form
7087 -347 -23 -318 -294 -70 -194 -428 -194 -236 -399 -157 255 44 -20 346 279 -22 360 193 -16 324 622
7108 622 238 245 655 122 271 489 329 89 128 454 5 394 58 -134 -73 -125 -476 -168 -22 -129 -712 -91
7130 -91 -171 -516 -306 -179 -350 -132 90 -315 -406 -143 -191 -519 -368 -332 -357 49 187 -311 -416 48 -393 -377
7152 -377 87 262 -302 -3 150 -130 283 343 527 600 415 151 243 482 206 82 156 317 255 286 134 89
7174 89 -215 267 -83 123 416 -156 -399 268 -96 -898 -147 -16 -646 -472 -257 -142 -374 -349 -404 -225 -353
7195 -353 -487 -440 -389 83 -433 -351 -126 -118 -286 -66 168 -248 312 115 147 -182 547 523 409 769 688 808 778
7218 778 752 441 388 718 113 283 688 373 270 594 8 -110 231 251 -354 -260 128 -265 -38 -366 -634
7239 -634 -657 -93 -209 -730 -271 -394 -682 -803 -645 -945 -936 -539 -1012 -1032 -427 -392 -667 -466 -388 -537 -124 -280
7261b80K55n37P82l67L20L33K4m56M50j29K0K48m2K03l7J02k75k54M23J73k97
7282F59j59R8k61J24R5l5k88K06k89O2O9m11l81L24m8J56j41%j35k30J91O7q7
7305d14Q2O0p62O23K62m22k65O98m81q5O26m25O8J46M73m98M00K2J41k45M10n3
7327C61k8J8k95J16K96J08k37M0L38k98j61K92k28j48LL65o19J58J26m51R5N04
7349C55n23O1L49k49m08K51r3j04p4l0r2K56nk36j95M14K06o50Q75j71l09m8L22
7372i8r8q0P18n05j95M99k8j62p0M59m46N17R3l32J37N18l61l72Q09o15k07N20
7394G01j2m73J29j7nl85N10o31M64j56J53m76M86l62M5m1L26o73K7J74k40J40
7416c16j68L52q12O85J3m22M31J10j16j19K30k19L1N09j46m01J53N83n76K82L41
$$ plain form
7261 -280 -25 -562 220 -147 173 506 530 74 524 395 415 663 621 824 787 889 614 360 783 956 659
7282 659 500 598 337 461 556 521 233 439 150 212 281 -130 -511 -187 -235 -79 -220 -220 -355 -585 -394 -327 -414
7305 -414 -332 -272 -1034 -411 -149 -571 -836 -138 -619 -704 -78 -503 -435 -289 184 -314 86 108 249 4 414 361
7327 361 333 351 56 172 468 576 339 379 717 419 258 550 322 174 177 542 -77 81 207 -244 -149 355
7349 355 -168 -107 242 -7 -415 -164 -257 -361 -435 -465 -557 -301 -306 -542 -737 -323 -117 -767 108 -63 -372 -420 -98
7372 -98 -196 -276 442 -63 -258 241 213 51 -19 440 -6 511 604 272 409 927 566 194 1003 388 181 701
7394 701 689 216 345 328 323 -62 448 -183 281 125 278 -198 288 -74 -29 -70 256 -417 -390 -216 -456 -316
7416 -316 -484 -132 -944 -259 -246 -668 -237 -127 -243 -362 -132 -351 -320 189 43 -358 -205 378 -198 84 425
7437D25k68n9L74m09J72j39L16k44M19N0k45k69K58j56M9K60j11j99K01j06n25
7458b06M02o1j5pJ7k03k08M86l43rO3J20n05L66J07l77J69n9k26K67N6J73n59
7481e52N08J5m08M14J3l13L42j7p0O3L01Q0k63P4Q1l6j49M25n20K13p5M9K76J29
7505E80M4m07L75J41n10J62j45m7k4L3p9m6K66n4p03M00K19n33K42J56m75K40
7527a65J81j55l49J92K41l80M04j76n6n8K85k76L95r3K2l31L46J80k02P3mj12
7549c8L25l59K01p3K28j40j24M13P7l97M42K2k93q7N62m83M4N54o81k19L46O1
7571C81k55q1O54p85J12K36j85j70L75o25k81N66N7k03k81M33l52J52K69l13k49
7592e45Q39l09j43Q1J21m43L40J75l20K47M60l17l10N73j84m15N17k12K22K28
$$ plain form
7437 425 157 98 472 63 235 96 412 168 587 637 392 123 381 225 274 534 423 224 425 319 -206
7458 -206 196 135 120 113 130 -73 -281 205 -138 -147 -84 36 -469 -103 4 -373 -204 -263 -489 -222 -166 7 -552
7481 -552 -44 -29 -437 -23 -10 -323 19 2 -68 -5 296 376 113 187 268 232 83 508 -12 201 126 175 451 580
7505 580 624 217 592 733 223 385 240 193 169 202 123 77 343 289 -414 -14 205 -328 -86 70 -405 -165
7527 -165 16 -139 -488 -296 -55 -435 -31 -207 -263 -321 -36 -312 83 -10 12 -319 27 207 5 78 74 -38
7549 -38 287 -72 129 56 284 144 20 433 510 113 555 577 284 197 759 276 320 874 193 -26 320 381
7571 381 126 45 699 -86 26 262 77 -93 282 -343 -624 -58 -1 -204 -485 -52 -404 -252 17 -296 -545
7592 -545 294 -15 -158 -77 44 -399 -59 116 -204 43 503 186 -124 449 265 -150 367 155 377 605
7612F05R7j90j88J68j89L2K60j36l29j22M79l57L98mm82j27K42J22m26K42K0l80
7634b65J03K18j87j93L14r6k81L44m4k69M31p6m43N14k99l9J88J17k24J90j85
7655a82n0J07L53L49o88M56j21j26KM61l48L37j07J61o35O70j64j93nO1k12L38
7677D64L33o14J29K59m52j08L14K25o40j23N74l59j0j00k49n7L55Qm74J47L04
7698g4m17J86j5K3O4j3j42J62J65n4L9K21k72k7K31J68j56O8K24k36m43N07P4
7721B83k21M39r4m41M57J49l13j6J49R3J69k05l16J61M9K46j62m32K22q3R1J30
7743C55j88j49k41J57p4o9m9j03k27K59j47j81M07lk06J94j86m59M04M35k76J52
7765a95J10k00p4M09m2k67J73K02j26J28J01k31K38J40k03J33K24l56Q0O3K46
$$ plain form
7612 605 702 512 324 492 303 335 595 459 130 8 487 130 528 524 42 -85 157 279 -147 95 115 -265
7634 -265 -162 56 -131 -324 -10 -106 -387 -43 -87 -356 75 -1 -444 70 -229 -268 -80 37 -187 3 -182
7655 -182 -232 -125 228 577 -111 345 224 98 100 561 213 550 443 604 -31 639 475 282 277 338 126 464
7677 464 797 183 312 571 119 11 325 550 -90 -213 361 2 -8 -108 -357 -414 -59 -51 -525 -378 -74
7698 -74 -491 -305 -320 -297 -233 -246 -388 -226 -61 -115 -76 145 -127 -154 77 245 89 157 381 145 -298 209 283
7721 283 62 501 407 -34 423 572 259 243 392 485 654 449 133 294 343 589 427 -5 217 134 225 355
7743 355 167 18 -223 -66 -140 -209 -258 -361 -588 -329 -476 -657 -250 -253 -459 -265 -451 -910 -506 -71 -347 -195
7765 -195 -85 -285 -359 50 8 -259 -86 116 -10 118 219 -12 226 366 163 296 520 164 244 307 553
7786E53m16J79J0J87j27J7K18l18l50K12K50k39J53n26J94L9j86K4J12k13j94
7807d21N67k43m17K07J83m03J36J52J77m96K87l32j9J82N1k3L20Rj36N2K80l87
7829b74j16N90j37k09K20K16j53P6K02l88J42L5n7j23O50k81j12j7J52k54J49
7850C11L3k40NK97l20J65P6j22j56J43j89p7j97J47l35J07K73j93l0J07L15o19
7872d99L26J59n49J55L67l06K23j6M2m61K78Q7l24N30J23k44NJ47n6j89L22N1
7894A71l54K10M85q51M15M82n65J61K32l37K14M0k05J0M26j98k30J78l3l74K25
7915A02K52l81nj75L07k04j9J68m83K13P1Qk31L53r9k58M24p4k16q0p7K54J06
7938d4j09K57n53M04q1P0j02O50m82J54J96m51k82J179o63R9O3n1j99O72m23m07
$$ plain form
7786 553 137 316 326 513 386 403 621 303 -47 165 415 176 329 -197 -3 36 -150 -126 -14 -227 -421
7807 -421 146 -97 -514 -307 -124 -527 -391 -239 -62 -558 -271 -603 -622 -440 -389 -412 -92 -83 -219 -167 113 -274
7829 -274 -390 200 63 -146 74 290 137 213 415 27 169 204 147 24 674 393 281 264 416 162 311
7850 311 344 104 109 406 86 251 327 205 49 192 3 -74 -271 -124 -459 -352 -79 -272 -302 -195 120 -499
7872 -499 -173 -14 -563 -408 -41 -347 -124 -140 -98 -559 -281 -194 -518 12 135 -109 -104 43 -13 -202 120 171
7894 171 -183 27 512 -339 76 558 -7 154 386 49 263 303 98 108 534 336 106 284 251 -123 102
7915 102 354 -27 -32 -207 100 -104 -123 45 -438 -225 -154 -146 -377 -24 -123 -381 43 -31 -247 -327 -404 -150 -44
7938 -44 -153 104 -449 -45 -126 -56 -158 492 10 164 360 -91 -373 806 143 242 305 254 55 727 304 -103
7960a03L12Q2J15l53K87l00J08J08L34q27L98M0n06L18Q7k11J07k11K47j17O1
7981b4l60J01M5J66k27P2J19l2K11j41p2j59O13m67J57l02O01j49j01L70l52k2
8003D7J70N1j51J09Oj89L14j50L7K62j40j6l10K87k80k02j2K99J24j23J16o38
8025c89L88j0k01O7J07j61p5M53k73k82L4Q3j93K0K15j51J82J97k49j10M67j98
8047g9k60J19J13k31L00n3m1K02J57j35p5q3M01k13k21O26l88K63K7j57J9J33
8069D24P4j71K10q3l97M5K63m00k34M34j92m0J05j62K18k25j2K7j62K03k38J7
8091b96L12k43k8lP7l30K96l1k47K37J07j80J82P8J12l03L89J8m24P66l17m34
8113b62J52K06Ll0L92n2j38J06j80m5O1m8m3J63L7P2k08K56j14j11KJ43k17J78
$$ plain form
7960 -103 209 291 406 53 340 40 148 256 590 -237 161 201 -305 13 100 -111 -4 -215 32 -85 -24
7981 -24 -384 -283 -238 -72 -299 -227 -108 -140 71 -70 -142 -301 312 -155 2 -300 301 152 51 421 69 47
8003 47 217 268 117 226 232 43 357 207 244 506 366 350 40 327 47 -155 -167 132 256 133 249 -389
8025 -389 -1 -11 -212 -145 -38 -199 -274 179 -94 -376 -342 -259 -452 -432 -217 -368 -186 11 -238 -348 119 -79
8047 -79 -339 -220 -107 -338 -38 -91 -132 70 227 92 17 -66 335 122 -99 527 139 402 429 272 291 424
8069 424 498 327 537 454 57 102 365 -35 -269 165 -27 -67 38 -124 94 -131 -143 -116 -278 -75 -313 -296
8091 -296 16 -227 -255 -258 -181 -511 -215 -246 -493 -256 -149 -329 -147 -69 43 -260 129 147 -277 489 172 -262
8113 -262 -110 96 99 69 461 409 271 377 197 152 213 165 122 285 322 394 186 442 328 217 219 362 145 323
8137C23N1k96k9o1kj32O3O5r7N4k07j88K05J88m26K44l0p4M5N49k11l04L26j27
8161g1m5O4N67k10k09K05m24J55k9K40N7l12N27o48L88L69n23K59L05j51j91K57
8183E80j95l24K72M49p57J92J64m09
$$ plain form
8137 323 374 78 49 -12 -14 -146 -83 -18 -115 -61 -268 -456 -251 -63 -489 -245 -275 -349 -304 245 34 -270 56 -71
8161 -71 -116 -52 515 305 96 301 -123 32 3 243 300 -12 515 -133 255 624 101 360 665 514 323 580
8183 580 385 61 333 782 25 217 381 -28
8191b8
$$ Imaginary data points
##PAGE= N=2
##DATA TABLE= (X++(I..I)), XYDATA
0@%%%%%%qJ6j6J6k4L2m0M8n6O9q4J01j18J36j60J87k14K47k87L31l77M27m84N49
30B91o17O93p75Q66r69J081j203J336j481J641j819K015k231K471k738L037l374
47a776L756m195M708n310O031o916Q028r476J1454j4329J8912k7399M8350j91816
61a59978l90787J85995K38288P3159j14306r2437l5883J8193m2135k4005R6471
72b47425J33042l9753j28611m8188O2579R4340P3267k613m215L1494k7656q8565
84a92304M6540J67998P0522o2434m0198L4655N8778N734o7802k5489J02470P4893
96A73363o6878o1200M9561N3855k0526o0230l5072N4762Q8356m4961j45311l2380
108d6661R4366N2315k1103k8889k5267k8699n3797o7273L0781J38646M5733j13215
$$ plain form
0 0 0 0 0 0 0 0 -8 8 -8 8 -16 16 -24 24 -32 37 -47 54 -64 72 -88 99 -115 132 -155 176 -201 226 -258 291
30 291 -326 367 -408 458 -511 570 -633 703 -778 863 -956 1059 -1172 1299 -1439 1598 -1776
47 -1776 1980 -2215 2493 -2817 3214 -3702 4326 -5150 6304 -8025 10887 -16512 31838 -159978
61 -159978 -550765 -364770 -126482 -53323 -167629 -260066 -295949 -277756 -319891 -343896 -247425
72 -247425 -114383 -154136 -282747 -330935 -268356 -174016 -100749 -103362 -107577 -76083 -103739 -192304
84 -192304 -145764 22234 92756 30322 -9876 24779 83557 89291 21489 -4000 98470 173363
96 173363 106485 45285 94846 148701 128175 67945 32873 87635 175991 131030 -14281 -46661
108 -46661 47705 100020 78917 50028 24761 -3938 -57735 -125008 -94227 44419 90152 -23063
120b3063r0281J4675K3839q89M718J4664L3411L581r1186p1994Q6649J33934J0615
133D8673p5452n7084n903L5870K2404q337N0867R1941k6157j21137k6193Q1559
145A1051N5144p288l4205j5447L9714L1973m8856l3250O2730M3026n2622n7339
157e369l623K7460L0543j6302n4143J1225N9969k5852q4789j6057L2025L445j7422
170e8890j2816J0142L8667j1951q9543l6387O3682L5786l3012j8973M762L147
182a05386O973r014r142N0113M7988n3757p6096J6498O3989M0225J2853j2010
194b6766o622J8905j6112m7446L1854R0169J2443n3676j7541J9312K7241K2946
206E4707j2957k1850K4657J4946m8249k2984N1115M2503o188k5660k9683J874
$$ plain form
120 -23063 -113344 -98669 -74830 -75719 -71001 -56337 -22926 -19345 -110531 -182525 -95876 38058 48673
133 48673 -26779 -83863 -89766 -53896 -31492 -39829 11038 102979 76822 -44315 -70508 11051
145 11051 66195 58907 24702 9255 48969 80942 32086 -1164 61566 104592 51970 -5369
157 -5369 -8992 18468 49011 32709 -21434 -10209 49760 23908 -60881 -76938 -44913 -41468 -58890
170 -58890 -71706 -61564 -22897 -34848 -124391 -160778 -97096 -61310 -94322 -113295 -108533 -105386
182 -105386 -98413 -107427 -116569 -66456 -18468 -72225 -148321 -131823 -67834 -27609 -14756 -26766
194 -26766 -33388 -14483 -30595 -78041 -46187 43982 56425 2749 -14792 4520 31761 54707
206 54707 41750 19900 44557 59503 11254 -11730 39385 81888 75700 50040 20357 22231
218B2231L1304j8246n0850K2238O0228j0906m4939l082J3725L285j0758l4639
230b0409q602M6832J3250n1425j9745L2292J1347j1577j1273j8354J95J4699k8217
243e0987l0146N0251N7630k6462n2125j5265N742J6278J1234j1148J0193L6698
255A893j7390n4565Q226N0483J3492j4145j6982k0396R984K8772p960o240M2783
268A7955J5030m9529l4796J3068K4254K3691J593k4256N734K9026k2633l7527
280c8390K4348L5888j3591k3912q342L356K6572J4630l2032j1245L5736L499m1398
293b4881j3057J6953J3546J4625l205j6889J7105J9579m1749m0130L1290L9603
305A2790j480q156p353o223J1296r59k2299J6253M0252j8894m7808m76K5400J9386
$$ plain form
218 22231 53535 35289 -15561 6677 66905 55999 11060 7978 21703 24988 14230 -20409
230 -20409 -29011 17821 31071 -20354 -40099 -7807 3540 -8037 -19310 -37664 -37469 -22770 -50987
243 -50987 -81133 -30882 26748 286 -51839 -67104 -61362 -45084 -33850 -44998 -34805 1893
255 1893 -15497 -70062 -61836 -11353 2139 -12006 -28988 -49384 -39400 -10628 -18588 -24828 17955
268 17955 32985 -16544 -51340 -38272 -14018 9673 11266 -12990 -7256 21770 -863 -38390
280 -38390 -14042 21846 8255 -15657 -23999 -20643 5929 20559 -11473 -22718 13018 16517 -24881
293 -24881 -37938 -20985 -7439 7186 3981 -12908 4197 23776 -17973 -58103 -26813 12790
305 12790 11310 3154 -4199 -10422 874 -85 -22384 -6131 34121 15227 -32581 -33057 -7657 11729
319A1729J7993q708k6788J338R91l4764j802N5790K7702k5563k7840j5957L185
332b2694K5828N72k3234J2989K1738k9079k8522K3513K8430M969o333k6581k0351
345c8755K1348J2958k2312N957L5393O79k4644r512k777O636J3668j2679j4681
358b8721L2667K5595l1119k3609J9602J3104k962k440r097K770K1098j0536k8960
371b2608K2424M3373n112k9591j6069q663J2390K4091l874l804K7955r66m8229
384h683j7258K9232K0029K239q490k0733j225J8307q960j3271K8294J6043l4360
397A164k9403J928J1764K2432J4202k1296j3302J8176p931l3283N217K9170N471
410D309q132j0244q136J8164J8329k7377k2139K6828J7679k0034p813J0645O383
$$ plain form
319 11729 29722 21014 -5774 -4436 -3445 -38209 -40011 15779 43481 17918 -9922 -25879 -22694
332 -22694 3134 3706 -19528 -6539 15199 -13880 -42402 -18889 9541 14510 8177 -18404 -38755
345 -38755 -17407 -4449 -26761 -20804 14589 15268 -9376 -18888 -21665 -15029 -1361 -14040 -28721
358 -28721 3946 29541 -1578 -25187 -5585 7519 4557 2117 -6980 -4210 16888 6352 -22608
371 -22608 -184 43189 38077 8486 -7583 -16246 -3856 20235 16361 12557 40512 39546 -8683
384 -8683 -25941 3291 23320 25559 17069 -3664 -4889 13418 4458 -8813 19481 35524 1164
397 1164 -28239 -26311 -14547 7885 22087 791 -12511 5665 -2266 -35549 -30332 -1162 4309
410 4309 -3823 -14067 -22203 -4039 14290 -13087 -35226 -8398 9281 -10753 -18566 -7921 -1538
423a538R845P72j7274O673K4900j5520l2430J1507K9763R811K068q474j2691R398
437A6810L257k7354P59M5413J2443l1715j5840N783J0023J4096l337j7283P873
450B0928J0470k9602j9055L2401L0884l941j9131k4602j0759K0762P699k3983
462g929N698L4716o568l6333q634J4077J4715M903k2117k1204K1295J8692k4084
475a2773j1143K7407J1831j4860j5570j2946M242K5524l38k3704J4334L1709j2604
488A1109k9853k614J1029J1252N054j4722p79L0914L248l9553n838L5095J2880
501B7222j5519j5558p771J3381K2790r608j6977K4364K0808l0299l1236N539K2149
514I285K0835K359k3543m761K4206q333l4241R390L7054Q40k5890j6147K469K4610
$$ plain form
423 -1538 8307 9079 -8195 -1522 23378 7858 -24572 -13065 16698 26509 28577 20103 7412 16810
437 16810 20067 -7287 -6528 38885 51328 19613 3773 9556 19579 33675 30338 13055 20928
450 20928 31398 1796 -17259 15142 46026 42085 22954 -1648 -12407 8355 16054 -7929
462 -7929 -2231 32485 25917 -10416 -19050 -4973 9742 14645 -7472 -28676 -7381 11311 -12773
475 -12773 -23916 3491 15322 462 -15108 -28054 -23812 1712 1374 -22330 -7996 23713 11109
488 11109 -18744 -21358 -10329 923 5977 -8745 -9524 21390 24638 -14915 -20753 14342 27222
501 27222 11703 -3855 -11626 1755 24545 14937 -2040 22324 43132 12833 -18403 -12864 9285
514 9285 30120 32479 8936 4175 28381 20048 -14193 -4803 32251 33091 7201 -8946 -6477 18133
528A8133J7548k2703j7249K2298N475l4548j4662K3535K4362P460j7682k9259
540a7292O756K9363j5706l4548J3818L2472m899k2687j0432Q807K2759P72l3968
553b4785r058L2313N161k9719m767K3234J5821J479j7758k0761J4057K1541j9967
566a3209j8603K9975K8982j2240k2302p967J2253K3170m335k7575Q050L3983o369
579B3813l0073O436K8610J0755r088k5333j4493K3980K0767k0361q943K8738J0818
592D5626k4950k2048j009J8085J9170j5252k9331J4460K8419j6675k8241R510
604b236J8880j610j7844k1997J840L1472P445l1620n550K7329J596k6520j5409
617c4224N438K1062J4996j9127k0465K3054K2329k4501k2030J5785K0052Q00j1253
$$ plain form
528 18133 35681 12978 -4271 18027 23502 -11046 -25708 -2173 22189 29649 11967 -17292
540 -17292 -10536 18827 3121 -31427 -17609 14863 9964 -12723 -23155 -14348 8411 9183 -24785
553 -24785 -33843 -1530 3631 -26088 -30855 -7621 8200 9679 -8079 -28840 -14783 6758 -13209
566 -13209 -31812 -1837 27145 14905 -7397 -15364 -3111 20059 15724 -11851 -3801 30182 23813
579 23813 -6260 176 28786 39541 30453 5120 -9373 14607 35374 15013 6070 34808 45626
592 45626 20676 -1372 -2381 15704 34874 19622 -9709 4751 33170 16495 -11746 -2236
604 -2236 16644 15034 -2810 -24807 -22967 8505 15950 -15670 -21220 6109 7705 -18815 -34224
617 -34224 -28786 -7724 7272 -11855 -32320 -9266 13063 -11438 -33468 -17683 2369 3169 -8084
630h084j3386J0629K9557k174k6835P430K6316p522k4019k006J5903K3714Q967
643C8490k4135j5350K3404J0906k6670j0956K2131J5119l569j5826j3918J4521
655A4147K4671j4843l0220R787K0036j2232j6875L612J3189J4026m681k8796r135
668a7314K4020K036k4404q05K0414N778r703j5552q720J6232J4771k3423k0022
681c6692K2354J9033j6114j5419N285J3436J0089j1181k6320L509K7103k261k0156
694b7334Q223K0600K264r655j3796l495K1759J4300j9808r152K5116J1462j6026
707D458o716Q667J1210P800j2297j7426J5116K5508q637j6187J2884J3057p238
720C0199j2317j0963L250K2523M349k5690m342K2867M77k2272q758O330Q436K605
$$ plain form
630 -8084 -21470 -10841 18716 16542 -10293 -2863 23453 15931 -8088 -10094 5809 29523 38490
643 38490 14355 -995 22409 33315 6645 -4311 17820 32939 29370 13544 -374 14147
655 14147 38818 23975 -6245 3542 23578 11346 -5529 -1917 11272 25298 20617 -8179 -17314
668 -17314 6706 8742 -15662 -16467 3947 9725 22 -15530 -24250 -8018 6753 -16670 -36692
681 -36692 -14338 4695 -11419 -26838 -21553 -8117 1972 -9209 -35529 -32020 -4917 -7178 -27334
694 -27334 -19111 1489 3753 -5902 -19698 -23193 -1434 12866 -6942 -16094 9022 20484 4458
707 4458 -2258 6409 17619 25419 13122 -4304 10812 36320 27683 11496 24380 37437 30199
720 30199 17882 6919 10169 32692 37041 11351 7009 29876 30353 8081 -677 5653 14089 16694
734A6694j7464j4812J7378J5266k0998j7430J0331O404r725j0669q599N663J9666
747h295m009k4096J376J7478q471j8277J605J0897Q337L0j6097n705K1398P633
761a6196k0920m791J8932O036p705l971K383J5651J7951j1192k0034J1666K0007
774G817p927r846R597J3206Q777k446j4302J953K3056J523j9942J653J7820J412
788C2351p133k809k23R951O050j8704j5125J6488J1123j5138p969Q576N099k969
802A9568j0306j5650M026J4957j1133k0394P659J4903o766j1374n603j25J0018
815a0220J632j9311o494J9562N152j5834j969R534K741k545r056q170J2651J6579
829e748j0391j0437J4386R100j0177n590L061N070R904q39j4987M234K0802k302
$$ plain form
734 16694 -770 -15582 1796 17062 -3936 -21366 -11035 -4631 -14356 -25025 -33624 -27961 -8295
747 -8295 -12304 -36400 -35024 -17546 -26017 -44294 -42689 -31792 -23455 -23425 -39522 -45227 -23829 -16196
761 -16196 -37116 -41907 -22975 -16939 -24644 -28615 -26232 -10581 7370 -3822 -23856 -12190 7817
774 7817 -110 -9956 -359 12847 21624 19178 4876 6829 29885 31408 11466 13119 30939 32351
788 32351 25218 22409 22186 32137 38187 19483 4358 20846 31969 16831 8862 17438 22537 19568
802 19568 9262 -6388 -2362 12595 1462 -18932 -11273 3630 -3136 -14510 -20113 -20238 -10220
815 -10220 -8588 -27899 -34393 -14831 -9679 -25513 -27482 -17948 -15207 -17752 -26808 -34978 -22327 -5748
829 -5748 -16139 -26576 -12190 -3090 -13267 -18857 -15796 -10726 -822 -1661 -16648 -12414 8388 6086
843F086j4585L749J0580p8m339o616Q2J8171R051j8177q475J5455L858j2254l499
858i91L615N433O319o624j3298Q070J4717j0321j3675N851P159k828m061n315
872e949J742J3398j328j9677o41J5877k577j2551J918O194N031K721r524r084
886a4450J3009Q340j4520p666J2585P167l318l572m302L713J1857n198j6065P020
900e400J4601o621r749N137O432K495j977j2421m063J4907L415j5912k18J4969
914E595O36q232n600j914P343R065j0528j3021J2042J2070r765p161O054M502
928A086J284m262j0400L066J7572j016j5544M071J2875k753p820j720J237Q173
942E849M473j1723n199J5917O272j4659n659P619L871J29n916q311P567J4422
$$ plain form
843 6086 -8499 -4750 5830 5752 1413 -5203 -5121 13050 22101 3924 -4551 10904 14762 2508 -991
858 -991 2624 8057 14376 7752 -5546 2524 17241 6920 -6755 -904 6255 3427 -634 -5949
872 -5949 -4207 9191 7863 -11814 -12455 3422 845 -11706 -9788 -3594 1437 4158 -5366 -14450
886 -14450 -1441 6899 -7621 -15287 -2702 4465 1147 -2425 -6727 -3014 8843 3645 -12420 -5400
900 -5400 9201 2580 -7169 -2032 4400 6895 4918 -7503 -11566 3341 6756 -9156 -9374 5595
914 5595 6231 -2001 -7601 -9515 -2172 6893 -3635 -16656 -4614 7456 -2309 -9470 -3416 1086
928 1086 2370 -1892 -12292 -9226 8346 7330 -8214 -4143 8732 5979 -1841 -3561 -2324 5849
942 5849 10322 -1401 -6600 9317 15589 930 -4729 2890 6761 6890 974 -7337 230 14652
956A4652q276j5572O956J0183o946q058j544K501R343J187j4312l031J4788r59
970I12j4185l17P987J873p26n028n082J0941R499j3563j1268J2139Q548p717n260
985a1247K439P169R270m923j5268M738J7187l876j3711L507J0502L215j465p344
999A93l537J2979N624j6040o190J4971O400q389m886J922N841O146r820j4049
1013h835Q430J3969q850j1296O743Q257r93n975r091L47J3893N47j7725r61J5979
1028D439K146j0256m515K442P032M290j2541j0347J5207J3122j1248q961Q384
1041h06P095k065o237p191O433J4852m247j6654O152J6455k008j1489l505M038
1055H23Q658J570j3481l994J8180O944j6804p397R782N077m549p418m689R852
$$ plain form
956 14652 6376 -9196 -2240 7943 997 -7061 -8605 -6104 3239 4426 -9886 -12917 1871 912
970 912 -13273 -13590 -5603 -3730 -4456 -9484 -14566 -3625 5874 -7689 -18957 -6818 1730 -5987 -11247
985 -11247 -8808 -1639 7631 2708 -12560 -7822 9365 5489 -8222 -4715 5787 9002 7537 193
999 193 -3344 9635 15259 -781 -6971 8000 14400 6011 1125 3047 8888 15034 5214 -8835
1013 -8835 -405 13564 4714 -6582 161 8418 7425 1450 -7641 -7294 6599 7146 -10579 -11540 4439
1028 4439 6585 -3671 -8186 -5744 1288 5578 -6963 -17310 -2103 11019 -229 -9190 -806
1041 -806 6289 4224 -2013 -9204 -2771 12081 7834 -8820 -2668 13787 11779 290 -3215 823
1055 823 9481 11051 -2430 -6424 11756 18700 1896 -5501 4281 9358 4809 -2609 -7298 2554
1069B554J1790j1126j4495J0422J2469q830j2613p53P246R515k769j5037O55J8017
1083G045J69j8561k730J2952M419n141p974o38J4661R386j5143j2388J3077J0206
1097I340q463p829M445Q881O860o081j3289O599J7128n275j7037L575J2708J939
1111A3501n485o216K852J2765N79j9682n538J7789O614j2553o591N241Q007K745
1125A4028j1116j1892R491J2553j1462j3704P520J2341j754q420p553K894J2231
1138E157l218j7816P49J7712Q64j2793k515P163O995j000j2715o803J5288J1367
1152H435j2281q152J1484Q731m370p797l238P924J2076o344j5757Q588J8182k732
1166A4749j2408k91O646N235k673j1840m21J7782N281j7207o090J2129M836o689
$$ plain form
1069 2554 14344 3218 -11277 -855 11614 2784 -9829 -10582 -3336 6179 3410 -11627 -10972 7045
1083 7045 7214 -11347 -14077 -1125 3294 -1847 -9821 -10459 4202 13588 -1555 -13943 -866 9340
1097 9340 877 -6952 -2507 6374 13234 7153 -6136 463 17591 12316 -4721 -1146 11562 13501
1111 13501 8016 1800 4652 17417 17996 -1686 -7224 10565 17179 4626 -1965 3276 11283 14028
1125 14028 2912 -8980 511 13064 1602 -12102 -4582 7759 6005 -2415 -9968 -7074 5157
1138 5157 1939 -15877 -15128 2584 3448 -9345 -11860 -4697 2298 1298 -11417 -18220 -2932 8435
1152 8435 -3846 -11998 -514 8217 3847 -3950 -7188 736 12812 6468 -9289 -701 17481 14749
1166 14749 2341 2050 8696 13931 11258 -582 -1003 16779 22060 4853 -1237 10892 15728 9039
1180I039p999l042Q175Q437j0610j2039J0223J1865r808j2664P86O274L469m268
1194b162j0742K504J5294k240j6738p56J1708R19o953n829J466J1523N707j3062
1208i361q199J3821Q918j0924q255N641R025L961m900q879P787J4873o045j5170
1222g707L707J1898Q76n371k171L183R773O79j4842l700J5418M348j2720n187
1236a816O512P023O61q271p242Q630R166j2751j2199Q557J0526l036o860l446
1250d546K802Q165l921j3893J112J5057K2j2513j488P875N292j166r487m882J1752
1265A81P117j2351o294J2180P995n422n993j019N437O902n735j1163O608J4296
1279A2739l730j0494J365O054K722l154q628m62J2614K488j4225k858J2534L500
$$ plain form
1180 9039 1040 -2002 6173 14610 4000 -8039 2184 14049 4241 -8423 -7637 -1363 2106 -2162
1194 -2162 -12904 -10400 4894 2654 -14084 -14840 -3132 -2213 -9166 -14995 -13529 -2006 3701 -9361
1208 -9361 -17560 -3739 5179 -5745 -14000 -8359 666 4627 -273 -9152 -1365 13508 7463 -7707
1222 -7707 -4000 7898 8774 3403 1232 4415 14188 14867 25 -3675 11743 16091 3371 -1816
1236 -1816 4696 11719 12380 4109 -3133 5497 14663 1912 -10287 -1730 8796 5760 -1100 -4546
1250 -4546 -1744 6421 2500 -11393 -10281 4776 4798 -7715 -9203 -1328 3964 2798 -6689 -11571 181
1265 181 7298 -5053 -11347 833 8828 3406 -2587 -3606 1831 8733 2998 -8165 -1557 12739
1279 12739 9009 -1485 -120 5934 8656 5502 -3126 -3588 9026 11514 -2711 -5569 6965 10465
1293A0465q149n915l38N246M994p939q060J0198R895r334j0050L176O335J489
1307B013l942p667L297J2344j851j3760K092J2312p15q530l050K954P868K630
1321E995q741m354J2284N461j1571n516O535N835Q13m655n180O140J0851o812
1335G085j2997N736J0930l929p551q29M073O223q57j0750j115J2262l08j2888
1349d915k508Q112L933k282n551l555P302N652j0609r525J0163Q121n848o745
1363h255R86N231N008l668r939L339J1267k982j0360L033Q834K238l876m928m14
1378d486Q385K976j0755k897J2220M388p977l583L060M771K438p101o740P478
1392B177R742p531r793N996P571j798n356n167J672Q172j235j1806O13J1525j86
$$ plain form
1293 10465 2316 -3599 -3937 1309 6303 -1636 -9696 502 10397 1063 -8987 -5811 524 2013
1307 2013 -1929 -9596 -6299 6045 4194 -9566 -7474 4838 4123 -4407 -7457 -4503 3365 5995
1321 5995 -2746 -7100 5184 10645 -926 -6442 93 5928 6741 2086 -3094 3046 13897 7085
1335 7085 -5912 -176 10754 6825 -726 -1555 2518 8741 7884 -2866 -3981 8281 7973 -4915
1349 -4915 -7423 689 4622 2340 -3211 -6766 536 6188 -4421 -13946 -3783 4338 -1510 -8255
1363 -8255 -7269 -2038 2970 -698 -10637 -7298 3969 987 -9373 -6340 2494 4732 856 -4072 -4486
1378 -4486 3899 6875 -3880 -6777 5443 9831 1854 -1729 1331 6102 8540 1439 -5301 2177
1392 2177 11919 4388 -5405 591 8162 6364 1008 -4159 -2487 5685 4450 -7356 -6743 4782 4596
1407D596q935l127K836L491P84p226m109Q990N495r703n930O899M684l396m734
1422i385k544N123P452m258q930N195J0461m246q286J156N907L694n61o150n68
1437e940J0879L090j0514k650Q980L515l405l783j43O411N665p060p735P138Q171
1452A2619p072o494L292M499J403k837o610J597Q562k243j1581L62Q608J29n016
1467g82l743Q89N878J349j0183n169R676N227r824m560M954N080M41n144o049
1482a1960M621Q397n294q848M439Q877j049m881k659K640P241n5r780p53J1755
$$ plain form
1407 4596 -4339 -7466 -4630 -1139 -355 -7581 -11690 -2700 2795 -6908 -12838 -5939 -1255 -4651 -9385
1422 -9385 -11929 -6806 646 -3612 -12542 -7347 3114 -1132 -9418 -8262 -2355 1339 778 -5372 -5940
1437 -5940 4939 8029 -2485 -5135 3845 7360 3955 172 29 6440 12105 5045 -2690 4448 12619
1452 12619 5547 -947 2345 6844 8247 5410 -1200 397 8959 6716 -4865 -4503 4105 4234 -782
1467 -782 -4525 -3636 2242 3591 -6592 -11761 -2085 3142 -6682 -11242 -6288 -1208 -767 -5911 -11960
1482 -11960 -7339 1058 -4236 -13084 -8645 232 -817 -5698 -8357 -5717 1524 1469 -8311 -9064 2691
$$ [...]
8191e32
##END NTUPLES=NMR FID
##END=
