##TITLE=1H_TG-2251-2
 CDCl3, 8 sc, 
 27.8.2019
##JCAMPDX= 6.0         $$ Bruker NMR JCAMP-DX V2.0
##DATA TYPE= NMR FID
##DATA CLASS= NTUPLES
##ORIGIN= UXNMR, Bruker Analytische Messtechnik GmbH
##OWNER= root
$$ XWIN-NMR		Version 3.5
$$ Tue Aug 27 13:46:22 2019 Russian Standard Time (UT+4h)  she@DPX200
##.OBSERVE FREQUENCY= 200.13155
##.OBSERVE NUCLEUS= ^1H
##.DELAY= (6, 6)
##.ACQUISITION MODE= SIMULTANEOUS
##.ACQUISITION SCHEME= undefined
##.AVERAGES= 8
##.DIGITISER RES= 18
##SPECTROMETER/DATA SYSTEM= spect
##.PULSE SEQUENCE= zg30
##.SOLVENT NAME= CDCl3
##.SHIFT REFERENCE= (INTERNAL, CDCl3, 0, 15.7039)
##AUDIT TRAIL= $$ (NUMBER, WHEN, WHO, WHERE, WHAT)
$$ ##TITLE= Audit trail, XWIN-NMR		Version 3.5
$$ ##JCAMPDX= 5.01
$$ ##ORIGIN= Bruker BioSpin GmbH
$$ ##OWNER= she
$$ F:/spectra/data/she/nmr/H-F/1/audita.txt
$$ ##AUDIT TRAIL=  $$ (NUMBER, WHEN, WHO, WHERE, WHAT)
(   1,<2019-08-27 13:45:09.54 +0400>,<she>,<DPX200>,
      <created by zg, POWCHK disabled, PULCHK disabled
       configuration hash MD5:
       00 E9 B6 7A A2 85 ED C7 34 08 36 98 17 FE 4E 26
       data hash MD5: 16K
       0B A1 57 EA E8 27 57 0E 5A A3 32 3F 2D 71 97 16>)
$$ ##END=
$$ 
$$ hash MD5
$$ CF A9 36 08 ED A8 43 0A 3A 7E 04 F7 45 82 FD C4
##$RELAX= 
##$RELAX= 
##$RELAX= 
##$RELAX= 
##$RELAX= 
##$RELAX= 
$$ Bruker specific parameters
$$ --------------------------
##$DU= <F:/spectra>
##$EXPNO= 1
##$NAME= <H-F>
##$PROCNO= 1
##$TYPE= <nmr>
##$USER= <she>
##$AMP= (0..31)
100 100 100 100 100 100 100 100 100 100 100 100 100 100 100 100 100 100 
100 100 100 100 100 100 100 100 100 100 100 100 100 100 
##$AQSEQ= 0
##$AQ_mod= 1
##$AUNM= <au_zg>
##$AUTOPOS= <>
##$BF1= 200.13
##$BF2= 200.13
##$BF3= 200.13
##$BF4= 200.13
##$BF5= 200.13
##$BF6= 200.13
##$BF7= 200.13
##$BF8= 200.13
##$BYTORDA= 1
##$CFDGTYP= 0
##$CFRGTYP= 5
##$CHEMSTR= <none>
##$CNST= (0..31)
1 1 145 1 1 1 1 1 1 1 1 1 1 1 1 1 1 1 1 1 1 1 1 1 1 1 1 1 1 1 1 1 
##$CPDPRG= <>
##$CPDPRG1= <>
##$CPDPRG2= <>
##$CPDPRG3= <>
##$CPDPRG4= <mlev>
##$CPDPRG5= <mlev>
##$CPDPRG6= <mlev>
##$CPDPRG7= <mlev>
##$CPDPRG8= <mlev>
##$CPDPRGB= <>
##$CPDPRGT= <>
##$D= (0..31)
0 1.2 0 0 0 0 0 0 0 0 0 0.03 0 0 0 0 0 0 0 0 0 0 0 0 0 0 0 0 0 0 0 0 
##$DATE= 1566899109
##$DBL= (0..7)
120 120 120 120 120 120 120 120 
##$DBP= (0..7)
150 150 150 150 150 150 150 150 
##$DBP07= 0
##$DBPNAM0= <>
##$DBPNAM1= <>
##$DBPNAM2= <>
##$DBPNAM3= <>
##$DBPNAM4= <>
##$DBPNAM5= <>
##$DBPNAM6= <>
##$DBPNAM7= <>
##$DBPOAL= (0..7)
0.5 0.5 0.5 0.5 0.5 0.5 0.5 0.5 
##$DBPOFFS= (0..7)
0 0 0 0 0 0 0 0 
##$DE= 6
##$DECBNUC= <off>
##$DECIM= 24
##$DECNUC= <off>
##$DECSTAT= 4
##$DIGMOD= 1
##$DIGTYP= 9
##$DL= (0..7)
0 120 120 120 120 120 120 120 
##$DP= (0..7)
150 150 150 150 150 150 150 150 
##$DP07= 0
##$DPNAME0= <>
##$DPNAME1= <>
##$DPNAME2= <>
##$DPNAME3= <>
##$DPNAME4= <>
##$DPNAME5= <>
##$DPNAME6= <>
##$DPNAME7= <>
##$DPOAL= (0..7)
0.5 0.5 0.5 0.5 0.5 0.5 0.5 0.5 
##$DPOFFS= (0..7)
0 0 0 0 0 0 0 0 
##$DQDMODE= 0
##$DR= 18
##$DS= 0
##$DSLIST= <SSSSSSSSSSSSSSS>
##$DSPFIRM= 0
$$ [...]
##$SUBNAM2= <"">
##$SUBNAM3= <"">
##$SUBNAM4= <"">
##$SUBNAM5= <"">
##$SUBNAM6= <"">
##$SUBNAM7= <"">
##$SUBNAM8= <"">
##$SUBNAM9= <"">
##$SW= 24.9336996594482
##$SWIBOX= (0..15)
0 0 2 0 0 0 0 0 0 0 0 0 0 0 0 0 
##$SW_h= 4990.01996007984
##$TD= 16384
##$TD0= 1
##$TE= 0
##$TE2= 300
##$TE3= 300
##$TEG= 300
##$TL= (0..7)
0 120 120 120 120 120 120 120 
##$TP= (0..7)
150 150 150 150 150 150 150 150 
##$TP07= 0
##$TPNAME0= <>
##$TPNAME1= <>
##$TPNAME2= <>
##$TPNAME3= <>
##$TPNAME4= <>
##$TPNAME5= <>
##$TPNAME6= <>
##$TPNAME7= <>
##$TPOAL= (0..7)
0.5 0.5 0.5 0.5 0.5 0.5 0.5 0.5 
##$TPOFFS= (0..7)
0 0 0 0 0 0 0 0 
##$TUNHIN= 0
##$TUNHOUT= 0
##$TUNXOUT= 0
##$USERA1= <user>
##$USERA2= <user>
##$USERA3= <user>
##$USERA4= <user>
##$USERA5= <user>
##$V9= 5
##$VALIST= <valist>
##$VCLIST= <CCCCCCCCCCCCCCC>
##$VD= 0
##$VDLIST= <DDDDDDDDDDDDDDD>
##$VPLIST= <PPPPPPPPPPPPPPP>
##$VTLIST= <TTTTTTTTTTTTTTT>
##$WBST= 1024
##$WBSW= 4
##$XGAIN= (0..3)
0 0 0 0 
##$XL= 0
##$YL= 0
##$YMAX_a= 122328
##$YMIN_a= -183703
##$ZGOPTNS= <>
##$ZL1= 120
##$ZL2= 120
##$ZL3= 120
##$ZL4= 120
##$ABSF1= 10
##$ABSF2= 0
##$ABSG= 5
##$ABSL= 3
##$ALPHA= 0
##$AQORDER= 0
##$ASSFAC= 0
##$ASSFACI= 0
##$ASSFACX= 0
##$ASSWID= 0
##$AUNMP= <proc_1d>
##$AZFE= 0.1
##$AZFW= 0.1
##$BCFW= 1
##$BC_mod= 2
##$BYTORDP= 1
##$COROFFS= 0
##$CY= 11.3945322036743
##$DATMOD= 1
##$DC= 2
##$DFILT= <>
##$DTYPP= 0
##$F1P= 20.1720416913024
##$F2P= 0.152960286110954
##$FCOR= 0.5
##$FTSIZE= 0
##$FT_mod= 4
##$GAMMA= 1
##$GB= 0.15
##$INTBC= 1
##$INTSCL= 1
##$ISEN= 128
##$LB= 0.24
##$LEV0= 0
##$LPBIN= 0
##$MAXI= 10000
##$MC2= 0
##$MEAN= 0
##$ME_mod= 0
##$MI= 1.114404
##$NCOEF= 0
##$NC_proc= 0
##$NLEV= 6
##$NOISF1= 3.799351
##$NOISF2= 2.8
##$NSP= 1
##$NTH_PI= 0
##$NZP= 0
##$OFFSET= 15.70392
##$PC= 1
##$PHC0= -9217.055
##$PHC1= 20.20096
##$PH_mod= 1
##$PKNL= yes
##$PPARMOD= 0
##$PSCAL= 0
##$PSIGN= 0
##$REVERSE= no
##$SF= 200.130013532006
##$SI= 16384
##$SIGF1= 3
##$SIGF2= 2
##$SINO= 400
##$SIOLD= 16384
##$SREGLST= <1H.CDCl3>
##$SSB= 0
##$STSI= 0
##$STSR= 0
##$SW_p= 3612.71676300578
##$SYMM= 0
##$S_DEV= 0
##$TDeff= 0
##$TDoff= 0
##$TI= <>
##$TILT= no
##$TM1= 0
##$TM2= 0
##$TOPLEV= 0
##$USERP1= <user>
##$USERP2= <user>
##$USERP3= <user>
##$USERP4= <user>
##$USERP5= <user>
##$WDW= 1
##$XDIM= 8192
##$YMAX_p= 0
##$YMIN_p= 0
$$ End of Bruker specific parameters
$$ ---------------------------------
##NTUPLES= NMR FID
##VAR_NAME=  TIME,          FID/REAL,        FID/IMAG
##SYMBOL=    X,             R,               I
##VAR_TYPE=  INDEPENDENT,   DEPENDENT,       DEPENDENT
##VAR_FORM=  AFFN,          ASDF,            ASDF
##VAR_DIM=   8192,          8192,            8192
##UNITS=     SECONDS,       ARBITRARY UNITS, ARBITRARY UNITS
##FACTOR=    0.0002004,     1,               1
##FIRST=     0,             0,               0
##LAST=      1.6414764,     0,               0
##MIN=       0,             -183703,         0
##MAX=       1.6414764,     122328,          0
$$ Real data points
##PAGE= N=1
##DATA TABLE= (X++(R..R)), XYDATA
0@%%%%%%%qJ6j6J8k6L2m0N0n8P2q8J04j22J43j67J96k28K60k98L41l88M41m98
30b64N61o32P10p95Q90r94J106j229J363j512J677j856K055k275K520k794L100
47A631l448L847m307M845n482O256p220Q454j0104J2433j6004K2242l6296J26805
61A03652m749j33817J34637K2605p8127j9266P2686k6992n9465j0302L9749k212
73C8399k8574j1352K7038k2431m8003R330L5479l3859k1032L4440m791m4172K0372
86d9156K3900l2700p109L4252j1191k2737J2939K988o425J8629k463j9235K2710
99c5598K0881l0815l920M0500L449k4464O525J9868M629o753r051J4529K7142
112B6922j9789k5128L7020K1292m4457M1N0151j7694l8903L1454J8618l8607P36
$$ plain form
0 0 0 0 0 0 0 0 0 -8 8 -8 10 -16 16 -24 26 -32 40 -48 56 -66 77 -90 106 -122 138 -160 181 -207 234 -264
30 -264 297 -335 375 -420 470 -524 582 -647 716 -796 881 -975 1080 -1195 1325 -1469 1631
47 1631 -1817 2030 -2277 2568 -2914 3342 -3878 4576 -5528 6905 -9099 13143 -23153 103652
61 103652 98903 -34914 99723 122328 44201 24935 97621 70629 11164 862 40611 38399
73 38399 9825 -1527 25511 3080 -44923 -35593 -114 -33973 -55005 -20565 -25356 -69528 -49156
86 -49156 -25256 -57956 -65065 -30813 -42004 -64741 -51802 -48814 -55239 -36610 -39073 -58308 -35598
99 -35598 -14717 -45532 -49452 -8952 -5503 -29967 -23442 -3574 1055 -5698 -14749 -220 26922
112 26922 7133 -17995 19025 40317 -4140 -4099 46052 28358 -10545 20909 39527 920 1656
125A656L2658j5801k2639J7164R746j3483p283L105J1920K377k3260k394L0001
138B3767j0140l4218K4022K5623l6831j3736L5862k448k5557J1661P413j3927
150h509R331O229j6123P929J3544k1093n403K3123o504j4341J6820M635j6337
163f699M663Q580p487Q205Q572j4378r95R390j3205J053K1040j2705j4235K5026
177A6825m31l3485J5045L1634k4481j8044K5532J388k4250N570J3394m011k227
190B459n052l993J2138k477j8633J2904J7254k4345q334K6717o735k2423J7656
203b864R512k2529M564J7108j6090n319J7466m682r261J0274l250q219J4094j071
217b67j6760J3171J1976k0137J99K1764p837j0989J4682l51j1221P722P14o919
$$ plain form
125 1656 34314 18513 -4126 13038 22784 9301 2018 5123 17043 19420 -3840 -6234 23767
138 23767 13627 -20591 3431 29054 -7777 -21513 14349 11901 -13656 -1995 5418 -8509
150 -8509 822 7051 -9072 -1143 12401 -8692 -14095 9028 2524 -11817 5003 9638 -6699
163 -6699 -2036 6544 -943 7262 15834 1456 461 9851 -3354 -2301 18739 6034 -8201 16825
177 16825 16394 -17091 -2046 29588 5107 -12937 12595 13983 -10267 -4697 8697 4686 2459
190 2459 -2593 -6586 5552 3075 -15558 -2654 14600 -9745 -18079 8638 1903 -20520 -2864
203 -2864 6648 -15881 -11317 5791 -10299 -15618 1848 -2834 -12095 -1821 -5071 -13290 804 -267
217 -267 -17027 -3856 8120 -12017 -11818 9946 2109 -8880 5802 5451 -5770 1952 2666 -4253
231d253J3641O19k1741J0829K0397k0038q841K5325n259k3125J5426J1890j7427
244b557N74J2648r273l719P756n698l89J0059j0193n787J4829o126j4072J9330
258G382O964k5219M113K1476j7054j3202K1416K196j5718O818M224j0085O149
271e40M472j0503P209R050j7656k278J8358q034j1526J7515L374j8374O081Q802
285E950j2042K781J0726j0215j540J1966j0983o999J7406k258j5447J4062N636
298I043k0774M805J8694j4107q162J8436j816j3758P422K982o849O815Q13r898
312f354R923M906j7414M818J9823j3901j2620J9520n12j8505J0900J1474j4611
325b553N38J1129q822l128J0148o133l804J1601o893j0953J4544K589j6527Q844
$$ plain form
231 -4253 9388 10007 -11734 -905 19492 -546 -9387 15938 10679 -12446 2980 14870 -2557
244 -2557 -1983 10665 1392 -2327 5429 -269 -658 9401 -792 -6579 8250 2124 -11948 7382
258 7382 14346 -10873 -6760 14716 -2338 -15540 5876 8072 -7646 -828 3396 -6689 -540
271 -540 3932 -6571 638 9688 -7968 -10246 8112 78 -11448 6067 9441 -8933 -2852 5950
285 5950 -6092 -3311 7415 -2800 -4340 7626 -3357 -10356 7050 4792 -10655 3407 9043
298 9043 -11731 -6926 11768 -2339 -10501 7935 6119 -7639 -217 2765 -4084 2731 3544 -6354
312 -6354 3569 8475 -8939 -4121 15702 1801 -10819 8701 8189 -10316 584 12058 -2553
325 -2553 -2015 9114 292 -2836 7312 1179 -2625 8976 2083 -8870 5674 8263 -8264 580
339E80J2190j6926l049J6163p381j0573J2066M82j0613P111K364j0276P965M796
353D899j4801L487J3756j3627q105J8422k719j5984J0962P722j3685K725R999
366C051q810j569Q792p940j728J2431o580p975J4375j086j5557J1465J1581j6852
380f402p25J6287q674q089J3785N11r903P487J989r036P257M309j2059N963J1120
395A3820j4357l465J7858o437j4256J3901M849j4946M534R123j0301o9Q967q427
409G94k158J0548p214p475J2514k528j3523J1674P487j6773J524J4016j0877o981
423h972J3426k443j0011P869P39q576P579L233j0956N670Q006j2945p04J5415
437G330q351j0408J4683K068j4563O800R034j0393MP865p227q21Q901p121m780
$$ plain form
339 580 12770 -4156 -7205 8958 1577 -8996 3070 3552 -7061 50 2414 -7862 103 4899
353 4899 -9902 -6415 7341 -6286 -14391 4031 1312 -14672 -3710 4012 -9673 -6948 3051
366 3051 -5759 -7328 1464 -6476 -8204 4227 -2353 -10328 4047 2961 -12596 -1131 10450 -6402
380 -6402 -7127 9160 486 -7603 6182 6693 -3210 4277 6266 -2770 4487 8796 -3263 2700 13820
395 13820 -537 -4002 13856 7419 -6837 7064 11913 -3033 1501 10624 323 254 9221 794
409 794 -1364 9184 1970 -5505 7009 4481 -9042 2632 10119 -6654 -5130 8886 -1991 -8972
423 -8972 4454 2011 -8000 -131 608 -7968 -389 2844 -8112 -2442 5564 -7381 -8085 7330
437 7330 -1021 -11429 3254 5322 -9241 -2441 6593 -3800 -3796 4069 -3158 -3979 4922 -2199 -6979
452f979J2935l288j1858J2284N199j5686M085J2048j1475m093J3577l729r225
465f205R155M21p553P370J735j0736O239O502j3303J397J4377j0225q570J5187
479E791j454j3907R007P193j2231J969Q698p901j177Q382o516k810J1381n231
493A194r895J2064K285j3336O877J0381j2322k254J2578n976p392J0457o27q402
507d368P193J430q974O944N552j1441K950J1300j1051o379J4736k477j1408R139
521C146M626j1432L756P768q090l92P158p217j865R134n832p149J2220p92j3003
536g964P958Q303j3272r72J1995p454o544J0617j386q002P262J052q073O323L475
551C318j0398M414Q703j1308k235J3774n654j0044J1281L553j2152M587O435q947
$$ plain form
452 -6979 5956 2668 -9190 3094 8293 -7393 -3308 8740 -2735 -6828 6749 3020 -6205
465 -6205 2950 3371 -4182 3188 4923 -5813 426 6928 -6375 -4978 9399 -826 -9396 5791
479 5791 4337 -9570 -563 6630 -5601 -3632 5066 -2835 -4012 4370 -2146 -4956 6425 1194
493 1194 -8701 3363 5648 -7688 -811 9570 -2752 -5006 7572 1596 -5796 4661 4034 -4368
507 -4368 2825 4255 -4719 2225 7777 -3664 -714 10586 -465 -6844 7892 5415 -5993 3146
521 3146 7772 -3660 96 7864 -226 -618 6540 -677 -2542 6592 760 -6389 5831 5039 -7964
536 -7964 -6 8297 -4975 -5947 6048 -1406 -7950 2667 1281 -6721 541 1593 -6480 -157 3318
551 3318 -7080 -2666 6037 -5271 -7506 6268 614 -9430 1851 5404 -6748 -2161 4274 -4673
565d673R71Q051p019j974R909o527n843J1080j977j0947R651O080j3023K057J0861
580F677q514l954J1294k576o791P157p32p339P179K605r851N472P365j1478q54
595d340J2541o467p716J2025O79j2431N635O483q038J847O568o721j343P243n801
610A64k945J0896l170r653R043K218j2175M812R558r891l552Q995n665o385Q729
625I79R83o938N776M11j0089N183O697r744N19R992p602o354J1170j006r045Q165
641i03M931j0011J428N936o853J185P868o585k518J0127m474p851J0418K485j1624
656f441N445Q641j0028j200J1487m143n628P802j262o548O708J366p277N629K557
671G108j0079L322J0218r111l889J0910m171j0367P788K274r732M654O643q953
$$ plain form
565 -4673 -3702 4349 -2670 -4644 5265 -1262 -7105 3975 1998 -8949 702 6782 -6241 -4184 6677
580 6677 -1837 -5791 5503 2927 -3864 3293 2561 -4778 2401 5006 -4845 627 7992 -3486 -4340
595 -4340 8201 1734 -5982 6043 6722 -5709 -74 6409 -1629 218 6786 65 -1278 5965 164
610 164 -2781 8115 4945 -4708 4335 6553 -5622 -810 8748 -1143 -4695 4300 -1365 -7750 979
625 979 1962 -4976 800 1211 -8878 -3695 3002 -6742 -6223 3769 -3833 -10187 983 -23 -9068 -903
641 -903 4028 -5983 -4555 1381 -5472 -4287 3581 -3004 -5522 4605 131 -7720 2698 5183 -6441
656 -6441 -996 7645 -2383 -3583 7904 3761 -1867 5935 4673 -1875 4833 6199 -1078 4551 7108
671 7108 -2971 351 10569 1458 -2431 8479 4308 -6059 1729 4003 -5729 -1075 5568 -3385
685c385j494O867n312j433Q556m330o355Q300j096j0279O771O425r514N39Q186
700B446p321m013Q761j741n131Q112n18q608N948M020q421M545Q279r431l422
715f495J1731k666p553R659K728q455L745M141o809J843O632n622o59N922o845
730A297l564J0887j771q682P946L144j2505K540R085p769l504R220l564p110N495
745A145O4n782N881K883q790J935M234p922O32Q471o274n325R020j315r982O438
761d687M488q081L590N386p755m09R125m577m429Q843j939p687P463M099q711
776e281K775P526o862j513Q182k441l311O225k166n720O374Q45o950O314M436
791H433j0467J343Q993p208m037J1094j653j0099N785M152q386K553N430n875
$$ plain form
685 -3385 -4879 1988 -3324 -4757 3799 -531 -6886 1414 318 -9961 -3190 3235 -6279 -5740 2446
700 2446 -4875 -8888 -127 -1868 -6999 1113 595 -8013 -2065 1955 -6466 -1921 6358 -3073 -6495
715 -6495 5236 2570 -4983 4676 7404 -1051 2694 6835 26 1869 8501 2879 2220 8142 1297
730 1297 -2267 8620 6849 -1833 6113 9257 -3248 -708 8377 608 -2896 6324 2760 -4350 1145
745 1145 1209 -4573 1308 4191 -4599 -2664 1570 -6352 -5720 2751 -3523 -8848 172 -1143 -11125 -4687
761 -4687 -199 -8280 -4690 696 -7059 -7468 1657 -2920 -7349 1494 -445 -8132 -669 3430 -5281
776 -5281 -2506 5020 -1842 -3355 4827 2386 -925 5300 3134 -2586 3788 4633 -2317 3997 8433
791 8433 -2034 -691 8302 1094 -2943 8151 6498 -3601 2184 6336 -2050 503 5933 58
805E8j024M647n034j874P159l188n197P938n58r551N205N569q567N41P581p324
821c619l622Q666j326o622O925J547o982M235L781q298J928Q562n962m094O953
836B072k128n268P737K374p271L730L025p023J704N910n283p17P525o078o094
851e785R142K27q736O667N203q900n91P800n244l649P437j554n180M047l27n577
867e020M488K325n979L444M328q557l51Q855m745n533Q366l12r016N646M880p354
883d535J262O143n439j904P984l307m357P333j011o767N502L079o526K990O115
898F562o384j667O165k997k222P571k276o591N622J568q008M289O428q220r35
913a095Q087n554n839Q881J494p598L350K293o793J560N040n220m24M939m995
$$ plain form
805 58 -966 3681 -1353 -3227 3932 744 -4453 3485 2927 -6624 -1419 4150 -4417 -3876 3705 -3619
821 -3619 -7241 1425 99 -6523 402 1949 -5033 -798 2983 -5315 -3387 5175 -787 -4881 2072
836 2072 -56 -5324 2413 4787 -2484 1246 4271 -2752 -1048 4862 -421 -1138 6387 309 -5785
851 -5785 3357 3584 -5152 1515 6718 -2182 -2773 5027 -217 -3866 3571 2017 -3163 884 557 -5020
867 -5020 -532 1793 -4186 -742 3586 -4971 -5322 3533 -1212 -6745 1621 1309 -7707 -2061 2819 -4535
883 -4535 -3273 2870 -2569 -4473 3511 204 -4153 3180 2169 -4598 904 3983 -2543 447 6562
898 6562 178 -1489 4676 1679 -543 7028 4752 -1839 3783 5351 -2657 1632 8060 -160 -1095
913 -1095 6992 1438 -4401 4480 5974 -1624 1726 4019 -2774 -1214 3826 -1394 -1818 3121 -1874
928a874k394P148l054n564P396O34q621L594N988p664o33Q286m059m918O677r67
944b5n753N166K322n992L334L810p060M41O737l885k085O577k767n998O025J651
960B498o169L680M103o740N56N540n286j516Q203l356o644O970J165p761L512
975a245N445o691J7O375m019l407N391j227l667N092j128n095M855K569p237K701
991a271N933o196k147Q395l236n790P158J389p729L478M905n828P69N097m841
1006H6j923O222k363l553N903j112n874M767K996o932J773N609n899j585N733
1021C848k865m193O177k09o220M141K534o984K131N704o535j350P014l229n432
1036e468N484O55n773M276J699n935J965M729n433K25N751m372k744O469k190
$$ plain form
928 -1874 -4268 2880 -174 -5738 1658 2292 -6329 -2735 3253 -4411 -5044 3242 -817 -5735 942 -25
944 -25 -5778 -612 1710 -4282 -948 2862 -4198 -3757 2980 -905 -2990 3587 820 -5178 847 2498
960 2498 -3671 9 4112 -2628 -2072 3468 -1818 -3334 4869 1513 -5131 1839 3004 -4757 -1245
975 -1245 4200 -2491 -2474 3901 -118 -3525 1866 639 -3028 2064 936 -4159 696 3265 -3972 -1271
991 -1271 4662 -1534 -3681 4714 1478 -4312 2846 4235 -3494 -16 4889 -939 -170 4927 86
1006 86 -1837 4385 2022 -1531 4372 3260 -2614 2153 5149 -1783 -10 5599 -300 -1885 3848
1021 3848 983 -3210 2967 2758 -3462 679 3213 -3771 -1640 4064 -2471 -3821 3193 -36 -5468
1036 -5468 16 671 -5102 -826 873 -5062 -3097 1632 -3801 -3576 2175 -2197 -4941 1528 -662
1051f62n790O764K297p320K158N816n622j107O736l024l323N903r37n338M215
1066G66K202m931L581L648o745J86O288l789k860O920j550o554N146J999o036
1081a729K943M229o628K31N365m259k506O307j967n711N298J310o166K756M261
1096C734o226l92N634l605k456N146j827m357M954M75n961M183L422o402P32N988
1112C042m890k423O991k144n694N759J999n791K314L434m688R93M716m712j187
1127b281N395k782l940O568J40o315M050L107o306J169N621m865j716N038j977
1142I06m220N306l29n050M032K775o552J481M443m795j195O246k672m533N377
1157A220j65n372M250K685n704J550M553m752p03N776l287l052O333j150n673
$$ plain form
1051 -662 -6452 312 2609 -4711 -2553 3263 -2359 -3466 3270 246 -3077 2826 1889 -3449 766
1066 766 2968 -1963 1618 5266 -1479 -1293 4995 1206 -1654 5266 3716 -2838 2308 4307 -1729
1081 -1729 1214 5443 -1185 -954 4411 152 -2354 3953 1986 -3725 1573 2883 -3283 -527 3734
1096 3734 -2492 -2884 2750 -855 -3311 1835 8 -4349 605 1080 -4881 -698 2724 -3678 -2946 3042
1112 3042 -1848 -4271 2720 576 -5118 641 2640 -3151 -837 2597 -2091 -1098 3618 -1094 -2281
1127 -2281 3114 332 -3608 2960 3100 -3215 835 3942 -2364 -1195 4426 -439 -2155 2883 906
1142 906 -3314 1992 1663 -3387 645 3420 -3132 -1651 2792 -2003 -3198 3048 376 -4157 1220
1157 1220 1055 -4317 -67 2618 -3086 -1536 3017 -1735 -2438 3338 51 -3001 3332 2182 -3491
1172c491M628L014n858J635N067n054j116N489k523l089N416q38m765M352J549
1187D416n563K386M434o284l09O330l856m071N624p30m992L814J609n916J831
1202a277L661n237l23M728l768k974N621k305m262N030J341o103K639M077n223
1217d375l25N231l407k047N436j380m322M826J283n103L331L611n529P78N436
1232C444m025k527O784r55m500M353J102n301L418L474n177J179M831m907j493
1247c00N672k232l851N308Oo338L605L741o231K14M968l991k045M611k053l883
1263b799M334L91n211K985K403n647J482M738m931j735N929k293m340N141O42
1278A089m819L079K880n210J257L707m078o88N662k788l356N510m88m671L927
$$ plain form
1172 -3491 1137 4151 -1707 -72 4995 -59 -1175 4314 1791 -1298 4118 3280 -1485 2867 4416
1187 4416 -1147 1239 5673 -611 -920 5410 1554 -2517 3107 2377 -2615 1199 2808 -3108 -1277
1202 -1277 2384 -2853 -3176 1552 -2216 -5190 431 -1874 -6136 -1106 235 -5868 -3229 848 -4375
1217 -4375 -4700 531 -2876 -4923 513 -867 -5189 -363 920 -4183 -852 2759 -2770 -1992 3444
1232 3444 -581 -3108 3676 2721 -1779 2574 3676 -1625 1793 5267 90 1269 6100 1193 -300
1247 -300 5372 3140 -711 4597 4603 -1735 1870 5611 -620 -406 4562 571 -1474 3137 1084 -2799
1263 -2799 1535 1926 -3285 -300 2103 -3544 -2062 2676 -2255 -3990 1939 -354 -4694 447 1089
1278 1089 -3730 -651 2229 -2981 -1724 1983 -2095 -2783 2879 91 -3265 2245 1757 -2914 1013
1293A013K510n421J258M268m143j182N291k632l060M814p06m782M324J970n771
1308b249J767L983n133j024N368k973l409N214n51m911L682J954n180J935L238
1323A711m413O5M652l636k571N750j222m788M505J850n195K060M294m894l82N287
1339C073k883k727M925r49l653M230Q46m786K769L232m618M88M381l488k460N509
1355C889r64m260M152Q38n196K221L026m216K53M168l750k081M627j720m040M358
1371A305P88n604K292L159m456J28M427l825j603M701k052l543M435m2m683L273
1387a300K713n037N98M970l916j519N443j393l935M232Q22m123K672K689m769
1402a853J194L964l409q87M958k501l037M864j07n054L939K728n485Q87L871m131
$$ plain form
1293 1013 3523 -1898 -640 3628 -515 -1697 3594 962 -2098 2716 2010 -2772 1552 3522 -2249
1308 -2249 -482 3501 -1632 -2656 2712 -261 -3670 1544 993 -3918 -236 1718 -3462 -1527 1711
1323 1711 -2702 -2637 2015 -1621 -4192 1558 336 -4452 53 1903 -3292 -1232 3062 -1832 -2214 3073
1339 3073 190 -2537 2388 1439 -2214 2016 2862 -1924 845 4077 -541 -53 4328 840 -1620 3889
1355 3889 2925 -1335 2817 3655 -1541 680 3706 -510 -257 3911 161 -1920 2707 987 -3053 1305
1371 1305 2093 -3511 -1219 1940 -2516 -2388 2039 -1786 -3389 1312 -740 -4283 152 110 -4573 -1300
1387 -1300 1413 -3624 -3026 1944 -1972 -3491 1952 559 -3376 856 1678 -2445 227 2916 -1853
1402 -1853 -659 3305 -104 -991 3967 1466 -1571 3293 3186 -1868 2071 4799 -686 201 4072 -59
1418e9j016N221k684l375M616j90m475K950J793m630J221L689m495r96M494k567
1434e03k964M764m52m537L167J740m520K023L024m204m61M693k866k794M916m70
1450E56m365L777J983n159K015M103l436j629M815k705k157M279m48l603L501
1465A527N82m721K694L526m048j92M202l675k891N147q43l972L768J405m903J285
1481a109L112l836N26M011l811k323M965j439l913L948J115m800K339L067m557
1496b705K07M324l357j433M518j236l594M646N60m421K925K610m885N50M778k907
1512E80k107M901j617l334L710R69m224K611K351m151R48K779l242q82M840k605
1528A527l413M584L17m662K630K252m599P82L974l762j728M035j753l006L690
$$ plain form
1418 -59 -1075 4146 1462 -1913 2703 2513 -1962 988 2781 -1849 -628 3061 -1434 -2430 2064 -503
1434 -503 -3467 1297 845 -3692 -525 1215 -3305 -1282 1742 -2462 -2923 1770 -1096 -3890 1026 556
1450 556 -3809 -32 1951 -3208 -1193 2910 -526 -2155 2660 -45 -2202 2077 1629 -1974 1527
1465 1527 2109 -2612 82 3608 -440 -632 3570 -105 -2996 2151 1308 -2664 1104 2509 -2394 -1109
1481 -1109 2003 -1833 -1307 2704 -1107 -3430 1535 96 -3817 131 1246 -3554 -1215 1852 -2705
1496 -2705 -2498 1826 -1531 -2964 1554 318 -3276 1370 1930 -2491 434 3044 -1841 -1291 3487 580
1512 580 -1527 3374 1757 -1577 2133 3102 -1122 1489 3840 -311 637 3416 174 -708 4132 1527
1528 1527 -1886 2698 3015 -1647 983 3235 -1364 -582 3392 -370 -2098 1937 184 -2822 868
1543H68k6l874K910J540m479J187L402m043p24M604k333k844L901K43m035L056
1559f47K198m408J135L430l809p77M537k196k149M423j89m572L505J930m581J460
1575g10L514l527q8L854k720k121M440r25l262L700R20m795K002K786m163J81
1591i14M187l076k581M677q52l760L273J180l783J621K296l679l64M028k864j666
1607b277L918j376l034L697Q83m255K028K695m324n7M151k575j711L833r36l580
1623b920L760O66l390J981K431l701O7L735l326r90M110j097l216L298M55l697
1639a834K221K136l621N48L701l659j288M485j927l242M029M48m214K368K131
1654B282m335N30L424k752j139L863j970k566L737l94l643L203J718m196O67L383
$$ plain form
1543 868 842 -3032 -122 1418 -3061 -1874 1528 -2515 -3239 1365 -968 -3812 89 332 -3703 -647
1559 -647 1551 -2857 -1722 1708 -2101 -2878 1659 -537 -2686 1737 1548 -3024 481 2411 -2170 -710
1575 -710 2804 -723 -811 3043 323 -1798 2642 1717 -1545 2155 3075 -1720 282 3068 -1095 -914
1591 -914 3273 197 -2384 2293 1441 -2319 954 2134 -1649 -28 2268 -1411 -1775 2253 -611 -2277
1607 -2277 1641 265 -2769 928 1811 -2444 -416 2279 -2045 -2102 2049 -526 -2237 1596 660 -2920
1623 -2920 840 1506 -1884 97 2528 -1173 -1106 2629 -697 -1687 2423 1326 -1890 1408 1863 -1834
1639 -1834 387 2523 -1098 -550 3151 -508 -1796 2689 762 -2480 1549 1997 -2217 151 2282
1654 2282 -2053 -1523 1901 -851 -1990 1873 -97 -2663 1074 680 -2963 240 1958 -2238 -1571 1812
1670A812l522r13M186k066k404M291j11m000K775J661l697J216L025l078m48L566
1686B293k245k271L806L47l614K995J062l737Q25L360l143o03L782k325k001L454
1702A985m81l242L454Q06m002J167K814l737m71L933k260k381L702r44l203K992
1718A32R74l389J966J949l157k20L657k545j931M332j445l785L821J112m022J989
1734e62K700l304j73L531k417j489L338n95l086L090O95l433J905K519l956O14
1750f23L514k541j712L424j134k909L589K27l217J722J943l973M59L578k627j339
1766a619L341j669k785L812M7l232J876J834l551M83L537l113r15L492j474k122
1782b058L252m8l540K457J724l359J020K862k918p34L436j419k659L240P81l576
$$ plain form
1670 1812 -1710 -2623 1563 -503 -2907 1384 1273 -2727 48 1709 -1988 -772 2253 -825 -1273 2293
1686 2293 48 -2223 1583 1930 -1684 1311 2373 -1364 -539 2821 -322 -925 2857 532 -1469 1985
1702 1985 1504 -1738 1716 2522 -1480 -313 2501 -1236 -1707 2226 -34 -2415 1287 343 -2860 132
1718 132 1106 -2283 -317 1632 -1525 -1745 1912 -633 -2564 1768 323 -3462 359 1471 -2551 -562
1734 -562 2138 -1166 -1339 2192 -225 -1714 1624 1029 -2057 1033 1728 -1705 200 2719 -1237 -623
1750 -623 2891 350 -1362 2062 928 -1981 1608 1835 -1382 340 2283 -1690 -1231 2347 -280 -1619
1766 -1619 1722 53 -2732 1080 1127 -2105 -229 1605 -1946 -1463 2074 -1039 -1954 1538 64 -2058
1782 -2058 1194 1146 -2394 63 1787 -1572 -552 2310 -608 -1342 2094 675 -1984 1256 2037 -1539
1798a539J730J724l332J303K575l155n52L540j933k113L406k60l479K764J391
1813B070m011J169K563k484q05L220k205k036L414l76l288K863J355l505J015
1828a041K608k858o73L307k123j989L533k73k806K399J286l609J766K426l319
1843a366r3L704k582j723L698o09k844L319P78l728J591K555l199J49L395k498
1859E47j710L313r99k683K993O67l334J736J609k934K39K953k209j175L170j561
1875F22k513K930M10l463K178J486l382M96K643k515q92L478j689k434K657O84
1891F96l362K039J599k823K05L394k972j256L540j615j643L005K08l057K271J682
1907A911l378P39K760k297j091L208j554j859L091M96l496K298J304l558J315
$$ plain form
1798 -1539 191 1915 -1417 -114 2461 -694 -1246 2294 361 -1752 1654 1394 -2085 679 2070
1813 2070 -1941 -772 1791 -693 -1498 1722 -483 -2519 895 519 -2769 94 1449 -2056 -1041
1828 -1041 1567 -1291 -1964 1343 -780 -2769 764 491 -2315 84 1370 -2239 -473 1953 -1366
1843 -1366 -1459 2245 -337 -2060 1638 1029 -1815 1504 2282 -1446 145 2700 -499 -350 3045 547
1859 547 -1163 2150 1151 -1532 1461 2128 -1206 530 2139 -795 -556 2397 188 -987 2183 622
1875 622 -1891 1039 1449 -2014 164 1650 -1732 -1236 1407 -1108 -2000 1478 -211 -2645 12 696
1891 696 -2666 -627 972 -1851 -1646 1748 -1224 -2480 1060 -555 -2198 807 1015 -2042 229 1911
1907 1911 -1467 -728 2032 -265 -1356 1852 298 -1561 1530 2026 -1470 828 2132 -1426 -111
1922a11K535k638q44L087j649k534L668r3l308K335J525l249N39K466k833m39
1938a543L037j908j963L219n89k430J996J013l095J604K528l027p89L527j975
1953c95j868L498n27k791K422J084l483J406K891k894l07L174k229j599L345o83
1969A044k443K485R58l293J035K261k494K2K655j977j505K781p46k444K537Q66
1985A742l362J148K401l248J91L130k554j383K977p75k329K464M45l090J727J579
2001A063k392M9K816k017j430K991j383k151K823M54k701J681J763k704K92K565
2017A719k071q00K819j359j777K662M88l056J469J903l071P02K461k250o90K884
2033B033j615j958K580J30k858K045J226k774N34K311k166o14K847j098k443K543
$$ plain form
1922 -111 2424 -214 -1058 2029 380 -2154 1514 1421 -1887 448 1973 -1276 -737 1729 -1104 -1543
1938 -1543 1494 -414 -2377 842 253 -2177 -181 832 -2263 -659 1869 -1158 -1947 1580 -395
1953 -395 -2263 1235 708 -2083 339 1423 -2060 -654 2237 -657 -964 2210 -19 -1618 1727 1044
1969 1044 -1399 1086 2044 -1249 -214 2047 -447 -425 2230 253 -1252 1529 783 -1661 876 1742
1985 1742 -1620 -472 1929 -1319 -1128 2002 -552 -1935 1042 267 -2062 402 847 -2243 -516 1063
2001 1063 -1329 -1280 1536 -481 -1911 1080 -303 -2454 369 823 -1878 -197 1566 -1138 -846 1719
2017 1719 -352 -1152 1667 308 -1469 1193 1681 -1375 94 1997 -1074 -372 2089 -161 -851 2033
2033 2033 418 -1540 1040 1170 -1688 357 1583 -1191 -657 1654 -512 -1126 1721 623 -1820 723
2049G23O8k704J725J185k754J027J978k335n07K840j515j535K507k79k716K492
2065B00J004l348J459K576k751l45K859j600j461K911l03k689K055J066l020J569
2081A82K018k474l85L051j900j965L239q33k276K065J008l144J598K070l230j9
2097i95K882k178j217K898j020j757J817L96k817J478K069k960pK722j908j323
2113a920K841p17k084K432K98k403J374J567k713N24K544k262r49K901j246j830
2129a643K417N52k792J615J642k334M7K282j910q08K490j168j708K389n7k267
2145a253J538J566k582K64K476k185j430K811p26k433K386L90k741J797J209k725
2161a638Q24K215k371q53K861j140j907K502j95k738K388J146k710P55K376k238
$$ plain form
2049 723 791 -1913 -188 997 -1757 -730 1248 -1087 -1594 1246 -269 -1804 703 424 -2292 200
2065 200 1204 -2144 -685 1891 -860 -1205 1654 54 -1407 1504 1201 -1488 567 1633 -1387 182
2081 182 2200 -274 -659 2392 492 -1473 1766 933 -1343 722 1730 -1414 184 2254 -976 -995
2097 -995 1887 -291 -1508 1390 370 -1387 430 826 -1991 -513 1556 -1404 -1411 1311 -597 -1920
2113 -1920 921 204 -1880 552 850 -1553 -179 1388 -1325 -801 1743 -519 -1468 1433 187 -1643
2129 -1643 774 1326 -1466 149 1791 -543 -496 1786 -124 -932 1558 390 -1318 1071 1014 -1253
2145 -1253 285 1851 -731 -467 2009 -176 -1606 1205 479 -1954 432 822 -1919 -122 1087 -1638
2161 -1638 -814 1401 -970 -1823 1038 -102 -2009 493 298 -2440 -52 1094 -1616 -861 1515 -723
2177g23n67K480j151j934L186J20k873K025J045k954R62K689k399n23K710j652
2193D41j604K427k3k132K002R73k887P05K173k251l32K526j770j597K548n2k875
2210a728K259J293l137Q34K046k679l07K710j660j394K264m64j784J883N74k528
2226a818J011J942k812L27K471j582j364K885p57k465K153R44k671J541J413k392
2242a174L31K355j814m95J956l31k313K447P44k493J232J336k179K02K199j984
2258A9o49K424j107j767K220m0k319J244J876k926O57K057k325o20K321r52j667
2275a554K196j42k694J894J365k180J27K055k210n78K219p60j905K676L84k812
2291a919J759Q49j948N89K176j999l44K130j236j589K463L91k361J534J210k630
$$ plain form
2177 -723 -1290 1190 39 -1895 1291 1411 -1462 563 1608 -1346 -384 2305 -94 -617 2093 441
2193 441 -1163 1264 1241 -891 1111 2084 -803 -98 2075 -176 -508 2018 248 -1349 1199 1147 -1728
2210 -1728 531 1824 -1313 -479 1567 -1112 -1419 1291 -369 -1763 501 37 -1747 136 710 -1818
2226 -1818 -807 1135 -1677 -1350 1121 -461 -1825 1060 303 -2162 -9 935 -1736 -195 1218 -1174
2242 -1174 -843 1512 -302 -797 1159 828 -1485 962 1706 -787 445 1781 -398 -196 2003 19
2258 19 -630 1794 687 -1080 1140 1100 -1219 25 1901 -1025 -368 1689 -636 -1256 1065 113 -1554
2275 -1554 642 500 -2194 -300 1065 -1115 -988 1067 -1143 -1721 498 -262 -2167 509 893 -1919
2291 -1919 -160 689 -1259 -670 1506 -493 -837 1293 57 -1532 931 1322 -1039 495 1705 -925
2307i25Q07K071k014m21K612j407j807K231q2k181K221P61k765J009J805k163
2323b48k96K397j881j421K359l91k649K252J079k718N41K072k328l7K137j447
2339e79j241K355n53k363K113R43k361R58K071k591K59K193j582j116K587k71
2355H22k348K046N37k359J137K048k766N13K367j924j082K381m27k064K109N45
2371A535k573J304J719k100k11K241j846j063K417n30j874J798K34k791J562J547
2387A369k339M23J806k105o67K072o19j388J793M54k367J169J020k255O34K269
2403A269k004q42K434r25k004K595L53k547J541J393k343L47K514j924p38K502
2419A621j187j790K598r9k037J648R22k474O67K209k239l98K711j581j811K349
$$ plain form
2307 -925 -118 1953 -61 -482 2130 723 -1084 1147 1065 -1116 1105 1866 -899 110 1915 -248
2323 -248 -544 1853 -28 -1449 910 519 -2130 122 1201 -1517 -976 1096 -1232 -1269 868 -579
2339 -579 -1820 535 -18 -2381 -268 675 -1686 -728 1343 -1248 -989 1204 -378 -1494 1093 822
2355 822 -1526 520 1057 -1302 -165 1883 -883 -370 1997 73 -1009 1372 945 -1119 990 1535
2371 1535 -1038 266 1985 -115 -326 1915 69 -994 1423 893 -981 817 1051 -1740 -178 1369
2387 1369 -970 -547 1259 -846 -1513 559 -60 -1448 345 799 -1568 -399 621 -1634 -1000 1269
2403 1269 -735 -1577 857 -68 -2072 523 876 -1671 -130 1263 -1080 -733 1781 -143 -881 1621
2419 1621 434 -1356 1242 1143 -894 754 1676 -798 -131 2078 -161 -559 2152 571 -1240 1109
2435A109p2k471J884J337k389J58J730j851p10K746j578j113J977o88k256K174
2451a3P08k505J080J796k270j92K211j320j205K459o43k242K024R69k467J026
2467e84K145k082n42K459j031j618K308j48j678J412Q69k432Q32J618k093M44
2483a21J711j061j115K476n28k111J741Q2j948P07J967k406K18J931j680j158
2499a295K066m32j809J527O74k485P26J898k381J1K226j731q97K038n12j425K207
2516D06k24k148J557J223k160J63K443j565q19K457r97j657J934M54k014J569
2532F22J478k511M86J999j679o94K297q32j779J732J37k272J859J049k374L18
2548a64K035k019p14K749j238j955J923R9k386J651P91k152Q78J526k032p84K512
$$ plain form
2435 1109 1037 -1434 450 1787 -602 -444 1286 -565 -1275 1471 -107 -1220 757 69 -2187 -13
2451 -13 695 -1810 -730 1066 -1204 -1396 815 -505 -1710 749 106 -2136 -112 857 -1610 -584
2467 -584 1561 -521 -1063 1396 365 -1253 1055 907 -771 641 1510 -922 -90 1528 -565 -121
2483 -121 1590 529 -586 1890 1362 -749 992 1074 -874 -167 1800 -606 -388 1543 -137 -1295
2499 -1295 771 339 -1470 57 731 -1754 -1028 870 -1511 -1500 726 -1005 -1902 136 -376 -1801 406
2516 406 182 -1966 -409 814 -1346 -1183 1260 -305 -1124 1333 336 -1321 613 1067 -947 622
2532 622 2100 -411 75 2074 395 -299 1998 1166 -613 1119 1256 -1016 843 1892 -482 -164
2548 -164 1871 -148 -862 1887 649 -1306 617 716 -1670 -19 772 -1380 -502 1024 -1008 -1792 720
2565G20j367j417K203J87k177J487Q28k166Q53J773k065l64K341j278r03K197
2581H52o5k020J615P17k359J163K289k252m43K350j348j229J987J96k704K112
2597H61O93k285R46J538j972L7J908j722r95K312o39k029J764M79k142N70J881
2614A205k246k3K074j663j123J844j8j713J660L34k094Q34K198k441J78J870j441
2631e65q30K104k54j933J957O97k562J549J420k363M52J978j760n63K580q47k133
2648a073K172L17j866J225R74j866j67K070j694o79K058p47j726J878J84k266
2664a206J652R26k444N17J488j394r38K303q44j939K262j74j854J418R11k463
2680a779N03K254j763o16K066j142j300K201j06k097J971Q20k552Q97J910j742
$$ plain form
2565 720 -647 -2064 139 326 -1851 -364 464 -1702 -849 924 -1141 -1505 836 -442 -1345 852
2581 852 787 -1233 382 1099 -1260 -97 2192 -60 -503 1847 499 -730 1257 1453 -1251 861
2597 861 1554 -731 215 1753 -219 -182 1726 4 -991 1321 682 -1347 417 896 -1246 -676 1205
2614 1205 -1041 -1064 1010 -653 -1776 68 50 -1663 -3 331 -1763 -929 1269 -1172 -994 876 -565
2631 -565 -1395 709 455 -1478 479 1176 -1386 163 1583 -780 -328 1650 -110 -673 1907 1060 -1073
2648 -1073 1099 1416 -450 775 1749 -117 -284 1786 92 -587 1471 724 -1002 876 1060 -1206
2664 -1206 446 1372 -1072 -555 933 -461 -1399 904 60 -1879 383 209 -1645 -227 684 -1779
2680 -1779 -1276 978 -785 -1401 665 -477 -1777 424 318 -1779 192 1012 -1540 -643 1267 -475
2696d75n78K434j099j505K241k13k013J461J167k070O17J719k035j13J716j075
2712A79j208K046k29j687J343M41j969J185J419k532p7K556j587j139J888P9k196
2729a488J557O86k557J275J652k158j79K132j517j121K686p55j760J808N42k396
2745a593J052J794k114J25K025j287j149K497o41j896J829M07j934J075J683k298
2761d25J89J951j479r00K381r47j923J668P41j977J207Q49k121N3J942j332j091
2778a214K284r18j386J772k7k096J504Q86j982J19J977j565p21K275j080j402
2794a574J474O90j977J413J066k238K93J995j330p05K010q28j329J807L63k210
2810a080J363J234k309N63J942k225k45K335j495j275K440k2k450J404J030k225
$$ plain form
2696 -475 -1053 1381 282 -1223 1018 805 -1208 253 1420 -650 -33 1686 -349 -462 1254 179
2712 179 -1029 1017 788 -899 444 885 -1084 101 1520 -1012 -1089 1467 -120 -1259 629 708 -1488
2729 -1488 69 755 -1802 -527 1125 -1033 -1212 920 -597 -1718 968 213 -1547 261 803 -1593
2745 -1593 -541 1253 -861 -736 1289 2 -1147 1350 709 -1187 642 1049 -885 190 1873 -425
2761 -425 -236 1715 236 -664 1717 770 -1153 515 1256 -721 486 1335 -786 -733 1209 -123 -1214
2778 -1214 1070 152 -1234 538 511 -1585 -81 805 -1177 -1058 919 -646 -1367 908 -172 -1574
2794 -1574 -100 590 -1387 26 1092 -1146 -853 1142 -188 -893 1117 289 -1040 767 1130 -1080
2810 -1080 283 1517 -792 -229 1713 -512 -757 1578 83 -1192 1248 1226 -1224 180 1210 -1015
2826a015R35J447j809n00K273j506j323K533n96j763J276R39k246J143J428j720
2842e04o43J671q24j148K208m61j988J907O97k200Q61J693j646k69J937j486j138
2859a333K220k04k037J983N17k222Q51J443j599k34K184j208j367K122n47j809
2875a240J812P49k417J488J160k261m4K317j576j149K037o88j745J821P94k251
2891a193J006J198k064L14J775j402j107K113o81j790K062P04k392J319J243k441
2907a336O59J727j622n23K251j103j547J784J23j831J482J300j972R5K075j868
2923c06m08J958o33j308J516J2k225J738J270k130L40J737j904p35K363r09j335
2940i59K061o2k111R97J284k142P89J608j905p79K201j140j201J938r2j930J369
$$ plain form
2826 -1015 -80 1367 -442 -942 1331 -175 -1498 1035 439 -1324 -48 891 -1355 -212 1216 -504
2842 -504 -1147 524 -300 -1448 760 299 -1689 218 915 -1285 -424 1269 -377 -646 1291 -195 -1333
2859 -1333 887 683 -1354 629 1146 -1076 -225 1218 -381 -615 1569 361 -1006 1116 569 -1240
2875 -1240 572 1321 -1096 392 1552 -709 -753 1564 -12 -1161 876 188 -1557 264 1058 -1193
2891 -1193 -187 1011 -1053 -739 1036 -366 -1473 640 -41 -1831 231 935 -1457 -138 1105 -1336
2907 -1336 -677 1050 -572 -1095 1156 53 -1494 290 413 -1418 64 1364 -608 -513 1562 -306
2923 -306 -714 1244 611 -697 819 831 -1394 344 1614 -516 -176 1561 -343 -1078 1285 376 -959
2940 -959 1102 1040 -1071 -74 1210 -932 -143 1465 -440 -1219 982 -158 -1359 579 487 -1443 -74
2957g4P73k076O66J828j659n71K253r76j662K199L9j930J692N51k397R13J325
2974H94j625L7K192j109j442K028k80j865J743J042k453P96J460j779l52K159
2990A446j082r95J876o49j775J628Q03k343R29J199k021j32K312j610r29K009
3006F66k32k128J633Q74k058J069R85j682l57K054j225n49J768l12k133J868L53
3023E94j739J153J245j829j62J828j259o42J916n98j604J453M41k004J653R60
3039A406j932M0K206j783o29J957o79j485J989q4j987J007J413k255M81K140k121
3056c16n07J750n16j596J771k8j827Q87J334k314M04K012j168q95J882p57j846
3073a730K162L44k044J426R09k242M82J861j845q0J933r79j474J946j29j753J534
$$ plain form
2957 -74 699 -1377 -711 1117 -542 -1113 1140 164 -1498 701 740 -1190 502 1053 -1344 -431 894
2974 894 -731 -694 1498 389 -1053 975 695 -1170 573 1615 -838 -42 1418 -361 -713 1446
2990 1446 364 -631 1245 596 -1179 449 1252 -1091 -162 1037 -984 -1116 1196 -414 -1343 666
3006 666 434 -1694 -61 813 -1245 -176 809 -873 -1230 824 -401 -950 818 506 -1627 241 594
3023 594 -1145 8 1253 -576 -738 1090 -169 -811 1105 507 -1097 356 797 -1207 446 1406
3039 1406 -526 -486 1720 -63 -692 1265 586 -899 1090 1006 -981 26 1439 -816 -335 1805 -316
3056 -316 -823 927 411 -1185 586 558 -1269 -382 952 -1362 -958 1054 -114 -1009 873 116 -1730
3073 -1730 432 776 -1268 158 1067 -1175 -693 1168 -677 -757 1176 197 -1277 669 540 -1213 321
3090C21J048k180N85J387j519k51J937r28j153J712k10k139K004P95j938N78J299
3107A348k165J38J814j569r42J747k3k039K002O24k053O11J474j996k70J940o87
3124d6j357J768J39j905R87J007j571L44J832j640m42J564j088o30J769m41j554
3141a264J679M21k249R40K078j752k11J914j426p07J862n32j260J369P07k284
3157g15P41J427j639O5J721j571r48K213r86j296J484L32k187J028P58j649N24
3174f98K057j501j132J815p27j501J832M03j712J129P11j886J92J954j273p30
3190a067J885o09j368J323N55j848J369J100k343O67J214j230l43J981p05j155
3206e74J406K30j761J245J002j696K69J174j392m74J782p21j238J735l81j622
$$ plain form
3090 321 1369 -811 -226 1161 -358 -609 1328 400 -753 959 749 -1390 614 1409 -529 49 1348
3107 1348 -817 -679 1135 -434 -1376 371 348 -1691 311 935 -1118 -507 967 -1029 -1299 641 -46
3124 -46 -1403 365 504 -1401 -414 593 -978 -634 1198 -442 -884 680 -408 -1038 731 290 -1264
3141 -1264 415 836 -1413 -473 1605 -147 -358 1556 130 -577 1285 753 -507 862 1569 -715
3157 -715 26 1453 -186 -121 1600 29 -919 1294 308 -988 496 828 -1359 -331 427 -1222 -698
3174 -698 1359 -142 -1274 541 -186 -1687 145 548 -1164 -35 676 -1210 -1018 936 -337 -1067
3190 -1067 818 209 -1159 164 719 -1129 240 1340 -1003 -336 878 -352 -695 1286 581 -574
3206 -574 832 1062 -699 546 1548 -148 121 1295 -97 -571 1211 490 -748 987 606 -1016
3222a016J223O61j440K01J532j960j33J587j140o12J651l14j858J499N92j858
3238a385Q16J373j739k13J669q97r99J741j27j838J489J072k149P64J392j255
3254b86l82J889j155j208K149n92j157J410N23j961R88J198j707mJ956j268j182
3271g89J819k60j634J478P19k083P65Q39j397L1J681j539n93J502o34j250J327
3288a8Q73k254P75J139j703R7J725j153q35J855o07j548J678L56j492P19J319
3305I26j925K29J500j115n68J834r39q92J376J73j558J249J237k033J78J614j407
3322a21l14J637l40j332J422K39j832J479L70j403J97J194j390m61J862j014j061
3339h68J531J28j849J192O76j640K30J454j517l76J929r48j372J905N9j829J107
$$ plain form
3222 -1016 207 868 -572 -371 1161 -799 -932 655 -485 -1097 554 240 -1618 -119 473 -1385
3238 -1385 -569 804 -935 -1148 521 -376 -1375 366 239 -1599 -110 962 -1187 -423 969 -286
3254 -286 -668 1221 66 -1142 1007 415 -742 668 1191 -770 218 1416 -291 -295 1661 393 -789
3271 -789 1030 770 -864 614 1333 -750 15 854 -543 -512 1169 -370 -963 539 -95 -1345 -18
3288 -18 855 -1399 -624 515 -1188 -1091 634 -519 -1354 501 -106 -1654 24 380 -1112 -393 926
3305 926 -999 -770 730 -385 -953 881 -58 -950 426 599 -959 290 1527 -506 -328 1286 -121
3322 -121 -435 1202 862 -470 952 1191 -641 838 1208 -195 2 1196 -194 -655 1207 193 -868
3339 -868 663 791 -1058 134 810 -830 -600 854 -663 -1039 890 -58 -1430 475 534 -1295 -188
3356a88N00j642Q26J069j342j02J642j056j336K174p1j505J238M26j501M25J624
3373A181j544j82J803j152j083J853l92j323J279O73j871Q27R63j424J02J531
3389A241q08j018J299l21j275J465M37k087J162O95j271j58J612j390o20J651
3405F14m43j233R35O43j515O64R56j027n17J647q78p81J810n04j260J331K41j579
3423h96O27J342j420J85J340j029q23J625j85j346J366J11j161N06R90j778L80
3440a66J484j387m77J519m95j137J030J63j459P40J280k100L63J449j306m15J688
3457G74r17j166J489k77j274R02P78j173Q3J357j386J4J661j134q22J566k00j429
3475a154J387M63j723O37J576j710l64J935q14r26J590L17j781J237L77j425N67
$$ plain form
3356 -188 312 -1330 -504 565 -777 -879 763 -293 -1629 545 474 -1031 207 633 -868 -443 1181
3373 1181 -363 -545 1258 106 -977 876 484 -839 440 1113 -758 69 1032 -392 -290 1241
3389 1241 433 -585 714 393 -882 583 1020 -1067 95 790 -481 -639 973 -417 -1037 614
3405 614 171 -1062 -127 516 -999 -335 621 -406 -923 724 -154 -935 875 371 -889 442 683 -896
3423 -896 -269 1073 -347 -162 1178 149 -674 951 766 -580 786 897 -264 242 1232 -546 -166
3440 -166 1318 -69 -546 973 478 -659 371 534 -925 -185 1095 -1005 -642 807 -499 -914 774
3457 774 -143 -1309 180 -97 -1371 -469 309 -864 -781 576 -810 -796 865 -269 -1091 475 275 -1154
3475 -1154 233 696 -1027 -390 1186 -524 -888 1047 233 -693 897 1214 -567 670 1047 -378 189
3492A89J432j533j91J445r28r25J458k44j150Q84L75j376M46J063j292j82J684
3509A155j079j003J394j95j456J522Qj384O88R13j448K7J463j129q93J687n2j355
3527a137J294L36j472M62J387j571J3J590j240p61J663m28j002J565R1j456O56
3544a0Q94j158j0J112q34l67J089r6j573J248K96j528R65R93j297j37J217j336
3562e32k02J727p84j047J468j05j318N95Q89j536J80J438j307j60J350n41j359
3579a244J455J07j514J188P56j379L70J081j264m51J493l36j122J654n0j896J454
3596C02N27j142L90J370j821L8J546j225j79R59J75j645R16R91j672L50J175j176
3614a21m08J500r39q87J652k57j296Q12M36j069L30R90j096o03J660q81q40J191
$$ plain form
3492 189 1621 88 -103 1342 414 -511 947 703 -447 437 812 -564 -118 945 -347 -529 1155
3509 1155 76 -927 467 272 -1184 338 346 -1038 -350 563 -885 -858 605 -524 -1417 270 218 -1137
3527 -1137 157 493 -979 -517 870 -701 -688 902 -338 -1099 564 136 -866 699 790 -666 -10
3544 -10 884 -274 -284 828 -6 -373 716 620 -953 295 591 -937 28 1021 -276 -413 804 -532
3562 -532 -734 993 209 -838 630 525 -793 -198 691 -845 -665 773 -534 -694 656 115 -1244
3579 -1244 211 318 -1196 -8 748 -631 -261 820 -444 -895 598 262 -860 794 744 -1152 302
3596 302 829 -313 77 1447 -374 -336 1210 -15 -194 765 940 -705 211 1202 -470 -120 1055 -121
3614 -121 -529 971 32 -855 797 540 -756 56 492 -577 -247 743 -353 -956 704 -177 -1017 174
3632A74j00j153J172O98k112N72J247j366M5J278p98o51J275k70j245J435K93
3649D94j409Q71O96j315J00J485o81o48J264o53j006J276O22j799R06P60j233
3666b70p9J273o14p95J283n94j058J286p9r61Q16N52j029r4J314j183n07J413
3684F74m19j135J237P0j414R97O10j380K68J147j478k25J638o24j017J499J47
3701E95j479R14P36q42J51J322j479l61J375o78p13J352j68j183Q56O12j350L37
3719cJ552j191m22J125j086p28J358K88j429Q98N06j563J30J393j347%J419j213
3737c13j046J578o1j073J065J76j089J68Q99q39k27J094o17q36J345m49r21J119
3755b7O05j559M66J087j129J01J346o51r37J318l93j020J158P30j486N74Q82j052
$$ plain form
3632 174 74 -1079 93 791 -1321 -749 498 -868 -823 455 -343 -994 281 11 -1234 201 494
3649 494 -915 -44 652 -663 -563 922 241 -407 857 204 -802 474 1096 -703 203 963 -270
3666 -270 -349 924 310 -485 798 204 -854 432 353 -608 208 760 -269 -363 951 -232 -739 674
3684 674 255 -880 357 427 -987 10 620 -760 -492 655 -823 -1048 590 -34 -1051 448 595
3701 595 -884 30 766 -76 75 1397 -82 -443 932 254 -459 893 725 -458 398 1010 -340 -3
3719 -3 1549 358 -64 1061 -25 -753 605 893 -536 362 868 -695 -565 828 -519 -519 900 -313
3737 -313 -1359 219 158 -915 150 326 -763 -595 304 -535 -762 332 -285 -1121 224 -225 -1146 -27
3755 -27 578 -981 -515 572 -557 -456 890 239 -698 620 227 -793 365 1095 -391 183 1065 13
3773A3l3J029r53n25J556m22j229Q80L00j224J036N93j275o2R93q69l39J288l24
3792D33j349J236j17j101R23M59j114q3J157j337j06J179J61j261R15M72j812
3809a345J041J078j399J55J116r28n76J229l43j038J706K54j398L81Q75r25K93
3826A76J124j270n22J500m81q47R96K33j034Q65K37j210J8J039o99m52J010m48
3844B35j009J381K4j121J89J375j722j51J444p82m44R15m18j071J079J47j154
3861a083J039K09j313N89J104j362J09J424r89n26J073k36r92R86P97j231M70
3878F8P46j121J79J219o44o85J390m03j335J302K01j252O20P24j045j73J196j008
3896b1k75R62M0j298O59P07j260L44R81j128l55J273q30n93J651q06j154J107
$$ plain form
3773 13 -20 1009 56 -469 1087 665 -564 316 616 -608 428 1021 -254 -316 677 -192 -531 757 433
3792 433 -916 320 203 -898 25 484 -630 -713 444 -893 -999 180 341 -920 -5 467 -1345
3809 -1345 -304 774 -625 -470 646 -282 -858 371 28 -1010 696 950 -448 -67 808 -117 176
3826 176 1300 30 -492 1008 527 -320 676 909 -125 740 977 -233 -215 824 125 -327 683 235
3844 235 -774 607 631 -490 -301 1074 -648 -799 645 -137 -581 334 -84 -1155 -76 71 -1083
3861 -1083 -44 165 -1148 -559 545 -817 -708 716 -273 -799 274 38 -954 32 829 -402 68
3878 68 814 -307 -128 1091 447 -238 1152 749 -586 716 917 -335 285 1009 -36 -209 987 -21
3896 -21 -296 666 706 -592 67 774 -486 -142 839 -289 -644 629 -201 -794 857 51 -1103 4
3914DK27j277N92P73j356K99J086j032o33J691n21r83J377R0j350R32O57j336
3932g60L93J560j315n23J307k65j096R62Q47j420O18O13j388O15J013q01p78J369
3950I51o06j171J409Jj367J328K72j236J2Q12j99q42J598q91q81J026l41r17J114
3969G2N09j358K49Q47r38l11J466l83q50Q36J29j210R13O66j247K24R19r56M2
3988c81J254n35q20J415l80j154P10R05j210J73Q93p60l86J326m41j216J729k49
4006H73j340O63L75j217N27J052j236k44J325r12l88Q98k33q28R79m7j229M54
4024e28J166q27l50R41q71n10J128j13r68J285J19j141P4Q82r43K47R94o97n63
4043f75J310m38p24R08J85j017M94O91j279j74J910r60o09J072n42j162J600o3
$$ plain form
3914 4 231 -1046 -454 319 -1037 -738 348 -684 -1317 374 -147 -1130 247 337 -1013 -81 576 -760
3932 -760 -367 1193 -122 -645 662 397 -699 263 1110 -310 308 921 -467 148 1161 360 -418 951
3950 951 345 -826 583 584 -783 545 817 -419 -407 405 206 -636 962 71 -810 216 -125 -1042 72
3969 72 581 -777 -528 319 -619 -930 536 153 -697 139 268 -942 -29 637 -610 -386 533 -423 -381
3988 -381 873 338 -482 933 553 -601 109 1014 -196 -23 870 110 -276 1050 609 -607 1122 873
4006 873 -467 196 571 -646 -119 933 -303 -547 778 -134 -522 376 143 -685 294 247 -982 -528
4024 -528 638 -189 -539 402 -469 -979 149 36 -932 353 472 -669 -595 287 -656 -409 585 -112 -675
4043 -675 635 197 -527 381 566 -451 43 734 -545 -719 1191 231 -378 694 152 -1010 590 527
4061E27r52Q33L08j237J14J099n75p27J094m96q39J038L54j200P27N87j312K75
4079c82J019j006j63J114n95p14J261k13j125R15J76p14K0J002n18q15J387m12
4097B37o51J182k85j241J019M72r83L24R43j027l95P53k10q45J527m20j077P65
4115H8N72r03p9J046j064Q1O99n54o57J067J58j406P95K99j222N36J059j110j46
4134g41J037o39q81J396l28p38R72L76j365J88J343j122k58J409q09o85J127J48
4152D30j031R14K41j214Q49O06r92l31J263p96l50J265n03p04Q21J81r96K29R42
4171H24j093L28Q27q38m01J101l85j186J165K94j118M39P86j368L6J633j223j80
4189c59Q53o67n08M39O32j041L31P68j158R4J171q65k89J060o11o12J017m6q93
$$ plain form
4061 527 -425 408 716 -521 -407 692 117 -610 484 -12 -851 187 541 -659 68 655 -657 -382
4079 -382 637 -369 -532 582 -13 -727 534 321 -804 111 287 -427 -407 595 77 -738 649 237
4097 237 -414 768 483 -758 261 733 -250 74 1017 -10 -405 348 138 -707 820 400 -677 88
4115 88 660 -243 -322 724 -340 -259 440 -114 -771 296 454 -952 -157 142 -1080 -544 515 -595 -741
4134 -741 296 -343 -1224 172 -156 -894 78 454 -911 -723 620 -502 -760 649 -160 -845 282 430
4152 430 -601 313 554 -660 189 795 -197 -528 735 -61 -411 854 351 -353 468 649 -347 -118 824
4171 824 -269 59 886 48 -353 748 363 -823 342 636 -482 -43 743 -625 -589 1044 -179 -359
4189 -359 494 -173 -681 -242 390 -651 -320 448 -710 -616 555 -310 -599 461 -150 -762 255 209 -684
4208f84R85L42j044K11J135j047l21J415j059n69J272m90q84J065M19j194K42
4225b06J088j093k16Q70l52q37J162K31j378R29O68j087J53P26r56J27M80m47
4243a38n22J009j53p68M08O37j167N69P47j052j49J300p57o64J172j82n89M02
4261A03P02j226L46J119j349j01J228p46m72R28k4j031J204P9j203K58Q76j033
4279c42K54J064p95o27J002l63q39Q82K89q95K52R36j307RJ227p19q59J301m11
4298E9r74J027K61j098J24J154j174J38J143r94n83J108l62p11J102N0j113J066
4316B23K19r48Q7J069q33m69J150l26p86J178l82o44O70P27j398M35J273j305
4334f0j25Q94l35j153J259L30j353O60O17j039L9J059r70j58J076m13j041J114
$$ plain form
4208 -684 301 643 -401 -190 945 -102 -423 992 -67 -636 636 146 -738 327 746 -448 -206
4225 -206 882 -211 -427 443 91 -746 416 647 -731 198 866 -221 -68 658 -298 -171 309 -138
4243 -138 -660 349 196 -572 -164 473 -694 -125 622 -430 -579 721 -36 -700 472 290 -299 103
4261 103 805 -421 -75 1044 -305 -406 822 76 -396 532 508 -523 681 760 -443 -185 691 -342
4279 -342 -88 976 181 -446 556 193 -646 236 525 -370 -118 818 -489 -480 747 28 -831 470 59
4298 59 -915 112 373 -725 -601 553 -621 -483 660 -334 -917 191 -171 -882 220 270 -843 223
4316 223 442 -506 -419 650 -183 -652 498 172 -614 564 182 -462 208 935 -463 -28 1245 -60
4334 -60 -185 709 374 -779 480 810 -543 117 734 -305 -266 793 -177 -335 741 328 -713 401
4352D01M8j079O17N85j376N69P85q45j03J023l10j146J304O7j267O68M97p34J87
4371a09J043j052n29J292o06n75J203p4j025J091K7j247M07J139j098j16J113
4388H84n47p79O90L48j020Q83K23j066M43O30j134Q1J067o20q57P05M36j497J131
4407AO6r53M94P00j160N1J149o54p34J130j33j075J283k90r25P29O37j235P04
4426b15O81o28l90J114j40j189J295J9j098O15R12j363M4J293q07m65J149q3q48
4445a04Q66Q7j151R29K64o06k90Q75q22j81J043o48o77J078k34j328R23P11j530
4464g95O07Q98j202nN51m6o07O28J49j328R32M79p45k03R05q66l96J131l28p89
4484a030R84K63j202Q59N08j120O34N98q01m42J424o43o19J163k28j116J208N48
$$ plain form
4352 401 449 -630 -13 572 -804 -235 550 -295 -398 625 315 -831 473 540 -727 -59 438 -296 -109
4371 -109 934 -118 -647 645 39 -536 667 593 -432 659 686 -561 -154 985 -113 -229 884
4388 884 337 -442 248 596 -424 459 682 -384 59 689 -445 -364 703 83 -774 -69 367 -1130 1
4407 1 67 -886 -392 308 -852 -801 348 -306 -1040 90 -43 -1118 165 -125 -1050 -321 316 -919 -215
4426 -215 466 -162 -552 562 422 -767 528 547 -551 64 976 -387 -343 950 143 -322 827 744 -104
4445 -104 762 849 -302 627 891 285 -5 870 48 -133 910 262 -415 663 429 -899 24 735 -795
4464 -795 -188 710 -492 -497 54 8 -599 29 178 -1150 -218 261 -484 -687 218 -648 -1044 87 -241 -1030
4484 -1030 -46 217 -985 -126 382 -738 -104 494 -307 -749 675 32 -587 576 348 -768 440 988
4502I88j403O57O05r61l1R96p99m61J215l04q39Q57L48r64J67Q03j198j81J119
4521F14n74q44R33J4j012Q71O83j376L26J043j511L77Q75r66l27J051k70q68Q72
4540h9N54j329P25Q30j215k89J547p96m86J189k62j120J028M24q88K58R30j095
4558h4M9J194r57o48J337m69q10P39N56j479Q47M17j078K85R36q47m03J269o88
4577A66p41Q56J77j312O30R06j139k3Q79r31l04J206m44o79P38K50j005O27L86
4596B43q20J91R63j027k24R10n33m26J091R1j016Q67K28j058P4J149q09j71J039
4615G62r35l62R58k10q07N85J038j029P5P29r58k43J335n31q07J136j60j134J011
4634D53K29r08p8R54j211J80O31k64o60P50M8p23M82P18j138M94L87q40j80J380
$$ plain form
4502 988 -415 242 847 -114 -145 851 52 -409 806 502 -337 520 868 -96 71 874 -324 -505 614
4521 614 40 -804 129 143 -869 2 685 -691 -365 678 -833 -456 419 -547 -874 177 -93 -961 -89
4540 -89 465 -864 -139 691 -524 -813 734 -62 -548 641 379 -741 287 711 -177 81 1011 -84
4558 -84 -35 1159 202 -446 891 422 -388 351 907 -572 275 692 -386 -101 835 -12 -415 854 166
4577 166 -575 281 458 -854 -224 682 -457 -480 399 -532 -836 370 -74 -753 -15 235 -770 -143 243
4596 243 -577 -386 577 -450 -674 236 -297 -723 368 459 -557 310 538 -520 -446 703 -106 -277 762
4615 762 -173 -535 423 213 -594 -9 1029 0 75 804 -154 -397 938 407 -400 736 576 -558 453
4634 453 682 -226 -304 650 -561 -381 250 -14 -674 76 124 -599 -117 601 -537 -43 344 -496 -676 704
4654G04l91r59J383n75r10N88P20j007M59P97j140k64J573p31o71J333n10r94
4672e95Q37L07j245P69N23j093K2R10l94o17J397m89j093R78J70j016L87R67r32
4691b07m23J091o94n86J216o23p35J442n6j143M77O47p57K90O78q84k16O51J80
4710C48j008R49K36j171P73O83j140J4J039n73l49J046o58l60N19Q9p70Q27J58
4729F52p73n4R49r89J4R49o28p45J156j06j084J052J18r47PP52p02j58R32n87
4749a92m08Q81k63j162P53M32n72R4R72r93k30R27k88p38R07n2q17P58J90p28
4769e29K83N77q47K24R60o44p37J096rp28N12M44r20K73Q18r47J05Q05n70m15
4789b49Q36m0j159J051j33q85N57Q70r93l0Q91p34n85R96lq31O69j18m43O5Q31
$$ plain form
4654 704 313 -646 737 162 -748 -160 560 -447 12 809 -331 -595 978 247 -424 909 399 -595
4672 -595 242 549 -696 73 596 -497 -475 435 41 -576 821 332 -761 217 387 -629 -242 725 -207
4691 -207 -630 461 -233 -819 397 -226 -961 481 425 -718 -241 406 -351 -61 617 -267 -483 168 348
4710 348 -660 289 525 -646 127 810 -330 -316 723 150 -199 847 189 -171 348 437 -333 494 652
4729 652 -121 -175 774 -215 -201 748 120 -625 531 425 -659 393 511 -436 -429 323 -379 -537 395 -192
4749 -192 -600 281 18 -1144 -391 41 -531 -437 535 -458 -688 239 -49 -787 120 68 -749 9 199 -529
4769 -529 -246 331 -516 -292 668 24 -713 383 374 -354 158 602 -318 -45 773 -174 -69 736 166 -249
4789 -249 587 547 -612 439 306 -579 -22 848 -145 -175 716 -18 -603 393 390 -441 228 110 -333 -268 563
4810E63j046K42O86o30l78R78n23r81J290L2q75P75K7k96l70R05o41j46P37n2
4830B97o50O23L99j004M81P67j185K02P63n32m98J100k40r34Q08L22j357Q25N52
4849G39j158K98P75p46j25P84n42q85J188j53q94M51L75o30L33O94j102O3Q04
4868B69p79m07J031J17r55O93M96j174K37J114r19l15J044p28m00J198l63o96
4886e37P46K87p54o7J007q79P9N96j66m34O43K68j135N49N38j062K22O95o87r7
4906a88J018o26n87J001j86r84Q98j36n67K75O97p98k80P51n05l04R26j16p82
4925d93N39N5m45K0P91p24k63J225p81o21J011k34j152J057J77o85L82Q30j103
4944d14J51Q33o93l04R42k00j035R44L94r76L58O86q53k28Q13l09l55Q78j75j116
$$ plain form
4810 563 -483 -241 445 -185 -563 415 -108 -1089 201 233 -642 133 160 -136 -506 399 -242 -388 349 297
4830 297 -353 270 669 -335 146 913 -272 -70 693 161 -337 763 523 -411 397 719 -638 187 739
4849 739 -419 -121 654 -92 -217 567 25 -860 328 175 -719 -268 107 -523 -190 504 -598 -535 269
4868 269 -510 -917 114 231 -724 -31 465 -709 -472 642 -277 -592 452 -276 -676 522 159 -537
4886 -537 209 496 -258 -325 682 -197 -118 478 312 -122 521 789 -346 203 741 -321 -99 596 -91 -188
4906 -188 830 204 -383 618 432 -552 346 210 -357 -82 615 -183 -463 288 -217 -521 405 289 -493
4925 -493 46 101 -344 -324 467 -257 -520 705 -76 -697 314 80 -1072 -15 162 -523 -141 689 -414
4944 -414 -263 570 -123 -427 515 315 -720 224 618 -358 0 686 -167 -395 418 109 -246 632 457 -659
4964f59R92j45j080R43L50q41K27O79o39m87R66l26o10N79L67j242N48M33n30
4983d75j93R94n61m94J235n89n98R11Q7q71N80L38o53K8Q88n62k08P06j38q23
5003c98R76j47o45L25N68p59M77L28q10J38N54k72n79Q68L8q82O03J73p69L38
5023A25L05m60j99R16p47o44J248n05n92L59M64q27K33O43p20Q2O89m50p62Q10
5043c2K03r57M13O39q04K94Q03j075J19R13n15l62N69J24r93P90L45q66N74N03
5063F85q02P7O89o99l82J003o2r88J087q0j037N65N64o85k10Q02m12n28Q14j37
5083B64q29P23J23q07M22L86r45J45Q83l93o56Q31l05n19P60j35k65p4P01q13
5103e03J6O92k05m01R34k74q65J049q5n14R1P16n92k26J137j069k70J209n88r40
$$ plain form
4964 -659 333 188 -892 51 401 -440 -213 466 -173 -660 306 -20 -630 -51 316 -926 -378 55 -475
4983 -475 -668 326 -235 -729 506 -83 -681 230 317 -554 26 364 -289 -261 627 65 -143 563 425 -398
5003 -398 578 431 -214 111 679 -80 397 725 -85 53 607 335 -244 624 662 -220 383 556 -213 125
5023 125 430 -30 -229 687 -60 -704 544 39 -553 -194 270 -557 -324 319 -401 -319 370 -80 -842 -32
5043 -32 171 -786 -373 266 -538 -244 559 -516 -397 516 1 -361 208 332 -661 129 474 -392 182 685
5063 685 -117 -40 649 -50 -432 571 509 -479 608 528 -509 56 620 -65 -275 527 115 -413 401 264
5083 264 -565 158 281 -526 -104 282 -663 -518 365 -28 -684 147 -158 -677 83 -52 -317 -391 310 -503
5103 -503 -487 205 0 -401 533 259 -606 443 358 -156 -65 651 59 -167 970 -99 -369 840 252 -688
5123f88J098Q0n81M27K78r75M94K91k65j94M65k41r37J116o5m00p2M03q44L15
5143b95M08n05j76Q97m68m65P10K34j158O30L62o60L74J74l90k73J081o10o28
5162g58R30k45j77K86K11m59J36R05j335K77P78j09o67R11k59p90R13oq32L68
5182G8P49p73j28O18l99l39P75j32m90M74k1r13K84P68p58k29J007n18l96N18
5202A75l97o37J041M9q70M27O52j000L42P85q79q3Q49k66p56N93M59j144N87N46
5222D73q74PJ172q17k85Q83l43n58Q85j10r43Q39Q7o73K07N64k99r20J003k84
5242A4j60M60N3r15P31J82l88k41P10o40j55P07m54m50N74L12j274O65M98q23
5262e94K37P01p03p5N86n4o01P09k98m54M67R0j55L1N60p30l94J093o06k79R13
$$ plain form
5123 -688 410 490 -91 336 614 -361 133 424 159 -35 430 189 -748 368 303 -97 -169 234 -610 -295
5143 -295 113 -392 -568 329 -139 -604 106 340 -818 -188 174 -486 -112 62 -328 -601 480 -130 -758
5162 -758 172 -73 -250 36 247 -212 -76 829 -506 -229 549 440 -227 684 425 -365 548 542 -290 78
5182 78 827 54 -74 544 145 -194 581 449 -41 433 412 -501 -217 551 -207 -436 571 53 -343 175
5202 175 -222 -859 182 231 -639 -212 440 -560 -218 567 -312 -395 454 188 -568 25 484 -660 -73 473
5222 473 -401 -394 778 -39 -324 559 216 -342 543 433 -510 329 416 -257 -50 514 215 -705 298 14
5242 14 -146 314 367 -548 183 365 -23 -264 446 -194 -349 358 -96 -546 28 340 -934 -269 229 -594
5262 -594 -357 344 -359 -434 152 98 -503 206 -92 -546 -79 11 -144 -113 447 -283 -677 416 -190 -469 444
5283D44j47n05P77k66m88L55N58o35o25J239o52l49R94j75r52L37N04l77K3K89
5303C49m15j07M24k9o76P81j49n47O51J33r15L58M74r61K50P33n89l37R77l52
5323E3n17L61K96q45M21P13j119J41J040p37m16J062o41k88M81L66p77J69R33
5342F96r10J92O63r34L2O43o1q69Q79L25r05M28L04p05JM78j43l69N98j76k57
5363i0L97K3q71N83M93o73J06N17o18K00L52n60m09P43J9p41L52L15n23O0P82
5384D57o05P8L79k75k92O24k12o91N27M08p35N32N58q37Q2P95o53p26J017l76
5404E5k00M62Ko11K10N49m73n5M80m69o67J227m94k63J50J06k26j67Q61q20j91
5425e34Q83o36l11Q46j28r84P04O30r42J55N53o95j62Q20M2q74P04N6o48N03L74
$$ plain form
5283 444 297 -208 569 303 -185 170 728 93 -532 707 55 -294 700 525 -427 -90 414 37 60 349
5303 349 -66 -173 251 222 -454 327 178 -369 282 415 -500 -142 332 -629 -379 354 -235 -572 405 53
5323 53 -464 -103 193 -652 -231 482 -637 -496 544 -193 -609 453 -188 -476 5 371 -406 -237 696
5342 696 -214 -22 641 -293 -261 382 321 -548 331 656 -249 179 483 -222 -221 257 114 -255 343 167 -90
5363 -90 307 330 -541 42 535 -138 -32 485 -133 67 419 -141 -550 193 212 -529 -177 138 -385 -325 457
5384 457 -148 -70 309 34 -258 366 154 -537 -10 398 -337 195 753 -84 -2 793 140 -586 431 55
5404 55 -145 317 319 -292 -82 467 -6 -61 419 -50 -717 510 16 -247 -97 9 -217 -384 477 -343 -534
5425 -534 349 -287 -598 248 120 -864 -160 470 -472 -317 236 -459 -621 199 241 -633 71 127 -521 -18 356
5446C56q61N55K42l99Q1M17j85o94J080l35n40O95J24o16L25L17n38p5N07m94
5466c8k57Q89j04o26M45j58o32M17M76o63P8M64n92JN23p9o48N88K59o41N5O81
5488D38q23J0M93m44%O63l19l36L86j7n84L04P89j232M04M75l97k97P73l36j37
5509a87N41L4m97M8K74r09N87O57n53k39O99m36k11M87j65o13Q36Q5o46LO87p07
5531b25k53N60j34l72P35q1o02M93m8p18K98Q82r17K7Q55o02k49Q33k82o14O01
5552A87J96q23K32P76k99m83M38L7l24P49n09p46P80N32j116M84M48o08p2N00
5572C79m63j61M91N8r36P98K51q45L63O22q42J59M63p57j35P51j83r17R21K13
5592B30p34M9O02m76k91R10n37l63P86j18q67Q34K23q30L74N04p82L03L51l75
$$ plain form
5446 356 -505 50 292 -107 -26 391 206 -488 592 257 -283 412 536 -80 245 562 24 -51 456 -38
5466 -38 -295 594 490 -136 309 151 -481 -64 412 -251 -173 291 -301 -300 223 144 -504 84 343 -298 -243 438
5488 438 -385 -375 118 -326 -326 337 18 -318 68 51 -533 -229 560 -672 -268 207 -190 -487 286 -50 -187
5509 -187 354 388 -109 -61 213 -696 -109 548 -5 -244 455 19 -192 295 130 -483 353 438 -208 -205 482 -225
5531 -225 -478 82 -52 -424 311 230 -372 121 73 -645 -347 535 -382 -355 500 -102 -351 482 200 -414 187
5552 187 383 -440 -208 568 269 -214 224 261 -63 686 177 -569 211 743 -373 111 559 -49 -121 379
5572 379 -84 -245 246 304 -632 166 417 -428 -65 557 -285 -126 337 -420 -555 196 13 -904 17 230
5592 230 -504 -455 147 -329 -620 290 -247 -610 176 58 -809 25 248 -582 -208 296 -486 -183 168 -207
5612b07m45J213k71o47M83K48o43L46M33o29l3P50m14o00P82P2p23Q70m24o52
5632d91P96Q9m58m1Q01p52n2O26k09l92M52k48l37M00K63j234P10N58m64m25O72
5653B64l01m62M68J40o19M48M61p95J91O52p50L05M31o12k34P13l39m49P30J72
5673D14o38L61M74p10K48L94m67l01N79J74q95N23M45j047M34M47m89J35M01l70
5693A12n08P06P4q08P90k1o28L60L01o98j42J026q96m58J002k74o90O16K56p64
5713f44K52L87m73K44N80p46n23Q57j83j74O88q5q10M57M22o86J91O46m13m36
5733d49O62j64n50O36K94p50N51J77p34O77K92n80m68J101n85J5K41L80r93K50
5753CM74n47OP32o44j47L49n02O4M24j64p38O37K52p02N50J64n28m2O40k79p70
$$ plain form
5612 -207 -652 561 290 -357 126 374 -269 77 510 -119 -152 598 184 -416 366 438 -285 585 161 -491
5632 -491 305 394 -64 -105 696 -56 -108 518 309 -83 369 121 -216 184 447 -787 -77 481 17 -408 264
5653 264 -37 -499 -31 109 -510 -62 399 -396 -205 447 -303 2 433 -179 -413 300 -39 -488 242 414
5673 414 -224 137 611 -99 149 543 76 -225 354 528 -367 156 601 -446 -12 435 -54 81 482 112
5693 112 -396 310 384 -424 366 345 -283 77 378 -320 -462 564 -332 -790 212 -62 -752 -136 120 -644
5713 -644 -392 -5 -478 -234 346 -400 -923 -66 -249 -423 265 180 -630 -173 249 -437 -246 400 -13 -449
5733 -449 213 49 -501 135 429 -321 230 407 -327 350 642 62 -406 695 110 125 366 746 -247 3
5753 3 477 -70 -64 668 24 -123 226 -276 -212 212 48 -690 -53 199 -503 47 211 -317 -359 281 2 -768
5775g68J003k87m57O18J78o08l6N53m69l5L04r6m49R27J77q96L69L76p00m0P74
5796D38m06m54R88k44m99K71J41l42N4M58n57K47L19m26l11P66n41j45P13r9r38
5817e67O83J96n85lN70m34j16O32m66o65J200l10o38K94O02r19L74L31n74L28
5837f7M72l63k99N30K47n67L21n5m88K54L19m34J50M87p13J43M65k28o38P40O8
5858C44q14P33o2m20K4P68o71Q0M44m20n00P79m3q22J003K5j115L23R52j141K05
5879c28O11l97m33Q58j47q61M65N02r21L92N67l73m75P72k7n44N01j48o36P74
5899A52P5n44J06K61p1k05P27l57l42P40o6p29L13N64p06%O34n84K7O94l71n94
5921b76M89j38o14R71p8p44M11M17o07j36P09m69l79P19j06n40M12n6l34L80R9
$$ plain form
5775 -768 235 -52 -509 109 287 -321 -357 196 -273 -308 -4 -100 -549 378 555 -341 28 404 -296 -336 438
5796 438 32 -422 566 322 -177 94 235 -107 -53 405 -152 95 414 -12 -323 443 -98 -243 470 371 -567
5817 -567 116 312 -273 -276 294 -140 -256 376 -90 -755 445 135 -503 -209 393 -526 -152 179 -395 -67
5837 -67 405 42 -257 273 520 -47 274 219 -269 -15 304 -130 20 507 -206 -63 402 174 -464 276 344
5858 344 -470 263 201 -219 -195 573 -98 -18 426 6 -494 285 242 -580 423 448 -667 -344 608 -533 -328
5879 -328 283 -114 -547 311 164 -697 -232 270 -651 -259 308 -65 -540 232 205 -339 162 14 -622 152
5899 152 227 -317 -211 50 -21 -226 501 144 -198 542 476 -253 60 624 -82 -82 552 -32 -5 689 318 -276
5921 -276 213 75 -539 432 354 -390 21 438 -169 -305 404 -65 -444 275 169 -371 41 -15 -349 31 130
5942A30l22k01M63o7o67Q27k11j90K57J36j135R81L84o43J63M85m30%K32k4m42
5963b74L65M51q20L40K25j61m11R88p67k88P19n26m48Q81K21o94K53L29l96l86
5983c99P20p32l41R41p3o18L79J21m84O83J32r04N63J50m57k40J068o31m42J054
6003D90k33n79L07O23q78J68O23p49j56Q06j16n85N99N1n52L54K49k29P8K91p72
6024b10l5O61j38l49Q07Pr03K95J90p00L33M12n08q6N60k6p25N96m8o13O16R9
6046B35n28M6O97q07k71J053q13kM95j51o91R25k23n01M66L07n73O2L11j44k60
6067c67O61j43m63O78j94n30M24L25o40k73J149l94m70N87k7o16P89J52q10N04
6087C42P6n57m0P06m38m42P34r0o34O15L46r77L57O84j198J98N38k67k78P20m40
$$ plain form
5942 130 -192 -393 70 3 -664 163 -48 -238 19 155 -980 1 385 -258 -95 390 -40 -40 192 168 -274
5963 -274 91 542 -278 62 287 126 -285 703 -64 -352 367 -159 -607 274 495 -199 54 383 -13 -399
5983 -399 321 -411 -752 189 116 -502 -123 -2 -486 197 329 -575 -12 138 -319 -559 509 -122 -564 490
6003 490 257 -322 -15 608 -270 -102 521 -228 -384 422 306 -279 320 371 -181 173 422 193 271 562 -210
6024 -210 -245 416 278 -71 736 743 -160 135 325 -375 -42 370 -138 -224 336 310 -415 181 133 -480 136 235
6046 235 -293 -247 450 -357 -628 425 -388 -390 105 -46 -737 188 -35 -536 -70 237 -336 -274 37 -107 -367
6067 -367 294 151 -312 366 172 -358 66 391 -249 -522 627 233 -237 350 323 -293 496 648 -162 342
6087 342 418 -139 -179 527 89 -353 381 291 -343 272 618 -359 -2 682 -516 -318 220 -47 -325 395 -45
6108d5m74O42j16o31O26N00r27M06J96l91K0P56m58p89P31K43m92J2N46o48K05
6129h8O97l31j57L13k07l00M66Lq59O23J13l65o9R67r49j09Q65j09q96J006o26
6150a2m26M28M25q23M48M18n00m31J003n64l45R96m15o11K83j9k84J43O84p13
6170c15j26O41m68k60P28k70k39L63j15l53L74O91p62m93Q24l84l52Q83k87j74
6190i4J92n0m26O64K08o15j48Q12l19l7M39k26m30L07K86p26J42N33q66K68N77
6211D91p53R7O45l36q41Q60J45m73M69o1o63R0L02j97k26N58k6p41M74M73q77
6232e90R77J03p00K57N91o77j97R16o32n14O87K48j169M99O45p01J17P64o39k37
6252b52L45J62o33N94P7o30M65L68m76k12P26p14l11Q52m81l83O29J62p91L71
$$ plain form
6108 -45 -519 123 7 -624 2 502 -425 -19 177 -214 -194 562 104 -685 46 289 -203 -191 355 -293 -88
6129 -88 609 278 121 434 227 -73 393 396 -463 160 273 -92 -161 806 -143 -252 613 504 -392 614 -12
6150 -12 -438 -10 415 -408 40 458 -42 -473 530 -34 -379 617 202 -409 -126 -145 -429 -286 398 -315
6170 -315 -441 200 -268 -528 200 -70 -309 54 -61 -414 -40 651 -111 -604 220 -164 -516 367 80 -94
6190 -94 98 48 -378 286 494 -121 -269 543 224 187 626 400 -30 277 563 -163 -21 512 -354 -86 491
6211 491 -262 -165 480 144 -697 163 308 -165 304 243 -420 -330 -28 -225 -451 107 81 -660 -186 287 -590
6232 -590 387 490 -210 47 638 -39 -236 680 48 -466 221 469 -700 -201 444 -257 -140 624 -15 -252
6252 -252 93 255 -378 216 293 -337 128 496 20 -192 534 -180 -491 361 -120 -503 126 288 -503 -132
6272a32M61o90pQ23q66M8Q43m06l75M15N0p61O28Q5m22M0K99l74M8R47m06q06
6294e58P82k0p75P52J33p64L54N13n25J09M28m16l91O83J9m94M09J97p11K51M32
6315D08o55p7Q53m11l47L87k66j73K82K12p30K02N90o20j20Q02p76k24Q34J41
6335C12p06L22K85o44rP09m91k16R59o96j06L52J53p41P77J51q18L18P56p87P2
6356d8O61p22l12Q96k47o18Q21rn52O3M17l90r0M17j44j42P25m42m94L18J85n14
6378b21L76M79q71j35R19q27p8O72n83j07N70j75m13L48J81o04K65N17p26j50
6398e63R60m23m42P67j66n89M21J69o29M78M41o92n5Q37m95l48P27k56n70M90
6418F2M15o16K24K82o46J58O40l15n27P09K00q61O73L21j035L34M05n91L17J13
$$ plain form
6272 -132 329 -361 -368 455 -411 -363 480 74 -301 114 164 -597 31 116 -306 -266 33 -341 -293 654 248 -558
6294 -558 224 204 -571 181 314 -450 -96 417 -108 1 429 13 -378 305 324 -170 239 436 -275 -24 408
6315 408 -247 -324 529 118 -229 158 -108 -281 1 213 -517 -315 275 -345 -465 337 -439 -663 171 312
6335 312 -394 -72 213 -431 -440 269 -222 -438 521 -175 -281 71 224 -517 260 411 -407 -89 667 -120 -48
6356 -48 613 -109 -421 475 228 -390 431 422 -130 -67 350 -40 -130 287 143 1 726 284 -210 108 293 -221
6378 -221 155 634 -237 -372 547 -280 -358 314 -269 -376 194 19 -394 -46 135 -469 -204 313 -413 -563
6398 -563 397 -26 -468 299 133 -456 -35 134 -495 -17 424 -268 -323 514 19 -329 398 142 -428 62
6418 62 477 -139 85 367 -279 -121 519 204 -323 386 586 -275 398 719 -316 18 423 -168 149 262
6438B62k79k99M71l70l42O07J23k21k89N82o60JO17l82n7O68l31m83M98p8m88
6459d50K79P14p53l15Q93j49k99N40k60p54P59j3l17J54M53n66p8O86n08J6L84
6480D16l88k78O43k6o39K66M18m63m7L95j89l33O13o51o6O72j66n38K54N13p46
6501c40J79N59o52n05R59l40k56N91j24p54M31O82p98J30O49k77m83P94k88l97
6521b40L62L87r54O87R6n46J57M20m82K6O61o07n7M92q8q38M88Q02j095K46M45
6542C62k35m28N79k85m18P62j87m49L26K77o34L4N95l53l19M21r4l93L51K07p78
6563f59R20m5r07O16N36o96j23O18j86k03L31j48m36N54P9n55M56K27n78J41L21
6584B63n0m82Q51k90k07l3M00o04K27M56m18q7M65k34m97Q10o71j44Q5N63q26
$$ plain form
6438 262 -17 -316 155 -215 -557 50 173 -48 -337 245 -415 -414 203 -179 -236 432 101 -382 116 38 -450
6459 -450 -171 543 -210 -525 368 219 -80 460 200 -554 205 192 -125 29 482 -84 -162 524 16 32 416
6480 416 28 -250 393 367 -272 -6 412 -51 -98 297 108 -225 388 -263 -329 343 177 -361 -107 406 -340
6501 -340 -161 398 -254 -759 200 -140 -396 195 71 -683 -252 430 -368 -238 411 134 -349 445 157 -240
6521 -240 122 509 -445 242 338 -208 -51 369 -113 -87 574 -33 -90 402 314 -524 -36 766 -329 -83 362
6542 362 127 -301 278 -7 -425 337 150 -299 27 304 -330 -296 299 -54 -373 48 -46 -439 -88 119 -659
6563 -659 261 216 -691 -75 461 -235 -358 260 74 -129 202 54 -382 172 251 -304 152 379 -199 -58 263
6584 263 213 -269 582 292 85 52 452 -152 75 531 113 26 491 257 -240 570 -101 -245 -160 403 -423
6605d23M65L83p83J79M69m57l78N90j54k70P08l95k02J22L0j83M98K15p34k51
6625e71P39k73j80K86J13m48J73P37k30m25M95l87j85O30l57o11N05K76j67j4
6645A06M66n52j07O21m14l19O12n17J5M31p6n61J95L01n26J10L83l30n22J133
6665D49l45n18K94K18m58L75L09o06R9P03r13j2N02N8n27N44k65m54O30K49p60
6686d28L48L97l68m02J067m24m24N82m13k62M89M23m07k56M05m14J92K94n91k32
6706d24Q80k56q0K54l64k72Q2M89p09J51L39j39l91O05j86n43R42j18o50K63N49
6727D22r40K14O10m30m58M45k5j70M67J8m08J71M91p44M73K40l73l22L92j16j70
6748b13J05L77l35m8P14q17L3M33k66J34J16K75o86K04M79p43M93q8m95N0Q20
$$ plain form
6605 -423 42 425 -358 -179 290 -167 -545 45 -109 -379 329 -66 -268 -146 -116 -299 199 414 -320 -571
6625 -571 168 -105 -285 1 114 -334 -161 576 346 -79 416 29 -156 474 117 -494 11 287 120 106
6645 106 572 20 -87 534 120 -199 413 -104 -89 342 266 -295 -100 201 -325 -215 168 -162 -684 449
6665 449 104 -414 -120 98 -360 15 324 -282 -183 520 -393 -405 97 155 -372 172 -93 -547 83 332 -428
6686 -428 -80 317 -51 -453 614 190 -234 348 -65 -327 162 585 178 -78 327 -87 105 399 -192 -424
6706 -424 456 200 120 374 10 -262 -180 309 -400 -249 90 -49 -440 165 -21 -564 378 260 -390 -127 422
6727 422 -518 -304 306 -124 -582 -137 -162 -332 135 153 -255 -84 407 -337 136 376 3 -319 73 -43 -213
6748 -213 -108 269 -66 -114 600 -217 -184 249 -17 117 233 508 -178 26 505 -238 255 167 -328 -278 542
6769E42p12L29P8j90k16O0J96n25K41M31n30J24N45m67k02R13n91l08K92j61k23
6790c74L38L71m88J57Q2m02j98Q90j51p49O81j76m05P87N7q04L21Q28o74k90N42
6811C43p0n87M67L87p64J68N86p37j4N92m93j09P45o47P2K03o0m90R12j32p59
6832c87L54J99l64J3M53k17m62K96p5j45M44j65j39j0N88n71l88R12l39L5K39
6853B71j59l95L40N87n53j77L40k93j04Q59o76k14M71m8l85N93p7l45L08J38n38
6874e7L9L07l29k62M02n3j29R0J40l95J55L53k44m46O23k16n00P71k00p80Q54
6895A23j25j70j27L99k50o1N06o37n7O68J39o64O82l91o07N52K58m21K22M83r67
6916d45L30J23K32p77Q32L13m55J56j16p24N45K31l49k60M58k6l29P50j43k48
$$ plain form
6769 542 -170 159 237 47 -169 -109 87 -438 -197 234 -296 -172 373 -94 -296 617 26 -282 10 -151 -374
6790 -374 -36 335 -153 4 86 -316 -514 376 225 -524 157 -19 -424 363 420 -384 -63 765 91 -199 343
6811 343 273 -314 153 540 -224 -56 530 -207 -221 371 -122 -231 514 -133 -61 142 82 -408 504 372 -387
6832 -387 -33 166 -198 -185 268 51 -411 -115 -190 -335 109 -56 -195 -205 383 -188 -576 336 -3 32 271
6853 271 112 -283 57 644 91 -86 254 -39 -143 716 40 -174 297 249 -136 457 380 35 343 481 -57
6874 -57 -18 289 -40 -302 100 47 -82 8 148 -247 -92 261 17 -429 194 -22 -522 249 49 -731 123
6895 123 -2 -172 -299 100 -150 -211 295 -342 -399 269 408 -256 426 35 -572 -20 238 -183 39 522 -445
6916 -445 -115 8 240 -537 295 608 153 309 193 -531 14 245 -104 -364 94 68 -261 489 346 98
6936I8r1L67l08J48J89k16l81P07k19o01P22l27l11k3N06o04J36N68n42RM52n47
6958b68R5K07J88k68J4Q8k42J16K08m56L36L97j27n75N79J47j247Q03M26n84M76
6979C13l5m04J21N10po20N49l06Oo8M17p64J54R8l80K01N79p36J15M45m6o77O07
7002G2M4o02N35M81j004P8O06n92k25P84o2m99M14M2l69N3K26l17L47K68m00r7
7024b17O86m03k91M17J26o18N54L38o84K14M12k64k72O02j35r80N79M98o70L79
7044B71K11n62O0K76l11l9L97p0n35M02L21o71O0N53n95N7N34l97J6K90m55l37
7066e24O67k43m53O35K12p20O9M21l54n8O32l34m3K82j16n60O90J30m57J89L3
7087I8L5m68L62K04o29Q10J25p00K69K23p00K9N12j02m02N45m7m01O16k13j08
$$ plain form
6936 98 7 374 66 214 403 187 -194 513 294 -307 415 88 -223 -246 260 -344 -208 360 -182 -173 279 -268
6958 -268 -173 34 222 -46 -32 56 -186 -70 138 -318 18 415 288 -287 292 439 -808 -5 421 -163 313
6979 313 278 -126 -5 505 498 -122 427 121 127 59 476 -288 -134 -36 -416 -215 364 -372 -257 188 142 -535 72
7002 72 116 -486 49 530 -474 -396 210 -382 -607 177 115 -384 30 72 -297 -244 -18 -335 12 280 -120 -217
7024 -217 469 66 -225 192 318 -300 254 592 -92 122 534 270 -2 600 465 -515 64 562 -108 271
7044 271 482 -80 -20 256 -55 -94 303 233 -302 100 421 -250 -190 363 -232 -175 359 -38 -22 268 -187 -524
7066 -524 143 -100 -553 82 294 -426 -357 64 -290 -348 284 -50 -93 189 73 -487 203 333 -124 65 98
7087 98 133 -335 27 231 -398 412 537 -163 106 329 -371 -342 170 68 -334 211 164 -237 379 166 58
7108E8K94Q0l31L6K31m91N0J56L3o51O86l1p32O74l5L7m4K99o17K21pJ2r2L24
7132A60k36o99O58L53n78N13N09p97j14M42j22m17P21l13j30M82L18o42J25L24
7152E57o81n4P15o41j65N75j39l78K42M03m88K4J25l17J74K44n7l58L72k62m65
7173e74P01j77n49K42M07m03J12M82o31J30M48ln41M23J70p08N43L43o83L28J39
7194A99n08P4O72k60k13N24m0n96J74M95m60J08O5p7k21M40l10k64K91k3k20M96
7216C46j48n22L91L65m94m10N44N9o64P18k42l35L70M6n89L97J99k80k0L06r1
7237e4m92Q31l15j76J27M40p96L87K77k42L1M29m64l21N52j00q1K87On97K75M15
7259D19l91K2M54l77k57M12Pk71K55J1n87L28N25o10k58N61m50p2P20l94l31M88
$$ plain form
7108 58 352 432 101 137 368 -123 -73 83 116 -535 151 120 -612 62 27 64 20 319 -298 -77 -84 -72 -164 160
7132 160 -76 -775 -117 236 -342 171 680 -117 -231 211 89 -328 393 80 -50 432 750 108 233 557
7152 557 -124 -178 537 -104 -269 306 167 -211 31 434 -54 -30 95 -222 -48 196 139 -219 153 -109 -574
7173 -574 127 -50 -599 -357 50 -353 -241 241 -390 -260 188 185 -356 67 237 -471 72 415 -268 60 199
7194 199 -309 -235 437 177 -36 488 448 -148 26 521 61 169 234 157 -64 376 66 -198 93 70 -150 346
7216 346 198 -324 67 432 -62 -472 72 131 -533 185 -57 -392 -22 24 -565 -168 31 -249 -269 37 -54
7237 -54 -546 285 -30 -206 -79 361 -435 -48 229 -13 18 447 -17 -338 214 114 33 320 326 -271 4 419
7259 419 28 50 504 127 -130 282 289 18 273 284 -303 25 550 -60 -318 243 -207 -279 441 47 -284 204
7281B04J37o97J87M94o52l55P64k26j35M55j44n61O54m2n93O54J13o55R5P78m45
7302C0k09M82m54k29O87j89k88L28j31O5n3M76l24k74O16k41p25N27K81n33J73
7323A5K90m38K29O49p72l34L73j59l39N74R6l39M05r4l44mL86m95k59P05l05k26
7345c86N15j48m57N28o6k69J81J36k55k9N01j91r9P7r6l7J73K02m63M14J32m90
7367a27l02R77m79m08Q44l12n30L76K88l60L07K60r80K91L97j56q1L54m8o56M71
7388A26R6m82L89L52m41l36L43l93M1K83r4k04L69J01k24pL34p28J69O42p72M0
7410c96P55n05k68N87k67l37M81K3k34L4P07n37j51N95l01l31M14L62o81L01L56
7431F07j003N59M05p16k04Q97k77n78O32n4r81R34J38m92%L98m06k38P33m39k53
$$ plain form
7281 204 341 -356 -169 325 -327 -682 82 -144 -279 176 32 -529 125 83 -510 144 257 -398 -303 475 30
7302 30 -179 303 -151 -380 307 118 -170 158 27 92 39 515 191 -83 533 292 -433 94 375 -158 15
7323 15 305 -133 96 745 -27 -361 12 -147 -486 88 184 -155 250 156 -188 -192 194 -301 -560 145 -160 -386
7345 -386 129 -19 -476 52 -14 -283 -102 34 -221 -250 251 60 -39 38 -58 -95 78 280 -183 231 363 -127
7367 -127 -429 548 69 -339 505 193 -337 39 327 -33 274 534 -446 -155 242 86 5 359 311 -345 126
7388 126 222 -260 129 481 40 -296 47 -346 -305 -22 -116 -320 49 150 -74 -81 253 -475 -306 336 -436 -396
7410 -396 359 -146 -414 173 -94 -431 50 73 -161 -127 580 43 -108 487 186 -145 269 631 -50 251 607
7431 607 -396 163 568 -148 -352 545 268 -310 322 268 -713 221 359 -133 -133 265 -141 -379 354 -85 -338
7452c38M97M0n40L64K38q20L68O20o03k56O09k87j33K74R6m29O6M60o50J49O53
7473C78o25K3N56k87m73O84k01k6L71m40j11J27N07n67j98O55m40j72L27L62p50
7494c00K96L04n51pJ054r43K6N22m33l9K26k05q8M74np30L21J44k02k71R54m11
7516A36k41M41m58l61N40K55k42r7J15l49k96R56o55K49R4M33q32M39K26r30Q60
7537B83j91l97L91K49o63K84P20n92n62P72l39k79N92ln06N2M64l42r4N55j95
7558A99o97P26k9m51L15K70n86K48O31j017J55M11k91l94Q50j13q02N71J07m04
7578c01K94O2p7k28O60n63l44Q70J1n42J61K2J19j27M00k81j52L29n05l3N60p5
7600B60o96K50M45j73k43O51n31p9K11O7m76M56j38k98O30j9m93O2L53m88j93
$$ plain form
7452 -338 159 199 -341 23 261 -559 -191 429 -174 -430 179 -108 -241 33 129 -300 -234 226 -424 -275 378
7473 378 -247 -224 332 45 -428 256 55 29 400 -40 -151 -24 483 -84 -282 373 -67 -239 88 450 -300
7494 -300 -4 300 -251 -258 796 -147 -121 401 -32 -71 155 -50 -138 336 331 -399 -78 66 -136 -407 547 136
7516 136 -105 336 -122 -483 57 312 70 -27 88 -261 -557 399 -256 -7 87 520 -312 127 353 -577 283
7537 283 92 -305 86 335 -328 -44 676 84 -478 294 -45 -324 268 265 -241 -189 275 -67 -161 394 199
7558 199 -498 228 199 -252 63 333 -253 -5 626 -391 -236 175 -116 -510 340 227 -575 -4 103 -301
7578 -301 -7 55 -22 -250 410 -153 -497 373 384 -158 3 25 144 17 417 136 -16 313 -192 -225 335 260
7600 260 -436 -186 259 86 -157 494 -37 -116 95 162 -314 142 4 -294 336 317 -176 -114 239 -249 -442
7621d42O44l52N5L03l77J09J19J43m84K74K06n48J83L29l47K57Q7l1l40L95l4
7642A49p21P90M00l63k50N67m59k03N63m88k37N87K00m65K72R7l43k5L75l38m8
7663F0L25q4o10K32K19r27P04K48l15J1N10o39j01O66m50p1M05k03l72K31L97
7684B36o43N95n2k59k81N99j5l53J51L56o83M20j68k95KN85j59j78O87o98J9K37
7706A03K82q52N46J13l80J71K01J98m98O84m55l47P12j75n42L74J47m16k41Q27
7726D52n23l58P81m11k49M43m06k2J88N02m02k51O95p73N3O01l46n06M90O3m11
7747c90J67M36m09J56M21o67j37P98n14k66Q61m01n95P23J19n88K68K14n51N82
7767B27M06n21q3K43j9m81M07L5o15K37P39p17QQ80q13N5N11k42o05M89J84m70
$$ plain form
7621 -442 202 -150 -95 208 -169 -60 59 202 -282 -8 198 -350 -167 162 -185 72 159 128 -212 183 149
7642 149 -572 218 618 255 5 572 113 -90 473 -15 -252 335 535 70 342 439 96 71 446 108 60
7663 60 385 301 -309 -77 142 -785 -81 167 -148 -137 373 -266 -367 299 -151 -222 183 -20 -392 -161 236
7684 236 -407 188 136 -123 -404 195 180 -173 -22 334 -349 71 -97 -392 -390 195 36 -142 545 -153 -134 103
7706 103 385 -467 79 192 -188 -17 184 382 -116 568 113 -234 478 303 -239 135 282 -134 -375 452
7726 452 -71 -429 352 -59 -308 135 -271 -293 -105 397 -5 -256 439 -334 -281 320 -26 -532 -42 21 -390
7747 -390 -223 213 -196 -40 381 -286 -423 375 -139 -405 456 55 -540 183 302 -286 -18 196 -355 227
7767 227 633 112 29 272 253 -228 179 214 -401 -164 575 -142 -134 746 -67 -12 499 257 -348 141 325 -145
7789a45L18O8n26M7O59n03m62P10j9o04M45k2j50j2M40o02P7L86k07r3M92j47
7811A50n25R5N56l69L61n9n24P56l57p3m3N04k49l20J10K35l98L48J95l82j52
7832a41N76n24j36L36k11l30O78l15k56J82L08k19k55M13j48n8M59k01m80M92
7852A70r6m44N8N51n86J40L08l65j9L02k99m6O92n15l52O09M00r19P12j1n41J4
7874b37O55l58o55P88M4l43L0O61q18M6N71n24k7O46j51n06M47k08k03M84K32
7895E74k50p3J10n10K37qk85o3N30L0p89N13J60m35J76M26m12r5L15M1m45O29
7917C76m78j94J33M81o57J65O24r10J12J60ql93P23j16l20K62K30q31O52J73j98
7938a4n5J84j16k70P29l75m56N55K31o26K60L72n66Q3M2j12j68P80n04n82P89
$$ plain form
7789 -145 173 241 -285 -238 421 -82 -544 166 147 -457 -12 -34 -184 -196 244 -358 -281 105 -102 -195 297 150
7811 150 -375 -280 276 -93 268 209 -315 441 84 11 -32 472 223 -97 13 248 -150 198 393 11 -141
7832 -141 435 -89 -225 111 -100 -430 248 -67 -323 -141 167 -52 -307 106 -42 -100 359 158 -322 170
7852 170 74 -370 -312 239 -347 -207 101 -264 -283 19 -280 -326 366 -149 -501 108 508 -411 301 290 -251 -237
7874 -237 418 60 -595 193 237 -106 -76 585 -233 -187 384 -140 -167 479 328 -178 269 61 -142 342 574
7895 574 324 251 361 -149 88 80 -205 -268 262 292 -497 16 176 -259 -83 343 -69 -164 151 192 -253 376
7917 376 -102 -296 -163 318 -339 -174 450 -460 -348 -188 -196 -589 134 18 -302 -40 190 -641 11 184 -14
7938 -14 -69 115 -1 -271 458 83 -373 182 413 -213 47 419 -147 -64 -22 -134 -302 478 -26 -608 181
7959A81k54k79K32K73n01K63K78m14p5O08l85o78Q35j69n86P51O8k01k61L94j32
7980e2k55M65j17o63R21Q0m91J99L28q30K82L67l33k84R22n46j66M86l67k78L00
8001c2j26Q2p7O01m98j95N63k10n48O21P3j82rJ13n61o3M27o1N2J07j17j81K36
8024A5j55P6K33Qm94M5N34l82k12N53l73N2L69R5o72K26K66r2K6L49q95K22N84
8047C78n92L44j85K76k85J20K41m97J64K22l01m3M84l92k96K14n3j02M18Q2n39
8068c42K67J52l17q4O66p29L34R1l92k6N01k7r62J072o6m06J14N08n03k42O62
8089B71j90m09M32J20m70L75N40o66j17M49m84K8L10p4m29J56N77p10L22O07p88
8110a50M36K05n03J07K97m64L2N36n95l51M50M09j39l36R0L0n59N70j55k55L87
$$ plain form
7959 181 -73 -352 -120 153 -348 -85 193 -221 -296 312 -73 -751 84 -85 -671 80 148 -53 -314 80 -52
7980 -52 -307 158 41 -622 299 379 -112 87 415 -415 -133 234 -99 -383 539 -7 -173 313 -54 -332 -32
8001 -32 -158 -76 -153 448 -50 -245 318 108 -440 181 254 72 63 176 -385 -448 -21 -82 -30 77 -40 -221 15
8024 15 -140 -64 169 177 -317 -272 262 -120 -332 221 -152 -100 269 364 -308 -82 184 92 118 467 -428 -206 378
8047 378 -214 130 -55 221 -64 56 297 -200 -36 186 -115 -158 326 -66 -362 -148 -201 -303 115 197 -342
8068 -342 -75 77 -240 -324 342 -387 -53 38 -354 -380 121 94 -868 204 138 -268 -154 354 -149 -391 271
8089 271 81 -328 104 224 -246 129 669 3 -114 335 -149 -121 189 115 -314 -158 419 -291 31 638 -150
8110 -150 286 491 -12 95 392 -72 -40 496 -99 -450 0 409 270 -66 24 54 -505 65 -90 -345 42
8131D2r5l87L26L59o33J43L90o71j2Q71p20L6M02P9n45M41m7p0j85M47n53L86
8153DJ65l67m67Q15Q9n62M79n4J03j82J52m10K87J87n0l11N72m63j46L66J01p38
8175d30N60O2k39P3M10l04l28N13m15k72J82M41l80J40n9k01
$$ plain form
8131 42 -53 -440 -114 245 -388 -245 145 -526 -538 333 -387 -351 51 130 -415 26 -21 -91 -276 171 -382 4
8153 4 169 -198 -665 150 239 -323 156 102 205 23 175 -235 52 239 189 -122 450 -13 -159 207 308 -430
8175 -430 130 192 -47 26 436 132 -196 317 -98 -370 -188 253 -127 13 -46 -247
8191b47
$$ Imaginary data points
##PAGE= N=2
##DATA TABLE= (X++(I..I)), XYDATA
0@%%%%%%%%%%qJ6j6J6j7K5l2L4m2M9n7O8p7Q9j04J19j36J56j76J98k23K50k78
33a46L12l51L90m33M81n33N91o55P26q04Q88r84J095j215J352j513J697j916K180
52A162k504K913l448M184n261O989j0208J8175p1053j24652J48731O1901r3977
65f7048k6526P8415j3410o3292P315N4552O208k7246l998L0657m260l3796J7770
78d4659M8432j9195k5479L6575J2018l8541J7169L9496k3815j2943L7150k643
90B3565k9286J3119J3774j0682R833L944k0202J3075K1770k7838j2786L5523J542
103C5351l6143k04J9697l802j3481q158Q484J7473j7647k9381K6659K3362m3406
116b1196j2878M7739j0078m6175K5658K9623l5442p546L7378q969k6207J9090
$$ plain form
0 0 0 0 0 0 0 0 0 0 0 0 -8 8 -8 8 -9 16 -16 18 -24 25 -32 36 -41 48 -56 63 -73 83 -93 105 -118 132 -146
33 -146 166 -185 205 -228 253 -280 311 -344 382 -422 466 -518 577 -638 714 -799 898 -1018 1162
52 1162 -1342 1571 -1877 2307 -2954 4035 -6173 12002 -59051 -183703 -34972 26929 -67048
65 -67048 -93574 -15159 -28569 -91861 -84546 -29994 -23786 -51032 -55030 -24373 -28633 -62429 -44659
78 -44659 3773 -15422 -40901 -4326 7692 -30849 -13680 25816 2001 -10942 26208 23565
90 23565 -5721 7398 21172 10490 20323 24267 4065 17140 38910 11072 -1714 33809 35351
103 35351 -792 -996 18701 14899 1418 -6740 1744 19217 1570 -27811 -1152 22210 -21196
116 -21196 -34074 13665 3587 -42588 -16930 12693 -22749 -30295 7083 -1886 -28093 -9003
128i003J7095j3464n181J1037J0257K154j5588k286K8735k309l1782J8491L1730
141C9886k9236j9588L9584O029l1339P953J6590j4590N22J0597j4863o82J5323
154B6186j6217j1095K3184j714k1327J0091P071k0458j056J2263q525j087P169
167D485j4571p633J1000p848o228J6827q054k0099J8523P456l0803R061L4274
180F390k0759k6169K5627Q955k5606M434K0362l992o594J940R5J0253L251j4882
194a6695Q817J9620j8127j2208K8092K466k4020J4976J7825k0098j451K1524j0496
207A0225j1553J8465K85j3964Q870L926j0221R337L916j6453O870J4100j8091
220E712o996K1880n056j8279J1889M411j4921L568N504j0373N493L625k0317M483
$$ plain form
128 -9003 8092 -5372 -10553 484 10741 12895 -2693 -4979 23756 21447 -10335 8156 39886
141 39886 10650 -8938 30646 36675 5336 13289 29879 15289 15811 26408 11545 10863 26186
154 26186 9969 -1126 22058 20344 -983 9108 16179 -4279 -5335 6928 -1597 -2684 4485
167 4485 -10086 -17719 -6719 -14567 -20795 -3968 -12022 -32121 -13598 -6142 -36945 -27884 6390
180 6390 -14369 -40538 -14911 -5956 -31562 -27128 -6766 -10758 -17352 -15412 -15317 -5064 -1813 -16695
194 -16695 -7878 11742 -6385 -18593 9499 11965 -12055 2921 20746 648 -803 20721 10225
207 10225 -1328 17137 17422 3458 12328 16254 6033 15370 19286 2833 9703 23803 5712
220 5712 -1284 20596 15540 -2739 9150 13561 -1360 2208 7712 -2661 2832 6457 -13860 -9377
234i377K2212j6275j5647K3205J203k5867J0446J7643j8312n312J5879n689q255
247a4146J0777n90m235R378n024q532J3364O24j4082J3410J1747k2377q72K5380
261A4822j0846j7544K0876P919j9492K606J0379r348K149R190r175J161J0317
274A3014j3434o827J8650k577j6749J3761P046j9159J572J4094j0089l513J1935
287G724p817p421J1211n120j0302J5214K743j7228Q650J0922j9197o47K0804r714
301a78j3868J6709L423j6375N730R364p788K647M337r417M136Q330j3640K66J9765
316A3441r107j6762J7479O069j9882O466J5443j3713n963J3742n411p276J0832
329E358j734p445R201j944j2742J0999P070j6785K714J5099j3548q164J7644k103
$$ plain form
234 -9377 12835 -3440 -19087 4118 5321 -20546 -10100 7543 -10769 -16081 -202 -5891 -14146
247 -14146 -3369 -3959 -8194 1184 -3840 -12372 992 1616 -12466 944 12691 -9686 -10558 14822
261 14822 3976 -13568 7308 15227 -4265 -1659 8720 -628 1521 10711 1536 2697 13014
274 13014 -420 -7247 11403 8826 -7923 5838 12884 -6275 -4703 9391 -698 -4211 7724
287 7724 -93 -7514 3697 -1423 -11725 3489 6232 -10996 -2346 8576 -10621 -11268 9536 -178
301 -178 -14046 2663 6086 -10289 -4559 4805 -2983 -336 4001 -5416 -1280 7050 -6590 -6324 13441
316 13441 4334 -12428 5051 11120 -8762 -2296 13147 -566 -6529 7213 1802 -5474 5358
329 5358 3624 -3821 5380 3436 -9306 1693 8763 -8022 -5308 9791 -3757 -11921 5723 3620
343C620j4781J0573N421j3233L583O996r391K910Q667j2036p79J5905r182j1357
357a3084J6811K637j7603P031J2381j2027j611J3266o714n611J0054l709n297
370c476J0846j850j1405J1387M718j5743P044J4621j4615o996J7236m248j3086
383e567J2379M407j3116M551N927r182K266P699j1262J9J2056j0681p951J6555
397H100j498j6677J0441R794j5848l59J2048p951m929R816m684o078J0940k927
411A88r755J0362K823j3970P041J0279j4793k588J6442o379j0721J3384K374j2677
425g990N815N447q570L480O855r673J149J1100r696m657J5135l980j3745J2172
439B842O061j5646K382J3006r806m192J0104m676m644Q798l550q035J0819M50
$$ plain form
343 3620 -11161 -588 4833 -8400 -4817 2179 -7212 -4302 4365 -7671 -8450 7455 -1727 -13084
357 -13084 3727 6364 -11239 -4208 8173 -3854 -5465 7801 1087 -4524 5530 1821 -3476
370 -3476 7370 5520 -5885 5502 10220 -5523 1521 16142 1527 -5469 11767 7519 -5567
383 -5567 6812 11219 -1897 2654 8581 -601 1665 9364 -1898 -1879 10177 -504 -8455 8100
397 8100 6602 -10075 366 10160 -5688 -6047 6001 -1950 -6879 2937 -1747 -7825 3115 188
411 188 -9567 795 3618 -10352 -3311 6968 -7825 -10413 6029 -350 -11071 2313 4687 -7990
425 -7990 -2175 3272 -5298 -1818 5037 -4636 -3487 7613 -2083 -6740 8395 4415 -9330 2842
439 2842 8903 -6743 -4361 8645 -1161 -5353 4751 75 -4569 4229 679 -7356 3463 3913
453C913j3030Q275R081j4676j52J4388p781r246J3803p1j2325O932N414q541L344
468f72N444r231K155Q854r924k570J4217n920j1473J3623L997j5006O053J1114
482A0661j0770k699J0911n122n128R388l105n842R952j201j1520R196O381j4000
496b898K493J2319j0886o671J3086k196j0698R110K860j0487L619M815r154K851
510a837P588r888j666J1924p655r114J3412J923j4035N639Q146j1193o65J0692
524C271o218m002Q282l453n300Q919k288q756R530L755j2835M676J1882j0959
538c496m252J3579l215r808R914K619r902M995N755q255L341O702q498J6J0073
553I568q485o206J3027k021j2626R501O559j2350P82R213p325k946Q736m694o154
$$ plain form
453 3913 -9117 -842 8239 -6437 -6589 7799 18 -9228 4575 4504 -7821 -889 4525 -4016 -672
468 -672 4772 -4459 -2304 6550 -3374 -5944 8273 2353 -9120 4503 8500 -6506 -453 10661
482 10661 -109 -2808 8103 2981 -2147 7241 4136 -1706 8246 7045 -4475 4721 11102 -2898
496 -2898 -405 11914 1028 -5643 7443 5247 -5451 3659 6519 -3968 -349 4466 -4688 -1837
510 -1837 5751 -4137 -5803 6121 -1534 -10648 2764 4687 -9348 -3709 4437 -6756 -7421 3271
524 3271 -2947 -6949 1333 -2120 -7420 1499 -789 -9545 -15 3740 -9095 -4419 7463 -3496
538 -3496 -7748 5831 2616 -7192 2722 5341 -4561 434 6189 -2066 1275 7977 -521 -505 9568
553 9568 1083 -5123 7904 5883 -6743 2758 9317 -3033 -2251 6962 -363 -3309 5427 733 -5421
568e421Q893k435q674Q962K631j1551O031Q776j2129k858J2640n212p534J0146
582B265R32r671N161L543q149M857N345r294J847Q981q664m274J3410k484j0647
597f842J0354M120j2759L061J0176p107k297Q550n220m445Q023k141n634Q656
611F495l61j1290N917O081j1136J253J1584q176p339R591j496q605P676L995r220
626e031K889M207q776K832Q887p918l412J0127m955q817J0125L252j0334N315
640a609P107r689j179Q510n049k002P853m284o074R462j23r292Q456N972j1122
655c063J637J0663q239n094J0835j179r087O885K360p917M401M565p524J740M756
670E739q198k94J0499o535p485J0420k35j1158O115O181q973J052Q297p857m397
$$ plain form
568 -5421 3472 1037 -7637 1325 3956 -7595 -1564 7212 -4917 -7775 4865 -347 -7881 2265
582 2265 3197 -6474 -1313 2230 -5919 -1062 4283 -5011 -3164 5817 -2847 -7121 6289 3805 -6842
597 -6842 3512 7632 -5127 -2066 8110 1003 -1294 7256 2036 -2409 5614 3473 -2161 6495
611 6495 6134 -5156 761 6842 -4294 -3041 8543 367 -6972 2619 1123 -7482 194 4189 -5031
626 -5031 -2142 2065 -6711 -3879 5008 -2910 -6322 3805 -1150 -9967 158 3410 -6924 -1609
640 -1609 5498 -4191 -5370 3140 -1909 -3911 3942 -342 -6416 3046 2923 -6369 2087 8059 -3063
655 -3063 -1426 9237 998 -4096 6739 5560 -3527 3358 5718 -2199 2202 6767 -757 983 5739
670 5739 -2459 -2753 7746 1211 -6274 4146 3911 -7247 -1132 5049 -3924 -2872 5425 -2432 -6829
685f829Q740k074m704Q218j309q604O594K235r958M266Q622q960k692R276l997
700a176o102Q971J410p299N707K142r200L348P016p172R30R375p807n395J1414
715F162K13r728O421N271j0086J22P275n759j016P375m194m520O065l186n604
730e189R257J060j0400M612O145j1053q34J1736n262p538R153n32r030M878M288
745A291n989L404M510q386p40O681n449k211R102l133p729P883K535r119M581
760b769P511p156jO782n778l123R207j799o751P523J325q325N377O232q658p55
776a158Q611m971m921Q721o11o355M439O89o759M187L700p277K062O433q886k536
792d632J0504l727p043R413N83j1682L681O915p269j014P457m417m306N963j680
$$ plain form
685 -6829 1911 -163 -4867 3351 2042 -6562 32 2267 -7691 -3425 5197 -3763 -6455 2821 -1176
700 -1176 -7278 1693 3103 -4196 1511 3653 -5547 -2199 4817 -2355 -1425 7950 143 -5252 6162
715 6162 6375 -3353 3068 8339 -1747 -1625 5650 -109 -1125 6250 2056 -2464 3601 415 -5189
730 -5189 4068 5128 -5272 -660 5485 -5568 -6402 5334 72 -7466 1687 1155 -7875 -2997 1291
745 1291 -4698 -1294 3216 -5170 -5910 771 -4678 -6889 2213 -920 -8649 -766 1769 -7350 -2769
760 -2769 4742 -2414 -2415 4367 -1411 -4534 4673 2874 -3877 3646 4971 -3354 2023 8255 -403 -1158
776 -1158 7453 2482 -2439 6282 5671 -684 3755 4444 -2315 1872 5572 -1705 357 6790 -2096 -4632
792 -4632 5872 2145 -4898 4515 5098 -6584 -2903 4012 -3257 -4271 3186 -1231 -5537 426 -1254
807a254l678O552p28p003N884K120r121L230P831o813k827Q972l855o248Q759
822A821J843q137M420M801p892J471O176o349j204R028m034o825P109J129o237
837b880N542L608p902Q72M906n946n80O672l935l785P125l224p057P836L738r001
853d011K779P214q427l462Q873k697n998O765J180p123L304K710n329K840M533
868C151n684Q5O110o537k815R292j458p308O525K815q853L455P883p241j394P343
884E369l603l784P162q66n941N221J909p721L377N633o870M56O792n389m924O708
900C529p7m820N157Q0q331L901M721p469J373P313o872l844P967k324p677P516
916A43L652q497M78N461n877J2O368l832l274N383k444l641O541j90o794N893
$$ plain form
807 -1254 -4932 1620 892 -6111 -227 1893 -7228 -3998 3833 -2980 -5807 3165 -690 -6938 1821
822 1821 3664 -4473 -53 4748 -3144 -1673 4503 -1846 -3050 5978 1944 -4881 2228 3357 -2880
837 -2880 2662 6270 -1632 -760 4146 -1800 -2380 4292 357 -3428 3697 473 -6584 1252 4990 -4011
853 -4011 -1232 5982 -2445 -5907 2966 269 -5729 1036 2216 -4907 -1603 1107 -4222 -1382 3151
868 3151 -2533 -2448 3662 -2875 -5690 3602 2144 -5164 1361 4176 -4677 -1222 6661 -580 -1974 5369
884 5369 1766 -2018 5144 4278 -1663 3558 5467 -2254 1123 6756 -114 342 7134 1745 -3179 3529
900 3529 3452 -1368 3789 3869 -4462 -561 4160 -3309 -1936 5377 -1495 -5339 2628 304 -7373 143
916 143 3795 -4702 -4224 1237 -4640 -4628 1740 -2092 -5366 17 -2427 -6068 473 283 -6511 -618
932f18L701q652J568P590o188l009Q757j845o748N526K619o249L660M371n949
947a466L62N319n683j670P209j822m914N812k57o945M831M355o412Q40N172n914
963a183j923O853l414l761P529q20p807N097M594p950J099O476n139k969P202
978C884k552n258N429J404n004L309J920n710K689M512o514j09P679m965m445
993c731P866m31p296N185L500p368J046O380m952k426N906l197l971O042l72n431
1009c250M428J244o574L265M375o236k70N988m528l804O425r47n578N494J975
1024B007p225K603M799o257PO602m306m382P405q57o523N066L279o117K157M251
1040B509n741M21N993l507k465O158j954m912O085Q74o722M766M763p177o65P092
$$ plain form
932 -618 3083 -5569 -4001 3589 -2599 -5608 3149 1304 -5444 82 2701 -3548 112 4483 -1466
947 -1466 -1104 4215 -1468 -3138 4071 2249 -2665 3147 2890 -4055 776 5131 -1281 -441 4731 -1183
963 -1183 -3106 3747 333 -3428 4101 3281 -4526 571 5165 -2785 -1686 4790 -349 -3318 3884
978 3884 1332 -3926 1503 2907 -2097 1212 3132 -2578 111 4623 -1891 -2000 5679 714 -3731
993 -3731 4135 3704 -3592 1593 5093 -2275 -1229 5151 199 -2227 3679 482 -3489 2553 2181 -3250
1009 -3250 1178 2422 -4152 -887 3488 -2748 -3018 2970 -1558 -5362 1063 116 -5462 32 2007
1024 2007 -5218 -2615 2184 -4073 -4066 2536 -1770 -6152 1253 396 -6127 -1061 2218 -3899 -1742 2509
1040 2509 -3232 -2811 3182 -325 -2790 3368 1414 -3498 2587 3461 -3261 1505 6268 -909 -1574 5518
1056E518m022l659O834o51n356M510J478n790K606L805n388O18M698n727j825
1071b351O655k160m943N780K54p452L500M312o082K99N231n003k529O170k228
1086e47m222N603J12o771L831L882o504J198N532m670k712O305j311m438N028
1101C16L66m990M015K701o141K251N090n486j129O774k802m196N981K76o428M606
1117A204L821n942L19N035m134q09N114l120l682N151j67n231M629J991o689K251
1133b59M534n432j421O499l467m402N574K4n474L819K401n816J886M172n466n68
1149c396N928l484l381O720q62n992M561K274n357K174M428m866o15N674l851
1164d5k643N972j145m428N027J055o374K887M759n513o85N621l857l159N868q67
$$ plain form
1056 5518 1496 -2163 4671 4020 -1336 3174 4652 -1138 1468 5273 -115 503 5201 -526 -2351
1071 -2351 4304 2144 -2799 2981 3235 -4217 -717 3595 -2487 -2188 3043 -1960 -4489 1681 -547
1086 -547 -4769 834 946 -5825 -1994 1888 -4616 -3418 2114 -2556 -5268 1037 -274 -4712 316
1101 316 682 -4308 -293 2408 -3733 -1482 3608 -1878 -3007 3767 965 -3231 2750 3026 -3402 1204
1117 1204 5025 -917 -598 4437 303 -506 4608 1488 -2194 2957 2790 -2441 2188 4179 -2510 -259
1133 -259 4275 -1157 -2578 3921 454 -3948 1626 1650 -3824 -5 2396 -3420 -1534 2638 -2828 -3396
1149 -3396 2532 -952 -4333 2387 1525 -4467 94 2368 -2989 -815 3613 -1253 -1868 3806 -45
1164 -45 -2688 3284 2139 -2289 2738 3793 -2581 306 5065 -448 -1133 4488 631 -2528 3340 2473
1180B473m701M161J020n692K683L089n110L16M950m856k224N853j788n558M584
1195h00J919n744K166L703n573j27N323l630k181M804j464l841N048N17n072L609
1211a343L365n637R02N459m188j894O016j459m040N060P00n356L480L240n143
1226h38J350M588m192j468N662k027m293N381P50n809K887K984m878Q22M542m654
1242H07j391N147k987l826N418l60n321L677J646o056J507M967m760k264N690
1257A894k542l885M511K33m868M010J661n133J354M263m955k63N437k865l337
1272d485N439j81n542M277K389n180J535M165m476m39M952k848k449N361j178
1287A340m230L931J469n049K105M135n016o92N457l030l113N244r86m615M270
$$ plain form
1180 2473 -2228 1933 2953 -2739 -56 3033 -2077 -1761 3189 -1667 -3891 1962 174 -5384 -800
1195 -800 1119 -4625 -2459 1244 -4329 -4456 867 -2763 -4944 -140 -1604 -5445 -397 120 -4952 -1343
1211 -1343 2022 -3615 -2713 2746 -1442 -3336 2680 1221 -2819 2241 2941 -2415 1065 4305 -838
1226 -838 512 5100 908 -560 5102 3075 -1218 4163 4913 -896 1991 4975 97 919 5461 807
1242 807 -584 4563 1576 -2250 3168 2808 -2513 1164 2810 -3246 -1739 3228 -1532 -3796 1894
1257 1894 -648 -4533 -22 211 -4657 -647 1014 -4119 -2765 1498 -3457 -3720 1717 -1148 -4485
1272 -4485 954 773 -4769 -492 1897 -3283 -1748 2417 -2059 -2498 2454 -394 -2843 2518 1340
1287 1340 -2890 1041 2510 -2539 -434 3701 -1315 -2007 3450 420 -2693 2551 1565 -3050 1220
1302A220P84m797K490L404n349j41N273l687k223N285j277m543M530J230n161
1317b962K414L638m976K78M333l280j581M728j798l952N263O86n511L262L322
1332C864n303L92M696l368k160N042j618m051M164P27m550K683K814m980N68M535
1348C455m227j875N513k111m151M929M73n006K758K254n205J143M483l733j627
1363b927M582k317l800M958L62m931L683K293n245J098M267l391j370M969k074
1378A57l138M839m22m301L467J936m427J741M132m761p93N115k095l635N484K79
1394C578n230L262K170m460J242L120l500j377M610k458k910M602j019m203L592
1409A019J463n085K147L737n632q04M821k675k250M471o60m401L627J789n264
$$ plain form
1302 1220 2004 -2793 -303 3101 -2248 -2389 2884 -803 -3026 2259 982 -3561 969 2199 -2962
1317 -2962 -548 3090 -1886 -1608 2725 -555 -2136 2592 794 -3158 2105 2791 -2720 542 3864
1332 3864 -1439 -1047 3649 281 -1879 3163 1545 -2506 1658 2385 -2165 518 3332 -1648 -1080 3455
1348 3455 -772 -2647 2866 755 -3396 1533 2006 -3000 -242 2012 -3193 -2050 2433 -1300 -2927
1363 -2927 1655 -662 -4462 496 858 -4073 -390 1903 -3342 -2244 2023 -1368 -2738 2231 157
1378 157 -2981 1858 1436 -2865 602 2538 -1889 -148 3984 -777 -1570 3545 1450 -2185 3299 3578
1394 3578 -1652 1610 3780 -680 562 3682 182 -1195 3415 957 -1953 2649 1630 -2573 1019
1409 1019 2482 -2603 -456 3281 -2351 -3155 1666 -1009 -3259 1212 552 -3849 -222 1567 -3697
1424c697J923L405m560l30M639k875k719N196q04l957M154J314m507J817L506
1439B505m187M7M057k903j905N316j688l583M190J117m923K322L731m521m31M922
1455D066l214k751M279r67l489L549J011m552J849K167m244P86M545l744j798
1470b507M234k036l791M449J094m575K490K394m730L05M384k919j183M416j534
1485D91l982M598O17m682L114K033m025J108L988l739r82M734j607k912M277J16
1501C147m488L223J885m554J293M111m556r24M810k073l122L865rm425K827K188
1517C198m472Q88L185l545q46L564k540j932M103r77m255L046K224n074J177M016
1533A760m280q09L989k012l054M189J48l694L082J912m713J728K892l665l14M711
$$ plain form
1424 -3697 -1774 1631 -2929 -3259 1380 -1495 -4214 982 178 -3779 375 1689 -2818 -1001 2505
1439 2505 -1682 -1635 2422 -481 -2386 2930 1242 -2341 1849 2966 -1957 365 4096 -425 -856 4066
1455 4066 852 -1899 2380 1413 -2076 1473 2484 -2068 -219 1948 -2296 -1510 3035 -709 -2507
1470 -2507 1727 -309 -4100 349 1443 -3132 -642 1752 -2978 -2673 1711 -1208 -2391 2025 491
1485 491 -3491 1107 1724 -2958 156 2189 -1836 -728 3260 -479 -1461 3273 1666 -1246 3031 3147
1501 3147 -1341 1882 3767 -787 506 4617 61 -863 3947 1874 -1248 2617 2608 -1817 1010 3198
1517 3198 -1274 -386 2799 -746 -1592 1972 -568 -2500 1603 626 -3629 -583 1641 -3433 -2256 1760
1533 1760 -2520 -3329 660 -1352 -4406 -217 -69 -3763 -681 1231 -3482 -1754 1138 -2527 -2841 1870
1549A870k640k134M469n15l888L222J680m138J844L275l938p0M622l129k345M720
1565B905p98m063M062R55m653J653L409l761j39L876k812j977M137j412l513L958
1581A827L19l815K059J959l954K07M193l402j750M674j982l203L224J274m304
1596b674J739K938l758M36L088k819j331L916j028l196L685K60l764K477K567
1611B536l818L69L492l110j709M471j054l177L595j3l875K840K161m122O74L437
1627B697l305j283M383k225k668L688L90m261K385K046l923Q58L346l199q34M083
1643B178j986k950L992m12m110L275J470l745J096K998l306r92M059j429k862
1658b724L613o5l852L336J425l603J580K865m042k30M224k357k275M315p43l483
$$ plain form
1549 1870 -770 -2904 1565 1050 -2838 384 2064 -2074 -230 3045 -893 -963 3659 530 -1815 2905
1565 2905 2107 -1956 2106 3061 -1592 61 3470 -291 -430 3446 634 -1343 2794 1382 -2131 1827
1581 1827 2146 -1669 390 2349 -1605 -1398 2795 -607 -2357 2317 335 -2868 356 1630 -2674
1596 -2674 -935 2003 -1755 -1319 1769 -1050 -2381 1535 507 -2689 996 1256 -2508 -31 2536
1611 2536 -1282 -913 2579 -531 -2240 2231 1177 -2000 1595 1582 -2293 547 2708 -1414 -740 2697
1627 2697 -608 -1891 2492 267 -2401 1287 1677 -2584 -199 1847 -2076 -1218 2128 -1071 -1905 2178
1643 2178 192 -2758 1234 822 -3288 -13 1457 -2288 -1192 1806 -1500 -2492 1567 138 -2724
1658 -2724 889 824 -3028 308 1733 -1870 -290 2575 -1467 -1697 2527 170 -2105 2210 1467 -2016
1674b016L059J559m279J271L139l398n3L507k281j830L433p76l213L072J411m042
1690a437J455K498m016q4L901k504j829L658j104l423L142J012l809K138K209
1705A807l892J65L270k447j683L713p38l088K986J056l671J954K653l514K27L614
1721B412l103j302L943j054k543L275M6l763K455K623l928M09L533k866j294L654
1737B497j114k849L229J34l553K283J901l733P64L001l117p67L708k066k894L694
1753A118k0l553K988J414m289R96K935l022p61L753j526k691L163k72l052K846
1769B7J681l608P60K733k727p17L685j489k244L311j69l134K977Q72l635J588
1785h9K779l182m08L439j984k179L704n79l183K288J659l800R64K547k905m39
$$ plain form
1674 -2016 1043 2602 -1677 -406 2733 -665 -718 2789 508 -1322 2111 1335 -1878 1194 2605 -1437
1690 -1437 18 2516 -1500 -1584 2317 -187 -2016 1642 538 -2885 257 1269 -2540 -402 1807
1705 1807 -2085 -1920 1350 -1097 -2780 933 195 -2893 93 1149 -2522 -568 2085 -1429 -1202 2412
1721 2412 -691 -1993 1950 896 -1647 1628 1674 -2089 366 2989 -939 -530 3003 137 -1157 2497
1737 2497 1383 -1466 1763 1897 -1656 627 2528 -1205 -441 2560 -557 -1324 2384 318 -2576 1118
1753 1118 1098 -2455 533 1947 -2342 -1346 1589 -1433 -2194 1559 33 -2658 505 233 -2819 27
1769 27 1708 -1900 -1140 1593 -1134 -1851 1834 345 -1899 1412 1243 -1891 1086 1958 -1677 -89
1785 -89 2690 -492 -900 2539 555 -1624 2080 1501 -1682 606 2265 -1535 -571 1976 -929 -1368
1801a368L393k206j865L548r45l478L342O57k909J342K447l563m68L674k376j840
1817b615L616p82k871K869J090l441J936K067l133k52L440k039j990L827r94k480
1833a752K818R99l757K004K163l136Q3K991k085j256L441j517k782L353N61l266
1849a138J871J945l774M66L158k848p40L092j441k317K668M80l517K400J451l495
1865a739P22K955l042j093L507j258k292K649J15l070K140J898l524N01K792k512
1881a251j090L451j712k066L289p8l009K560J451l313P68K566k213p05L438j296
$$ plain form
1801 -1368 2025 -181 -2046 1502 557 -2921 421 1078 -1831 -489 1958 -1605 -2073 1601 -775 -2615
1817 -2615 1001 219 -2652 217 1307 -2134 -198 1869 -1264 -1516 1924 -115 -2105 1722 728 -1752
1833 -1752 1066 2065 -1692 312 2475 -661 -578 2413 328 -928 2513 996 -1786 1567 2128 -1138
1849 -1138 733 2678 -1096 -630 2528 -320 -1060 2032 591 -1726 942 1422 -2095 305 1756 -1739
1865 -1739 -1017 1938 -1104 -2197 1310 52 -2240 409 524 -2546 -406 1492 -2032 -1531 1261 -1251
1881 -1251 -2341 1110 -602 -2668 621 543 -2466 94 1545 -1768 -1000 1566 -647 -1352 2086 790
$$ [...]
8191b49
##END NTUPLES=NMR FID
##END=
