##TITLE=1H_TG-2251-1
 CDCl3, 8 sc, 
 22.8.2019
##JCAMPDX= 6.0         $$ Bruker NMR JCAMP-DX V2.0
##DATA TYPE= NMR FID
##DATA CLASS= NTUPLES
##ORIGIN= UXNMR, Bruker Analytische Messtechnik GmbH
##OWNER= root
$$ XWIN-NMR		Version 3.5
$$ Thu Aug 22 14:16:20 2019 Russian Standard Time (UT+4h)  she@DPX200
##.OBSERVE FREQUENCY= 200.13155
##.OBSERVE NUCLEUS= ^1H
##.DELAY= (6, 6)
##.ACQUISITION MODE= SIMULTANEOUS
##.ACQUISITION SCHEME= undefined
##.AVERAGES= 8
##.DIGITISER RES= 18
##SPECTROMETER/DATA SYSTEM= spect
##.PULSE SEQUENCE= zg30
##.SOLVENT NAME= CDCl3
##.SHIFT REFERENCE= (INTERNAL, CDCl3, 0, 15.7039)
##AUDIT TRAIL= $$ (NUMBER, WHEN, WHO, WHERE, WHAT)
$$ ##TITLE= Audit trail, XWIN-NMR		Version 3.5
$$ ##JCAMPDX= 5.01
$$ ##ORIGIN= Bruker BioSpin GmbH
$$ ##OWNER= she
$$ F:/spectra/data/she/nmr/H-F/1/audita.txt
$$ ##AUDIT TRAIL=  $$ (NUMBER, WHEN, WHO, WHERE, WHAT)
(   1,<2019-08-22 14:15:05.25 +0400>,<she>,<DPX200>,
      <created by zg, POWCHK disabled, PULCHK disabled
       configuration hash MD5:
       00 E9 B6 7A A2 85 ED C7 34 08 36 98 17 FE 4E 26
       data hash MD5: 16K
       73 05 D4 F9 FD 22 DA C1 DA 4F 73 52 99 63 32 75>)
$$ ##END=
$$ 
$$ hash MD5
$$ B6 16 96 35 4D 77 29 6C CB 8E B9 3B 11 08 A2 B7
##$RELAX= 
##$RELAX= 
##$RELAX= 
##$RELAX= 
##$RELAX= 
##$RELAX= 
$$ Bruker specific parameters
$$ --------------------------
##$DU= <F:/spectra>
##$EXPNO= 1
##$NAME= <H-F>
##$PROCNO= 1
##$TYPE= <nmr>
##$USER= <she>
##$AMP= (0..31)
100 100 100 100 100 100 100 100 100 100 100 100 100 100 100 100 100 100 
100 100 100 100 100 100 100 100 100 100 100 100 100 100 
##$AQSEQ= 0
##$AQ_mod= 1
##$AUNM= <au_zg>
##$AUTOPOS= <>
##$BF1= 200.13
##$BF2= 200.13
##$BF3= 200.13
##$BF4= 200.13
##$BF5= 200.13
##$BF6= 200.13
##$BF7= 200.13
##$BF8= 200.13
##$BYTORDA= 1
##$CFDGTYP= 0
##$CFRGTYP= 5
##$CHEMSTR= <none>
##$CNST= (0..31)
1 1 145 1 1 1 1 1 1 1 1 1 1 1 1 1 1 1 1 1 1 1 1 1 1 1 1 1 1 1 1 1 
##$CPDPRG= <>
##$CPDPRG1= <>
##$CPDPRG2= <>
##$CPDPRG3= <>
##$CPDPRG4= <mlev>
##$CPDPRG5= <mlev>
##$CPDPRG6= <mlev>
##$CPDPRG7= <mlev>
##$CPDPRG8= <mlev>
##$CPDPRGB= <>
##$CPDPRGT= <>
##$D= (0..31)
0 1.2 0 0 0 0 0 0 0 0 0 0.03 0 0 0 0 0 0 0 0 0 0 0 0 0 0 0 0 0 0 0 0 
##$DATE= 1566468904
##$DBL= (0..7)
120 120 120 120 120 120 120 120 
##$DBP= (0..7)
150 150 150 150 150 150 150 150 
##$DBP07= 0
##$DBPNAM0= <>
##$DBPNAM1= <>
##$DBPNAM2= <>
##$DBPNAM3= <>
##$DBPNAM4= <>
##$DBPNAM5= <>
##$DBPNAM6= <>
##$DBPNAM7= <>
##$DBPOAL= (0..7)
0.5 0.5 0.5 0.5 0.5 0.5 0.5 0.5 
##$DBPOFFS= (0..7)
0 0 0 0 0 0 0 0 
##$DE= 6
##$DECBNUC= <off>
##$DECIM= 24
##$DECNUC= <off>
##$DECSTAT= 4
##$DIGMOD= 1
##$DIGTYP= 9
##$DL= (0..7)
0 120 120 120 120 120 120 120 
##$DP= (0..7)
150 150 150 150 150 150 150 150 
##$DP07= 0
##$DPNAME0= <>
##$DPNAME1= <>
##$DPNAME2= <>
##$DPNAME3= <>
##$DPNAME4= <>
##$DPNAME5= <>
##$DPNAME6= <>
##$DPNAME7= <>
##$DPOAL= (0..7)
0.5 0.5 0.5 0.5 0.5 0.5 0.5 0.5 
##$DPOFFS= (0..7)
0 0 0 0 0 0 0 0 
##$DQDMODE= 0
##$DR= 18
##$DS= 0
##$DSLIST= <SSSSSSSSSSSSSSS>
##$DSPFIRM= 0
$$ [...]
##$SUBNAM2= <"">
##$SUBNAM3= <"">
##$SUBNAM4= <"">
##$SUBNAM5= <"">
##$SUBNAM6= <"">
##$SUBNAM7= <"">
##$SUBNAM8= <"">
##$SUBNAM9= <"">
##$SW= 24.9336996594482
##$SWIBOX= (0..15)
0 0 2 0 0 0 0 0 0 0 0 0 0 0 0 0 
##$SW_h= 4990.01996007984
##$TD= 16384
##$TD0= 1
##$TE= 0
##$TE2= 300
##$TE3= 300
##$TEG= 300
##$TL= (0..7)
0 120 120 120 120 120 120 120 
##$TP= (0..7)
150 150 150 150 150 150 150 150 
##$TP07= 0
##$TPNAME0= <>
##$TPNAME1= <>
##$TPNAME2= <>
##$TPNAME3= <>
##$TPNAME4= <>
##$TPNAME5= <>
##$TPNAME6= <>
##$TPNAME7= <>
##$TPOAL= (0..7)
0.5 0.5 0.5 0.5 0.5 0.5 0.5 0.5 
##$TPOFFS= (0..7)
0 0 0 0 0 0 0 0 
##$TUNHIN= 0
##$TUNHOUT= 0
##$TUNXOUT= 0
##$USERA1= <user>
##$USERA2= <user>
##$USERA3= <user>
##$USERA4= <user>
##$USERA5= <user>
##$V9= 5
##$VALIST= <valist>
##$VCLIST= <CCCCCCCCCCCCCCC>
##$VD= 0
##$VDLIST= <DDDDDDDDDDDDDDD>
##$VPLIST= <PPPPPPPPPPPPPPP>
##$VTLIST= <TTTTTTTTTTTTTTT>
##$WBST= 1024
##$WBSW= 4
##$XGAIN= (0..3)
0 0 0 0 
##$XL= 0
##$YL= 0
##$YMAX_a= 477905
##$YMIN_a= -648510
##$ZGOPTNS= <>
##$ZL1= 120
##$ZL2= 120
##$ZL3= 120
##$ZL4= 120
##$ABSF1= 10
##$ABSF2= 0
##$ABSG= 5
##$ABSL= 3
##$ALPHA= 0
##$AQORDER= 0
##$ASSFAC= 0
##$ASSFACI= 0
##$ASSFACX= 0
##$ASSWID= 0
##$AUNMP= <proc_1d>
##$AZFE= 0.1
##$AZFW= 0.1
##$BCFW= 1
##$BC_mod= 2
##$BYTORDP= 1
##$COROFFS= 0
##$CY= 11.3945322036743
##$DATMOD= 1
##$DC= 2
##$DFILT= <>
##$DTYPP= 0
##$F1P= 20.1720416913024
##$F2P= 0.152960286110954
##$FCOR= 0.5
##$FTSIZE= 0
##$FT_mod= 4
##$GAMMA= 1
##$GB= 0.15
##$INTBC= 1
##$INTSCL= 1
##$ISEN= 128
##$LB= 0.24
##$LEV0= 0
##$LPBIN= 0
##$MAXI= 10000
##$MC2= 0
##$MEAN= 0
##$ME_mod= 0
##$MI= 1.114404
##$NCOEF= 0
##$NC_proc= 0
##$NLEV= 6
##$NOISF1= 3.799351
##$NOISF2= 2.8
##$NSP= 1
##$NTH_PI= 0
##$NZP= 0
##$OFFSET= 15.70392
##$PC= 1
##$PHC0= -9211.534
##$PHC1= 13.20096
##$PH_mod= 1
##$PKNL= yes
##$PPARMOD= 0
##$PSCAL= 0
##$PSIGN= 0
##$REVERSE= no
##$SF= 200.130013532006
##$SI= 16384
##$SIGF1= 3
##$SIGF2= 2
##$SINO= 400
##$SIOLD= 16384
##$SREGLST= <1H.CDCl3>
##$SSB= 0
##$STSI= 0
##$STSR= 0
##$SW_p= 3612.71676300578
##$SYMM= 0
##$S_DEV= 0
##$TDeff= 0
##$TDoff= 0
##$TI= <>
##$TILT= no
##$TM1= 0
##$TM2= 0
##$TOPLEV= 0
##$USERP1= <user>
##$USERP2= <user>
##$USERP3= <user>
##$USERP4= <user>
##$USERP5= <user>
##$WDW= 1
##$XDIM= 8192
##$YMAX_p= 0
##$YMIN_p= 0
$$ End of Bruker specific parameters
$$ ---------------------------------
##NTUPLES= NMR FID
##VAR_NAME=  TIME,          FID/REAL,        FID/IMAG
##SYMBOL=    X,             R,               I
##VAR_TYPE=  INDEPENDENT,   DEPENDENT,       DEPENDENT
##VAR_FORM=  AFFN,          ASDF,            ASDF
##VAR_DIM=   8192,          8192,            8192
##UNITS=     SECONDS,       ARBITRARY UNITS, ARBITRARY UNITS
##FACTOR=    0.0002004,     1,               1
##FIRST=     0,             0,               0
##LAST=      1.6414764,     0,               0
##MIN=       0,             -648510,         0
##MAX=       1.6414764,     477905,          0
$$ Real data points
##PAGE= N=1
##DATA TABLE= (X++(R..R)), XYDATA
0@%%%qJ6j6J6k4M0m8O4q8J04j22J53j91K25k65L20l79M42n19O02o94P99r18J052
$$ 0 0 0 0 -8 8 -8 8 -16 24 -24 40 -48 56 -66 87 -104 121 -144 176 -203 239 -280 322 -372 427 -491 561
27E61j196J356j538J735j951K190k453K741l055L403l786M200m656N162n715O326
$$ 561 -635 721 -817 918 -1033 1157 -1296 1445 -1610 1793 -1993 2207 -2449 2713 -3002 3324
43C324p007P761q603R551j0626J1856j3275J4936j6915J9315k2303K6146l1290
$$ 3324 -3683 4078 -4525 5026 -5600 6256 -7019 7917 -8998 10317 -11986 14160 -17130
56a7130L8587m9841O9674j14986M01583J22181n57230J88966K96273R9828k41747
$$ -17130 21457 -28384 41290 -73696 327887 450068 -107162 81804 378077 477905 236158
67B36158p6670J11434P0508k90326k29136J81002L40705q7393l53729j49236J91734
$$ 236158 159488 270922 341430 51104 -178032 2970 343675 256282 -97447 -246683 -54949
78e4949J44827j32447k32015P5703K70029r188l41091j45507K16044K03811p5996
$$ -54949 89878 -42569 -274584 -198881 71148 61960 -279131 -424638 -208594 -4783 -80779
89h0779j56949J2202J46359j3048k22379o6833K80138K21682j61133k64165J0945
$$ -80779 -237728 -225526 -79167 -92215 -314594 -381427 -101289 120393 -40740 -304905 -293960
100b93960K02983R3143j10378r7490J16633J50924j08140k00173O8761K34938
$$ -293960 -90977 2166 -108212 -205702 -89069 61855 -46285 -246458 -177697 57241
110E7241L4565j68883q6135J12460J31362o8122j72979M1050K35457M0190k18341
$$ 57241 91806 -77077 -163212 -50752 80610 12488 -160491 -119441 116016 156206 -62135
121f2135j06712J43198J26246p3895j36359K9997J81928L7172k21682j41072J73597
$$ -62135 -168847 -25649 100597 26702 -109657 -79660 102268 139440 -82242 -223314 -49717
132d9717J86958r2181j83136J3976J58893M5810j64689j37731J38489K16020o6780
$$ -49717 137241 45060 -138076 -124100 34793 80603 -84086 -221817 -83328 132692 65912
143F5912k30926j2591J84105O6831j19456r0505R7884J61392m4296k13224k7027
$$ 65912 -165014 -177605 6500 73331 -46125 -136630 -38746 122646 78350 -134874 -161901
154a61901K25172J19128j32555j13173Q0189J21936l0156j44214j7274J99630
$$ -161901 63271 182399 49844 -63329 16860 138796 108640 -35574 -52848 146782
164A46782J35303j47206j78989O9027J58045l976j05860j0999J16331O9486j25379
$$ 146782 282085 134879 -44110 24917 182962 178986 73126 62127 178458 247944 122565
175A22565j58812P7946K06273P420j67427o1907Q2907M8452o5196p5098N5941
$$ 122565 -36247 41699 247972 255392 87965 26058 108965 157417 92221 17123 73064
186G3064J35253k2764j97465q0531J32125R3656p1596p9497K9186O1624l8472
$$ 73064 208317 185553 -11912 -92443 39682 133338 61742 -17755 11431 73055 34583
197C4583j38706m4412J52430J16463j16774j53471L3588J03895r708q5326j6591
$$ 34583 -104123 -148535 3895 120358 3584 -149887 -116299 -12404 -22112 -107438 -124029
208a24029R8914P2017j08291j53571N7603J78833J6809j24906l9837P7919M8239
$$ -124029 -25115 46902 -61389 -214960 -157357 21476 38285 -86621 -126458 -48539 -300
219c00o7285r1377N5536J66733J7992j71331p6761J15978Q4606o4410p5097M3598
$$ -300 -67585 -158962 -103426 63307 81299 -90032 -166793 -50815 33791 -30619 -105716 -62118
231f2118J07270K817j47150p8977J37437J32049q2393j29595L0899J03293K920
$$ -62118 45152 47969 -99181 -178158 -40721 91328 8935 -120660 -89761 13532 16452
242A6452r6891m6451J06486J20600p6046j67791J4672J52140L3141r7609m0663
$$ 16452 -80439 -126890 -20404 100196 24150 -143641 -128969 23171 56312 -41297 -81960
253h1960P7713P5282n9655j36557P569J69402O3428j32898q5033Q1749Q0049m7582
$$ -81960 -4247 71035 11380 -125177 -117608 51794 115222 -17676 -102709 -20960 59089 11507
265A1507r1584J2056J25863N5360j28456j15666R2148J36009l3584j05687N202
$$ 11507 -80077 -68021 57842 113202 -15254 -130920 -38772 97237 63653 -42034 -36832
276c6832R1440L1656q7752q2988Q3399J52417k0473j49249k1331J12241M1768
$$ -36832 54608 86264 -1488 -84476 -1077 151340 130867 -18382 -39713 72528 114296
287A14296p1349m8082O4678J04123k1853j45136m0697J35807Q1133q9241q0287
$$ 114296 42947 -5135 59543 163666 141813 -3323 -44020 91787 172920 83679 3392
298C392M7602P0171k2799r4079k8643J06218Q0516r8614j25017M3674J05805j3092
$$ 3392 50994 121165 98366 4287 -24356 81862 162378 63764 -61253 -17579 88226 75134
310G5134q4596j7609O6532M7360p2010j10014L4927J31966N187j12701k8858P4282
$$ 75134 -9462 -27071 39461 86821 14811 -95203 -60276 71690 76877 -35824 -64682 9600
322I600L0691o0674o5070L5849J10259J2600j26720o0613R9641P2679o3103o9339
$$ 9600 40291 -20383 -85453 -49604 60655 73255 -53465 -114078 -14437 58242 -4861 -74200
334g4200L0703P2678L265q9356n3404Q8572R4640o3677j05661K6485Q1992o387
$$ -74200 -43497 29181 32446 -56910 -110314 -21742 72898 9221 -96440 -69955 12037 5650
346E650p0401k3136O6871P0701m9563j14289Q119J06841J3079p9701j6557O3713
$$ 5650 -64751 -87887 -21016 49685 122 -114167 -106048 793 13872 -65829 -82386 -18673
358a8673L2427n0543p3591J5716J03960K7790j01104m9946Q1283N5842n3336n6769
$$ -18673 13754 -36789 -110380 -94664 9296 37086 -64018 -113964 -32681 23161 -30175 -86944
370h6944K8018P5004J8254q2547o1360P4488R0047m1602p3810L0757O6444j1235
$$ -86944 -58926 16078 34332 -48215 -109575 -35087 54960 13358 -60452 -29695 36749 25514
382B5514o6223k5617P0386Q6033l5252j03949R638R6868O249p6648j4690O8224
$$ 25514 -40709 -66326 4060 90093 54841 -49108 -39470 57398 63647 -13001 -27691 40533
394D0533N0354m0649q5903N872J09208L1570j04196n1355Q3277O3140n4056p7681
$$ 40533 90887 50238 -35665 -29793 79415 110985 6789 -44566 38711 101851 47795 -29886
406b9886J1900R5561M3292r3839r1084O3117R8816l5399q6297J3133P7993J7617
$$ -29886 -17986 77575 120867 27028 -64056 -939 97877 62478 -23819 -10686 67307 84924
418H4924p5180p1357M8887J06684j6049j13995j0981R6761K6856p5834n2067M4892
$$ 84924 9744 -61613 -12726 93958 77909 -36086 -47067 49694 76550 716 -51351 -6459
430f459P8228r028j00153k8529J01653N4652q3707o4727N6569O9911k3855q1479
$$ -6459 71769 62741 -37412 -65941 35712 90364 6657 -58070 -1501 68410 44555 -36924
442c6924k0938Q6121P0654o7702r4163L9710Q7532k0350p5731m353O6033L9504
$$ -36924 -57862 28259 98913 31211 -62952 -23242 64290 43940 -31791 -36144 29889 69393
454F9393n2226p7731K6890R1774j1362r7178q497Q2644K2930o7494n5590L4261
$$ 69393 17167 -60564 -33674 58100 46738 -50440 -58937 23707 46637 -20857 -76447 -42186
466d2186P8871m675j03434l5281R4628N0344q0949o4502N2218P5613j6244r5079
$$ -42186 36685 32010 -71424 -106705 -12077 38267 -42682 -107184 -54966 20647 4403 -90676
478i0676m1079R1255Q5510o8094j02988M1254J04005p305r1727l1869P6652Q1287
$$ -90676 -131755 -40500 45010 -23084 -126072 -84818 19187 11882 -79845 -111714 -35062 46225
490D6225m0636j05629J5120J21362K0582j03336l8179Q4194O9871m2208q8986
$$ 46225 5589 -100040 -84920 36442 57024 -46312 -84491 -297 69574 27366 -61620
501f1620M974J15557M9305j04044p7397P9874R1087m1945q7049O038R2040M4620
$$ -61620 -56646 58911 108216 4172 -73225 6649 97736 55791 -31258 -25220 66820 111440
513A11440q2339r1512N6292J13525k3597j08947r708Q6715L8702o0648p1143K6152
$$ 111440 29101 -62411 -6119 107406 83809 -25138 -34846 51869 90571 29923 -41220 -15068
525a5068R1065J550j02907l0699Q7000M4939o1586n3996K9366N8143l473p5015
$$ -15068 75997 77547 -25360 -56059 30941 75880 14294 -39702 -10336 47807 44334 -30681
537c0681l2415P8091O0264o3915p0186L9007O2998j7336o0640j2601O0815N0467
$$ -30681 -63096 14995 75259 11344 -58842 -19835 43163 25827 -34813 -47414 13401 63868
549F3868n1927p9317L4936R0771j1260q0375j1715O1777L6287l8381n9071K1049
$$ 63868 11941 -67376 -32440 58331 47071 -33304 -45019 16758 53045 14664 -44407 -23358
561b3358Q5069M748r2840k8816P7796M3459n0511m9919K5638O4782M753q2031
$$ -23358 61711 66459 -26381 -55197 22599 66058 15547 -34372 -8734 56048 60801 -21230
573b1230m2661P8172O6597o1452p6236L2131P1478k416p1006l9887N8670P2311
$$ -21230 -63891 14281 80878 19426 -56810 -24679 46799 44383 -26623 -66510 -7840 64471
585F4471m6527r9502J6787R7041J0681q0198m0807M8717O0230k3875q5849o903
$$ 64471 17944 -81558 -64771 32270 42951 -37247 -78054 -29337 30893 7018 -78831 -85734
597h5734R5810L6899q3058n4200N3057N7866k3511o1879n296P2500M3882o6602
$$ -85734 10076 46975 -36083 -90283 -37226 20640 -2871 -64750 -70046 2454 46336 -20266
609b0266o8369N0567P8282k2526o5394K620N9438K9470m5124n5392L7974Q6249
$$ -20266 -88635 -38068 40214 17688 -47706 -45086 14352 43822 -1302 -56694 -18720 67529
621F7529j0188q6024j0495P1010L1215l9872l6223K5906N7987m432p7806k2581
$$ 67529 57341 -28683 -39178 31832 63047 23175 -13048 12858 70845 66413 -11393 -33974
633c3974P8700M6813n4635m9937K6289M3725p799n1911k1308N5375M5048n5518
$$ -33974 44726 91539 36904 -13033 13256 56981 49182 -2729 -24037 31338 76386 20868
645B0868o8032L1426O2023j5053n6976j2132M1439L0833m1876o5748K3444Q1336
$$ 20868 -47164 -15738 46285 31232 -25744 -37876 3563 34396 -7480 -73228 -49784 31552
657C1552j360p8126k1766M9899K8306l1661m0300J7538O5185Q832p6960l5079
$$ 31552 30192 -47934 -69700 -19801 8505 -23156 -63456 -45918 19267 28099 -48861 -83940
669h3940O7743N0767l8200m5088J9337N0606J0737n2176l5060N5727O4177l6823
$$ -83940 -16197 34570 -3630 -48718 -29381 21225 31962 -20214 -55274 453 64630 27807
681B7807o5935J8981O0185M111m4443k0294M0978N0727k8787p7012M395P9740
$$ 27807 -38128 -19147 41038 45149 706 -19588 21390 72117 43330 -33682 -29287 50453
693E0453K0426n7081k8061L3099L1183k2506n2429l93O9476K8015o9533n1169
$$ 50453 70879 13798 -14263 18836 50019 27513 -24916 -25309 44167 72182 2649 -48520
705d8520M3873M7924k4791m6988M27M6504K2707n3925n5569M1524P0324k0545
$$ -48520 -4647 43277 18486 -28502 -28075 18429 41136 -12789 -68358 -26834 43490 22945
717B2945o6254k921M5781J6072l4476l5461K7989O3642p815p5898j5904O2413
$$ 22945 -43309 -46230 -449 15623 -18853 -54314 -26325 37317 29502 -46396 -62300 113
729A13K8965l5720k6793K3733M0012l525n5597k0483O1796M5456m2359m4031K5204
$$ 113 29078 -6642 -33435 -9702 30310 26785 -28812 -49295 12501 57957 15598 -28433 -3229
742c229L6853q689l3116o620M2192L4548m1315n9577K2987O2481j195m4402j0096
$$ -3229 33624 24935 -8181 -14801 27391 61939 20624 -38953 -15966 46515 45320 918 -9178
755i178K7116J6529k4848m1761J2316O1117O183o0399k2951L7607J7466k7384
$$ -9178 17938 34467 9619 -32142 -19826 41291 47474 -12925 -35876 1731 19197 -8187
767h187k3958J3702L7696L273n4618l1399M6103M0129l1309l6240J4812K7411
$$ -8187 -32145 -18443 19253 22526 -32092 -63491 -17388 22741 -8568 -44808 -29996 -2585
779b585o347l3685j4449M1595M4905l4009o2064J3007N4773M632l5822q837L0739
$$ -2585 -8932 -42617 -57066 -15471 29434 -4575 -66639 -53632 1141 5773 -30049 -38886 -8147
792h147L0350j9477n2401L192O4155K0224m5232j9391L2880K2000j7966k7781
$$ -8147 22203 2726 -49675 -46483 17672 37896 -7336 -26727 6153 28153 10187 -17594
804a7594O240M6639K1156m7256l6659L7391L9881k0595k8718J0416K8144L593
$$ -17594 -11354 35285 56441 9185 -27474 9917 49798 29203 485 10901 39045 42638
816D2638l5827k9635L3127N1683j8514n3366K405L6557N26l0896j4557K4492L7376
$$ 42638 6811 -22824 10303 61986 43472 -9894 -7489 29068 29594 -1302 -15859 8633 46009
829D6009j1236n6968j2502M8473K0197l4696j8319K1289J8212j2327l1945o119
$$ 46009 34773 -22195 -34697 13776 33973 -723 -19042 2247 20459 8132 -23813 -29932
841b9932M2235K5819l9812l5444K6687L0083j6263k4530P781L0762J3693l4382
$$ -29932 12303 38122 -1690 -37134 -10447 19636 3373 -21157 -13376 17386 31079 -3303
853c303m1373K3533N3109o014m1402Q18L1477N344k7770k4093J8223M8232L438
$$ -3303 -44676 -21143 31966 25952 -15450 -14632 16845 22189 -5581 -29674 -11451 36781 40219
866D0219n2785j9507M0480K1183k5500j8210J3599K3646j219l4496k0578L6181
$$ 40219 -12566 -32073 8407 29590 4090 -14120 -521 23125 21906 -12590 -33168 3013
878C013L3128k6438l2723J4855K0129j3451k2730o29K8544K4664k6883m5734R808
$$ 3013 36141 9703 -23020 -8165 11964 -1487 -24217 -24846 3698 28362 1479 -44255 -34447
891c4447M1012m537l1122K957K5388P098k2579l0137Q247M4150Q940m1895j4193
$$ -34447 6565 2028 -29094 -26137 -749 6349 -16230 -46367 -38120 6030 14970 -26925 -41118
904d1118L1651J1634k2195j2996J5184K6662L024l5485k1854L3086K9913k2104
$$ -41118 -9467 2167 -20028 -33024 -17840 8822 11846 -23639 -45493 -12407 17506 -4598
916d598k0330K1282J9341j4981k7869n676L3322L4597k1292m2491J1509L7616
$$ -4598 -24928 -3646 15695 714 -27155 -32831 491 35088 13796 -28695 -17186 20430
928B0430p664l2045R66L1807K1608j9722m1704l5M9624J6742l9125j6437K9403
$$ 20430 12766 -19279 -18313 13494 35102 15380 -26324 -26359 23265 40007 882 -15555 13848
941A3848J6536k0714k3670P250L8790J9481l6643l5712K4722L2875j5063k2434
$$ 13848 30384 9670 -14000 -6750 32040 51521 14878 -20834 3888 36763 21700 -734
953g34J4096K5613J142l0235k6995K1705M4031p283m1417J505L1147j285k7635
$$ -734 13362 38975 40117 9882 -17113 4592 48623 41340 -77 1428 32575 31290 3655
966C655j0316K0542K9263o184m4741j3785L9361J9171k8583j5289J8321J2664
$$ 3655 -6661 13881 43144 36960 -7781 -21566 17795 36966 8383 -6906 11415 24079
978B4079j3808k6169n947L1734K4741k7408l1636J6662K1164j7445k0336J0082
$$ 24079 10271 -15898 -21845 9889 34630 7222 -24414 -7752 13412 -4033 -24369 -14287
990a4287K4181P477k5796l0828J5347L8460r268l5776N403L0111r61k7121j5725
$$ -14287 9894 17371 -8425 -39253 -23906 14554 5286 -30490 -25087 5024 4063 -23058 -38783
1003c8783J8612L4546k387m4366j1054L9357J5135l1493j6258K4031K5263p155
$$ -38783 -20171 14375 11988 -32378 -43432 -4075 11060 -20433 -36691 -12660 12603 5448
1015E448l5225j6774L4510L1602k7260l1069K1956K9356j4390l1025m102L0256
$$ 5448 -29777 -46551 -12041 19561 -7699 -38768 -16812 12544 -1846 -32871 -36973 -6717
1027f717K6824k0343m1561J0448M3890k806l8802m224L2106J7558j9751l2274
$$ -6717 20107 -236 -41797 -31349 12541 9735 -29067 -33291 -1185 16373 -3378 -35652
1039c5652K226M2860J4553l9232j9783L3039K1440k4268k5953R879L4795J5759
$$ -35652 -33426 9434 23987 -15245 -35028 -1989 19451 -4817 -30770 -20891 13904 29663
1051B9663l0738l2245K1871L5909j5208k9299J3246L0585K018k6401k0080J8201
$$ 29663 -1075 -33320 -11449 24460 9252 -20047 -6801 23784 25802 -599 -20679 -2478
1063b478L8260k998l8315l87L6116M638k7804q185K3670K6009n561l6119j1925
$$ -2478 35782 32784 -5531 -5918 30198 34836 7032 -1153 22517 48526 42965 6846 -5079
1076e079L6360K3466k6911j8651K3648J8240j7448k6448k763K9740K4299k4615
$$ -5079 31281 54747 27836 9185 32833 51073 33625 7177 4414 34154 58453 33838
1088C3838l5773J3185K9872j3543k9020M391K3984P303k3926l0891P551L6828
$$ 33838 -1935 11250 41122 27579 -1441 2950 26934 34237 10311 -20580 -13029 23799
1100B3799P47l7299q258K5813L384k5623j4269J4369K8049P62l7593k0461K9487
$$ 23799 24546 -12753 -21011 4802 8186 -17437 -31706 -17337 10712 11474 -26119 -46580 -17093
1113a7093K2226k3111j7694J7780J8575q391k5712j0595K6648K8468j9323l3501
$$ -17093 5133 -17978 -35672 -17892 683 -7708 -33420 -44015 -17367 11101 -8222 -41723
1125d1723J2697L0430o443k4660o30K3133J7249j5208l2839M488M0045P507l2700
$$ -41723 -29026 1404 -5039 -29699 -30329 -7196 10053 -5155 -37994 -33506 6539 14046 -18654
1138a8654q262K5577J1585j7575k0254N377L2294J3219l3040k3538K6575K3951
$$ -18654 -26916 -1339 10246 -7329 -27583 -22206 10088 23307 -9733 -33271 -6696 17255
1150A7255j9274k1763R451K2319M425k4213k1959K0420L2928j4597l5590N889
$$ 17255 -2019 -23782 -14331 7988 12413 -11800 -33759 -13339 19589 4992 -30598 -24709
1162b4709K9140R49k2366j2749J6031K6947n374l6698n197L6144J2383k6701j2012
$$ -24709 4431 5380 -16986 -29735 -13704 13243 7869 -28829 -34026 2118 14501 -12200 -24212
1175b4212J9464J8896m564k3437q456K9087K3098k1805k1267J9863K2701r291
$$ -24212 -4748 14148 9584 -13853 -22309 6778 29876 8071 -13196 6667 29368 20077
1187B0077j6669K124K0092J4630j4006k3557J3729L1344o974k5708M977K2538
$$ 20077 3408 5532 25624 40254 26248 2691 16420 47764 40790 15082 20059 42597
1199D2597L061j6258j5698R564K7440J104l2661q298K6996P073k4226j3266J1669
$$ 42597 45658 29400 13702 23266 50706 51810 19149 10851 37847 44920 20694 7428 19097
1212A9097J7836j665k7008j7406K1294J8865k3092k4033J3546J6815j0542k1752
$$ 19097 36933 35268 8260 -9146 12148 31013 7921 -16112 -2566 14249 3707 -18045
1224a8045q380J6133J7984j6147l1535O877K8475o974k7322n46K1531J1320j5368
$$ -18045 -26425 -10292 7692 -8455 -39990 -33113 -4638 -11612 -38934 -39480 -17949 -6629 -21997
1237b1997k6831J602L4594J0280l0264j2213K6675J5426j5980j8341N293K7096
$$ -21997 -48828 -47226 -12632 -2352 -32616 -44829 -18154 -2728 -18708 -37049 -31756 -4660
1249d660J5540k3462k3395K0765K9146j0940k1336P695J9978M418j4890j5911
$$ -4660 10880 -12582 -35977 -15212 13934 2994 -18342 -10647 9331 13749 -1141 -17052
1261a7052J2543K8997l864k9753q14K3749J640j8424p074J2137J6998l680k7965
$$ -17052 -4509 24488 20624 -9129 -9943 13806 15446 -2978 -10052 2085 19083 15403 -12562
1274a2562j0160K6062J2865k3827j4702J4910J3347p825j8845p544J7536J8886
$$ -12562 -22722 3340 16205 -7622 -22324 -7414 5933 -1892 -20737 -28281 -10745 8141
1286H141j6231k4510J0099K1105n892j4783J925J3411R555q307j8860N477K7135
$$ 8141 -8090 -32600 -22501 -1396 -7288 -22071 -20146 -6735 2820 -5487 -24347 -18870 8265
1299H265K945j9237J809J9164L165j1670o141R044K1281O480k1283r980K2687
$$ 8265 11210 -8027 -6218 12946 16111 4441 -1700 7344 28625 35105 13822 3842 26529
1312B6529J3120j6101q883J2360J2871r17j6342j2553J5197K1725j1717k3533
$$ 26529 39649 23548 14665 27025 39896 38979 22637 10084 25281 47006 35289 11756
1324A1756N027J4472n731j3084l978P808J1533o878k4378k962J8644J16j7696
$$ 11756 16783 31255 25524 12440 8462 16270 27803 20925 -3453 -6415 12229 12345 -5351
1337e351m23J0791jj1012j2388p25J7584O819j9740j1412J5341Q121j3413p724
$$ -5351 -5774 5017 5016 -5996 -18384 -19109 -1525 5294 -14446 -25858 -10517 -2396 -15809 -23533
1351b3533P443J0942L133j3670j4415J2355K0493p855j5471P238J2642l741r566
$$ -23533 -16090 -5148 -2015 -15685 -30100 -17745 2748 -5107 -20578 -13340 -698 -4439 -14005
1364a4005l872Q318J5971k05j8432j102J6517j635j3721L814J3336M211p540j3813
$$ -14005 -17877 -9559 6412 6207 -12225 -13327 3190 1555 -12166 -8352 4984 9195 1655 -12158
1378a2158k734J8893R143j8198r327J5080N329j2831q250M681J2608O745j4821
$$ -12158 -14892 4001 13144 -5054 -14381 699 6028 -6803 -15053 -10372 2236 8981 -5840
1391e840j8210R927J7753q467j3553P322J0763j777j0378r758M660J8151J030
$$ -5840 -24050 -14123 3630 -4837 -18390 -11068 -305 -2082 -12460 -22218 -17558 593 1623
1404A623j7279n10J5171k044j2657J295J1126Q309k053j4009m861J7719J0514
$$ 1623 -15656 -16166 -995 -3039 -15696 -14401 -3275 5034 2981 -11028 -15889 1830 12344
1417A2344j4473n451J4911O996r580q223K039J4037J2262j0580j5489J0089J4718
$$ 12344 -2129 -7580 7331 14327 4747 -3476 -1437 12600 24862 14282 -1207 8882 23600
1430B3600q855j1205P840J2981J899q538j3287L265J7575q13j7444K348J5543
$$ 23600 14745 3540 11380 24361 26260 17722 4435 7700 25275 24462 7018 9366 24909
1443B4909l053j5625m085Q396J1837j351j8449p643J6804O832j7705p185J4038
$$ 24909 21856 6231 2146 10542 22379 21028 2579 -5064 11740 18572 867 -6318 7720
1456G720Q499q730j4931o031J4048J4382j2205j7513J0100J5266r820j6242K203
$$ 7720 16219 7489 -7442 -13473 575 14957 2752 -14761 -4661 10605 785 -15457 -13254
1469a3254J3417Q727q013j7793K164J9659r28j9404L85J6864K446j2021j0521
$$ -13254 163 8890 877 -16916 -14752 4907 3979 -15425 -15040 1824 4270 -7751 -18272
1482a8272L176J6329O006j8504r747J7251Q877j5739r801J0559J2939J299j3307
$$ -18272 -15096 1233 7239 -11265 -21012 -3761 5116 -10623 -20424 -9865 3074 4373 -8934
1495h934j2143J1000J6525r169j5806R654J5927n010j3574m576R086J4116k155
$$ -8934 -21077 -10077 6448 -2721 -18527 -8873 7054 2044 -11530 -16106 -7020 7096 4941
1508D941j8457q20J9322Q39j7364k005J4033O807o245j3243l472J5788R665j5188
$$ 4941 -13516 -14336 4986 5825 -11539 -13544 489 7296 1051 -12192 -15664 124 9789 -5399
1522e399r671J4834Q924j1443j0945L798J1866Q028q987j3938Q121J5467p739
$$ -5399 -15070 -236 8688 -2755 -13700 -9902 1964 9992 1005 -12933 -4812 10655 2916
1535B916j4390P783J4668m42j0353p511N466J5329n96j6670K74J7957rj5884k453
$$ 2916 -11474 -3691 10977 10535 182 -7329 -1863 13466 12870 -3800 -3526 14431 14422 -1462 -3915
1550c915J1149R673k105j3602n826J4908Q409j5570q341J5597R445r888j1833
$$ -3915 7234 16907 14802 1200 -4626 10282 18691 3121 -5220 10377 19822 9934 -1899
1563a899p86J0454R432r198j3603R471J4579j0433j5642O030J3860J930r324j1977
$$ -1899 -2685 7769 17201 8003 -5600 3871 18450 8017 -7625 -1595 12265 14195 4871 -7106
1577g106M434J6586k035j8808N96J9099J438j6564q510P430J4247K490j6668q771
$$ -7106 -2672 13914 11879 -6929 -6333 12766 14204 -2360 -10870 -3440 10807 13297 -3371 -12142
1591a2142J5729R940j6429j2379J1958J3844k751j3208q966Q828J4245p698j6971
$$ -12142 3587 13527 -2902 -15281 -3323 10521 7770 -5438 -14404 -5576 8669 971 -16000
1604a6000P125J6672n324j6264j667J0765R281m431j5512j253J7038J738j7500
$$ -16000 -8875 7797 2473 -13791 -15458 -4693 4588 157 -15355 -16608 430 2168 -15332
1617a5332l190J7413O573j0554j1752k84J4431Q853j2816j0545J4062J1119j2099
$$ -15332 -18522 -1109 5464 -5090 -16842 -17126 -2695 6158 -6658 -17203 -3141 7978 -4121
1630d121j1916O775J2485M369q337j1154O130J4601m907j4081N936J4451l405
$$ -4121 -16037 -9262 3223 7592 -745 -11899 -5769 8832 3925 -10156 -4220 10231 6826
1643F826j2037l785P438J0973j315j4393q89J6004J39j7517k748J5534Q386o979
$$ 6826 -5211 -8996 -1558 9415 8100 -6293 -7182 8822 8961 -8556 -11304 4230 12616 5637
1657E637j3491k723J3895R507j4720j0973J4284J2862j0583j3853K611J2578Q546
$$ 5637 -7854 -10577 3318 12825 -1895 -12868 1416 14278 3695 -10158 -7547 5031 13577
1670A3577r014j5310O594J7957m654j6854K582J5324K664j0290r352L955J5402
$$ 13577 4563 -10747 -4153 13804 9150 -7704 -5122 10202 12866 2576 -6776 -2821 12581
1683A2581J697j7441m312J8459O275j5171r458P478J3040K202j3689r770J3612
$$ 12581 14278 -3163 -7475 10984 17259 2088 -7370 108 13148 15350 1661 -8109 5503
1696E503J4719j2420j6482P985J5579r14j2019p204O606J3848l383j7394k96J7123
$$ 5503 20222 7802 -8680 -695 14884 13970 1951 -5253 1353 15201 11818 -5576 -5872 11251
1710A1251P19j4043m267P125O918k235j0027m114J1666M452j4572o872J2358P767
$$ 11251 11970 -2073 -6340 785 7703 5468 -4559 -8673 2993 7445 -7127 -13999 -1641 6126
1724F126p689r311m45P245O006r130r251R724J2717r139j3931M164J1331L069
$$ 6126 -1563 -10874 -11319 -4074 1932 -7198 -16449 -6725 5992 -3147 -17078 -12914 -1583 1486
1738A486n899q372L203J2429j048j4279J008J4939J731r951m198M180P293J355
$$ 1486 -4413 -12785 -9582 2847 1799 -12480 -11472 3467 5198 -4753 -8951 -4771 2522 3877
1752C877q401k873J1885M547j3780o815J1789Q356m010p770k827P234P343q701
$$ 3877 -4524 -7397 4488 9035 -4745 -11560 229 8585 4575 -3195 -6022 1212 8555 -146
1766a46j0925R231J3317o150j3206J90Q967N480l845j0770Q78J3262L60j4525
$$ -146 -11071 -1840 11477 5327 -7879 -7689 1278 6758 2913 -7857 -6979 6283 6643 -7882
1780g882j592J2479M217o435n768q30P078M461q476m490J0952O064j0559o483
$$ -7882 -9474 3005 7222 787 -4981 -5811 1267 5728 -2748 -7238 3714 9778 -781 -7264
1794g264O248O549K23n240m554O076R441o557j1491O468J1356k948q597j233M751
$$ -7264 -1016 5533 5756 516 -4038 2038 11479 4922 -6569 -101 11255 8307 -290 -1523 3228
1809C228O648k148j0206N02J2777K40j2705k786Q793L950k945n672j761O730M025
$$ 3228 9876 7728 -2478 -1976 10801 11041 -1664 -4450 4343 8293 5348 -324 -2085 4645 8670
1824H670r766o160J0312O170p792n979L653M152J229n804n972P002R865o583j1754
$$ 8670 -1096 -7256 3056 9226 1434 -4545 -892 3260 4489 -1315 -7287 -285 9580 2997 -8757
1839h757M408R227q16o160k729K863O668j723j1054L21J2682J138j0867l019N464
$$ -8757 -4349 4878 4062 -2098 -4827 -1964 4704 2981 -8073 -7752 4930 6068 -4799 -7818 -2354
1854b354L329j376m698k251P537M293j0040o056Q719N761n332m025J408M300K845
$$ -2354 975 -401 -5099 -7350 187 4480 -5560 -11616 -2897 2864 -2468 -6493 -5085 -785 2060
1869B060n420o872O460R960m970j0216L336Q718j53m333l495K062Q505r79j0830
$$ 2060 -3360 -10232 -3772 6188 1218 -8998 -5662 3056 2903 -1430 -4925 -2863 5642 4663 -6167
1884f167m65J1592J474q017k449M012L808l30o489l284R244O068r870o319P117
$$ -6167 -6632 4960 6434 -1583 -4032 -20 3788 3458 -3031 -6315 2929 8997 -873 -7192 -75
1899g5N250l987m743J84M805N329n862r211N714J0357m166r025K204O662Q50l641
$$ -75 5175 1188 -3555 -3371 1434 6763 901 -8310 -2596 7761 3595 -5430 -3226 3436 4286 645
1915F45n415J479J0080J11j1542j014R597J589o018k518K598N345P65p951m444
$$ 645 -4770 -3291 6789 6900 -4642 -5656 3941 5530 -488 -3006 -408 4937 5702 -2249 -6693
1930f693Q934O594q411n865O324M977k657m879k480N869P191m895r900L939R168
$$ -6693 2241 8835 424 -5441 883 5860 3203 -1676 -4156 1713 8904 4009 -5891 -1952 7216
1945G216k900o456O27M776K906l211p609N16J0705J167r930j871P057J388m595
$$ 7216 4316 -2140 -1513 3263 6169 2958 -4651 -4135 6570 7737 -2193 -4064 2993 4381 -214
1960b14l581J250O089L260q451n984P265O083o218m943M276M500k54n120n107
$$ -214 -3795 -2545 3544 6804 -1647 -7631 -366 5717 -501 -5444 -1168 3332 3078 -2042 -7149
1975g149M088R278l448r298K572O916j823m636k46L389L791j407p970o30R436
$$ -7149 -3061 6217 2769 -6529 -3957 2959 1136 -3500 -3746 -357 3434 2027 -5943 -6573 2863
1990B863J304q401k70O586J072m379l894L50O977M497q622n702Q189N209o779
$$ 2863 4167 -4234 -4504 2082 3154 -1225 -5119 -4769 2208 6705 -1917 -7619 570 5779 -1000
2005a000m801L965N784J467n884p064M917J0200m370q646K463P715j569o088k493
$$ -1000 -5801 -1836 3948 5415 -469 -7533 -2616 7584 3214 -5432 -2969 4746 3177 -2911 -5404
2020e404L502P358o75r771j894R780J028q490j697O991M169k873p112k997R149
$$ -5404 -1902 5456 4781 -4990 -6884 2896 3924 -4566 -6263 728 4897 2024 -5088 -8085 1064
2035A064O395q425o607P396O534m638o482J94O652O073m605r839K137J0976j543
$$ 1064 7459 -966 -7573 -177 6357 1719 -4763 -4569 2083 8156 3551 -6288 -4151 6825 5282
2050E282q590M54O863J799l710o853M8Q717K895q131l465P135J616o616k716L768
$$ 5282 -3308 -2854 4009 5808 2098 -4755 -4707 4010 6905 -1226 -4691 2444 4060 -2556 -5272 -1504
2066a504M538J721o573n422O272O240n990n618O231N619k953n755k055M606P933
$$ -1504 3034 4755 -1818 -7240 -968 5272 -718 -6336 -105 5514 2561 -3194 -5249 -643 7290
2081G290k455q961K122Q200k023p481J536N936K937k471p030j036P809K308p776
$$ 7290 4835 -4126 -2004 6196 4173 -3308 -1772 4164 7101 4630 -2400 -3436 4373 6681 -1095
2096a095j501P975J512p302m100K146O719K366p094o111P244O285p960o572N544
$$ -1095 -2596 5379 6891 -411 -4511 -2365 4354 6720 -374 -6485 759 7044 -916 -7488 -1944
2111a944P530n06p747o485M821J0042k328j0329J090R397m97q287l108M814P454
$$ -1944 5586 5080 -2667 -9152 -4331 5711 3383 -6946 -5856 3541 3044 -5243 -8351 -3537 3917
2126C917L48r211l805Q600L742p388l841P219M609l146n884k170O198O828n210
$$ 3917 4265 -4946 -8751 -151 3591 -3797 -7638 -419 4190 1044 -4840 -7010 -812 6016 806
2141H06p203N916O651m735p097K377O632M248l734q625J430Q829M07q290L86P129
$$ 806 -6397 -481 6170 1435 -5662 -3285 3347 7595 3861 -4764 -3334 5495 5902 -2388 -2002 5127
2157E127J194m557n310O49O834K997o676m549O125K862o492l042M713L687j107
$$ 5127 6321 1764 -3546 -2897 3937 6934 258 -4291 1834 4696 -1796 -4838 -125 3562 2455
2172B455n035l492M265M913n014n206N306N821m573o545N1N482N249k823p654
$$ 2455 -2580 -6072 -1807 3106 -1908 -7114 -1808 4013 -560 -7105 -7054 -1572 3677 854 -6800
2187f800J100Q938j197q800O11P940L699l944o102l70P675L276o361l057P617
$$ -6800 -5700 3238 2041 -6759 -6148 1792 5491 1547 -4555 -4925 2750 6026 -335 -3392 4225
2202D225L679o091m487K833N797K232m503n435M510O156m929o424M635O938j810
$$ 4225 7904 1813 -2674 159 5956 8188 3685 -1750 2760 8916 3987 -2437 2198 9136 7326
2217G326o809l875L239P031j176q519l12Q209k74q993k448M655N086p00o591m210
$$ 7326 517 -3358 -119 6912 5736 -2783 -3095 5114 4840 -4153 -6601 -1946 3140 2440 -4151 -8361
2233h361N882M394o164m203O208M036l684m499o38M021N227k969n702L379O454
$$ -8361 -2479 1915 -4249 -8452 -2244 1792 -1892 -6391 -7029 -3008 2219 -750 -6452 -3073 3381
2248C381l702n982K657O382K066l317m825N85O858N47o681j87Q204J284o555l522
$$ 3381 -321 -6303 -3646 2736 4802 1485 -3340 -2755 4103 4650 -2031 -2218 5986 7270 715 -2807
2264b807K156N223K327n133m605N568L435o173l807N207M162j588m656k754K692
$$ -2807 -651 4572 6899 1766 -2839 2729 6164 -9 -3816 1391 5553 3965 -691 -3445 -753
2279g53M409k552n714L221O148l868o304M25M200L239j291n389q38O079L3p207
$$ -753 3656 1104 -4610 -1389 4759 891 -5413 -4988 -788 2451 1160 -4229 -5067 1012 1045 -6162
2295f162N0P019J907m532l704j11M421L026m299l721N725L930n396m231L506M486
$$ -6162 -6112 907 2814 -1718 -5422 -5533 -1112 1914 -2385 -6106 -381 3549 -1847 -6078 -2572 1914
2311A914Q49k430l571K099M900k135n492L542O613j369m837j487K428L543L31
$$ 1914 2763 333 -3238 -1139 3761 1626 -3866 -324 6289 4920 83 -1404 1024 4567 4898
2326D898m858j38N842L2o794j423N268K810j383l732k422L041L395m641l414M800
$$ 4898 40 -98 5744 5776 -1018 -2441 2827 5637 4254 522 -1900 1141 4536 -105 -3519 1281
2342A281L656m339m557P90L008K293j705m125J482M902l017n888K541N743j52
$$ 1281 4937 598 -3959 -3169 -161 2132 427 -3698 -2216 2686 -331 -6219 -3678 2065 1913
2357A913l026k702J010L763P60m845m59O486R28n817k056L306L149J91k658k027
$$ 1913 -1113 -3815 -2805 958 1718 -3127 -3586 2900 3828 -1989 -4045 -739 2410 2601 -57 -2084
2373b084L777K607m818l245N139M187k776l573l87K260K149j201m315K452N363
$$ -2084 1693 4300 -518 -3763 1376 5563 2787 -786 -1173 1087 3236 2035 -2280 172 5535
2388E535k820o209R25M455O82j598k641l88M340j1n777j086O303J651m488k336
$$ 5535 2715 -3494 -2569 1886 2568 970 -1671 -2059 2281 2270 -3507 -4593 1710 3361 -1127 -3463
2404c463J117J804J336k289k479M001K986n080l752L624L588m83k174j072J041
$$ -3463 -2346 -542 794 -1495 -3974 27 3013 -2067 -5819 -2195 1393 910 -1264 -2336 -1295
2419a295L128k473m089K680O346j458n353n10K415J877m95k438j2M083N50n991
$$ -1295 1833 -640 -4729 -2049 4297 2839 -2514 -3024 -609 1268 773 -1665 -1677 2406 2956 -3035
2435c035r24M981J962k643j665l25J940J090k603k059M363L147m696l302K908
$$ -3035 -3959 1022 2984 341 -1324 -1649 291 1381 -1222 -3281 1082 4229 -467 -3769 -861
2450h61K705m88j708j573K558L343k809n244J963O444p89m235q95J670K354l90
$$ -861 1844 1356 -352 -1925 633 3976 1167 -4077 -2114 4330 3541 -694 -1589 81 2435 2045
2466B045l890l15N407J256n666k086L966J822j300j822p01K164K586l415l836
$$ 2045 -1845 -2160 3247 4503 -1163 -3249 717 2539 1239 -583 -1284 880 3466 51 -3785
2481c785L901M168k631l547J660J720L21j479l039K339N106j706n637J67M939
$$ -3785 116 4284 1653 -1894 -234 1486 1807 328 -2711 -372 4734 3028 -2609 -2442 2497
2496B497K63k652j273N82K926M02m620k076M940K373l542k026J354P15jp41j408
$$ 2497 2760 108 -1165 -583 2343 2745 -1875 -3951 989 3362 -180 -2206 -852 -137 -138 -879 -2287
2513b287K224K661l211l405K786K653j890j300J769J153N9j659l246K484N299
$$ -2287 -63 2598 -613 -4018 -1232 1421 -469 -1769 0 1153 1212 -447 -3693 -1209 4090
2528D090j633m860O30L721m93j985j114J176L366J31n337j938N383K032l762j317
$$ 4090 2457 -2403 -1773 1948 1455 -530 -1644 -468 2898 3029 -2308 -4246 1137 3169 -593 -1910
2544a910J696R01m73k464j614L609L689l598m055K711K487j591k220P00K248J994
$$ -1910 -214 687 214 -2250 -3864 -255 3434 -164 -4219 -1508 979 -612 -2832 -2132 116 2110
2560B110k761m710J828O124l62m800n14L199J254j618k693j85N175J901n216k857
$$ 2110 -651 -5361 -3533 2591 2229 -2571 -3085 114 1368 -250 -2943 -3128 2047 3948 -1268 -4125
2576d125L842K743j904j414Q07J519J162k167k999K467M522j983k979J378J472
$$ -4125 -283 2460 556 -858 -51 1468 2630 463 -2536 -69 4453 2470 -509 869 2341
2591B341n64j405n20J252L492j402m999N08M882o57l323p5K421P56j392l119j248
$$ 2341 1777 372 -148 1104 4596 3194 -1805 -1297 3585 2928 -395 -470 1951 2707 1315 -1804 -3052
2608c052M859K233m283k487K624J268k079j042R44J635J779l047l842L154L640
$$ -3052 1807 4040 -243 -2730 -106 1162 -917 -1959 -1015 620 2399 -648 -4490 -1336 2304
2623B304k491k527K130J990r16k132j785K152M782j329n101M64M782q17l593j21
$$ 2304 -187 -2714 -584 1406 490 -1642 -3427 -1275 3507 2178 -2923 -2459 2323 1506 -2087 -2208
2639b208K728K630n10m766k316N197L563m138k663K561J944j570j919j108K893
$$ -2208 520 3150 2640 -2126 -4442 755 4318 180 -2483 78 2022 452 -1467 -2575 318
2654C18L546k592m397J666L899j775k361P87K214Q40j775m082P91N131M00m773
$$ 318 3864 1272 -3125 -1459 2440 665 -1696 -909 1305 2145 370 -3712 -2921 2210 2610 -2163
2670b163n65L375K23k697j419R99L158J552m553l348L823L048k455k032J779J813
$$ -2163 -2728 647 870 -1827 -3246 -2247 911 2463 -2090 -5438 -1615 1433 -1022 -3054 -1275 538
2686E38L01j834k997K347M555j198l788J195L352j743j609M54K005K139o10m047
$$ 538 839 -995 -3992 -1645 2910 1712 -2076 -881 2471 728 -881 -427 1578 3717 3107 -940
2702i40l59M744K68l345q3K926M81j258k582n00L158K620l610k882K740J655k527
$$ -940 -1299 3445 3713 368 285 3211 3692 2434 -148 -648 2510 5130 1520 -1362 1378 3033 506
2719E06j465O23K093J203k168l483M65M125q84l333J163K352j268k265j181N03
$$ 506 -959 -336 1757 2960 792 -2691 -2226 1899 1015 -2318 -1155 1197 -71 -2336 -3517 -3014
2735c014L616O16m054j293L536M78l069m43K383J526o1l114j935L172K945j876
$$ -3014 602 1218 -2836 -4129 -593 -115 -3184 -3627 -1244 282 221 -2893 -4828 -1656 1289 -587
2751e87k478K507J737j683j529K6J922L156j341l474N11L789q36k682J587K362
$$ -587 -3065 -558 1179 -504 -2033 -2007 -85 3071 1730 -1744 -1233 2556 1720 -962 625 2987
2767B987j92j061k433kL634J541l306j595K748K30k316r91J108K223Q12k627l201
$$ 2987 2795 1734 -699 -701 2933 4474 1168 -427 2321 2551 235 -756 352 2575 3387 760 -2441
2784b441J871K908k015j945J875J395r32k112j263O29L136m3l610L29K781j262
$$ -2441 -570 2338 323 -1622 253 1648 716 -1396 -2659 -2030 1106 1063 -2547 -2218 563 -699
2800f99k388N36K124J204l69k874j347L364J508k669o01K849M63j588j382K43
$$ -699 -3087 -2551 -427 777 408 -2466 -3813 -449 1059 -1610 -2211 638 1101 -487 -1869 -1626
2816a626K102K313j398l337K620J890k030j430K398J209Jo95j963J45L302n19
$$ -1626 476 2789 1391 -1946 674 2564 534 -896 1502 2711 2712 2017 54 199 3501 2982
2832B982k486P69K507j434k446o2J114K159o3l442j336K827P23l521o47K331Q07
$$ 2982 496 1265 3772 2338 -108 -170 944 3103 3040 -402 -1738 1089 1812 -1709 -2356 -25 782
2849G82r72k267j569J527K806j646k619J832J576k012j590O83J605J368o35k312
$$ 782 -190 -2457 -4026 -2499 307 -1339 -3958 -2126 -550 -2562 -4152 -3469 -1864 -496 -1131 -3443
2865c443q6K925k8k309J419K703o03j494j064R01K208J649k350j422K978J240
$$ -3443 -3529 -604 -632 -2941 -1522 1181 578 -916 -1980 -1079 1129 2778 428 -994 1984 3224
2881C224k806j163K444J100J007j367k602J018K945j089k289J639J565j728j275
$$ 3224 418 -745 1699 2799 3806 2439 -163 855 3800 2711 422 2061 3626 1898 623
2896F23l52L22J686L26k829k78K199r45k389N30K067o7j203j575n52K015J092
$$ 623 271 593 2279 2605 -224 -502 1697 752 -1637 -1107 960 893 -310 -1885 -2437 -422 670
2913F70k505j455K515J364k127j594Q46J286K010j205k566Q44K814j125k040J695
$$ 670 -1835 -3290 -775 589 -1538 -3132 -2286 -1000 1010 -195 -2761 -1917 897 -228 -2268 -573
2929e73J762k96m00j153J97K163P97k237J64K399m27k297R06J512J53L70j171
$$ -573 1189 893 493 -660 -463 1700 2497 260 424 2823 2396 99 1005 2517 2670 3040 1869
2946A869j869K195J290k988p71K186J074j791r89o74M51J453n09k305N35J513
$$ 1869 0 2195 3485 497 -274 1912 2986 1195 206 -468 -17 1436 927 -1378 -843 670
2962F70j475j510Q06O78l57j93o99p89J326P2k130P80K289o66k258M11J028O18
$$ 670 -805 -2315 -1509 -831 -1188 -1381 -2080 -2869 -1543 -1471 -3601 -2821 -532 -1198 -3456 -3045 -2017 -1399
2980a399P6o36j072K818O70k926m39K677J055m58q49r33O65K413r08j613J293
$$ -1399 -1323 -1959 -3031 -213 457 -2469 -2908 -231 824 366 -483 -1416 -751 1662 754 -859 434
2997D34K403j334j722L94P92Q98R7j189l32J813l43k604N13K183J0j740n06l29
$$ 434 2837 1503 -219 175 967 1865 1962 773 441 2254 1911 -693 -180 2003 2013 273 -233 -562
3015e62Q87J131k202j207K440R05k715j248J326J235K78n37j508K59K156j136
$$ -562 325 1456 -746 -1953 487 1392 -1323 -2571 -1245 -10 268 -269 -1777 -1518 638 -498
3031d98k083J954K069r53r36K3M55P16J093q30o47K107l60k511J174K078j25n58
$$ -498 -2581 -627 1442 489 -447 -424 31 747 1840 1010 363 2470 2110 -401 773 2851 2726 2168
3049B168l10n78J073Q40j708o12K382O94k830r91J209P96M51n87k228L88J925
$$ 2168 1858 1280 2353 3193 1485 873 3255 3949 1119 128 1337 2133 2584 1997 -231 157 2082
3066B082j407k021J181J480p96j625n39r2J178L51j667l44K008p05k276q4J876
$$ 2082 675 -1346 -165 1315 519 -1106 -1645 -1737 -559 -208 -1875 -2219 -211 -916 -3192 -3276 -1400
3083a400K59l57j328p35J448J369j908j168K924P90j605j277L22J091J683l98
$$ -1400 -1141 -1498 -2826 -3561 -2113 -744 -2652 -3820 -896 -106 -1711 -2988 -2666 -1575 108 -290
3099b90k121N75K462p94j703J406J374j4m13j203j13J571J302k338o23K306J24
$$ -290 -2411 -1836 626 -168 -1871 -465 909 895 482 -721 -834 737 2039 -299 -922 1384 1508
3116A508j923m68Q29O78N09j332j549J277J536j874j454J821R57j033j104m0J53
$$ 1508 -415 -883 -54 624 1133 -199 -1748 -471 1065 -809 -2263 -442 515 -518 -1622 -1662 -1509
3133a509K034j21k732M00K068m96j027N72P09L71l7m92m34J863R27j885n2K061
$$ -1509 525 404 -2328 -1928 140 -356 -1383 -811 -102 269 232 -260 -694 1169 2096 211 159 2220
3151B220J23q06l98O46Q03R68j078j296J507J587j375j151J547M63k65n47m99
$$ 2220 2343 1537 1139 1785 2588 3556 2478 1182 2689 4276 2901 1750 3297 3760 3495 2948 2449
3168B449L3J363m43k100K95J713r71j032m32j0L76%j010q90J280J27k532m64J795
$$ 2449 2482 3845 3402 1302 1597 3310 2339 1307 875 865 1241 1241 231 -659 621 748 -1784 -2248 -453
3187d53l70q47k72r47P17J092j487j263J592J223j633q73N69N44L89J98j222j65
$$ -453 -823 -1670 -1942 -2889 -2172 -1080 -2567 -3830 -2238 -1015 -2648 -3521 -2952 -2408 -2019 -1821 -3043 -3208
3205c208K253p1k139R43J764J89r15k65O6J125P68j267r41K243L82j830m94J617
$$ -3208 -955 -1026 -3165 -2222 -458 -269 -1184 -1449 -1383 -258 510 -757 -1698 545 927 -903 -1397 220
3223B20O71k01n88j067N16J562r58j599J469J316j148j201Q3l3J031M48j824m10
$$ 220 891 690 102 -965 -449 1113 155 -1444 25 1341 193 -1008 -925 -958 73 521 -1303 -1713
3241a713J853q63j385L90J621l67l63m52o78J334Q57j284m20J430P70j708l79
$$ -1713 140 -723 -2108 -1718 -97 -464 -827 -1279 -1957 -623 234 -1050 -1470 -40 730 -978 -1357
3258a357J185P13M88j33j354J001J524q31j062J354J432n55o56Q5k9J602M15j587
$$ -1357 -172 541 1029 896 -458 543 2067 1236 174 1528 2960 2405 1749 1834 1805 3407 3822 2235
3276B235m33K069k70j490K36P94L5J97p03o85Q88N16j574p11J665K85j765q62
$$ 2235 1802 3871 3601 2111 2347 3141 3176 3373 2670 1985 2873 3389 1815 1104 2769 3054 1289 427
3294D27O5N71N11p93j788J88J516j143j764R13J007n08p82q48m67J437L13j855
$$ 427 492 1063 1574 781 -1007 -819 697 -446 -2210 -1297 -290 -798 -1580 -2428 -2895 -1458 -1145 -3000
3312c000j96J674k63j220q7P80O63N02o37j364J423Q38j338m69J905N37l04o18
$$ -3000 -3196 -1522 -1785 -3005 -3092 -2312 -1649 -1147 -1784 -3148 -1725 -887 -2225 -2694 -789 -252 -556 -1174
3330a174l62N85J725k00j780Q67J789m06k051N79Q37O35j89q69r45J199R40j711
$$ -1174 -1536 -951 774 574 -1206 -339 1450 1044 -1007 -428 409 1044 855 -14 -959 240 1180 -531
3348e31l44J430k93q05n62j4K42R73r65j289J087L68j033r97J447L17j32l95j211
$$ -531 -875 555 262 -543 -1105 -1119 -877 96 -869 -2158 -1071 -703 -1736 -2733 -1286 -969 -1101 -1496 -2707
3367b707K7J979j73j499R99J431k41j091K71L01R79J053j178n49J412P24j295
$$ -2707 -2680 -701 -874 -2373 -1374 57 -184 -1275 -1004 -703 276 1329 151 -398 1014 1738 443
3384D43k1J560M42l8k03m95M89J361n94r37J566R66j835m35N82O27K08k37j232
$$ 443 422 1982 2424 2386 2183 1688 2177 3538 2944 2007 3573 4539 2704 2269 2851 3478 3686 3449 2217
3403B217PJ097p35j454J58J698n75j020n34q01R62O07j374o65R37j51j659kO23
$$ 2217 2224 3321 2586 1132 1290 2988 2413 1393 859 58 1020 1627 253 -412 525 374 -1285 -1287 -664
3422f64P9j61l60j104L11O44n55j020J522Q08j330o20N4K74J163j15j044L72J313
$$ -664 -585 -746 -1106 -2210 -1899 -1255 -1810 -2830 -1308 -500 -1830 -2450 -2396 -2122 -959 -1074 -2118 -1746 -433
3441d33m34j554P76J356O32l74m49r23J095J410r39q45J565K87r88n27J69J28
$$ -433 -867 -2421 -1645 -289 343 -31 -480 -1403 -308 1102 163 -682 883 1170 182 -345 -176 -48
3459d8J266l59j402O14R81j389j072J128J033j377l64k59m42J054K38j483P3J332
$$ -48 1218 859 -543 71 1052 -337 -1409 -281 752 -625 -989 -1248 -1690 -636 -398 -1881 -1808 -476
3477d76n36j903J79R71K70L27n17q24R66O30q13m73J784M37p41l08n3M99J140
$$ -476 -1012 -2915 -2736 -1765 -1495 -1168 -1685 -2509 -1543 -913 -1726 -2199 -415 22 -719 -1027 -1080 -581 559
3496E59l5r51J189J114j236q39J449P76L89m33k47o62J527K1j229L04J828m64
$$ 559 524 -427 762 1876 640 -199 1250 2026 2415 1982 1735 1073 2600 2621 1392 1696 3524 3060
3514C060j288l44N60L02M78o25q88R33O72j741r82J424K04l56p48j42j06L86l17
$$ 3060 1772 1428 1988 2290 2768 2143 1255 2188 2860 1119 137 1561 1765 1409 661 519 413 799 482
3533D82j124O33J413j218j306O09J89q7M16r58o98J497k15j401K56J792m66r28
$$ 482 -642 -9 1404 186 -1120 -511 -322 -409 7 -951 -1649 -152 -367 -1768 -1512 280 -186 -1114
3551a114k57m83R19J008p19j173J698M86j162o34R32K14K69K31q01K5J241r86
$$ -1114 -1371 -1854 -935 73 -646 -1819 -121 365 -797 -1431 -499 -285 -16 215 -586 -561 680 -306
3569c06o77J005J463j128q68o4J97M81J25q63j13J153l68j303m72J517Q7n83l80
$$ -306 -983 22 1485 357 -511 -575 -378 103 228 -635 -748 405 37 -1266 -1738 -221 -134 -717 -1097
3588a097p37M50J123j019j053J452J083j551p86M94L94K41J42q20L80J189o69
$$ -1097 -1834 -1384 -261 -1280 -2333 -881 202 -1349 -2135 -1641 -1247 -1006 -864 -1684 -1304 -115 -784
3605g84j028Q91J210m54k12J9j00J069N91j051r9J860K51j558J69P65pM92j90
$$ -784 -1812 -921 289 -165 -377 -358 -458 611 1202 151 52 1912 2163 605 774 1539 1532 2024 1834
3624A834j183O15J038q56j269J404O59p10p05J12m74O16L35j569L29J174j055
$$ 1834 651 1266 2304 1448 179 1583 2242 1532 827 939 465 1081 1416 -153 176 1350 295
3641B95j316M72J121k78k70o55n02J298j39j168k53J787j88r29m23L76L42J092
$$ 295 -1021 -549 572 294 24 -631 -1133 165 26 -1142 -1395 392 204 -725 -1148 -772 -430 662
3659F62m81r50Q75P93m66j273J357N31k72o9m17q8Q98J73r58J67J435n74j061
$$ 662 181 -769 106 899 433 -840 517 1048 776 707 290 202 1100 1273 315 482 1917 1343 282
3678B82l7K36M61L40o64p07Q90J82j436j86J387J02q77m94m51R4R57k72j393L90
$$ 282 245 481 942 1282 618 -89 801 983 -453 -639 748 850 -27 -521 -972 -878 79 -193 -1586 -1196
3698a196J011j169n28Q16L14p60J79j73l6O06J41j223K21J703q91m45J02N82M1
$$ -1196 -185 -1354 -1882 -1066 -752 -1512 -1333 -1506 -1542 -936 -795 -2018 -1797 -94 -985 -1430 -1328 -746 -705
3717g05R23o06l74R96P94k027M42J075N38j47Ql25J13J096l21o36L71J182j015
$$ -705 218 -388 -762 234 1028 -999 -557 518 1056 909 917 592 705 1801 1480 844 1215 2397 1382
3736A382q39O03M47R2L04j324k4P27r9j953M04J481o37r81k68o51L94N71p67j037
$$ 1382 543 1146 1593 1685 1989 665 641 1368 1269 -684 -280 1201 564 -417 -685 -1336 -942 -371 -1138 -2175
3756b175J190K01j362n65R87J53k3J35p24P9R03j22r04P47R02n46l73O45q1J080
$$ -2175 -985 -784 -2146 -2711 -1724 -1571 -1594 -1459 -2183 -2104 -1201 -1323 -2227 -1480 -578 -1124 -1497 -852 -933 147
3776A47K83p44R0J272J48j320O35J496O1p10L6j14Q01M40m7j093J559Q6q69o54
$$ 147 430 -314 -224 1048 1196 -124 511 2007 2068 1358 1394 1280 2081 2521 2474 1381 2940 3026 2157 1503
3796A503N88m2N94R4j274j83Q10n71j201P26O90j386j91k87n14P49J02j178l31
$$ 1503 2091 2049 2643 2737 1463 1280 2090 1519 318 1044 1734 348 157 -130 -644 105 207 -971 -1302
3815a302J389q88j760N64J090l88O7m09p70O49P54q24o04J203O66q96O9K68K68
$$ -1302 87 -801 -2561 -1997 -907 -1295 -1228 -1637 -2407 -1758 -1004 -1828 -2432 -1229 -563 -1459 -1390 -1122 -854
3834h54P09J07n73M56J195r21l56O84R60n96K20j3k76N50P68j009j82J596o44
$$ -854 -145 -38 -611 -155 1040 119 -237 447 1407 811 1031 1018 742 1292 2060 1051 869 2465 1821
3853A821j364J64O43J4k50k9j298Q38L66j045j020J049N45j173k07p55j90O74
$$ 1821 457 621 1264 1278 1028 999 -299 539 905 -140 -1160 -111 434 -739 -946 -1701 -1891 -1217
3871a217l14j041N12N93q09j168P15L02O7j8l11q2P69J53j091N21J568J17j023
$$ -1217 -1531 -2572 -2060 -1467 -2276 -3444 -2729 -2427 -2360 -2378 -2689 -2771 -2002 -1849 -2940 -2419 -851 -734 -1757
3890a757J22J46Q91Q42j30n02J410P90r55m34J266P61m0K38n40J55Q53J9r40N96
$$ -1757 -1635 -1489 -598 244 114 -388 1022 1812 857 423 1689 2450 2410 2648 2108 2263 3116 3135 2195 2791
3910B791J287n65j169J93K15k3K62o93p31O66j80j661j36J291l93p23k39q03L61
$$ 2791 4078 3513 2344 2537 2752 2729 2991 2298 1567 2233 2053 392 256 1547 1154 431 192 -611 -250
3929b50L22p01j181J273P61j496j042M65M34J68J67m32k93J076o34r71P02J720
$$ -250 72 -629 -1810 -537 224 -1272 -2314 -1849 -1415 -1247 -1080 -1512 -1805 -729 -1363 -2334 -1632 88
3947H8l13m60J04j36N53P02m38r0J664l91j208j58J682K43k10j69o70L70J018
$$ 88 -225 -685 -581 -717 -164 538 100 10 1674 1283 75 -83 1599 1842 1632 1463 793 1163 2181
3966B181p06j163J384J047j381r02J44r8J42No85n31J371j320j559P61O98n14
$$ 2181 1475 312 1696 2743 1362 460 604 506 648 653 -32 -563 808 -512 -2071 -1310 -612 -1126
3984a126k20m24o21J16M51j045k21J427lj928m6N79K48L46R0q12N64R89j071l57
$$ -1126 -1346 -1770 -2391 -2275 -1824 -2869 -3090 -1663 -1666 -3594 -3640 -3061 -2813 -2467 -2377 -3189 -2625 -1636 -2707 -3064
4004c064J242J428o43n84L31K07R96R2j69J83J469o26r65P67N38N37J69j34o01
$$ -3064 -1822 -394 -1037 -1621 -1290 -1083 -87 5 -164 19 1488 862 -103 664 1202 1739 1908 1774 1173
4023A173O37Q92j214J00J443J07j283j61J22K04N03j74p16M18P95j387j036O93
$$ 1173 1810 2702 1488 1588 3031 3138 1855 1694 1816 2020 2523 2349 1633 2051 2846 1459 423 1116
4041A116Q39n48j43n97o28N74L0j541K88J187n62q57j31J03L45N9l05l17J087
$$ 1116 1955 1407 1264 667 39 613 643 -898 -610 577 15 -842 -973 -870 -525 -466 -771 -1088 -1
4060aN00j936R7J250L31m66k0K49j25Q72n12q10R99J392m98j289L58P61o5M98
$$ -1 499 -1437 -1340 -90 241 -225 -245 4 -121 751 239 -571 428 1820 1322 33 391 1152 1087 1585
4080A585m42N3R56n07j185l05J512l17m42k01k48rj20k35n72J445Kj888p88N57
$$ 1585 1143 1196 2152 1645 460 155 1667 1350 908 707 459 450 330 95 -477 968 970 -918 -1706 -1149
4100a149L12m42M92p88o85P39p34j340J156J126p22r08K3j98R4P33o27K39J030
$$ -1149 -837 -1279 -787 -1575 -2260 -1521 -2255 -3595 -2439 -1313 -2035 -2943 -2920 -3118 -3024 -2291 -2918 -2679 -1649
4119a649j19j765K49J556p5M69k71J05k02O70m30K12J368P91j119k1M59l4Q92
$$ -1649 -1768 -3533 -3284 -1728 -1803 -1334 -1605 -1500 -1702 -1032 -1462 -1250 118 909 -210 -231 228 194 1086
4138A086K16k54J04J010j231r80J504J043m09l78j55l43J02L74n52J09J058k28
$$ 1086 1302 1048 1152 2162 931 -49 1455 2498 2089 1711 1556 1213 1315 1689 1137 1246 2304 2076
4156B076j312j81P66k90P3J8m03Q3L28j205n42J760K97j129J2K97k66Q3N42p99
$$ 2076 764 583 1349 1059 1132 1150 747 830 1158 -47 -589 1171 1468 339 351 648 382 465 1007 208
4176B08N91P31o74j028P49Q63l87K49m80P8L58K94j012L70J366o9j291L11J65
$$ 208 799 1530 856 -172 577 1440 1053 1302 822 900 1258 1552 540 910 2276 2207 916 1227 1392
4195A392j65R0K36o35O57N65j561m21O25K77m38l94j89l33J42p1j256l0J406p75
$$ 1392 1227 1317 1553 918 1575 2140 579 158 783 1060 622 228 39 -294 -152 -223 -1479 -1509 -103 -878
4215h78j182M3J03l09J68m05j76N83j17j439j72J315J27q16P04k43m87O91m7k88
$$ -878 -2060 -2017 -1914 -2223 -2055 -2460 -2636 -2053 -2170 -3609 -3781 -2466 -2339 -3155 -2451 -2694 -3181 -2490 -2537 -2825
4235b825P47J254j317k09R55p7l24N79N20k49Q57k87q21P91J437p99n06P77j58
$$ -2825 -2078 -824 -2141 -2350 -1395 -1472 -1796 -1217 -697 -946 -89 -376 -1197 -406 1031 232 -274 503 345
4254C45n40Q56l30k93J327N5j436J69O91R4p66O74n5j40K55n98m44P93P82r34
$$ 345 -195 661 331 38 1365 1420 -16 153 844 938 172 846 791 651 906 308 -136 657 1439 505
4274E05l21N82m86k35Q69m29K14N22k52j193P58J087k30k43O20j47m32M17m1k57
$$ 505 184 766 280 45 914 485 699 1221 969 -224 534 1621 1391 1148 1768 1621 1189 1606 1565 1308
4294A308J618K34j348K25Q24n08k58J004m70j37P37j120j043J140Q51j337O5N25
$$ 1308 2926 3160 1812 2037 2861 2353 2095 3099 2629 2492 3229 2109 1066 2206 3057 1720 1785 2310
4312B310q13j30j38p24N4R07q48j624L73P43q58l02R6k01l30K37j352k76J168
$$ 2310 1497 1367 1229 505 559 1466 618 -1006 -633 110 -748 -1050 -954 -1155 -1485 -1248 -2600 -2876 -1708
4331a708k36j070L75M87q83k03N10R9J13O48o79r40J502L32r04N87M82J88k24
$$ -1708 -1944 -3014 -2639 -2152 -3035 -3238 -2728 -2629 -2516 -1868 -2547 -3487 -1985 -1653 -2557 -1970 -1488 -1300 -1524
4350a524l0m20M84J684l50r81P63K97p12O51J56k11P82N29j192n50J292J08q89
$$ -1524 -1554 -1974 -1490 194 -156 -1137 -374 -77 -789 -138 18 -193 589 1118 -74 -624 668 776 -113
4369a13L19O59o60j80j45o70P82O58j372o85J175K37j371L94K41k87L26m81n51
$$ -113 206 865 205 25 -120 -790 -8 650 -722 -1407 -232 5 -1366 -972 -731 -1018 -692 -1173 -1724
4388a724L93J211m40r56R70K51l84p3L92nP38J016j038N3J367m14k29O83K04J67
$$ -1724 -1331 -120 -560 -1516 -546 -295 -679 -752 -360 -365 373 1389 351 404 1771 1357 1128 1811 2015 2182
4408B182M54k31n85J306J014q34n96R25P7m48K0K0l03J257m16j614M41P96p73
$$ 2182 2636 2405 1820 3126 4140 3306 2710 3635 3712 3264 3284 3304 3001 4258 3842 2228 2669 3465 2692
4427B692o38J78k6p98N7q43q05J289l34j473O7N91j059n01J38J15l83j27r05p44
$$ 2692 2054 2232 2206 1408 1465 622 -183 1106 772 -701 -634 -43 -1102 -1603 -1465 -1350 -1733 -1860 -2765 -3509
4447c509J136R27j367m64Q22j1m77J81l02J11J356l19j051M64R45k37m54R61K96
$$ -3509 -2373 -1446 -2813 -3277 -2455 -2466 -2943 -2762 -3064 -2953 -1597 -1916 -2967 -2503 -1558 -1795 -2249 -1288 -992
4466i92qK08o98J53J266N43j399M52J473o55l21M26l88L08Q09l98j541J055P02
$$ -992 -1000 -792 -1490 -1337 -71 472 -927 -475 998 343 22 448 60 368 1177 779 -762 293 995
4485I95r85j03N24k63m45M57j096m9P69k35j302L93Q22r38j78M49m78K75L51n81
$$ 995 10 -93 431 168 -277 180 -916 -965 -196 -431 -1733 -1340 -518 -1456 -1634 -1185 -1663 -1388 -1037 -1618
4505a618m76J063K64j024M59P50n14M51J25m37R52R93o11o28J183Q05n00K95O98
$$ -1618 -2094 -1031 -767 -1791 -1332 -582 -1096 -645 -520 -957 -5 988 377 -251 932 1737 1237 1532 2230
4524B230k48N34L06o28J96J479k53j128Q46M90o87M01n9n94K85N66q60q33Q45
$$ 2230 1982 2516 2822 2194 2390 3869 3616 2488 3334 3824 3137 3538 3479 2885 3170 3736 2876 2043 2888
4543B888J96j327M28Q6r43k82J37j160K53O01j009j335J112O5j122N9l29m10K73
$$ 2888 3084 1757 2185 2271 1328 1046 1183 23 276 877 -132 -1467 -355 -290 -1412 -1353 -1682 -2092 -1819
4562a819j1q70Q7O54m9o69M04K81m72K70K40o56R57N99q26k06J140m3n52Q96K26
$$ -1819 -1830 -2700 -2613 -1959 -2008 -2677 -2273 -1992 -2464 -2194 -1954 -2610 -1653 -1054 -1880 -2086 -946 -989 -1541 -645 -419
4583d19k79M28M41q61N36J213q33m17O99k5o1M27n19m19J053K15j405K12J098
$$ -419 -698 -270 171 -690 -154 1059 226 -191 508 483 422 849 330 -89 964 1179 -226 -14 1084
4602A084q67o19L29m8k45M74o39r36P40P42j347l54Q30j77n44K42j67JM98j23
$$ 1084 217 -402 -73 -121 -366 108 -531 -1467 -727 15 -1332 -1686 -856 -1033 -1577 -1335 -1502 -1501 -1003 -1126
4622a126p39M94Q76r85nP75R4m51P69o6m65J055M15q22K74J160n59QQ35n1j50
$$ -1126 -1865 -1371 -495 -1480 -1485 -710 -616 -1067 -298 -364 -829 226 641 -181 93 1253 694 702 1537 1486 1336
4643A336M36J22q32J138O29r74j2Q33n22K25M28n25m48O90J34j315L70O76q28
$$ 1336 1772 1894 1062 2200 2829 1855 1843 2676 2154 2379 2807 2282 1834 2524 2658 1343 1713 2389 1561
4662A561l64L32q03j58L26n96m79O68K46j549R2P83r20j53M67k54m57N75m69r21
$$ 1561 1197 1529 726 568 894 298 -181 487 733 -816 -724 59 -861 -1014 -547 -801 -1258 -683 -1152 -2073
4682b073J076J8q55O59N08o48K86N06j127L80J446n93j200P62L21l63O32M45o64
$$ -2073 -997 -979 -1834 -1175 -667 -1315 -1029 -523 -1650 -1270 176 -417 -1617 -855 -534 -897 -265 180 -484
4701d84J77N94q57k15J105j05q02J254j32p81m6Q77r88M29P46n46r96R57k21n27
$$ -484 -307 287 -570 -785 320 215 -587 667 535 -246 -292 585 -403 26 772 226 -770 187 -34 -561
4721e61M35K72o93L42P8q73L64R01q28m45L47p4p06L71R50r28L46L61q86K30J009
$$ -561 -126 146 -547 -205 -127 -1000 -636 265 -563 -1008 -661 -735 -1441 -1070 -120 -1048 -702 -341 -1227 -997 12
4742A2j11l46M83J8o73L61K08k07N22R87p77m71J196m45o70Q63N52q58O68L36
$$ 12 -99 -445 38 56 -617 -256 -48 -255 267 1254 477 6 1202 757 87 950 1502 644 1312 1648
4762A648j202Q2J100n08k27M74j36q86O15L70j129R43J02q87l74J278j080n62
$$ 1648 446 528 1628 1120 893 1367 1231 345 960 1330 201 1144 1246 359 -15 1263 183 -379
4780c79Q57K3p24P19l84p36L96O61p68k57R86n57q74J025j39m61R38j35j242M35
$$ -379 478 501 -223 496 112 -624 -228 433 -335 -592 394 -163 -1037 -12 -151 -612 326 191 -1051 -616
4800f16R06j093o1J154l71n80Q92q7m05L55P10j045K86O79r44l56J135P2o19L51
$$ -616 290 -803 -864 290 -81 -661 231 144 -261 94 804 -241 45 724 -220 -576 559 631 12 363
4820C63k5j122J007L16q89M1R47p69n09M73l43K96P93p69p98N07K75p70J44P27
$$ 363 338 -784 223 539 -350 -309 638 -131 -640 -167 -510 -214 579 -190 -988 -481 -206 -976 -832 -105
4840a05m57k68M29k87n45R66P8r27N47M91q47l3O91j24j02N75k99n88J288k37
$$ -105 -562 -830 -401 -688 -1233 -267 -189 -1116 -569 -78 -925 -958 -267 -391 -493 82 -217 -805 483 246
4860B46j006P56R67o11j47M01p20K33J149n03q03O39O41p54j79N79m60K2M10p72
$$ 246 -760 -4 963 352 205 606 -114 119 1268 765 -38 601 1242 488 309 888 428 450 860 88
4880H8k3P45p5j139J205J30q47k87N05o66o7P83p81l01M71M2j128M57L44k59L90
$$ 88 65 810 735 -404 801 931 84 -203 302 -364 -431 352 -429 -730 -259 -217 -1345 -888 -544 -803 -413
4901d13j14p49P1J150p43n88J189J14r61M72O13q86O51Q75p65k03J048l18o33
$$ -413 -527 -1276 -1205 -55 -798 -1386 -197 -83 -1044 -572 41 -845 -194 681 -84 -287 761 443 -190
4920a90P96M26n62K62Q4m07K57Q11j012q4J381p35m28P9O28o89M81k4p45j57R79
$$ -190 606 1032 470 732 816 409 666 1477 465 381 1762 1027 599 678 1306 617 1098 1074 329 172 1151
4941A151p82p78J096%q10J76j90q08N79O25j152l43J345q27p78R18l63J15K3J10
$$ 1151 369 -409 687 687 -123 53 -137 -945 -366 259 -893 -1236 109 -718 -1496 -578 -941 -826 -803 -693
4961f93p61K85O62l82k76J054k02m16N60j76k23Q59K34r38J89J400r40m46R57
$$ -693 -1454 -1169 -507 -889 -1165 -111 -313 -729 -169 -345 -568 291 525 -413 -224 1176 236 -210 747
4980G47J63k69O12k51n52O07L71q66M7J033q88n71N65m66k13J144m87r56L71P35
$$ 747 910 641 1253 1002 450 1057 1428 562 609 1642 754 183 748 282 69 1213 726 -230 141 876
5000H76j319J6R20q57m09L27o69q5O10m09m26J88L97o83j81N27l24J1P47m31r16
$$ 876 -443 -427 493 -364 -773 -446 -1115 -1200 -590 -999 -1425 -1237 -840 -1523 -1704 -1177 -1501 -1490 -743 -1174 -2090
5021b090J434J28p36L73O08l13j26M78n56KJ552m89l31O91L72j150O71N01k06
$$ -2090 -656 -528 -1264 -891 -283 -596 -722 -244 -800 -798 754 265 -66 625 997 -153 518 1019 813
5040H13k46Q90n41p9R38n31n02Q57J90p70J40j9n77PR96r39n54P59L1j276L89
$$ 813 567 1457 916 837 1775 1244 742 1599 1789 1019 1159 1140 563 570 1566 627 73 832 863 -413 -24
5061b4M04o08L41J87q63k63Q54l74q03R56K9r87M13J38n62K63R28j048o3P68n53
$$ -24 380 -228 113 300 -563 -826 28 -346 -1149 -193 -164 -1151 -738 -600 -1162 -899 29 -1019 -1082 -314 -867
5082h67k14Q53L83q33M69N25r54N01Q86m78j07R42m72m04L93J32k71O33L28r70
$$ -867 -1081 -228 155 -678 -209 316 -638 -137 749 271 164 1106 634 230 623 755 484 1117 1445 475
5102D75K08O99o57n2O58qp93K14L61j034O27N73j107j75O80r12n33O23j62p45
$$ 475 683 1382 725 673 1331 1323 530 744 1105 71 698 1271 164 -11 669 -243 -776 -153 -315 -1060
5122a060Q71k82j022L74L52o66l3Q40q32o14Q39j92n86P61M4q44K26R31r10O6
$$ -1060 -189 -471 -1493 -1119 -767 -1433 -1466 -626 -1458 -2072 -1233 -1425 -2011 -1250 -1206 -2050 -1824 -893 -1803 -1737
5142a737P18j89m91Q26L41p63N84P06m72K06Q57o75j35J392q35l70J125L4r79
$$ -1737 -1019 -1208 -1699 -873 -532 -1295 -711 -5 -477 -271 586 -89 -224 1168 333 -37 1088 1122 143
5161A43O69N00q56M58O48l70n58Q03n8m61M61K21j153M36L74r95J25M60m48m44
$$ 143 812 1312 456 914 1562 1192 634 1437 1379 918 1379 1600 447 883 1257 262 387 847 399 -45
5181d5J074k88j105L81J06l53rO85j042J59O14p48k97P64n8n41P41J32n88L43
$$ -45 1029 741 -364 17 123 -230 -239 446 -596 -437 177 -571 -868 -104 -162 -703 38 170 -418 -75
5201g5L59n93J42P73l40p62J234l26l60Q19J34q07M10O66j242K56R77l69n40O70
$$ -75 284 -309 -167 606 266 -496 738 412 52 871 1005 198 608 1274 32 288 1265 896 356 1026
5221A026j96k13M38J36q39L72P79j184j15M63k81o02M71j78p43O05M01j513N06
$$ 1026 830 617 1055 1191 352 724 1503 319 204 667 386 -216 255 77 -666 -61 340 -1173 -667
5240f67N37p11j84N22o27l34R59k39o47L57K74j063M93N31q00k60R78m15m42Q86
$$ -667 -130 -841 -1025 -503 -1130 -1464 -505 -744 -1391 -1034 -760 -1823 -1330 -799 -1599 -1859 -881 -1296 -1738 -852
5260h52j82q02N39P42q00j03Q67m17l9J196n40o42P69L36p32N05O06l44J00N18
$$ -852 -1034 -1836 -1297 -555 -1355 -1458 -591 -1008 -1047 149 -391 -1033 -264 72 -660 -155 451 107 207 725
5280G25q04k22Q23N1o94Q51K97j351R90M91o31o1Q58p46n96J347m69o83R74L00
$$ 725 -79 -301 522 573 -121 730 1027 -324 666 1157 526 465 1323 577 -19 1328 859 176 1150 1450
5300A450j308L57P27p61R1Q38o78m48R37n38o33M89M87o80N09J84p47r1J175o90
$$ 1450 142 499 1226 465 556 1394 716 268 1205 667 34 523 1010 330 839 1023 276 185 1360 670
5320F70j93K59j3o24P12Q3p32N33O17q54l40P27j53p62Q75J69j109L84K80p87
$$ 670 477 736 723 99 811 894 162 695 1312 458 118 845 692 -70 805 974 -135 249 529 -258
5340b58L83P03r04k77O71n47j43M38P7o89N90L65j070M10L11m70p34J149o10k71
$$ -258 125 828 -76 -353 318 -229 -372 66 143 -546 44 409 -661 -251 60 -410 -1144 5 -605 -876
5360h76N91J81r49M3R42j004k13Q14k76m82Q29k25q07Q36j80q66P04L90q43j23
$$ -876 -285 -104 -1053 -1010 -68 -1072 -1285 -471 -747 -1229 -400 -625 -1432 -596 -776 -1642 -938 -548 -1391 -1514
5380a514Q58l0o91L04J56r25J146N28j207N01P78j148J15J014p80k61J103R1j144
$$ -1514 -656 -686 -1377 -1073 -917 -1842 -696 -168 -1375 -874 -96 -1244 -1129 -115 -895 -1156 -53 38 -1106
5399a106N74N97p40M11P21p06k6R81o39m24J267l3q16M67P55q82L57M99m44l67
$$ -1106 -532 65 -675 -264 457 -249 -275 706 67 -357 910 877 61 528 1283 401 758 1257 813 446
5419D46R55m39l22R45jj036O73M17r03K96P79o24m15J056m54q48N40P36j114N29
$$ 446 1401 962 640 1585 1584 548 1221 1638 735 1031 1810 1186 771 1827 1373 525 1065 1801 687 1216
5439A216K67p38J26N90n79m67R27m96n24N67j70q35P63K95r09K70L87q25k11P89
$$ 1216 1483 745 871 1461 882 415 1342 846 322 889 719 -116 647 942 33 303 690 -135 -346 443
5459D43k11j031N09L00p53L77K38n88j83J348j113m13P12k67l89M17Mn71M75M50
$$ 443 232 -799 -290 10 -743 -366 -128 -716 -899 449 -664 -1077 -365 -632 -1021 -604 -600 -1171 -696 -246
5479b46p43n46J366p33p9Q52p33m57Q71N58j183J81P19r36j77J187k60p55R14
$$ -246 -989 -1535 -169 -902 -981 -129 -862 -1319 -448 110 -1073 -892 -173 -1109 -1286 -99 -359 -1114 -200
5498b00nq42K23Q00j369M34J133p49l21P52o57j53Q17k76p22K72O94q94L06O03
$$ -200 -205 -1047 -824 -24 -1393 -959 174 -575 -896 -144 -801 -954 -137 -413 -1135 -863 -169 -1063 -757 -154
5518a54q95M68Q06n45p98R71K74q46O77M53q49K21P55o90k92R19J63q85R10j8
$$ -154 -1049 -581 225 -320 -1118 -147 127 -719 -42 411 -438 -217 538 -152 -444 475 638 -247 663 645
5538F45l54J51O50o65L60P30o06l52Q52j50n86R33L32p20p2O93p71M42O42m32
$$ 645 291 442 1092 427 787 1517 911 559 1411 1261 675 1608 1940 1220 1148 1841 1070 1512 2154 1722
5558A722q20R11j75q72M21L22o73M32M96j484J14O30n87p13J122k00j159Q67R4
$$ 1722 902 1813 1638 766 1187 1509 836 1268 1764 280 394 1024 437 -276 846 646 -513 354 448
5577D48r62J90P22j119l10J086o53o85P83L01q89L07N07r45L94L83n83k52R39
$$ 448 -514 -324 398 -721 -1031 55 -598 -1283 -500 -199 -1088 -781 -274 -1219 -825 -442 -1025 -1277 -338
5596c38k49q03O70J49p20Q26M09p89k43J180n41p42J190l32m84R27k64q52R81
$$ -338 -587 -1390 -720 -571 -1291 -465 -56 -845 -1088 92 -449 -1191 -1 -333 -817 110 -154 -1006 -25
5615b5K54n41j34Q13p32l57R13n72l10P27l31q57M98O71r21J85P48o15m57N73
$$ -25 229 -312 -446 367 -365 -722 191 -381 -691 36 -295 -1152 -654 17 -904 -719 29 -586 -1043 -470
5635d70K3p36O87K89q29oJ031p37k7Q84o62k18O38l1p17P29N45q71N27P13p71
$$ -470 -447 -1183 -496 -207 -1036 -1042 -11 -748 -775 109 -553 -771 -133 -164 -881 -152 393 -478 49 762 -9
5656ik57J292n72j53J166k05p96Q97K75q88M06M61o58K45P08n47o33J031j87n52
$$ -9 -266 1026 454 301 1467 1262 466 1363 1638 750 1156 1617 959 1204 1912 1365 732 1763 1576 1024
5676A024L28K93n61M6Q20j108p7Q60l91j491J119l5q72N48K96j077K47M30p71
$$ 1024 1352 1645 1084 1130 1950 842 765 1625 1234 -257 862 827 -45 503 799 -278 -31 399 -372
5695c72n31J196n36p51R12j10q17J73P04j036Q2P98p66p96J258k59p39J141j29
$$ -372 -903 293 -243 -994 -82 -192 -1009 -836 -132 -1168 -1086 -288 -1054 -1850 -592 -851 -1590 -449 -578
5714e78p89P67M78j021N27R51q01n37P57J87r10P66L38n99J11Q50q85j85J212
$$ -578 -1367 -600 -122 -1143 -616 335 -466 -1003 -246 -59 -969 -203 135 -464 -353 497 -388 -573 639
5733F39m19q19R29j77q34J010m0p24J48P60j352O0J046l07m33R7K49q11M91K08
$$ 639 220 -599 330 153 -681 329 289 -435 -287 473 -879 -819 227 -80 -513 -416 -167 -978 -487 -279
5753b79j002N30Q22q18m12J035n80m41P75l23n31O84O63j119J28Q57l11k90Q50
$$ -279 -1281 -751 71 -747 -1159 -124 -704 -1145 -370 -693 -1224 -540 123 -996 -868 -11 -322 -612 238
5772B38m00o5N83P7j005J052N76p31N0Q93n88k51R02l69o04J013l3q92N42P63
$$ 238 -162 -227 356 433 -572 480 1056 325 375 1268 680 429 1331 962 358 1371 1338 446 988 1751
5792A751p69j49M82k45k20N25l56q85R58K51j288N62K88o75m2N59o36m36R17k97
$$ 1751 982 833 1315 1070 850 1375 1019 134 1092 1343 55 617 905 230 188 747 111 -325 592 295
5812B95r03P51N3r80O95J78r65K48O98l04n53Q26l6r52P75M49j097k1R27o85j71
$$ 295 -608 143 196 -784 -89 89 -876 -628 70 -234 -787 39 3 -949 -174 275 -822 -843 84 -601 -772
5833g72Q86m16p85R95J72p67L30M82o14K26P10o45l52J260o73o24P61R8r85R87
$$ -772 114 -302 -1087 -92 80 -687 -357 125 -489 -263 447 -198 -550 710 37 -587 174 272 -713 274
5853B74L54r95J82O17q18o1O94m34p18Q96P0p38K72N92j216N80M01o98j70R59
$$ 274 628 -367 -185 432 -386 -447 247 -187 -905 -9 61 -677 -405 187 -1029 -449 -48 -746 -916 43
5873D3m2q29O18J05j008P54O12j256K96P76p76K8O34Q1p56J090n5r40P39O10r25
$$ 43 1 -828 -210 -105 -1113 -359 253 -1003 -707 69 -707 -679 -45 36 -720 370 315 -625 114 724 -201
5894b01J66R53p50o74J552o28o24P71J00n49L32O00j012J36N44j09m50P24k56
$$ -201 -35 918 168 -506 1046 418 -206 565 665 116 448 1048 36 172 716 607 157 881 625
5913F25l75Q12R1j115L61K27o86J6R34p70n98R64N1r58O35P15j041L2Q11p76l20
$$ 625 250 1062 1153 38 399 626 -60 -44 890 120 -478 486 537 -421 214 929 -112 -80 731 -45 -365
5934c65Q70k42o46M64J18p59Q66L49j168L90J008r52o49J322m46q57Q91Q2r59
$$ -365 505 263 -383 81 199 -560 306 655 -513 -123 885 -67 -716 606 160 -697 194 276 -683
5953f83N92N45p42Q7O17r12k04R09l76m64O20Q4q35L62O07j038L26P70m59p24
$$ -683 -91 454 -288 -201 416 -496 -700 209 -167 -631 -11 73 -762 -400 207 -831 -505 265 -194 -918
5973i18O24j92o90J231j58r22N63Q16j110j91Q18l87o9N36Qr75P89L93q13O89
$$ -918 -294 -486 -1176 55 -103 -1025 -462 354 -756 -947 -129 -516 -585 -49 -41 -1016 -227 166 -647 42
5993D2N67j176J0J128l57n11P86j46q38Q30M21j163N39K62j85l16R37q53k68J222
$$ 42 609 -567 -557 571 214 -297 489 343 -495 335 756 -407 132 394 209 -107 830 -23 -291 931
6013I31n74q37R18K33j186J69O88m55n1Q93o18q37R19J06p19L98M66q64k42J286
$$ 931 357 -480 438 671 -515 -346 342 -113 -164 729 111 -726 193 299 -420 -22 444 -420 -662 624
6033F24r65J8Q03k99p90J108J43j211N72P63r54L44L48n22j67J388m11j206Q57
$$ 624 -341 -323 480 181 -609 499 642 -569 3 766 -188 156 504 -18 -185 1203 792 -414 443
6052D43O56j247L92P08o36J2P00o69n74J098J0j189Q67J68o55J42N48j240K96
$$ 443 1099 -148 244 952 316 328 1028 359 -215 883 893 -296 571 739 84 226 774 -466 -170
6071a70R28j078j04R20l64q53N73p7m33L80N78r26r2O51l65p49J058k30p17P09
$$ -170 758 -320 -424 496 132 -721 -148 -225 -658 -278 300 -626 -718 -67 -432 -1181 -123 -353 -1070 -361
6091c61l66m65O39R45j334j03J312o96o99J194j27q46R11M47j391M06J269q92
$$ -361 -727 -1192 -553 392 -942 -1045 267 -429 -1128 66 -61 -907 4 451 -940 -534 735 -157
6109a57n09J367l54n54N95K5p55Q48J71r11M99P55q44m73R24l71k70N82j45q95
$$ -157 -666 701 347 -207 388 413 -342 506 677 -234 265 1020 176 -297 627 256 -14 568 423 -472
6129d72R14J75j149J08J237o96n29Q00n82m68Q71Q6j288R48O86j298j53R90l29
$$ -472 442 617 -532 -424 813 117 -412 388 -194 -662 209 295 -993 -45 641 -657 -810 180 -149
6148a49p40J099n18o21J217L2j188P21M08j121L92Q87l30j59Q78q47l14Q96J77
$$ -149 -889 210 -308 -929 288 320 -868 -147 261 -860 -468 419 89 -70 808 -39 -353 543 720
6167G20j009M70N28n02K92O15j022Q7R24o40o67P93M27q72m5L74j18m81J161j150
$$ 720 -289 181 709 207 499 1114 92 179 1103 463 -204 589 1016 144 99 473 355 -126 1035 -115
6187a15m48J040o5p48L45P94j279M9O67o08k42P64n88n23R47P9r24L93K80q56
$$ -115 -563 477 412 -336 9 803 -476 -427 240 -368 -610 154 -434 -957 -10 69 -855 -462 -182 -1038
6207a038M25P12j010p0J457n76o41M86K99n70L64M32m68J4Q12r35k73J104p5q74
$$ -1038 -613 99 -911 -981 476 -100 -741 -255 44 -526 -162 270 -198 -184 628 -307 -580 524 449 -425
6227d25M65O60q18K05Q86q67j79J360j027l46R98k31j273J028L47r71L76O30j248
$$ -425 40 700 -118 87 973 106 -73 1287 260 -86 912 681 -592 436 783 -188 188 818 -430
6246d30N81Q01r80n06J114j07j013Q88k62r91N20R50j095j96R80o25n52P96J26
$$ -430 151 952 -28 -534 580 473 -540 348 86 -905 -385 565 -530 -726 254 -371 -923 -127 -1
6265aq78N93N03r09J45J218j206k7R56n95o00J038j04p83R67O6r75K52J275n89
$$ -1 -879 -286 217 -692 -547 671 -535 -562 394 -201 -801 237 133 -650 317 383 -592 -340 935 346
6285C46n12J005n16n31R05k04q39P80O60j454M20P19r81j0N76O5q80R09M4q79
$$ 346 -166 839 323 -208 697 493 -346 434 1094 -360 60 779 -202 -212 364 429 -451 458 502 -377
6305c77K59J010j451K39J177j038k42Q54n50m68P88m78l25M26N59r03j09R28n08
$$ -377 -118 892 -559 -320 857 -181 -423 431 -119 -587 201 -277 -602 -176 383 -520 -629 299 -209
6324b09n48R33l08p67Q80J41p62P20O02p48k23O34j60o05O50J20p88J174k38p83
$$ -209 -757 176 -132 -899 -19 122 -640 80 682 -66 -289 345 185 -420 230 350 -438 736 498 -285
6344b85M90Q26j150K1J148j118k73J313n50r26R54L45q95q4N84m45J62M92n21
$$ -285 205 1031 -119 -98 1050 -68 -341 972 422 -504 450 795 -100 -184 400 -45 117 609 88
6363H8q84P39J93q62Q44J77j154P61M13q59K40L66l02n70J074l50p33J022K38
$$ 88 -796 -57 136 -726 118 295 -859 -98 315 -544 -304 62 -240 -810 264 -86 -819 203 441
6382D41j145M48L84m19j90Q39j47j289J270M12j204O29L82q16M00Q34q89k46J042
$$ 441 -704 -256 128 -291 -481 358 211 -1078 192 604 -600 29 411 -405 -5 829 -60 -306 736
6401G36n26l75O20J3r17O06M91p90N8O76k69r66J103l81n94Q47K3r69K76O99j138
$$ 736 210 -165 455 468 -449 157 648 -142 -84 592 323 -643 460 79 -515 332 355 -614 -338 361 -777
6422g77O25P61j102l48Q66j75m57M27J30q02O55K65n44j64J121p04l90Q57j38
$$ -777 -152 609 -493 -841 25 -150 -607 -180 -50 -852 -197 68 -476 -640 481 -223 -613 244 106
6441A06m08O02L40j082L56O73q11M75N36k24q18O69J78o37O18L07j037N40N23
$$ 106 -302 300 640 -442 -86 587 -224 251 787 563 -255 414 592 -45 573 880 -157 383 906
6460I06r94L01Q02n88o02J068p58j88M27J19j112M39J072j014m66Q13R4j081Q85
$$ 906 -88 213 1015 427 -175 893 135 -53 374 493 -619 -180 892 -122 -588 225 319 -762 123
6479A23n1r27N77L65q68J57R16q23n39R68j25o39Q69j17r69R81N46j079Q9O75
$$ 123 72 -855 -278 87 -781 -624 292 -531 -1070 -102 -227 -866 3 -114 -1083 -102 444 -635 -546 129
6499A29k44m58R41o08k56R24K37j130R52M13q68k72J102p40m44J202n37q27J011
$$ 129 -115 -573 368 -240 -496 428 665 -465 487 900 32 -240 862 122 -322 880 343 -484 527
6518E27Q9r77K13O50m98j29P96o58m30P73o76o12Q10M57j068M2O59l02k34L19
$$ 527 616 -361 -148 502 4 -125 671 13 -417 356 -320 -932 -122 335 -733 -691 -32 -334 -568 -249
6538b49j62n22P54J79j151O08O45q15q6O84m89J43J055p16p36R43J81p12O07M59
$$ -249 -411 -933 -179 0 -1151 -543 102 -713 -799 -115 -604 -461 594 -122 -858 85 266 -446 161 620
6558F20o98J14Q21o43k79J236l90r07J065j37o30N11M18l51n8M63n25n07J022
$$ 620 -78 36 857 214 -65 1171 781 -126 939 802 172 683 1101 750 692 1155 630 123 1145
6577A145l64q55Q44k3p26L35L80j063N47N09r04l36P30k38n71M70Ro90N23L32
$$ 1145 781 -74 770 747 21 356 736 -327 220 729 -175 -511 219 -19 -590 -120 -111 -801 -278 54
6597E4j065J96J213j354J85M63k18o17Q26J04l16M63L23j110L75P44l47p03J062
$$ 54 -1011 -815 398 -956 -771 -308 -526 -1143 -317 -213 -529 -66 257 -853 -478 266 -81 -784 278
6616B78Q7o10M00L64r18P63N55q74J14M93n9o14N38n2m44M93M75j157K79O91p46
$$ 278 365 -245 155 519 -399 364 919 45 159 652 593 -21 517 465 21 514 989 -168 111 802 56
6637E6j90K83k93k39M99J34q00M73J93r02L43O02p31n42R74m96k02P29k55j004
$$ 56 -134 149 -144 -383 116 250 -550 -77 116 -786 -443 159 -572 -1114 -140 -636 -838 -109 -364 -1368
6657a368Q10N00r10k40J191o34J62P08k39r31Q99N11r29L94N95l62k28Q58o15
$$ -1368 -558 -58 -968 -1208 -17 -651 -489 219 -20 -951 -52 459 -470 -76 519 157 -71 787 172
6676A72l04J074k57o62R57O5n85j6P10r07K9Q68m43l19O08j62r78R79M96j472
$$ 172 -132 942 685 23 980 1045 460 444 1154 247 276 1144 701 382 990 828 -150 829 1325 -147
6696a47K91O60j159K86N55m98k81M03r9q33P02L00p00N3Q24j338K12Q15m58l55
$$ -147 144 804 -355 -69 486 -12 -293 110 11 -822 -120 180 -520 -467 357 -981 -769 46 -412 -767
6716g67Q22l90q79P78O07o83M2O26m41o7P24m55m09R90J12j021L97O63p10K20
$$ -767 55 -335 -1214 -436 171 -512 -470 156 -285 -352 372 -83 -492 498 610 -411 -14 649 -61 159
6736A59P93p78m6N92J23q63Q98p5j126O47O58r86J73P86q48m60Q98n61p49Q67
$$ 159 952 174 128 720 843 -20 878 803 -323 324 982 -4 169 955 107 -353 545 -16 -765 102
6756A02M21j024K86L39q74K03O98l81n53P29k31n65K62L24o28J52M81n19J8J127
$$ 102 523 -501 -215 124 -750 -547 151 -230 -783 -54 -285 -850 -588 -264 -892 -740 -259 -778 -760 367
6776C67o97n19J024k89m67P51Q7r20O82N97o28j32R46q97n29J193R5q20P49J81
$$ 367 -330 -849 175 -114 -581 170 257 -663 19 616 -12 -144 802 -95 -624 569 664 -156 593 774
6796G74o42M34L68j035k49J677r76l82P69r1o92N69J31q75O29K87j111L32P04
$$ 774 132 566 934 -101 -350 1327 351 -31 738 647 -45 524 655 -220 409 696 -415 -83 621
6815F21m58n83O40l57m29M17K12p37L86N78p11K70M34m32n44P62J25p08N98K69
$$ 621 163 -420 220 -137 -566 -149 63 -674 -288 290 -421 -151 283 -149 -693 69 194 -514 84 353
6835C53r05L56J020r48m9Q10m73k78O43N6p29M39K80l89m8P70o47k58Q72l86o28
$$ 353 -552 -196 824 -124 -173 637 164 -114 529 585 -144 295 575 186 138 908 261 3 875 489 -139
6856a39P24j80l71L75J50p68Q8Q27p66n52R80n17m75Q07O5j311N18O68o91l88
$$ -139 585 405 34 409 559 -209 -121 706 -60 -612 368 -149 -624 183 248 -1063 -545 123 -568 -956
6876i56P16n18k79R40j52p37O25K97j036M69M37l18q8O33q50M3J034l55o46P89
$$ -956 -240 -758 -1037 -97 -249 -986 -361 -64 -1100 -631 -194 -512 -600 33 -817 -774 260 -95 -741 48
6896D8K67p86M80K62m30k69J072m87j13P66k04p60O01N25j335O25M74n74j7P82
$$ 48 315 -471 9 271 -159 -428 644 157 44 810 606 -154 447 972 -363 262 736 162 145 927
6916I27q60k86O03K45q49M27L77q03Q4Q59j039j20R52k34o27N52Mr75P51M91p10
$$ 927 67 -219 384 629 -220 207 584 -219 -135 724 -315 -435 517 283 -344 208 212 -763 -12 479 -231
6937b31j97R35j031j27J007j50q73P14L85n24K39L00n42Q4N96q79l26J255j83
$$ -231 -428 507 -524 -651 356 206 -667 47 432 -92 147 447 -95 -11 585 -294 -620 635 452
6956D52n82O85j91n94P03N72j170J80O13j34p70Q01j46o62O56K45j006N22K56
$$ 452 -130 555 364 -230 473 1045 -125 55 668 534 -236 565 419 -243 413 658 -348 174 430
6975D30n62j31R40n89o95N81L57p84N17J73q77L56O69j041j90J069k12p61M54
$$ 430 -132 -263 677 88 -607 -26 331 -453 64 237 -640 -284 385 -656 -846 223 11 -750 -296
6994b96J84q66P97J44p76j8R34n11m06R58n43j73O84Mj014Q54M98r67M4R45p47
$$ -296 -112 -978 -181 -37 -813 -831 103 -408 -814 144 -399 -572 112 116 -898 -44 454 -513 -469 476 -271
7015b71O9R74n45o05P04J24n96N65J07n85l43J048m98j52M03l41k44P16N8j022
$$ -271 -202 772 227 -378 326 450 -146 419 526 -59 -402 646 148 -4 399 58 -186 530 588 -434
7035d34M81N62o70M1L62m00j71N73o42m15Q90R4q15K69Q39o62j69O54m39l81P14
$$ -434 47 609 -61 -20 342 -58 -229 344 -298 -713 177 271 -544 -275 564 -98 -267 387 -52 -433 281
7056B81k86o99Q38M95j061K71P63n81K12K98o01QJ089m62j000O67M22m38O7L35
$$ 281 -5 -704 134 629 -432 -161 602 21 233 531 -70 -62 1027 565 -435 232 654 216 283 618
7076F18n29O7O56m56l88P63j19p03O01L31j063L32P46j113K03O43l34r26Q81j08
$$ 618 89 156 812 356 -32 731 612 -91 510 841 -222 110 856 -257 -54 589 255 -671 210 102
7096A02j027R77K33o71J61L14r78K26J022q99l44N58J75o38J94J24o69Q29M53
$$ 102 -925 52 285 -386 -225 89 -889 -663 359 -540 -884 -326 -151 -789 -595 -471 -1140 -311 142
7115A42n32n17J076q05l83J068j71m31K96N35o91J12O21m43k32J032l79o50P61
$$ 142 -390 -907 169 -636 -1019 49 -122 -553 -257 278 -413 -301 320 -123 -355 677 298 -352 409
7134D09P5m65K60J31o17M68N49k44j093J050q7o40L96K94j097M80Q23r36q4P42
$$ 409 484 19 279 410 -207 261 810 566 -527 523 436 -204 192 486 -611 -131 692 -244 -328 414
7154D14l13o34J011l76j091J004M82r84N1N66m60k89N04k97k54P76N4q14P78R0
$$ 414 101 -533 478 102 -989 15 497 -487 -436 130 -330 -619 -115 -412 -666 110 164 -650 128 218
7174B18p24L04Q93o08l42O91j71k92Q79l17o63O28M32j089L46O35q25q7N92J41
$$ 218 -506 -202 691 83 -259 432 261 -31 848 531 -132 496 928 -161 185 820 -5 -92 500 641
7194F41m33M53q7p46P61l5n12N0N97n42l75Q26k55o61M81K13r53K26N91p28K7
$$ 641 208 661 574 -172 589 554 42 92 689 147 -228 598 343 -318 163 376 -577 -351 240 -488 -461
7215d61L41j75k63N24Kr04Q97M5r44K57M75m52j60R14r12m27J280l21m10M37o
$$ -461 -120 -295 -558 -34 -32 -936 -39 6 -938 -681 -206 -658 -818 96 -816 -1243 37 -284 -694 -257 -263
7236b63k31M21M61o60m42J044m02j16M23Qp21R08K04o60k9M94l51O2O16l94j024
$$ -263 -494 -73 388 -272 -714 330 -72 -188 235 243 -478 430 634 -26 -55 439 88 150 766 372 -652
7257f52J247m35m70O22L5l83N1N90p18j34Q59q76l48R30m70m37L15O19r54K76
$$ -652 595 160 -310 312 347 -36 15 605 -113 -247 612 -264 -612 318 -152 -589 -274 345 -609 -333
7277c33N59o86j50Q33l97p05Q25M07r64K69R03p24n5K57m40J79Q87n56o56J118
$$ -333 226 -460 -610 223 -174 -879 -54 353 -611 -342 561 -163 -218 39 -401 -222 665 109 -547 571
7297E71k79l46N81K09p78k7J053r02J59P07l47o56N96J57p08K26J046j060k28
$$ 571 292 -54 527 736 -42 -69 984 82 241 948 601 -55 541 698 -10 216 1262 202 -26
7316b6J135q42n62R17j52q73R82k67p35J35N59q35R7R02n88p04O74j97l51N61
$$ -26 1109 267 -295 622 470 -403 579 312 -423 -288 271 -564 -467 435 -153 -857 -183 -380 -731 -170
7336a70J76q12K89N67q84R6Q10o28k75N83L01r68N49N96j091N09R02p80l25R06
$$ -170 6 -806 -517 50 -834 -738 72 -556 -831 -248 53 -915 -366 230 -861 -352 550 -230 -555 351
7356C51m24k54N28J66n19P37j0j183P56M93q58J80N82j16j001P84J7p20O23N13
$$ 351 -73 -327 201 367 -152 585 575 -608 148 641 -217 -37 545 429 -572 212 229 -491 132 645
7376F45p18k05P06l61n41O88j33q96J109m36n57M39M86o56n9P73o38l23N86J09
$$ 645 -73 -278 428 67 -474 214 81 -815 294 -142 -699 -260 226 -430 -489 284 -354 -677 -91 18
7396A8n93O77J04q64L65M98l03r6N16k36k82J031p28l99Q15J24n22K8Q20q48J78
$$ 18 -575 102 206 -658 -293 205 -98 -194 322 86 -196 835 107 -292 523 647 125 153 973 125 303
7417C03O24m77m74R54k82o94N05N73j079N9R28j100J77P45m59o07Q32j12j063
$$ 303 927 450 -24 930 648 -46 459 1032 -47 12 940 -160 17 762 303 -304 528 416 -647
7436f47O02M53p99J4O27m62l03R10o98n73Q25L4o22K99L57q07J96O43o80k84J012
$$ -647 -45 408 -391 -377 250 -212 -515 395 -303 -876 -51 -17 -639 -340 17 -790 -594 49 -631 -915 97
7457I7l61l84J067k68r92O73O99q16j64R91p90l25J137m14l14N92k27l05L81L04
$$ 97 -264 -648 419 151 -841 -168 531 -285 -449 542 -248 -573 564 150 -164 428 201 -104 277 581
7477E81q62N27P56r95k73N42k52k57O70k36q83P98K64o10j42M64m74k77P97l83
$$ 581 -281 246 1002 7 -266 276 24 -233 437 201 -682 116 380 -230 -372 92 -382 -659 138 -245
7497b45o96P53J34n31L93K35p70J77O43p79l6O56Mn81Q05k09n33L16M27n99l7
$$ -245 -941 -188 -54 -585 -192 43 -727 -550 93 -686 -722 -66 -62 -643 162 -47 -580 -264 163 -436 -473
7518d73R39m24m56R90M3o37L88N51j037N43O84q91J70O92m47m87P08n2p54M03
$$ -473 466 42 -414 576 619 -18 370 921 -116 427 1111 220 390 1082 635 148 856 804 50 453
7538D53K37o64L95O88r76j09Q97n53m75O32j15q59P20K45o89k07O80l33k80M97
$$ 453 690 26 421 1109 133 24 921 368 -107 525 410 -449 271 516 -173 -380 300 -33 -313 184
7558A84l63p23P73L0q50N41K38n91J82R91o98o08O46J62q64Q52K39j005Q29J36
$$ 184 -179 -902 -129 -99 -949 -408 -170 -761 -579 412 -286 -894 -248 -86 -950 -98 141 -864 -35 101
7578A01m90j5N49l23l74O58J27p69J003k0q89O04N26o53p5N97k44o73P90K59j114
$$ 101 -389 -404 145 -178 -552 106 233 -536 467 447 -442 162 688 35 -40 557 313 -360 430 689 -425
7599d25N58K53r52N52K49m55k03P94j66o27O36l86o23R72j14p87R6P77q39J88
$$ -425 133 386 -566 -14 235 -220 -423 371 205 -422 214 -172 -795 177 63 -724 -628 149 -690 -502
7619e02M91m45r0N35q0n73P21M2o01J71N16l62j00O84l30m67N19K11o72N51M35
$$ -502 -11 -456 -546 -11 -91 -664 57 99 -502 -331 185 -177 -277 407 77 -390 129 340 -332 219 654
7640F54o25LP61m97k62P11k06o98R17J99r36M23K36o93M80K56n17j80R56o84n59
$$ 654 29 32 793 296 34 745 539 -159 758 957 21 444 680 -13 467 723 206 26 982 298 -261
7661b61O28J91o99L37O33p96k01O99o88k58O43j64m45L74J78q57K41O67q85J94
$$ -261 367 558 -141 196 829 33 -168 531 -157 -415 228 64 -381 -7 171 -686 -445 222 -663 -469
7681d69N05o62jM93J57p86N94K28q40M32O02o60j81J122n69m94O62R1n71K48O16
$$ -469 36 -626 -627 -134 23 -763 -169 59 -781 -349 253 -407 -588 534 -35 -529 133 224 -347 -99 517
7702E17o79L96K20n98j71J113m60q62R68o4q26O50K16q00N01L07m08n63R61o60
$$ 517 -162 234 454 -144 -315 798 338 -524 444 380 -446 204 420 -380 121 428 20 -543 418 -242
7722b42k54P21k81n36M97L69j000K93N01n94n10J022oo57M73M06j192Q47M63r82
$$ -242 -496 225 -56 -592 -95 274 -726 -433 68 -526 -1036 -14 -20 -677 -204 202 -990 -143 320 -662
7742f62J74M95j81m04O35l02k32P09P8r25R16K48n45L31L43l14o53J184j76j003
$$ -662 -488 7 -174 -578 57 -245 -477 232 310 -615 301 549 4 335 678 364 -289 895 719 -284
7762b84Q38J63q01L20O33o65o9P56o02j56Q10k84q25Q75j54o76J41N63o70k27
$$ -284 554 717 -84 236 869 204 135 891 289 133 943 659 -166 709 555 -121 20 583 -87 -314
7782c14M88j93n17J025m65l69K87J63n54N2N67n64k52R03k85n98O84N5r55N65
$$ -314 174 -19 -536 489 24 -345 -58 105 -449 -397 170 -394 -646 257 -28 -626 58 113 -842 -277
7802b77N51p96J43P97p31j18P22n79o3N11K52q59L61K91l07L16J4k44m0M86k98
$$ -277 274 -522 -379 418 -313 -431 291 -288 -351 160 412 -447 -86 205 -102 214 228 -16 -56 430 132
7823A32o06N67M14o65J89K42l56L5P72j085j12J189n99o86K71M63p91N82P3k78
$$ 132 -474 93 507 -158 31 273 -83 -48 724 -361 -473 716 117 -569 -298 165 -626 -44 29 -249
7843b49q3M48l85l39N06K56q55M36K21n72L04P22j288N31O46o82j24L89K83n46
$$ -249 -332 116 -269 -608 -102 154 -701 -265 -44 -616 -312 410 -878 -347 299 -383 -507 -118 165 -381
7863c81O92J26m76k26J022j100K38N15j10k12J70L27n79K21K39m99K20N32o95
$$ -381 311 437 -39 -265 757 -343 -105 410 300 88 258 585 6 227 466 -33 187 719 24
7882B4j87J278o92n35M51o7l85L21M96r12K80N58p69k43P03N4n23K59K92q17K91
$$ 24 -163 1115 423 -112 339 272 -113 208 704 -208 72 630 -139 -382 321 375 -148 111 403 -414 -123
7903a23J85o07J51M26r4n07R08m28p22Q38J0o75J79P36n86N6O19k56o69M06n9
$$ -123 62 -545 -394 32 -62 -569 339 -89 -811 27 37 -638 -459 277 -309 -253 366 110 -559 -153 -212
7924b12r7N00j49k98M35N04o23n1N40m49n86P54M03j071P45L00p80P7M53n26K06
$$ -212 -309 191 42 -256 179 683 60 9 549 100 -486 268 671 -400 345 645 -135 -58 395 -131 75
7945G5L50l43l73N64l17l86P63q6p17n8O62o41j11O39l46j36N62K2o01M22M32
$$ 75 425 82 -291 273 -44 -430 333 247 -470 -528 134 -507 -618 21 -325 -461 101 123 -478 -56 376
7966C76p13M7L61l89j01P64k91k37M76k1o04K62P53p80Q4K53j18l84Q40n14m95
$$ 376 -337 -290 71 -318 -419 345 54 -183 293 272 -332 -70 683 -97 -13 240 122 -262 578 64 -431
7987d31Q31M9n00L73K24m01o7L25n62J21M83j00o70O18j81l94N99J66p64lN25
$$ -431 400 449 -51 322 546 145 78 403 -159 -38 445 345 -325 293 112 -282 317 483 -281 -284 241
8008B41l90m34O42k01m16L88J05n02M52K63m87j07Q95p90k47Q73k76o86O16K95
$$ 241 -149 -583 59 -142 -558 -170 -65 -567 -115 148 -339 -446 449 -341 -588 285 9 -677 -61 234
8028B34l28p3L65n08J34L99n0p24J172k85o07O66j17k99K60J48k62k11Q60k55
$$ 234 -94 -167 198 -310 -176 223 173 -551 621 336 -271 395 278 -21 239 387 125 -86 774 519
8048E19m87M96o2p86L79J49l15K51J66k66k61M85n5o84O75k28m92L27K00l51K9
$$ 519 32 528 466 -320 59 208 -107 144 310 44 -217 268 213 -471 204 -24 -516 -189 11 -340 -311
8069c11O23p10l57R73q7m17J60rl24K62K83n43lP07l14l18P48k85j34j09K14r4
$$ -311 312 -398 -755 218 131 -286 -126 -135 -459 -197 86 -457 -460 247 -67 -385 363 78 -56 -165 49 -45
8091d5l1M56o36J48O12m14l06O18Lk27L53Q3n14K3M64m26r8N27m83j61K53n3n65
$$ -45 -76 380 -256 -108 504 90 -216 402 405 178 531 614 100 123 587 161 63 590 107 -54 199 146 -419
8114d19M80K16n48J99L17o32k42P36m36k01L38r4n83P63Nn05J93M75n61p4L10
$$ -419 61 277 -271 -72 245 -387 -629 107 -329 -530 -192 -286 -869 -106 -101 -606 -413 62 -499 -573 -263
8135b63k35j22O73m4n19L47M35p69N20O7k1k32N28j55m07P05j64l81J3Q29p22
$$ -263 -498 -620 53 9 -510 -163 272 -497 23 90 69 -163 365 210 -197 508 344 -37 -24 805 83
8156H3j07Q30m54k42M14j85k55M13j01n41L86Q5m44k46P18n09J3L79r4n78O31
$$ 83 -24 806 352 110 524 339 84 497 396 -145 241 326 -118 -364 354 -155 -142 237 143 -435 196
8177A96N4o34L98J71j16o84R15o68k41Q79l24o85N12K1
$$ 196 250 -384 14 185 69 -615 300 -368 -609 270 -54 -739 -227 -206
8191b06
$$ Imaginary data points
##PAGE= N=2
##DATA TABLE= (X++(I..I)), XYDATA
0@%%%%%%qJ6j6J6k4L2m0M8n7P3q8J04j25J47j71J99k30K65l05L48l94M48n11N79
$$ 0 0 0 0 0 0 0 -8 8 -8 8 -16 16 -24 24 -33 40 -48 56 -69 78 -93 106 -124 141 -164 184 -210 238 -273 306
30C06o48P29q19R15j021J138j266J404j556J727j914K118k344K596k875L189l547
$$ 306 -342 387 -432 483 -538 600 -666 738 -818 909 -1005 1113 -1231 1365 -1510 1679 -1868
47a868L950m412M953n593O360p300Q490j0049J2181j5304K0328k9724N3223k15067
$$ -1868 2082 -2330 2623 -2970 3390 -3910 4580 -5469 6712 -8592 11736 -17988 35235 -179832
61a79832m68678L14474L96029R090k90555r3297J35760O8771k09108j24940K56559
$$ -179832 -648510 -334036 61993 71083 -219472 -312769 -177009 -108238 -317346 -442286 -185727
72a85727L11046j42655l55298l6256K90385J66728j36062j74508J17828K56960
$$ -185727 125319 -17336 -372634 -408890 -118505 48223 -87839 -262347 -144519 112441
82A12441m0809l11535n7446L03286K00397j35610j80992L1819J42148j5100j75905
$$ 112441 71632 -239903 -297349 5937 206334 70724 -110268 -78449 63699 48599 -127306
93a27306j3295K66565J43666k40662k65375P9248K38184M9869j54093j02253J01743
$$ -127306 -140601 125964 269630 28968 -236407 -157159 81025 130894 -23199 -125452 -23709
104b3709J14250j20437j78939R3684K25002j8741k09316o6054J38249J10277q4154
$$ -23709 90541 -29896 -208835 -115151 109851 91110 -118206 -184260 -46011 64266 -19888
115a9888j45850O1664K12690j6k32850p3513J91070J28866r6541j20377N9880
$$ -19888 -165738 -104074 108616 108600 -124250 -197763 -6693 122173 25632 -94745 -34865
126c4865J62726N297k01109q1591K15638J81718j25420j81761N7603J75415K1124
$$ -34865 127861 133158 -67951 -149542 66096 247814 122394 -59367 -1764 173651 194775
137A94775j54504q2612J63353J86526j02850k30157K7514K15469M5894j48963
$$ 194775 40271 -42341 121012 307538 204688 -25469 2045 217514 263408 114445
147A14445p7846J05112J19348p9232j95730P629K25675P3073j91010j31707R2563
$$ 114445 36599 141711 261059 181827 -13903 -6274 219401 292474 101464 -30243 62320
158F2320J05344o3612j36582M340J69114O5886j94731j78053R9329J67897l7691
$$ 62320 167664 104052 -32530 -28190 140924 206810 12079 -165974 -66645 101252 63561
169F3561j35793j1442R8213K6905j30878j18539J05344J89406l9294j99551m5544
$$ 63561 -72232 -83674 14539 41444 -89434 -207973 -102629 86777 47483 -152068 -197612
180a97612J21229N7496o6475n4396O3006J02094m6779j75548k8086J78410J00917
$$ -197612 -76383 -18887 -85362 -139758 -76752 25342 -21437 -196985 -225071 -46661 54256
191E4256r5324q6217M5908O5398l4766r3584Q091J59080Q7232j39896j41873P5169
$$ 54256 -41068 -127285 -81377 -15979 -50745 -144329 -136238 22842 110074 -29822 -171695 -96526
203i6526J34185j3696q6348J31Q9767L9042j08929j15283R0005J75530j8805j59613
$$ -96526 37659 23963 -62385 -62254 27513 66555 -42374 -157657 -67652 107878 89073 -70540
215g0540l7183R4039L9167p1309o5231O4867J28942k6342j82527n5312J45656
$$ -70540 -107723 -13684 25483 -45826 -111057 -46190 82752 56410 -126117 -181429 -35773
226c5773Q5821q6722p6321N3715Q7273k4259j28627l6714J53805J15927j07998
$$ -35773 50048 -36674 -112995 -59280 27993 3734 -124893 -161607 -7802 108125 127
237A27j31807N9823J22244o679q9419j3811J09946Q8695r0572j44866N3399J74662
$$ 127 -131680 -71857 50387 43708 -45711 -59522 50424 139119 48547 -96319 -42920 131742
249A31742K0558j18717l3286Q7768N5971o8101j02449M1510J63282L1675j56212
$$ 131742 152300 33583 297 88065 144036 75935 -26514 14996 178278 209953 53741
260E3741q0769J05094Q2565o3981q2654L1624J07037J7268j35815r1164J12236
$$ 53741 -27028 78066 160631 96650 13996 45620 152657 169925 34110 -57054 55182
271E5182J29999o4677j26468J3308R1495P388r1214n7809Q6617J17556o0167j64684
$$ 55182 185181 120504 -5964 7344 98839 106227 15013 -42796 43821 161377 101210 -63474
283f3474r413J28428L0491r2119m6190O3366O7269n3108j34371j4250J44053O2805
$$ -63474 -72887 55541 86032 -6087 -52277 11089 78358 25250 -109121 -123371 20682 83487
295H3487j17564q7790O2670P0249l7991q1932j022J01773N3739j07533j08231
$$ 83487 -34077 -121867 -59197 11052 -26939 -108871 -109893 -8120 45619 -61914 -170145
306a70145P3319J22118k4367r2647j172P4357L1481o8637p6782N9865J30373j1258
$$ -170145 -96826 25292 925 -91722 -92894 -18537 12944 -55693 -132475 -72610 57763 46505
318D6505j25203j9527R3454L0435o4771m2910N2925Q9386j3403j24639l9671J16519
$$ 46505 -78698 -98225 -4771 25664 -39107 -82017 -29092 60294 46891 -77748 -117419 -900
330i00P0482q1436p1947M5925O8085j6005q1815k7693R1521P6182p8971j06110
$$ -900 69582 -11854 -83801 -37876 30209 14204 -67611 -95304 -3783 72399 -6572 -112682
342a12682M3710R5919j4672p3338n137O9857M5987o0919r5453L1114J17479Q659
$$ -112682 -68972 26947 12275 -61063 -66200 3657 49644 -11275 -106728 -75614 41865 50524
354E0524r1054j2629P1908K2809n5928m9449L8747R5127J0189j03410l9557R4803
$$ 50524 -40530 -53159 18749 41558 -14370 -63819 -25072 70055 80244 -23166 -62723 32080
366C2080N7165o4516n3213M3975O7382m669p8971l9131Q3420Q1812n6890q4173
$$ 32080 89245 24729 -28484 15491 82873 78204 -767 -39898 43522 125334 68444 -15729
378a5729L5455O8408k3428o4358l263P1532N6797n6513j00349J9250J01372r08
$$ -15729 19726 88134 64706 348 -2915 68617 125414 68901 -31448 -12198 89174 88266
390H8266q6798j0117P1645K8984n8226p0125K2142R9006J2679j11375m4983R3547
$$ 88266 1468 -8649 62996 91980 33754 -36371 -14229 84777 97456 -13919 -58902 34645
402C4645N5530p0813p1290L3601Q5617J3098j00053p2690P8983R8041m9146r4880
$$ 34645 90175 19362 -51928 -18327 67290 80388 -19665 -92355 -13372 84669 35523 -59357
414e9357K2447P9037k614p9624m5644O3211R1393l3905j15760k71J05296J7593
$$ -59357 -36910 42127 39513 -40111 -85755 -22544 68849 34944 -80816 -81087 24209 41802
426D1802q8148m0100O0025O4535k8538r1877j0797J02749M3102r5189o1867P0522
$$ 41802 -46346 -86446 -26421 38114 9576 -82301 -93098 9651 52753 -42436 -104303 -33781
438c3781O6382m1397p5002L490Q6255M7743p9373q7044N4086R4126k8779q0237
$$ -33781 32601 -8796 -83798 -80308 5947 53690 -25683 -112727 -58641 35485 6706 -73531
450g3531J0202P2208K1487n9913n8824M0458Q8574j7039r5004L229R2173J6240
$$ -73531 -63329 8879 30366 -29547 -88371 -47913 40661 23622 -71382 -68153 24020 40260
462D0260p4763l6902N3244O9145j8610r1711j4664J03356M6329q7224n6107O9063
$$ 40260 -34503 -71405 -18161 50984 32374 -59337 -74001 29355 75684 -11540 -67647 1416
474A416P0343l4977q5291j0137R7034O7935q0142r7147N5555J05376k4705r8694
$$ 1416 71759 36782 -48509 -58646 38388 106323 26181 -70966 -15411 89965 65260 -33434
486c3434j1163Q6105N7468n9958r6688K7502J15717K608j15695l0216R4066N2452
$$ -33434 -44597 41508 98976 39018 -57670 -30168 85549 88157 -27538 -57754 36312 88764
498H8764o4395q0409K3543J04131K1603j14673o6564R3763Q6388o1313q9239K5604
$$ 88764 24369 -56040 -32497 71634 93237 -21436 -88000 5763 92151 30838 -58401 -32797
510c2797R0155J8605q9490o9675P2097J07338l8686j13129P481J00138K5018p3634
$$ -32797 57358 75963 -13527 -83202 -11105 96233 57547 -55582 -48101 52037 77055 3421
522C421n4220M4055Q3493j1708r8967j6862R7816L9593p5569n1044M3988N4167
$$ 3421 -50799 -6744 76749 65041 -33926 -50788 47028 86621 11052 -39992 3996 58163
534E8163j7824o7667j5165P6963M6392p5027p0607M9148O4322l0779o3047J368
$$ 58163 40339 -27328 -42493 34470 80862 5835 -64772 -15624 48698 17919 -45128 -43760
546d3760N8231K9305o0490o9387M2126Q5594k5304q8979j417O9914K2914n0142
$$ -43760 14471 43776 -16714 -86101 -43975 41619 16315 -72664 -74081 -4167 18747 -31395
558c1395m7968K9880P2880r106r1768j6487Q9179L9161o2945m4409L9709N8205
$$ -31395 -79363 -49483 23397 14291 -77477 -93964 -4785 34376 -28569 -72978 -33269 24936
570B4936r595p2227k0856Q5095N9652o8418p0430N0018P6901j5220o9868j5677
$$ 24936 15341 -56886 -77742 7353 67005 -1413 -71843 -21825 55076 39856 -30012 -45689
582d5689O7862N8782n1541q6341L4108J02075j718q9818k6598O4448N0210l6326
$$ -45689 22173 80955 29414 -56927 -22819 79256 77538 -12280 -38878 25570 75780 39454
594C9454p4026P941R2608K0914r3889n0061O6242N4931m0377o1118P410O4927
$$ 39454 -34572 -26631 65977 86891 -6998 -57059 9183 64114 23737 -37381 -29971 34956
606C4956K2162p3901o0763N7519P3967l8416p4836J1206O0745J2101n3021m2904
$$ 34956 57118 -16783 -77546 -20027 53940 15524 -59312 -48106 12639 24740 -28281 -71185
618g1185M2197P2269k5181q8722l7Q1964K4012n3450l1517L2885M7542j4172o6658
$$ -71185 -28988 43281 18100 -70622 -70659 11305 35317 -18133 -49650 -16765 30777 16605 -50053
631e0053n782Q4203L9042o6358m8186M2276M7769j4323m4291m171N6504L4861
$$ -50053 -55835 28368 67410 1052 -47134 -4858 42911 28588 -15703 -19874 36630 71491
643G1491n5951n7370M5843O8326k2679n9293J992M8379K0563m1968m8638L3997
$$ 71491 15540 -41830 4013 72339 49660 -9633 -7641 40738 61301 19333 -29305 4692
655D692P5729j4498q4955j3458O2804K4147m1284l4562K2372N0314q867p7051
$$ 4692 80421 65923 -19032 -32490 30314 54461 13177 -21385 987 51301 42434 -34617
667c4617k5404P2320M2826n5653n1415K6075M4308p735n3615k4802N4086M9590
$$ -34617 -60021 12299 55125 -528 -51943 -25868 18440 10705 -42910 -67712 -13626 35964
679C5964m8728o8856K6845O4477p013n1609j1129M3228L5307l5018o3773K0009
$$ 35964 -12764 -81620 -54775 9702 2689 -48920 -60049 -16821 18486 -16532 -80305 -60296
691f0296Q4888J1770o7484k3747M6371L1041k4212l7099J5809O5610J6624o9913
$$ -60296 24592 36362 -31122 -54869 -8498 22543 -1669 -38768 -22959 42651 59275 -10638
703a0638l9880O0334N3414l1488m4972J3935M7309J1031n0192l9243M9943O5676
$$ -10638 -50518 9816 63230 31742 -13230 705 48014 59045 8853 -30390 19553 85229
715H5229l2214p2097O850N4953Q753m0252k5824K9750M7116k2125p5658o907O9491
$$ 85229 53015 -19082 -12232 42721 51474 11222 -14602 15148 62264 40139 -35519 -42426 27065
728B7065K2173n0917l0326K6002K8755j7235n0605r868N9941L3165n5316m8686
$$ 27065 49238 -1679 -32005 -6003 22752 5517 -45088 -54956 4985 38150 -17166 -65852
740f5852L2203L9307j7023l3840K368L7336J9733m2899m8161L4908O6194r547
$$ -65852 -33649 5658 -11365 -45205 -42837 -5501 14232 -28667 -76828 -41920 24274 14727
752A4727n3473m145L5914J4191k2900k5621K2645N5273j654o2050j4809N1169
$$ 14727 -38746 -42891 -6977 7214 -15686 -41307 -18662 36611 34957 -27093 -41902 9267
764I267K2768k9112j7361K1721L1033n904m7473j7736N2812L9068l9426m0222
$$ 9267 32035 2923 -14438 7283 38316 32412 -15061 -32797 20015 59083 19657 -20565
776b0565K2438K9742j1621k9638l383L8266K8152m1466n7501K2833N9795l940
$$ -20565 1873 31615 19994 -9644 -13027 25239 53391 11925 -45576 -22743 37052 33112
788C3112m5389p222L0703J6553k7112m2662J1931O0825R696n6366k2096L7988
$$ 33112 -12277 -19499 11204 27757 645 -42017 -30086 30739 40435 -15931 -38027 -39
800c9J9717k4922k2705J3926L7654P856m8358k9502M4512M1178k6959l3536J6380
$$ -39 19678 -5244 -27949 -14023 23631 31487 -16871 -46373 -1861 39317 12358 -21178 -4798
813d798K8385l876l0379j4096L7778M4066k5524n4247R626M6336N01l1395m891
$$ -4798 23587 19711 -10668 -24764 13014 57080 31556 -22691 -13065 33271 33772 2377 -2514
826b514K8571K5591j9637m9914j593N5206J8026m2789k0002K5700J5410j9124
$$ -2514 26057 51648 32011 -17903 -19496 35710 53736 10947 -9055 16645 32055 12931
838A2931k5606K403L5996J4588m4614l5036L1210L1819k2946k8154J0732K4640
$$ 12931 -12675 -10272 25724 40312 -4302 -39338 -8128 23691 745 -27409 -16677 7963
850G963j428l5375l0140K9624M8865j5366n0086J589L4342L03k9680j3397K4789
$$ 7963 6535 -28840 -58980 -29356 19509 4143 -45943 -44354 -10012 -9709 -39389 -52786 -27997
863b7997L8120q090n2559j2870M8737K3135l1413j8077K1000K0944o913k7880
$$ -27997 10123 2033 -50526 -63396 -14659 8476 -22937 -41014 -20014 930 -5983 -33863
875c3863p502L8943L0161l0907l3472K1304K7701j2063j7970R675K7507J3093
$$ -33863 -41365 -2422 27739 -3168 -36640 -15336 12365 302 -17668 -7993 19514 32607
887C2607k8877l6599J9522M7246n246l5036M746K7947K37k4703j8199J6825L8951
$$ 32607 3730 -32869 -13347 33899 28653 -6383 -1637 26310 26547 1844 -16355 470 39421
900C9421N64m5157j2969L5880J2869k6619j1766J8935J8028q128l2883j3957L5765
$$ 39421 39985 -5172 -18141 17739 30608 3989 -7777 11158 29186 21058 -11825 -25782 9983
913I983K7938k8041k6106K0295J7265j9795k2641O318L2775K1257k8334m0788
$$ 9983 37921 9880 -16226 4069 21334 1539 -21102 -14784 17991 39248 10914 -29874
925b9874J5830M1497q280l3749O833L3598R439k6153l2072J1426M8942J0495m4535
$$ -29874 -14044 27453 19173 -14576 -7743 25855 35294 9141 -22931 -11505 37437 47932 3397
938C397j7157L4347J6524k4746j8286J5591L2193N614m0699k9984L0532L5835
$$ 3397 -13760 20587 37111 12365 -5921 9670 41863 47477 6778 -23206 7326 43161
950D3161j9390k7201J3659K0957r915l0339j5474K6383L6213j5458m6417J319
$$ 43161 23771 -3430 10229 31186 21271 -9068 -24542 1841 38054 22596 -23821 -22502
962b2502L4223l118l0852m319K3662J7731j6095m0685m683M2977J7076l4786j8871
$$ -22502 11721 8603 -22249 -26568 -2906 14825 -1270 -41955 -46638 -3661 13415 -21371 -40242
975d0242K2006J1723j7404j8510N020L0692J6207l0973l0499K1403K7643j6068
$$ -40242 -18236 -6513 -23917 -42427 -37407 -6715 9492 -21481 -51980 -30577 -2934 -19002
987a9002j9045J6712K2587k083k5539j9075K2167L7427j0523l6987Q185L3678
$$ -19002 -38047 -21335 1252 -831 -26370 -45445 -23278 14149 3626 -33361 -25176 8502
999H502l234k8069n054K4740K5867r928m0513n027M3868J5078l4670j4759K8707
$$ 8502 5268 -22801 -27855 -3115 22752 12824 -27689 -32716 11152 26230 -8440 -23199 5508
1012E508K0026j6420l1075l994L6669K6135l0317l1955K3909L0092j8725k9807
$$ 5508 25534 9114 -21961 -25955 10714 36849 6532 -25423 -1514 28578 9853 -19954
1024a9954P353L2167J5969k5547l5182J5747M4263n673m1020L6L6410J0754k6344
$$ -19954 -12601 19566 35535 9988 -25194 -9447 34816 29143 -11877 -11841 24569 35323 8979
1037H979k4857J2710L9299P475m1634j8422L6428K1306k8813k2677J8915L0959
$$ 8979 -15878 -3168 36131 43606 1972 -16450 19978 41284 12471 -10206 8709 39668
1049C9668K684l3544k5940K6246L5878j7537l2396J4533K9569p628k9127j1277
$$ 39668 42352 8808 -17132 9114 44992 27455 -4941 9592 39161 31533 2406 -8871
1061h871K2917L0225j0714m0267n48L6823K535l2700o371K5576J5371j7343l2933
$$ -8871 14046 44271 33557 -6710 -7258 29565 32100 -600 -6971 18605 33976 16633 -16300
1074a6300n006L6603J8565l2881k3494K3523J5283k3109k2859O882K8626J2667
$$ -16300 -21306 15297 33862 981 -22513 1010 16293 -6816 -29675 -22793 5833 18500
1086A8500k9095l3551J7104L2767j4189k9335R328K6109o43k5265j9299J5606
$$ 18500 -10595 -44146 -27042 5725 -8464 -37799 -28471 -2362 -3005 -28270 -47569 -31963
1098c1963L6010k580l8631m973L1814N698k5331o676K1706K1519p204l3389j2306
$$ -31963 4047 1467 -37164 -42137 -10323 -4625 -29956 -36632 -14926 6593 -611 -34000 -46306
$$ [...]
8191B1
##END NTUPLES=NMR FID
##END=
