##TITLE=1H_TG-2250
 DMSO, 8 sc, 
 19.8.2019
##JCAMPDX= 6.0         $$ Bruker NMR JCAMP-DX V2.0
##DATA TYPE= NMR FID
##DATA CLASS= NTUPLES
##ORIGIN= UXNMR, Bruker Analytische Messtechnik GmbH
##OWNER= root
$$ XWIN-NMR		Version 3.5
$$ Mon Aug 19 14:37:40 2019 Russian Standard Time (UT+4h)  she@DPX200
##.OBSERVE FREQUENCY= 200.13155
##.OBSERVE NUCLEUS= ^1H
##.DELAY= (6, 6)
##.ACQUISITION MODE= SIMULTANEOUS
##.ACQUISITION SCHEME= undefined
##.AVERAGES= 8
##.DIGITISER RES= 18
##SPECTROMETER/DATA SYSTEM= spect
##.PULSE SEQUENCE= zg30
##.SOLVENT NAME= DMSO
##.SHIFT REFERENCE= (INTERNAL, DMSO, 0, 15.7039)
##AUDIT TRAIL= $$ (NUMBER, WHEN, WHO, WHERE, WHAT)
$$ ##TITLE= Audit trail, XWIN-NMR		Version 3.5
$$ ##JCAMPDX= 5.01
$$ ##ORIGIN= Bruker BioSpin GmbH
$$ ##OWNER= she
$$ F:/spectra/data/she/nmr/H-F/1/audita.txt
$$ ##AUDIT TRAIL=  $$ (NUMBER, WHEN, WHO, WHERE, WHAT)
(   1,<2019-08-19 14:36:24.28 +0400>,<she>,<DPX200>,
      <created by zg, POWCHK disabled, PULCHK disabled
       configuration hash MD5:
       00 E9 B6 7A A2 85 ED C7 34 08 36 98 17 FE 4E 26
       data hash MD5: 16K
       45 8C 0B 91 2E 33 F6 49 79 72 56 81 62 6E 1E 47>)
$$ ##END=
$$ 
$$ hash MD5
$$ 33 D9 67 5E E9 EC 9F 57 11 6A FE 65 39 27 02 D2
##$RELAX= 
##$RELAX= 
##$RELAX= 
##$RELAX= 
##$RELAX= 
##$RELAX= 
$$ Bruker specific parameters
$$ --------------------------
##$DU= <F:/spectra>
##$EXPNO= 1
##$NAME= <H-F>
##$PROCNO= 1
##$TYPE= <nmr>
##$USER= <she>
##$AMP= (0..31)
100 100 100 100 100 100 100 100 100 100 100 100 100 100 100 100 100 100 
100 100 100 100 100 100 100 100 100 100 100 100 100 100 
##$AQSEQ= 0
##$AQ_mod= 1
##$AUNM= <au_zg>
##$AUTOPOS= <>
##$BF1= 200.13
##$BF2= 200.13
##$BF3= 200.13
##$BF4= 200.13
##$BF5= 200.13
##$BF6= 200.13
##$BF7= 200.13
##$BF8= 200.13
##$BYTORDA= 1
##$CFDGTYP= 0
##$CFRGTYP= 5
##$CHEMSTR= <none>
##$CNST= (0..31)
1 1 145 1 1 1 1 1 1 1 1 1 1 1 1 1 1 1 1 1 1 1 1 1 1 1 1 1 1 1 1 1 
##$CPDPRG= <>
##$CPDPRG1= <>
##$CPDPRG2= <>
##$CPDPRG3= <>
##$CPDPRG4= <mlev>
##$CPDPRG5= <mlev>
##$CPDPRG6= <mlev>
##$CPDPRG7= <mlev>
##$CPDPRG8= <mlev>
##$CPDPRGB= <>
##$CPDPRGT= <>
##$D= (0..31)
0 1.2 0 0 0 0 0 0 0 0 0 0.03 0 0 0 0 0 0 0 0 0 0 0 0 0 0 0 0 0 0 0 0 
##$DATE= 1566210983
##$DBL= (0..7)
120 120 120 120 120 120 120 120 
##$DBP= (0..7)
150 150 150 150 150 150 150 150 
##$DBP07= 0
##$DBPNAM0= <>
##$DBPNAM1= <>
##$DBPNAM2= <>
##$DBPNAM3= <>
##$DBPNAM4= <>
##$DBPNAM5= <>
##$DBPNAM6= <>
##$DBPNAM7= <>
##$DBPOAL= (0..7)
0.5 0.5 0.5 0.5 0.5 0.5 0.5 0.5 
##$DBPOFFS= (0..7)
0 0 0 0 0 0 0 0 
##$DE= 6
##$DECBNUC= <off>
##$DECIM= 24
##$DECNUC= <off>
##$DECSTAT= 4
##$DIGMOD= 1
##$DIGTYP= 9
##$DL= (0..7)
0 120 120 120 120 120 120 120 
##$DP= (0..7)
150 150 150 150 150 150 150 150 
##$DP07= 0
##$DPNAME0= <>
##$DPNAME1= <>
##$DPNAME2= <>
##$DPNAME3= <>
##$DPNAME4= <>
##$DPNAME5= <>
##$DPNAME6= <>
##$DPNAME7= <>
##$DPOAL= (0..7)
0.5 0.5 0.5 0.5 0.5 0.5 0.5 0.5 
##$DPOFFS= (0..7)
0 0 0 0 0 0 0 0 
##$DQDMODE= 0
##$DR= 18
##$DS= 0
##$DSLIST= <SSSSSSSSSSSSSSS>
##$DSPFIRM= 0
$$ [...]
##$SUBNAM2= <"">
##$SUBNAM3= <"">
##$SUBNAM4= <"">
##$SUBNAM5= <"">
##$SUBNAM6= <"">
##$SUBNAM7= <"">
##$SUBNAM8= <"">
##$SUBNAM9= <"">
##$SW= 24.9336996594482
##$SWIBOX= (0..15)
0 0 2 0 0 0 0 0 0 0 0 0 0 0 0 0 
##$SW_h= 4990.01996007984
##$TD= 16384
##$TD0= 1
##$TE= 0
##$TE2= 300
##$TE3= 300
##$TEG= 300
##$TL= (0..7)
0 120 120 120 120 120 120 120 
##$TP= (0..7)
150 150 150 150 150 150 150 150 
##$TP07= 0
##$TPNAME0= <>
##$TPNAME1= <>
##$TPNAME2= <>
##$TPNAME3= <>
##$TPNAME4= <>
##$TPNAME5= <>
##$TPNAME6= <>
##$TPNAME7= <>
##$TPOAL= (0..7)
0.5 0.5 0.5 0.5 0.5 0.5 0.5 0.5 
##$TPOFFS= (0..7)
0 0 0 0 0 0 0 0 
##$TUNHIN= 0
##$TUNHOUT= 0
##$TUNXOUT= 0
##$USERA1= <user>
##$USERA2= <user>
##$USERA3= <user>
##$USERA4= <user>
##$USERA5= <user>
##$V9= 5
##$VALIST= <valist>
##$VCLIST= <CCCCCCCCCCCCCCC>
##$VD= 0
##$VDLIST= <DDDDDDDDDDDDDDD>
##$VPLIST= <PPPPPPPPPPPPPPP>
##$VTLIST= <TTTTTTTTTTTTTTT>
##$WBST= 1024
##$WBSW= 4
##$XGAIN= (0..3)
0 0 0 0 
##$XL= 0
##$YL= 0
##$YMAX_a= 172541
##$YMIN_a= -243034
##$ZGOPTNS= <>
##$ZL1= 120
##$ZL2= 120
##$ZL3= 120
##$ZL4= 120
##$ABSF1= 10
##$ABSF2= 0
##$ABSG= 5
##$ABSL= 3
##$ALPHA= 0
##$AQORDER= 0
##$ASSFAC= 0
##$ASSFACI= 0
##$ASSFACX= 0
##$ASSWID= 0
##$AUNMP= <proc_1d>
##$AZFE= 0.1
##$AZFW= 0.1
##$BCFW= 1
##$BC_mod= 2
##$BYTORDP= 1
##$COROFFS= 0
##$CY= 11.3945322036743
##$DATMOD= 1
##$DC= 2
##$DFILT= <>
##$DTYPP= 0
##$F1P= 20.1720416913024
##$F2P= 0.152960286110954
##$FCOR= 0.5
##$FTSIZE= 0
##$FT_mod= 4
##$GAMMA= 1
##$GB= 0.15
##$INTBC= 1
##$INTSCL= 1
##$ISEN= 128
##$LB= 0.24
##$LEV0= 0
##$LPBIN= 0
##$MAXI= 10000
##$MC2= 0
##$MEAN= 0
##$ME_mod= 0
##$MI= 1.114404
##$NCOEF= 0
##$NC_proc= 0
##$NLEV= 6
##$NOISF1= 3.799351
##$NOISF2= 2.8
##$NSP= 1
##$NTH_PI= 0
##$NZP= 0
##$OFFSET= 15.70392
##$PC= 1
##$PHC0= -9237
##$PHC1= 44.80097
##$PH_mod= 1
##$PKNL= yes
##$PPARMOD= 0
##$PSCAL= 0
##$PSIGN= 0
##$REVERSE= no
##$SF= 200.130013532006
##$SI= 16384
##$SIGF1= 3
##$SIGF2= 2
##$SINO= 400
##$SIOLD= 16384
##$SREGLST= <1H.CDCl3>
##$SSB= 0
##$STSI= 0
##$STSR= 0
##$SW_p= 3612.71676300578
##$SYMM= 0
##$S_DEV= 0
##$TDeff= 0
##$TDoff= 0
##$TI= <>
##$TILT= no
##$TM1= 0
##$TM2= 0
##$TOPLEV= 0
##$USERP1= <user>
##$USERP2= <user>
##$USERP3= <user>
##$USERP4= <user>
##$USERP5= <user>
##$WDW= 1
##$XDIM= 8192
##$YMAX_p= 0
##$YMIN_p= 0
$$ End of Bruker specific parameters
$$ ---------------------------------
##NTUPLES= NMR FID
##VAR_NAME=  TIME,          FID/REAL,        FID/IMAG
##SYMBOL=    X,             R,               I
##VAR_TYPE=  INDEPENDENT,   DEPENDENT,       DEPENDENT
##VAR_FORM=  AFFN,          ASDF,            ASDF
##VAR_DIM=   8192,          8192,            8192
##UNITS=     SECONDS,       ARBITRARY UNITS, ARBITRARY UNITS
##FACTOR=    0.0002004,     1,               1
##FIRST=     0,             0,               0
##LAST=      1.6414764,     0,               0
##MIN=       0,             -243034,         0
##MAX=       1.6414764,     172541,          0
$$ Real data points
##PAGE= N=1
##DATA TABLE= (X++(R..R)), XYDATA
0@%%%%%%%qJ6j6K4l2L2m0N0n8P2q8J05j22J45j69J94k26K62l02L45l94M47n04
30b67N69o42P21q06R01j006J120j246J385j534J698j883K086k307K554k832L145
47A656l499L901m368M915n563O347p323Q577j0252J2617j6245K2585l6871J28445
61A04922k8764k34291O0790J58899J10985p0247j15336o3705N9210P6597K1250
72H0310n1221l4053n402Q562J384K5535K2678j8081n8031k1194M1540N9481M610
85E6118n3619n6664N289N8279M5081k0701n3351k7890K3097M1887J8906k1479
97A4953l2936j1157J8632K6492J1127j6640k8916r023K3810K9044J46k7670k1621
110b3759P860K5253J2806j1566k0505m079J5248J1514r713j1146R374J1902r408
$$ plain form
0 0 0 0 0 0 0 0 0 -8 8 -8 16 -16 16 -24 26 -32 40 -48 57 -65 80 -89 105 -121 141 -161 184 -210 237 -267
30 -267 302 -340 381 -425 476 -530 590 -656 729 -805 893 -990 1096 -1211 1343 -1489 1656
47 1656 -1843 2058 -2310 2605 -2958 3389 -3934 4643 -5609 7008 -9237 13348 -23523 104922
61 104922 76158 -158133 -97343 61556 172541 102294 -13042 -76747 -17537 59060 80310
72 80310 29089 -4964 -10366 -1804 -420 25115 47793 29712 -28319 -49513 -7973 51508 56118
85 56118 2499 -54165 -48876 9403 54484 33783 -19568 -47458 -24361 17526 36432 14953
97 14953 -17983 -29140 -10508 15984 27111 10471 -18445 -27468 -3658 25386 25532 -2138 -23759
110 -23759 -15899 9354 22160 10594 -9911 -13990 1258 12772 3059 -8087 1287 13189 3781
123C781j6496M339J7766P195j3356j7253J192K1776J4960j5412k6557j019K6712
136G628J8382j4464k5149j755J8467J1557o909j0958n77P837L225p374n690Q676
150B896J0069o437j3854J341J4343N526j2844j3346Q392K0625P83k3741j3326
163a9573J7160K4224l878k5861r359K1809K0499j3944k8096J950L2496J5952k6986
176F393l3553J0217M2499J2439l7667l1189K1213M2553K737m0312k7378K4490
188g558M3836J619m2626k5400K4641L7677k224l5589j7264K3071K7277p581k8493
201h614j0103J9910K0665n223k3289r471J5619J6969n165j7861o007J1662J2331
214A1423k488j4396p973Q166J2601J660j0139r783R43J0577P295m767j2078l655
$$ plain form
123 3781 -12715 -8376 9390 16585 3229 -14024 -12832 8944 23904 8492 -18065 -19084 7628
136 7628 26010 11546 -13603 -15358 3109 14666 7757 -3201 -3778 4059 7284 -90 -5780 2896
150 2896 12965 6528 -7326 -5985 8358 13884 1040 -12306 -3914 16711 17494 -6247 -19573
163 -19573 -2413 21811 17933 -7928 -17287 4522 25021 11077 -17019 -15069 17427 33379 6393
176 6393 -27160 -16943 25556 37995 328 -30861 -9648 32905 35642 -4670 -32048 -7558
188 -7558 36278 37897 -4729 -30129 -5488 32189 29965 -5624 -22888 183 27460 19879 -8614
201 -8614 -18717 1193 21858 16635 -6654 -16125 -506 16463 11298 -6563 -12570 -908 11423
214 11423 8935 -5461 -13434 -5268 7333 8993 -1146 -10929 -9986 591 7886 3119 -8959 -12614
228a2614R274J1433m17j4165j0191P563J7033N119j4516j6726L930K0467R759
241A5949j5544j8404N065K0341O823j5697j7049N694K2123P709j8619j9085P350
254a3344K3745P322j8331j8873Q068K3608N436j9935j5826R032K2290N232j9241
267h17j7805R052K3198M206j9363j4954J0270J9926J444j9145j1172J3159J7585
280A5584l667j7746o065J2830J1807n886j3599O7J3509M377j2373q592P843J2823
294A0912k380j4079m200J3073R248r563j2900M651J5351K787j4159j0661Q621
307c299J7121o96j7830q036J3176J5784m866j8579n750J5266J4294o828j6037
320f280l615J1998R839m307j2170k897J0019Q263n072j1223k077Q977P067k919
$$ plain form
228 -12614 -3340 8093 7676 -6489 -16680 -9117 7916 13035 -1481 -18207 -14277 6190 15949
241 15949 405 -17999 -12934 7407 14230 -1467 -18516 -12822 9301 17010 -1609 -20694 -13344
254 -13344 10401 17723 -608 -19481 -11413 12195 17631 -2304 -18130 -9098 13192 18424 -817
267 -817 -18622 -9570 13628 17834 -1529 -16483 -6213 13713 15157 -3988 -15160 -2001 15584
280 15584 11917 -5829 -11894 936 12743 6857 -6742 -6675 6834 11211 -1162 -9754 -1911 10912
294 10912 8532 -5547 -9747 3326 12574 3011 -9889 -5238 10113 12900 -1259 -11920 -3299
307 -3299 13822 13126 -4704 -12740 436 16220 11354 -7225 -12975 2291 16585 9757 -6280
320 -6280 -9895 2103 11942 7635 -4535 -7432 2587 10850 5778 -5445 -7522 1455 8522 5603
334E603q864l383N310O048o65n701l918K341N638K154n180o425P44O771M589k924
350B138q204l602O594R187r38j0518p174O845J2769J709j3942j0259Q182J5301
364H088K877j4093j2100O047J6892M064j4025j2858O490J7045L800j4489j2336
377a4598O991J7320K908j5264j1869P393J7248L623j5190j4114Q049J8901L406
390A4804j7048j3727R075J9270L144j7627j3904R504J9460J936j7328j2483R559
403e365J8473J21j6354r941J0850J4195k437j3345m997Q815R455l240r585j444
417d799P129M620m210n310P88M836J382l073j999K006J313j746r69K254Q51k314
433G59k058J525L139m0m299k196L862M189j949n493j639M002M347j546n443j819
$$ plain form
334 5603 -3261 -6644 -1334 4714 4049 -1652 -5570 -3229 2409 4563 -617 -7042 -6298 473 5062 2138
350 2138 -6066 -9668 -3074 6113 5175 -5343 -12517 -5672 7097 8806 -5136 -15395 -7213 8088
364 8088 10965 -3128 -15228 -9181 7711 11775 -2250 -15108 -8618 8427 12227 -2262 -14598
377 -14598 -7607 9713 12621 -2643 -14512 -7119 10129 13752 -1438 -15552 -7503 11398 14804
390 14804 -2244 -15971 -6896 12374 15518 -2109 -16013 -6509 12951 14887 -2441 -14924 -5365
403 -5365 13108 13229 -3125 -13066 -2216 11979 9542 -3803 -8800 15 9470 6230 -3355 -4799
417 -4799 2330 6950 2740 -2570 -1782 3054 4436 1363 -636 1370 2683 937 -32 2222 3073 759
433 759 -1299 226 3365 3325 -974 -3170 692 4881 2932 -2561 -4200 -198 4149 2603 -2840 -4659
449d659M684L906k435m819n29L186L502j868l990m16K530K061j120k107o59J845
465h88J337j308p04M75O12l82j23J191L94j850j000J216K644N97l634k809K545
482a687N196o2n550m191L472P394P12p270n637M459Q082R10p763n614M096Q361
498D908J239q166o240M505R570J296q764p388M432J1192J758j0015q487N621J2002
513G463K070j1058r430O304J3668K239j2807r710O898J3905K229j3443r374P384
527c662J4006O22j2641p756O450J1844P45j0292o713N264R213O18p298n242L265
542a577O608J070m938m125J072M562K312k750m779k92M137L915j868n389k106
557d148L995N526q16o475l503M438O673k15p028m552M282P235L51p678m516M202
$$ plain form
449 -4659 25 3931 1496 -3323 -3852 -666 2836 968 -3022 -3438 -908 1153 33 -2074 -2733 -888
465 -888 449 -859 -1563 -1088 -476 -858 -981 210 604 -1246 -2246 -1030 1614 2211 -1423 -4232 -1687
482 -1687 3509 3447 -2103 -6294 -2822 4572 5284 -1986 -7623 -3164 4918 5828 -1935 -7549 -3453 4908
498 4908 6147 -2019 -8259 -3754 5816 7112 -1652 -9040 -4608 6584 8342 -1673 -10160 -4539 7463
513 7463 9533 -1525 -10955 -4651 9017 11256 -1551 -11261 -4363 9542 11771 -1672 -11046 -3662
527 -3662 10344 10966 -1675 -9431 -2981 8863 9608 -684 -7397 -2133 7080 7698 400 -4842 -1577
542 -1577 5031 6101 1163 -2962 -1890 2672 4984 2234 -2545 -2837 1300 5215 3347 -2042 -4148
557 -4148 -153 5373 4557 -1918 -5421 -983 5690 5475 -1553 -6105 -1823 5412 5763 -1915 -6431 -2229
573b229P152M66o720n266L649P343O60o303m354K564O039J347n041m055K300N538
589C090kn210k475K978L711k68l862k178K786K950r50k069q27J478J655o33j498
606a324J99J154J92q00K31L39J70k17q23K69J031O51j306q60L74J261J101q51
624G91j924K02K733O92j750k658R08L407J680k763m210R80N543J791m601m621
640c800K294O406J118o068n307L774P342R33p153m607L943P102L30o709m643M092
656i53N865P03o004m050K752N345J184m652l505J456L877J559k428l943j73M290
672A323K610k653m382n16M242L537j461n379j996M717M904j923o098k474N143
687d06N534j705o944k706N785N772j391p197l282N055O632j003o846l788M905
$$ plain form
573 -2229 4923 5389 -1331 -6597 -2948 4395 5055 -1248 -5602 -3038 3001 4348 -693 -4748 -2448 3090
589 3090 3088 -2122 -4597 -1619 2092 1824 -2038 -4216 -1430 1520 570 -1499 -2326 -848 807 174 -1324
606 -1324 -1125 29 221 -579 -348 -9 161 -56 -879 -610 421 1072 -234 -1094 -720 541 1642 791
624 791 -1133 -931 1802 2494 744 -1914 -1006 2401 4081 1318 -2892 -1912 3631 5422 821 -3800
640 -3800 -1506 4900 6018 -50 -5357 -1583 5759 6692 -461 -5068 -1125 5977 6307 -402 -5045 -953
656 -953 4912 5615 -389 -4439 -1687 3658 4842 190 -3315 -1859 2018 3577 1149 -2794 -2967 1323
672 1323 3933 1280 -3102 -3618 624 4161 2700 -2679 -4675 42 4946 3023 -3075 -5549 -406
687 -406 5128 3423 -3521 -6227 -442 5330 3939 -3258 -6540 -1485 5147 4144 -2702 -6490 -1585
702a585O628p33o812m310M860O692o07o591l611L972N432K71n535l492L658N014
718C251m14m922k625L233M365K00m280l063K332L655J086l290k963R47M167J422
734C101k897l347N58M340J689k317l932O87L411K002k576k893R08L044J078k083
750G73k480J068K377L74j899p63O22J145l68m98j66O64R8r02J99O92R5j164l69
769e02J040J223m93j866r20K157J504j386j412n29J482J384p24j468p73J324J332
786A373qj222j412L86J698Q49j337j269k64J350J716j090k203p06K320J994j024
803A151l298m94K448L276j472l945j018L224K956j338l775j134K943L850j189
818B185m809j915L511M743j179m620k563L356M651n56n123k414L667M129l17m707
$$ plain form
702 -1585 5043 4310 -2502 -6812 -1952 4740 4133 -2458 -6069 -2097 3335 3606 -1929 -5421 -1763 3251
718 3251 2837 -2085 -4710 -1477 2888 3088 -1192 -4255 -1923 1732 2818 -472 -3435 -2488 1679 3101
734 3101 204 -3143 -2585 1755 3444 1127 -2805 -2118 1293 3295 719 -2174 -1266 1778 2856 773
750 773 -1707 -639 1738 2112 213 -550 72 1217 849 351 185 849 947 45 244 936 1031 -133 -502
769 -502 538 1761 1268 -598 -1518 639 2143 757 -655 -1184 298 1682 958 -510 -1283 41 1373
786 1373 1365 143 -1269 -883 815 1664 327 -942 -1206 144 1860 770 -1433 -2139 181 2175 1151
803 1151 -2147 -2641 -193 3083 1611 -2334 -3352 -128 2828 1490 -2285 -3419 -476 3374 2185
818 2185 -2624 -4539 -1028 3715 2536 -2084 -4647 -1291 3360 2804 -2319 -4733 -1066 3063 2746 -1961
834a961k619K886M790j05m536k151K094M142N05m012k785K541L891J13l355k649
850c211J438L967J131l571k967J031M135J834k976m225Q87M968J561l163m517
865c678Q45M737K201l151m407P87M605K191l339l575N03L880J708k424l238O34
881a721K836J213j474k294L41J742J244q82j896k79J407J469p73j507p48J036
897b86J907m07j431r88J023K024j42k019j164J089J686j13j741o84J018J269l5
914A006j159j231J425N89l48j061J64OJ049n55m32L3K36l4j02L05j68%l34l30
934i41P51O74j8j226k38O91R36k08j305l69J185J550r00j887m19J521J671k79
952A189k092j162J597K295l48k380p08J466J651l99j860r55J751J610n47j117
$$ plain form
834 -1961 -4580 -1694 3096 2991 -1545 -3696 -1602 2540 3045 -967 -3752 -1211 2680 2793 -562 -3211
850 -3211 -1773 2194 3325 -246 -3213 -2182 1953 3787 811 -3414 -2527 2441 4002 839 -3678
865 -3678 -2833 1904 4105 954 -3453 -2666 1939 4130 791 -2784 -2281 1599 3307 883 -2355 -1721
881 -1721 1115 2328 854 -1440 -1099 643 1887 1005 -891 -1170 237 1706 933 -574 -1322 -286
897 -286 1621 1214 -217 -1205 -182 1842 1700 -319 -1483 -394 1292 1179 -562 -1246 -228 1041 1006
914 1006 -153 -1384 41 630 282 -779 -615 -609 440 -115 -547 -514 -278 -312 -414 -109 -277 -277 -611 -941
934 -941 -190 484 466 -760 -998 -307 629 421 -884 -1253 -68 1482 582 -1305 -1724 -203 1468 1189
952 1189 -903 -2065 -468 1827 1479 -901 -1609 -143 1508 1109 -751 -1706 45 1655 1108 -9
968ij419O75K117L31j992j574J014K420M46j912k438N50L484J202k527l118Q62
985a888L683J703l091l147M46M107J450k732l608J122M081J199k842k837Q17L125
1001A588J820k681l026O42K725J955k038k721P9K108K004r18k670q64K130K315
1017B448q66k748n73J962K098m16l059j245K344K532q19l038r52K048K535l76
1033A875l121j468K122K718j121k160j013J581J958j09j948j490J544J329K99
1048I96j590q64P01J558K61j489q09Q84P59M67j032o85M87O75N51r84k76N4Q24
1067D88j27k51k46N0K38M21j21m07j32o1N42j37k51k40j06M58K88l02k06L44k38
1088DL02l51L37j67k47K25oM71l94n20J26N71N79r69m97L57J217K72j054j376
$$ plain form
968 -9 -1428 -753 1364 1695 -297 -1871 -857 1563 2009 97 -2341 -1791 1693 2895 368 -2750 -1888
985 -1888 1795 3498 407 -2740 -2294 1813 3263 531 -3077 -1955 2126 3325 483 -2354 -1537 1588
1001 1588 3408 727 -2299 -1657 1068 3023 985 -1736 -1657 451 2455 1537 -1133 -1997 133 2448
1017 2448 1582 -1166 -1739 223 2321 1905 -1154 -2399 -55 2477 1658 -1380 -2332 -284 2251 1875
1033 1875 -1246 -2714 -592 2126 1005 -1155 -2168 -587 1371 1262 -686 -2176 -632 697 996
1048 996 -594 -1458 -757 801 1062 -427 -1236 -352 407 874 -158 -843 -356 319 870 -114 -390 -336 488
1067 488 361 110 -136 -86 152 573 452 45 -87 -148 394 257 6 -234 -340 118 406 104 -102 242 4
1088 4 306 -45 292 125 -122 103 97 568 174 -346 -220 351 930 -39 -536 -179 1038 1310 256 -1120
1108a120M68K003M04j671j277N39J874M48j358j456P38J362L80j145j265N89J628
1125A141O54j391j455M79J314P17r12j450k03J744O80p18j270p84J640J270o54
1142H02j961l87J547J645m85k451o72J793J868q92j770q04J512J992l34k842n77
1159b016J862J655j40k208j280K025J810m04k107r77J356J928j64k504p13J304
1175e73J583M29j882j261J151J671J10j641q84P47J512n4j088j305Q74J372M98
1192A259j192j056J25J443O68r29j545L26J519Q08j005j272k01J022J262q78j277
1209i23j36J030R78k64j429rJ096P08m35j044L9Q91N3m24o97K14O07J55l02k25
1229a17J20j68L89qK59o78r2J96K16q0p0k41k7N30Jn21k0J2L97M9k56J55l87M16
$$ plain form
1108 -1120 -652 1351 1755 84 -1193 -654 1220 1668 310 -1146 -408 954 1334 189 -1076 -487 1141
1125 1141 1795 404 -1051 -572 742 1459 547 -903 -1106 638 1318 600 -670 -1454 186 1456 802
1142 802 -1159 -1546 1 1646 1161 -1290 -1962 -169 1699 807 -963 -1767 -255 1737 1403 -1439 -2016
1159 -2016 -154 1501 1361 -847 -2127 -102 1708 1304 -803 -1780 -424 1504 1340 -1164 -1877 -573
1175 -573 1010 1439 -443 -1704 -553 1118 1228 -413 -1297 -550 962 908 -180 -1485 -611 761 1259
1192 1259 67 -989 -864 579 1247 318 -1227 -901 618 1426 421 -851 -1052 -30 1232 354 -923
1209 -923 -1059 -29 949 685 -744 -753 343 1051 616 -428 -389 502 555 131 -566 -352 255 410 108 -117
1229 -117 3 -165 224 216 475 -203 -295 -99 117 37 -33 -274 -301 229 230 -291 -311 -299 98 147 -109 46 -341 75
1253G5K12K7j49n63R1K96L93l81m5q11R00L27N6o92n34R67N78j38j266j96M65
1274c88J514p00r66n02J033R11j62j351m76R70J009n8j390r10R25J479r0j357
1292e09o25Q28J428l45j116o40L68J794K6j718q89J057J231K17j271r65Q42J138
1310H51K00j188r60L80J389M83j174p99m6J426M96j078q54m3J292R37j157j175
1328a020P6J537N15o91j497K92J208R72r24j253n6J382O97r34j063L00O45R35
1346A121r59q71J18P55M83k19o37m60O92O14l40m92k85L22N48L06r23j40mO36
1366B65M19r12n32O11P15P6q72m61N43O92r2q03k3J51N00J00o14J56K87j21P0
1387A55k38K58n32K56K10P3j82j89O8K29n3O9k20J59j57n5L23rl00j5o1M37p6
$$ plain form
1253 75 287 314 165 -398 -307 -11 382 1 -44 -855 45 372 428 -264 -798 169 747 609 -657 -853 -388
1274 -388 1126 426 -540 -1042 -9 902 740 -611 -1087 -117 892 834 -556 -1466 -541 938 848 -509
1292 -509 -1134 -306 1122 777 -339 -979 -611 1183 1209 -509 -1398 -341 890 1107 -164 -1129 -287 851
1310 851 1051 -137 -1097 -717 672 1155 -19 -818 -864 562 1058 -20 -874 -917 375 1312 155 -1020
1328 -1020 -944 593 1108 417 -1080 -788 420 1392 468 -785 -841 541 1238 304 -759 -459 186 1121
1346 1121 162 -709 -591 164 647 428 -209 -669 23 637 297 -195 -480 -158 390 696 -227 -367 -371 265
1366 265 684 -228 -760 -149 566 642 -230 -691 -148 544 452 -351 -374 -223 277 377 -237 -81 206 85 155
1387 155 -83 175 -357 -101 109 182 0 -189 -121 108 55 124 -96 63 -94 -149 174 165 -135 -150 -211 226 150
1410A50o31J29K52L52Q0o01j88L26O36n1p59k56L18P21M3o22k91K57N37l67l87
1431c52j63J07Q20j02o56J6k85J227j02p54l01Q4P06K35m79o30J53J031K74p07
1451A22p69l13J153O25l51j378N12Q10P29j084m66nQ54K95m12p66m1R13J94K7
1471F49j262L5P43O49l40q59k77P00N60k8r79k36M19J009j02p00q11Q75N65R3
1491G03j285j08O83P71l30q46k82N66R21q1q29p62P80N28K32q73n08K62R16K4
1511D82q67m66O48M84J54o82k14J51N16r4j03m60Q7O71J76m77%m7K42l5M9j07
1533A08m17N53l99P9N3m04O76j41m5k47k22N59N7j42j58K04J08n4l87L99o5j02
1555A3M2p3q3J33k31J21j66N12k38l08M10k06R0m4J88m58N3K57M30m87L6p7N13
$$ plain form
1410 150 -481 -352 -100 252 332 -269 -457 -131 505 454 -305 -561 -243 478 521 -101 -392 -135 402 35 -352
1431 -352 -515 -408 412 310 -346 -330 -615 612 510 -244 -545 -461 245 480 1 -629 -476 555 829 122
1451 122 -647 -960 193 818 467 -911 -399 411 1140 56 -410 -415 439 734 322 -444 -485 428 622 649
1471 649 -613 -578 165 814 474 -385 -662 38 598 570 -409 -645 -226 783 681 -19 -830 45 610 703
1491 703 -582 -690 -7 764 434 -412 -694 -128 793 712 -117 -879 -99 429 661 -212 -720 -458 458 482
1511 482 -385 -851 -203 281 435 -247 -461 -310 206 112 9 -451 -364 307 483 6 6 -41 201 166 215 108
1533 108 -309 244 -155 -76 -23 -427 249 108 63 -184 -406 153 210 68 -90 114 222 168 -219 180 115 13
1555 13 55 -18 -101 32 -199 -78 -244 268 30 -278 132 -74 16 -28 160 -298 -245 12 442 -45 -9 -86 427
1578D27K49o76j68k23P82J31n50j73P6M87J93n05o34K66O59L0l08l22J9M14L22
1599D96J50o33l56J80N55k79l99k3O0Q71j21n45o21O03N14N2p61l08L23R97k81
1620D74p90j95j1Q31L03o05n24J44Q30K91j047l18N06N52J90p02n89O3R22M36
1640G61r37m50L50P16Q4q15n11N72N74Rm10m44l6Q28L26m24n11J06O54j24j45
1661A73l82k79R96J44n69m37K6M19K90j22m50N2J10L73j30l73k35N91K90m35o
1682D6m99L03N84n62j73k33N70K1M0k44k53O66k85Mj58K19m3q0K64m1M3j49k52
1705b12K76o9K36k94R3N1k38K21r1j02J42J80j25n1j59pK42P4j50n8L8J99j41
1728E5L7m54q1M40J49J65k03k73L46j58o2J18j65Q2K50j34m01j58M72K44O6n83
$$ plain form
1578 427 676 0 -168 -391 391 522 -28 -201 -125 362 555 50 -584 -318 341 371 63 -259 -240 174 496
1599 496 646 13 -343 -163 392 113 -286 -309 -249 622 501 -44 -665 -62 452 504 -257 -565 -242 755 474
1620 474 -316 -511 -522 309 612 7 -517 -373 457 748 -299 -617 -111 441 631 -71 -660 -597 325 761
1640 761 -176 -626 -276 440 524 -291 -802 -230 344 353 -57 -501 -537 291 617 193 -318 -212 442 318 173
1661 173 -209 -488 508 652 83 -354 -328 91 381 259 -191 -139 -29 344 214 -159 -394 197 487 52 46
1682 46 -453 -150 434 -128 -301 -534 36 57 97 -147 -400 266 -19 -15 -173 46 3 -77 187 146 189 40 -212
1705 -212 64 -5 231 -63 30 81 -157 64 -27 -129 13 193 68 17 -142 -149 93 167 17 -41 -3 196 55
1728 55 92 -362 -443 -3 146 311 108 -165 181 23 -39 79 -86 -4 246 112 -289 -447 25 269 335 -248
1750b48j68K73N51Q6o83j18J84M78j13l79m17M55K84j70j22m84J00Q26j53j11
1770G1n72J57N65j36j50j14K2M93M3o32RJ04K87J93j02m39j38N82J73O8p56l28
1792f00P55L47k32k97m28N26K30jo89J35O12j56m3o27j05P82M01m31n21N1L77
1813H6N0J39o20K20m1O57j58m68j64N5L35L04m53p8K33j15j7k5j44n7O94m18k8
1836a3p9O8K97J21n57JK59j6K64k75m06R8M32r9p8j63oM0J35J77l23k10M52K0
1860A39J7L2j91j22Q4J7j30J50j70K28l88L70k6l1j02j11N26m9j73j17n0Q9M3
1883C5l57P0k2M20K35m09R7k67K68J81o04J85K75k0K54o87K19J7O0K97m17J4L36
1906A80o4J78j77k65L3K83M99o96l11J23M87j25R8n64J00J70M98m60n69N49J85
$$ plain form
1750 -248 -416 -143 408 494 -189 -307 -123 355 242 -137 -554 -99 185 15 -107 -591 -491 335 182 71
1770 71 -501 -344 221 85 -65 -179 -157 336 379 -253 -244 -140 147 340 238 -201 -339 243 416 484 -272 -600
1792 -600 155 502 270 -27 -455 71 301 300 -389 -254 358 202 159 -468 -573 209 610 179 -342 -291 86
1813 86 136 275 -345 -125 -166 491 333 -135 -299 -244 91 395 -58 -136 97 -18 -35 -60 -204 -261 433 15 -13
1836 -13 -92 -24 273 394 -163 -162 97 81 345 70 -336 -238 194 95 17 -146 -152 -112 23 200 -123 -333 119 139
1860 139 156 188 -3 -125 -41 -24 -154 -4 -174 54 -334 36 10 -21 -123 -234 292 243 70 -47 -97 -8 35
1883 35 -322 -252 -274 146 381 -28 69 -198 70 251 -353 -168 107 87 341 -346 -127 -110 -50 247 -170 -156 180
1906 180 116 294 117 -148 -115 168 667 -29 -340 -217 270 145 243 -321 -221 -51 447 -13 -582 -33 152
1927A52K33k92l70L03%J92k64j09j89L55N99m82k92j34L22L98l84k31L79J1J5
1948B12R2k61k75N2N73j42j74n53L22M65q6n44q3N44J48J57m79k97R2J77J74p3
1970D1l27K12K38r3N2m27J67L05k28M7l70K80M66k2j89m71J85K11J8J3k34L5q3
1993a74L61Kr0l52K82J65k25J08k44N5L03k27O2m0J5m3j06J88q5Q0J69r0L60n17
2017d3K07q5J72k53j67R3k72J43P9K49q4m5j1ql9K1n2j87M99j41j27J27k95K26
2041Gj07M5j4J13l59L30J3n54N11O3L31m67k6lL37k21L24k41k64M1J18L25n16
2064b14P1K7J55m9j62Q5J45K69j74j63l40J08M68k72k9o5j48L77L09m61j39L30
2086A28J53o9n11L14l48O64r4l50m0k74N47oJ45m75K20O7K10l47j72K18K45Q3
$$ plain form
1927 152 385 93 -277 26 26 218 -46 -155 -344 11 610 128 -164 -298 24 422 38 -193 186 197 212
1948 212 304 43 -232 -180 393 251 77 -476 -154 311 225 -319 -402 142 290 447 -32 -329 -237 -60 114 41
1970 41 -286 -74 164 71 123 -304 -137 168 -60 -13 -383 -103 363 341 152 -319 -134 77 95 108 -126 -91 -174
1993 -174 187 189 99 -253 29 194 -31 77 -167 -112 191 -36 26 -14 1 -42 -148 40 -45 35 204 114 474 -43
2017 -43 164 79 251 -2 -169 -76 -348 -205 -126 123 39 -6 -17 -25 -64 -43 -95 -282 217 76 -51 76 -219 7
2041 7 -100 -55 -69 44 -315 15 28 -526 -15 48 379 -88 -114 -117 220 -1 323 82 -182 -141 -23 302 -214
2064 -214 -143 -116 39 -10 -172 -87 58 327 153 -10 -350 -242 226 -46 -75 -140 -288 89 398 -63 -202 128
2086 128 281 212 -299 15 -333 331 237 -113 -153 -427 120 114 259 -216 4 71 281 -66 -238 -20 225 308
2108C08k56k24J16j77K03J50l93OM19l81M93m72J49M60l54n6q3n4L08M7l56r6
2130b43j60K08L68m17J14j57K23K81j57k40M9J90M9J96n36Q1J5L92k01j07Q7l5
2152@K0N7j19Q1N14k46N0n60N0K49k77M74l21o7j40K35J90p8pJ02k11j5K83k50
2176A4L6m7K13k61O9J07l23K89l0O1l05J01o8K66M7N2n58K12J86J02k3k17K42
2199A65j87R1K6p6l81M31Q0j70l2J29L7J75l8m82J18K39j32N1%k82R6L21K6j29
2223G6k73M7K07J38j80m4J53j15j09j31nM00N1O0l59Q8k00J75J83lM9j43n7M4
2247E2j78J30l1k67K35o2j53kK91J44j72r9j02K80J10j65j3j05J7K11k49L16l30
2270a42K39J51j24j41j49J81K07n03M14l08J14L44k02J06m70K39L31m5l24m97
$$ plain form
2108 308 52 -172 -56 -233 -30 120 -273 -267 152 -229 264 -208 -59 401 47 -9 -92 -146 162 209 -147 -243
2130 -243 -403 -195 173 -244 -130 -287 -64 217 60 -180 -131 59 108 304 -232 -151 -136 256 55 -52 35 0
2152 0 20 77 -42 39 553 307 357 -203 -153 96 -181 293 -28 -95 -235 0 190 112 105 207 -4 -19 264 14
2176 14 50 3 216 -45 24 131 -192 97 67 128 -177 -76 -144 122 169 221 -337 -125 61 163 140 -77 165
2199 165 -22 69 95 19 -362 69 149 -21 -53 76 113 288 250 -232 -114 125 -7 44 44 -238 -142 179 205 76
2223 76 -197 -150 57 195 15 -29 124 9 -100 -231 -236 164 215 275 -84 4 -196 -21 162 159 208 65 8 52
2247 52 -126 4 -27 -294 -59 -121 -274 -276 15 159 -13 -112 -214 66 176 11 -2 -107 -90 121 -128 188 -142
2270 -142 97 248 124 -17 -166 15 222 -281 133 -175 -61 283 81 187 -283 -44 287 242 -82 -579
2290e79L25N25Jk66j42R0p9M78l98k24J06M76j44j90r7Q3N8J11k85M1n8J09O2
2313Cj9pJ15J24k51J26p9R1l03J17K76n47K66P0k3Qj21M8J00J3j57%k9K48j7J08
2339A60K08m40K06j25J36j19l7J17j33O8j19j27J75J26k82L22k38J38j42l5K23
2360H2J49l56PL33j87J16n4Q0m47K87n6K02l15oM1K52k8j78L2k16M48j68n6J04
2384F6N5j50J18J1l03J28K9K78m38kJ25K58L8k71n1M9J28K60n77L84j44J94k00
2407a5J93k35K00P6j78Kj42k10N28k62j68m7L55J40o2k31l52M95K37j64l22l1
2429a93J33M25k64l2J36k52J18L39r4k51k56J20r4q3K11M1k7O3O1j1k54J23j06
2452a47L85k89M5r2K36j76L60m7k67Q3J01M1m54J67K69J47o43L29n30M96j1k11
$$ plain form
2290 -579 -254 271 272 6 -136 -46 -125 353 -45 -269 -163 313 169 -21 -118 -35 23 134 -151 -110 -168 -59 3
2313 3 -16 -23 92 216 -35 91 12 103 -200 -83 193 -354 -88 -18 -41 -33 -154 -106 -6 7 -150 -150 -179 69 52 160
2339 160 368 -72 134 9 145 26 -11 106 -27 41 -78 -205 -30 96 -186 136 -102 36 -106 -141 82
2360 82 231 -125 -118 215 28 144 90 170 -277 10 -46 156 -159 -165 -124 128 100 -78 -46 -262 186 18 -38 66
2384 66 121 -29 89 100 -203 -75 -46 232 -206 -208 -83 175 213 -58 -109 -60 68 328 -249 135 -9 185 -15
2407 -15 178 -57 143 219 41 43 -99 -309 219 -43 -211 -258 97 237 175 -56 -408 87 324 160 -162 -193
2429 -193 -60 365 101 69 205 -47 71 410 316 65 -191 -71 -165 -248 -37 4 -23 40 101 90 -164 -41 -147
2452 -147 238 -51 -6 -98 138 -38 322 275 8 91 192 233 -221 -54 215 362 -281 48 -482 14 3 -208
2474b08r1K36L64r8l84J55k65K85J08R7Ok39L03n57L55l62L81n8r5N9j13m7K38
2497G0j85j42L99j21m8J42n9j10p0J24L4q4J07j12o7k3K54L6k37r1R6qM9p8K4
2522a00q0J74j10o5R4O8j79L21l1k68L01P8l9j19j58J3KJ97k95r9J89M76l64K12
2546B18m64O10m38L18k52nq9Q8J50l71K47q5J3n5L17l7j75J00j32n6k5k76J87
2569b12J85J02l3O6j76K05j76K18m39J39J33j72K37j38j69P4P7K76J08l95KM02
2591C14n6p6l82L29M9l07K16k23K9K22k8l09M2K32J86l51r7j43K63K28r3Jj48
2614a02L48m20K44j88K21k8j20L03n72K84J03j38l11LL86j14l9J50R0j90n1L4
2636a07j72L84k60J51k5j28L57l30K46j14J14k5L6o8j83K68k75L22R8l34Q7L5
$$ plain form
2474 -208 -299 -63 301 203 -181 -26 -291 -6 102 199 205 -34 269 -288 67 -295 86 28 -67 -8 -121 -168 70
2497 70 -115 -257 142 21 -27 115 56 -54 -124 0 34 -50 57 -55 -122 -145 109 145 -92 -183 -87 -95 -46 -124 -100
2522 -100 -180 -6 -116 -181 -87 -19 -198 123 92 -176 125 203 164 45 -113 -100 -98 99 -196 -295 -106 370 6 218
2546 218 -246 364 -74 244 -8 -13 -102 -14 136 -235 12 -73 -60 -115 202 165 -10 90 -42 -98 -123 -399 -212
2569 -212 -27 75 42 108 -68 137 -39 179 -260 -121 12 -160 77 -61 -230 -156 -79 197 305 -90 -88 314
2591 314 258 182 -200 129 178 -129 87 -136 -107 115 87 -222 -180 52 238 -113 -210 -353 -90 138 45 46 -102
2614 -102 246 -174 70 -118 103 75 -45 258 -314 -30 73 -65 -376 -373 13 -101 -140 10 100 -90 -141 -107
2636 -107 -279 105 -155 -4 -29 -157 200 -130 116 2 116 91 127 59 -124 144 -131 191 289 -45 42 77
2658G7k06J28K51j53j98J27n5n8j41J63J7J89m87J82J97k7p0N5j37N08j36l31
2680a05J93l6J5j08J00k07K14Q6o4k49J04l4l09K12J88k5O8j12n2K20j97K20k26
2703a04R6j13j58K0J99M2Q2J13m18L86l98M4K6K36q8K7J3Pp2k3M50J32p09K92
2727H2m6k91L04k02K12l4J15J01j66Jl43K92L37l03k5l63K02K27j43J8j99K68
2749D4J13K3j96J18j99j24M87k1J6l94K75l27J07K58l16j41L72k49j86K83j50
2770b07J13K97o1j15j75J51N7j67L34l50J83k07J74k29K84k4l5m2R1l29K86J4
2792D3l72L39l17M33K8k29J02K61l99nk30O26j30l09L32k70K0J31j05L6O2n8n0
2815f1j19L74k64J70k90J8o9L09k4j61k30L76j06P6j38O0K03k24J45k84M20l57
$$ plain form
2658 77 -129 -1 250 97 -101 26 -29 -87 -228 -65 -48 141 -346 -164 33 6 -64 -9 -146 362 226 -105
2680 -105 88 52 67 -41 59 -148 66 152 88 -161 -57 -91 -400 -188 0 -25 43 -69 -121 99 -98 122 -104
2703 -104 -8 -121 -279 -259 -60 -18 64 177 -241 145 -253 -209 -183 53 -35 -8 5 12 -60 -83 367 499 -210 82
2727 82 36 -255 49 -153 59 25 140 241 75 76 -267 25 362 59 34 -329 -127 100 -43 -25 -224 44
2749 44 157 180 -16 102 -97 -221 266 245 261 -133 142 -185 -78 180 -136 -277 95 -154 -340 -57 -207
2770 -207 -94 203 142 27 -148 3 60 -107 227 -123 60 -147 27 -202 82 58 23 -19 72 -257 29 43
2792 43 -329 10 -307 126 154 -75 27 288 -111 -116 -346 280 150 -159 173 -97 -77 54 -51 -15 47 -11 -61
2815 -61 -180 194 -70 100 -190 -172 -241 68 44 -117 -347 29 -77 -1 -139 -79 124 -100 45 -239 181 -176
2837a76J7M10j93m8K18P5nm75L79k10J67j43n4q3j56J72K69j34p9p1L08l81L0
2860a63N6N6q2K93m5P5m58K58l2K91j84l09M09j40k65K69k0M7l9L4j65Q6j2R9
2884E9q7j19J44R3P8Nj68J34k60M9K21q7o6J7k26M00j74r4K31k76M37k21nN8j32
2909A1lj26j9j72K63j48K69j56k29K39M0J30k36j1K71J18j23j65J10J32J24l80
2931f1P3N3j68K41m2Ql1K00j67j43q1J70l8j58j5j49M28Mrl9j2J46K4j10j27r0
2957i3k29M84k52l20L94k55M18j36k07Q6%oK08j67K67l94K86Q0l04M94k10r7l9
2980Hj39J87J08m20oJ94K4J27l2j26nN9K68k73J08l33J25L91j10m2r8J16k4o8
3004C9j78j01J55J66j28L6M2j3rm1o6L67p7n3j28l3Q2r4J17r5l81N99j83j67K75
$$ plain form
2837 -176 -159 251 58 10 228 303 298 -177 202 -8 159 16 -38 -121 -277 -105 164 30 -49 -120 188 -193 -163
2860 -163 -107 -51 -133 160 115 190 -268 -10 -42 249 65 -244 165 25 -240 29 9 56 17 51 -114 -28 -40 59
2884 59 -28 -147 -3 90 168 173 5 139 -121 -72 149 62 -4 13 -213 187 13 -81 150 -126 311 90 85 143 11
2909 11 8 -118 -137 -309 -46 -194 75 -81 -310 -71 -31 99 -137 -148 123 241 118 -47 63 195 319 -61
2931 -61 12 65 -103 138 96 104 73 273 106 -37 -118 52 14 -144 -159 -308 120 124 115 76 64 210 234 124 -3 -93
2957 -93 -322 162 -90 -410 -16 -271 147 11 -196 -110 -110 -116 92 -75 192 -202 84 164 -140 354 144 47 8
2980 8 -131 56 164 -256 -262 -68 -44 83 51 -75 -80 -21 247 -26 82 -251 -126 265 155 113 15 131 107 39
3004 39 -139 -240 -85 81 -47 -11 31 18 9 -32 -98 269 192 139 11 -22 60 -34 83 -12 -393 206 23 -144 131
3029A31p7o0k6J29J61j70j98k71L53L40k42j86m1L9L00j01L7l70L07J48k92K10
3051A21l96N79l44p1K23P0l10K84K12j90k67J60k45M5O9poJ67j94m5J75j08K00
3074A22k29J87k17R3N3K85l31J15j51L14l0j29P2q2P7qr8K10j69J20k11m70K11
3097b66J04J30J34N0k44M2RPQ9o8j11K61j58J15k87k95K50j6P7P3j88M63r5p8
3121bmR5r8m1j98QJ46J70k71L31j6J58k39p3N8j14R7l7j00K60l1J40k05J48j11
3146G1J26J22m56M27k58%L7n7j25OK57j55L09j54j89J11k26J62K0N8j5j45N6K75
3170B57nm02o0L33l0q6p9O5K7o2j2j15J86RJ75j12lm4jj17K29o3l0N5j73j82J94
3197d6K46j64o5N9j53K47J36k04J10j6k14P3k99L48j99J54K8K25n0k59L78j46
$$ plain form
3029 131 54 -6 -32 97 258 88 -110 -381 -28 312 70 -116 -157 -118 182 81 118 -252 55 203 -89 121
3051 121 -275 304 -40 -111 112 182 -128 156 368 178 -89 71 -174 -129 -60 -67 -73 94 -100 -145 30 -78 122
3074 122 -107 80 -137 -44 9 294 -37 78 -73 241 211 82 154 72 149 141 43 253 84 204 -7 -477 -266
3097 -266 -162 -32 102 152 -92 -50 -41 -34 55 -13 -124 137 -21 94 -193 -488 -238 -254 -177 -104 -292 171 76 -2
3121 -2 -6 89 -9 -50 -248 -240 -94 76 -195 136 120 278 39 -34 24 -90 7 -30 -130 130 99 239 34 182 71
3146 71 197 319 -137 290 32 32 69 12 -113 -107 150 -5 304 150 -39 72 -154 8 28 86 71 -74 -18 257
3170 257 252 -150 -210 123 93 7 -72 -7 20 -42 -54 -169 17 26 201 89 86 42 41 -76 153 90 60 115 -58 -240 -46
3197 -46 200 36 -29 30 -123 124 260 56 166 150 -64 9 -290 58 -141 13 41 266 216 -43 335 189
3219A89j54jj17j17L98l02l7J0O3q3K92j42K35j45k11l8L29r8k75J58R6j3R3j70
3243d0K93o5j44J60l13L3K35j3j91R7q4L01j24j35K1l8J52j84l1J22j52J79P9
3266A58l97K08J41K92l19J0k24K64j21jl6q9J55k74J11J09J1J59l39j30M69k95
3288a38J90L24l70J47r4j31j48p7M25O1j71J05k04L15k61J02J69j13j77J12J91
3309B57l64K20k11K35K83k89j31K16M3j07j33J7n2r7K66o04M36J93l92K28k55
3330b41Q6J19K15j59Q9R2J56n69J92J25k67K79K48j84j42O1k95K21j46L7K69j89
3352cj93j46J77K85K78n74m5J71J09n1j36J85Rk64P3J86j85J89P8j28LK37l15
3375f0K69k62J89j19k59L0RK12J41r4l15J66o9n4N29k93K5n77O75mn6l57J31M04
$$ plain form
3219 189 35 34 -83 -200 198 -104 -141 -131 -68 -151 141 -1 234 89 -122 -160 169 71 -204 -46 50 37 130 -40
3243 -40 253 188 44 204 -109 -76 159 146 -45 52 -32 269 145 10 31 -7 145 -39 -70 52 -100 79 158
3266 158 -239 -31 110 402 83 93 -131 133 12 11 -25 -114 41 -233 -122 -13 -2 157 -182 -312 157 -138
3288 -138 52 376 6 153 59 -72 -220 -297 128 189 18 123 -81 234 -27 75 244 131 -46 66 257
3309 257 -107 113 -98 137 420 131 0 216 259 152 19 36 -16 -113 153 -451 -15 178 -214 14 -241
3330 -241 -155 -36 179 20 109 201 357 -212 -20 105 -162 117 365 181 39 100 -195 26 -120 -83 186 -3
3352 -3 -196 -342 -165 120 398 -176 -221 -50 59 8 -128 57 66 -198 -125 61 -124 65 143 15 18 255 -60
3375 -60 209 -53 136 17 -242 -212 -203 9 150 56 -259 -93 -162 -216 313 20 45 -532 143 139 83 -274 -143 261
3399B61n00R0J94j96L88j63K83l52K08q1k65L71m12K03J42k76j1l3R6NJ32j15
3421c1j17p9K78j66j84L79k01J46j00L2o0L2j16l0J56JJ46n7q6r4J3L07l76Q8
3445a19J82m9p6j0M2m2j4J47j6j14oL17l28J08J50r8O1l13K63k11J16J84l4j1
3469A29m40P7L85l4j62K59j70m4P4o8m7L43j68P8j50L0M1j88L37k80O1N2r6j06
3493h7r9J92K9Q9k89K46o6J76o5o8m4J4K28j63k05K73j17j26J27M4L4p4k35R9
3517h7J35L5k10k9J51p2J11q6m1K38k30N5k07J39j03K29j9j46K68k36R5k0MP8
3541E2R5k20L8j4qJ62J49L1m18J25K77m91J95pJ36m44J71R2J05k21L85j65j60
3564a35K32k33J75J02k15J63k38J77k4O0K34o03J7L99k64RJ95J26m18J81J47n2
$$ plain form
3399 261 -239 -149 45 -151 237 74 357 5 213 132 -133 238 -174 29 171 -105 -116 -149 -53 -48 84 -31
3421 -31 -148 -227 51 -115 -299 80 -121 25 -75 -43 -103 -71 -187 -217 -61 -60 86 29 -57 -151 -138 169 -207 -119
3445 -119 63 14 -62 -72 -30 -72 -86 61 45 -69 -75 242 -86 22 172 74 135 -178 85 -126 -10 174 140 129
3469 129 -311 -234 151 117 -45 214 44 0 74 6 -41 302 134 212 62 92 133 -55 282 2 63 115 19 -87
3493 -87 -186 6 35 124 -165 81 15 191 126 58 14 28 256 93 -112 161 44 -82 45 89 123 49 -186 -87
3517 -87 48 83 -127 -156 -5 -77 34 -52 -93 145 -85 -30 -237 -98 -201 28 9 -137 131 -105 -10 -30 -26 52
3541 52 147 -73 -35 -49 -57 105 254 285 -133 -8 269 -222 -27 -34 102 -342 -171 -79 26 -195 190 25 -135
3564 -135 97 -136 39 141 -74 89 -149 28 4 64 298 -305 -288 111 -153 -144 51 177 -241 -60 87 35
3586C5j22J23N0k2k66K16O5K9m64J46M77j80k72J83P7r9L88k66Q2q2L19m24J98
3609A91k33M5j60K77k58O3K85j49k26L15l53J89K05P6p0j56j34mQJ67j98K69k7
3632A22l96O37l87K9K7J62k88j28K54J3M5m19L18J82k55J1m9J67j19K10N6l1n63
3655d02N02J6k30j17O3Q8L67k55j52M03j42j10m8J09J1P4j75M3J23j60j15J41
3677C4Rk07K23k1o5j25J95K0j28Jo2q2K59L7j28j14K6j08K82j17j41O8K66j76
3701e4J21J8jK47p72O29k43j48M99p3j97N4j27k31N38k24j6J63l2j71j38L18k85
3724a25K81l44J68J49l9nJ61k65o4J35j5k01P8N2J10j29J10n9l7J22M5k11L8R1
3748D6j20M7j8m4J23K81n69O4j4J29k17L02k23R1J68K18r2N1j21r7r0K79o4l6
$$ plain form
3586 35 -87 36 86 64 -202 14 79 108 -356 -210 267 87 -185 -2 75 -24 364 98 180 98 417 -7 191
3609 191 -42 3 -157 120 -138 -75 210 61 -165 150 -203 -14 191 267 197 41 -93 -97 -89 78 -120 149 122
3632 122 -274 363 -24 5 32 194 -94 -222 32 45 90 -329 -11 171 -84 -73 -122 45 -74 136 192 161 -402
3655 -402 100 116 -114 -231 -168 -80 287 32 -120 283 141 31 -17 92 103 177 2 45 168 8 -107 34
3677 34 43 -164 59 38 -27 -152 43 63 -65 -64 -126 -208 51 88 -40 -154 -128 -236 46 -71 -212 -144 122 -54
3701 -54 67 85 84 331 -441 188 -55 -203 296 223 26 80 -47 -278 260 36 20 183 151 -20 -158 160 -125
3724 -125 156 -188 -20 129 90 85 246 -19 -83 52 37 -164 -86 -34 76 -53 57 -2 -39 83 128 -83 -45 46
3748 46 -74 -27 -45 -89 34 315 -254 -190 -204 -75 -292 10 -213 -122 46 264 172 223 102 5 -85 194 130 94
3772I4j82k18L11M5P4q0M1J45j32m6kp0R3j69L12j78N6q6P0M8Mo2j43J58j79K92
3798A96k76J21m1R2j20J65k50M5k73Q7J9L31k63J58M81k79k94L8J28k36P1n5J99
3821D4M4p6J59jk07n7Q7K7k41K72nmJ74j18L5K90n33K19k6mk06L79k29K82r6p
3847B02k06Ll1K2J3q0P1J8N0o2p0M1K88l62J8Q2J01J18l72J46K06k51K50l30J69
3872C4J40l98K37L9J03k81L41k60Q0J30L3k65J74j86k9K45J2l30L38L1k97m4N4
3895i9J64j58K59L6q7J06J6l26k9J31k43J30K0j88N71j83j40L4q8q1J33k01K51
3918B8j2J34r9j78J36k42L34j8j49j5K47k4rRj14r1K63r3j36p8J47k07M14j81
3942F6q7K75m83J80K07j16k94L10K18k89j24K07Kk35J20M18m16r3L6o0J13K8j91
$$ plain form
3772 94 -88 -306 5 50 124 44 85 230 98 52 50 -20 73 -96 216 38 94 8 78 126 130 68 -75 83 -96 196
3798 196 -80 41 0 92 -28 137 -113 -68 -341 -254 -235 96 -167 -9 472 193 -101 -63 65 -171 -100 -155 44
3821 44 88 12 171 170 -37 -94 -7 20 -221 51 46 42 216 98 133 423 -110 109 83 79 -127 252 23 305 209 202
3847 202 -4 -1 -32 -10 3 -77 -6 12 62 0 -70 -29 259 -103 -85 -3 98 216 -156 -10 196 -55 195 -135 34
3872 34 174 -224 13 52 155 -126 215 -45 35 165 198 -67 107 -79 -108 137 149 -181 157 188 -109 -153 -99
3895 -99 65 -93 166 202 115 221 237 -89 -118 13 -230 -100 -80 -268 303 120 -20 14 -74 -155 -22 -223 28
3918 28 16 150 51 -127 9 -233 101 83 -66 -81 166 142 133 142 28 -63 200 107 -29 -107 40 -167 247 66
3942 66 -21 254 -229 -49 158 42 -252 58 276 -13 -137 70 72 -163 -43 375 -41 -134 -98 -158 -45 -17 -208
3965b08K06J23j92j30L47j88L04J5m00p4K71P2j18jJ00k49M8K8m4P5M2n5J29R4
3989A95m97J10K44l06J88J80P1l43K77k92K13k1O3M9j56Q5K1n9o5L69n27K27j90
4012a64K31L6R9o6m7j14K36q3k6L1j95j10k9M8L31j69j18N4n0n3K79j04K20k80
4036d3j06J63J1n49M75O7j22L29j25j38P9k21J99J62M5l92J83J44J54j50l31K93
4058A27j70j93K27j32N6N2m6K26l94K01J93l30M35l33j41M58l46J75j32Q6J32
4079A51n06L98l4kj30k9j07N16j85J29l01j43J78oj76K29J39j2P3j5j74j62R5
4102g4j04K88j3k86N2J99Q5j20J39m6j12K2k0j46K78k3j16j54K19m1o8q2K57k21
4126h7K42k01J02m66L33k00L01K35l25J85l00N8M59k71P6j91P0K01l0K12l67k12
$$ plain form
3965 -208 -2 121 -71 -201 146 -42 262 277 -123 -197 74 146 28 27 127 -122 -74 -46 -90 -15 27 -28 101 195
3989 195 -302 -192 52 -254 -66 114 185 -158 119 -173 40 19 82 131 -25 60 81 22 -43 326 -201 26 -164
4012 -164 67 103 202 136 89 -25 211 128 102 133 -62 -172 -201 -153 178 9 -109 -55 -105 -158 121 17 237 -43
4036 -43 -149 14 25 -524 -49 18 -104 225 100 -38 41 -180 19 181 226 -166 17 161 315 165 -166 127
4058 127 -43 -236 -9 -141 -85 -33 -79 147 -247 -46 147 -183 252 -81 -222 236 -110 65 -67 19 151
4079 151 -355 43 9 7 -123 -152 -259 257 72 201 -100 -243 -65 -71 -247 -18 121 109 182 167 -7 -169 -74
4102 -74 -178 110 97 -189 -137 62 147 27 166 120 8 30 10 -136 142 119 3 -151 68 27 -41 -123 134 -87
4126 -87 155 -46 56 -410 -77 -277 24 259 -66 119 -181 -123 336 65 141 -50 20 221 191 403 36 -176
4148a76J65O5j47J56L10l05L72l77j01m2J81K07l20J85l32N61m73K02k70L74j59
4169G6j70J10k25Q5K31q1k03n4K0K84j64JJ58k11j7J61j47L10j54Q3p1L9j08j04
4193a51j66L72Q2l37M91j66l41j9L54j71O7k2j05o9J94j26K72j51K3m2P5l0J40
4216A74p0l47M29Rk84j62M31k34n7k09L73k8o5J37n79Q07m21Q5n0O72p03j15J89
4239a8o8M5J60k15K22J30k22j12N4J9k01L51r6j41L81j56L3l2l19J61r7O9k00
4262b52L3J62K06N6k14K44m74L20j52J89J86o10K70k06M92l63L13k33rRj73J26
4284h0P8N6J3J95j92j19J90j84j8N17n11j72j24L66m2j91J40K08n87L51K64j08
4306E0n7j82K81J04j32J44k00o3J06O7m49J13J96j63Q7J47j86j16K5K74m4J8l6
$$ plain form
4148 -176 -11 54 -93 63 373 68 440 63 -38 -80 101 308 -12 173 -159 402 -71 131 -139 235 76
4169 76 -94 16 -209 -124 107 26 -177 -231 -211 73 -91 -90 68 -143 -160 1 -146 164 10 93 22 61 -47 -151
4193 -151 -317 55 137 -200 291 125 -216 -235 119 -52 15 -7 -112 -181 13 -113 159 8 31 -11 64 34 174
4216 174 104 -243 186 195 -89 -251 180 -54 -111 -320 53 25 -40 97 -482 325 -96 -11 -61 611 -92 -207 -18
4239 -18 -86 -41 119 -96 126 256 34 -78 -24 -5 -206 145 49 -92 289 133 166 134 -185 -24 -121 -52 -252
4262 -252 -219 -57 149 205 -9 235 -239 81 -71 118 304 -306 -36 -242 250 -113 200 -33 -42 -33 -206 -80
4284 -80 -2 54 67 262 70 -49 141 -43 -61 456 -55 -227 -351 15 -27 -218 -78 130 -457 -106 158 50
4306 50 -7 -189 92 196 64 208 8 -55 51 118 -331 -218 -22 -185 -98 49 -137 -253 -228 46 2 20 -16
4329a6l3K64N0l39J09l7n2K33m39K75q2j86J52J65l17R2L65R9l35qK54j98q7K05
4353A34k62J23M10m69N3L40j53n75J11M81k34L84l85K1k71R4L4J19m2J71k46O3
4375i9M15n27K29N1J53q9j79J94j18l7j59L8N17m61J49QJ77j79l61K59K05l10
4397a24J46r8j95K27N6m0m0M58l96j63K30rj04K16O3l46j8P7K61k37k43J37J45
4420CJ41P1l0k80NJ8P9O0j21J2N6N9l50O59n05k87N24l97N41k96o6j6J30O9m02
4445c23M59J07J6j75qK8j4k72M3L22n6O9o8k47L24k52J95l25n1K98J77l52J69
4468F4q0j61J70q7Q4k80K38o5K49r1%j98M1P0k4o7l11K80L10k09J14j44J13L17
4492C33m16N0RJ07J5K63r5j90N1k42j32J42K3k42J09J50L16k46p9J4J59k36M1
$$ plain form
4329 -16 -49 215 265 -74 35 -2 -54 179 -260 15 -67 -253 -101 64 -253 -161 204 303 -32 -40 214 16 -71 134
4353 134 -128 -5 405 -64 -11 329 176 -399 -288 193 -41 343 -42 -21 -292 -198 -164 -45 -87 84 -162 -99
4375 -99 316 -211 18 69 222 133 -46 148 30 -7 -166 -128 389 -72 77 85 262 83 -278 -19 186 -124
4397 -124 22 -76 -271 -44 12 -28 -68 390 -6 -169 61 52 -52 164 227 -119 -137 -60 201 -36 -279 -142 3
4420 3 144 215 185 -95 -90 -72 7 67 -54 -42 14 73 -277 382 -123 -410 114 -283 258 -38 -104 -120 10 79 -323
4445 -323 136 243 259 84 76 104 90 -182 -139 183 127 196 128 -119 205 -47 148 -177 -228 70 247 -105 64
4468 64 -16 -177 -7 -94 -10 -290 -52 -117 132 41 41 -157 -116 -46 -70 -137 -448 -168 142 -67 47 -97 16 333
4492 333 -83 -33 -24 83 98 361 266 76 127 -115 -247 -105 -82 -324 -215 -65 251 5 -74 -60 99 -137 -96
4515i6L13k13m4K35k41k38O9K86j4j80J72j43q3P0J26k30K35J3k11K98l0r8k04
4538b08L00l54L09l1R0J23j69m06K59MJ87L25k76j77J2j3k07L48J89r4l9k01l6
4561f5J84l9K4j21k98J42m1L43Q9M3j75j83P9N1J32k46J08O5l00L84k98R7J09
4584H4k71J21N2O4m1j66K96q9O8r2K72n30K55r0J69j74R6j99L72j8k71K43m4j28
4608b1LQ3J79l40K70k3j31J87j08p5R2r1J61l05L88l88J59J29j34k7n8j74N2K22
4632E0j17K85j63m1j6k43L57K28k79p9p4j6M63k00n9K48k39j35J44p5Q9k19L00
4655B09l59M3J75j67K75j71j05K52j02j11K17J22j03j37j91K22J27M2j37j6l03
4676b18K14K73m94K51J74P9n08J37R5r0K80n7j06q0K60k18l8K3k28M3q1N3pK25
$$ plain form
4515 -96 217 4 -40 195 -46 -284 -215 71 57 -123 49 -94 -177 -107 19 -211 24 37 -174 124 94 -4 -208
4538 -208 92 -262 47 16 106 229 60 -346 -87 -83 104 429 153 -24 -12 -25 -232 116 305 211 172 -29 -65
4561 -65 119 80 104 -17 -315 -173 -214 129 218 261 86 -97 -18 33 165 -81 27 92 -208 176 -122 -25 84
4584 84 -187 -66 -14 50 9 -157 139 50 118 26 298 -232 23 -67 102 -72 24 -175 197 179 -92 151 107 -21
4608 -21 -18 65 244 -96 174 151 20 207 99 24 116 25 186 -119 269 -119 40 169 35 8 -50 -224 -172 50
4632 50 -67 218 55 14 -2 -245 112 340 61 -18 -92 -108 355 155 96 344 105 -30 114 39 128 -91 209
4655 209 -150 -107 68 -99 176 5 -100 152 50 -61 156 278 175 38 -153 69 196 238 101 85 -218
4676 -218 -4 269 -225 26 200 279 -229 -92 3 -87 193 136 30 -50 210 -8 -46 -23 -251 -208 -289 -236 -243 -18
4700a8j01M8J91k33L43j44l87J46K48l48K64K20j46k25K74j27l3Q3R7j88L27k98
4722gJ82k62p8O3K36m06J09K01K21j76k51K70j79K31j86K3O4k8J57J00k52j55
4744a23P4L17r9k99J98j24q0J41L38j62O2l73J68j11K70k65M33k12k27K02j50
4765b2J83l05L47k04J15Rj10K28k18J14j70K61o7k28J25j7J21l52J37J48j7j20
4787d2k77L90j11q7K8p7J62oJ20m30K90k46M01k35J37k12o0K66n5j53R0J85jJ06
4811A83N7m39O7P7O7j00j38K36P8k03K14m9q4L5n3k17J24J93J32l41q5L61j30
4834a5Q3J86Ol01J40k08M2J21j79R9k10L85l52l8M63j45j53J19m65N07j21r0J85
4857E9j51l4K22j07J67j62p3K89k15j20RL88n11J9K51LL1N2k25J59r5L6N7m53
$$ plain form
4700 -18 -119 -71 120 -113 230 86 -301 -155 93 -255 9 229 83 -142 132 5 -28 55 152 -36 291 -7
4722 -7 175 -87 -165 -102 134 -272 -163 38 259 83 -168 102 -77 154 -32 -9 55 27 184 284 32 -123
4744 -123 -49 268 169 -130 68 -56 -136 5 343 181 243 -130 38 -73 197 -68 365 153 -74 128 -22
4765 -22 161 -144 203 -1 114 123 13 241 23 137 -33 228 161 -67 58 41 162 -190 -53 95 78 -42
4787 -42 -319 71 -40 -127 -99 -176 -14 -20 100 -330 -40 -286 115 -120 17 -195 -255 11 -44 -197 -107 78 77 183
4811 183 240 -199 -132 -55 12 -88 -226 10 88 -115 99 50 -34 1 -52 -269 -145 48 180 -161 -246 115 -15
4834 -15 68 254 260 -41 99 -109 -67 54 -125 -26 -236 149 -203 -241 222 77 -76 43 -422 85 -36 -126 59
4857 59 -92 -126 96 -11 156 -6 -79 210 -5 -125 -116 272 -239 -220 31 34 65 117 -108 51 -44 -8 49 -404
4881d04L82r4J22l7Q4J28m62r2J58K68o3j59M30j66k18j97O76m37J95k99O9L70
4903B54m33J55n5M31l00j25K39l95J42j1j16J96K45m76K16L17k47kj61j34J95
4924f5p7j31L40j39K1J60k71J72M6P0m5k07K97k08K60m87N45l07k37K96r5L01
4946B39l12J86m0k72O11l15ok40M59m66PJ05J98K24l91q0n2L46j96l8J6P5k07
4969a49L92Q9n41rL64k40M15n31K22r8J96m9J2l3r9l0J02j10KO71p23L21j86J48
4993A36k75J60j60L69m88M79k28P2p5L15k59l7R9k61K70j87o0J47n5M7j5m6pJ41
5017H2j48Q9L7J00l10j20L06R6J01q9k95J52q3n4J67K62k11k59L43Rj33j8L1N5
5041A10mj62r1K11P6j14L95m53K93m21J29J1j32J18j98K89k83M40j33K46k56j69
$$ plain form
4881 -404 -22 -116 6 -31 53 181 -281 -373 -215 53 -10 -169 261 95 -123 -320 356 -81 114 -185 -116 254
4903 254 -179 -24 -79 352 52 -73 166 -229 -87 -98 -214 -18 227 -249 -33 284 37 35 -126 -260 -65
4924 -65 -142 -273 67 -72 -51 109 -162 10 56 126 81 -126 171 -37 223 -264 281 -26 -263 33 -62 239
4946 239 -73 113 73 -199 412 97 91 -149 310 -156 -149 -44 154 378 -13 -93 -145 201 5 -33 -17 58 -149
4969 -149 243 332 -209 -218 146 -94 321 -210 12 -86 110 61 73 40 -59 -89 13 -97 -95 576 -147 174 -12 136
4993 136 -139 21 -139 230 -258 221 -7 65 -10 305 46 9 108 -153 117 -70 -130 17 -38 9 -6 -52 -59 82
5017 82 -66 23 60 160 -150 -270 36 132 233 144 -151 1 -82 -136 31 293 82 -177 166 175 42 24 55 110
5041 110 106 -56 -147 64 140 26 421 -32 261 -160 -31 -20 -152 -34 -232 57 -226 214 81 327 71 -98
5063i8K21j53L21m40J66j01M30k58k47J17l1K34j92J14Q7M3l14Q8N2k51J28K53
5085A69J52k48n1l2J1j18L04J27j71m7j79J77m9K2l8k31M42n79L14k63J39K58
5107A09r4k74J55j84j96K78K49O4j38J02J16j71J4M25m22J04j63Mn0K95J48l74
5129cJ62k00K80j37k9k32jQ8L43l57J79j25J62j11J21j68j36K90j2J36l16L14
5151B48k51J28k37J12L45k93k65K11j04J33J2K4q9k5K20k79l58N45k00Q7J33J02
5173A99k13P6P9j1P5j02m5q1J49l75K84l0o6R1k21J93O7l6n8m8J56R8r0j10R9
5198H0k75N0p4L98k46Lm2k11M32j27Q0j10j17J78K81j69k26N10l83J02J91k94
5220C1j8j08O8N9k7K2j50J58o6k0o0M02j36O6j20r3P7j68J29l86K93J61r5K53
$$ plain form
5063 -98 123 -30 291 -149 17 -84 346 88 -159 -42 -73 161 -31 83 170 213 -101 -13 39 -212 -84 169
5085 169 321 73 22 -10 1 -117 187 314 143 96 -83 94 45 67 29 -202 240 -339 -25 -288 -149 109
5107 109 15 -259 -104 -288 -484 -206 43 107 -31 71 187 16 30 455 33 137 -26 -22 -72 223 371 -3
5129 -3 159 -41 239 102 73 -159 -160 -72 271 -86 93 -32 130 19 140 -28 -164 126 114 250 -66 248
5151 248 -3 125 -112 0 345 52 -213 -2 -106 27 39 63 -26 -51 169 -110 -468 77 -123 -36 97 199
5173 199 -14 62 141 130 205 103 58 -23 126 -249 35 5 -61 30 -191 2 69 33 -25 -73 83 181 91 -19 80
5198 80 -195 -145 -219 179 -67 -64 -106 -317 115 -12 68 -42 -159 19 300 131 -95 415 32 134 325 31
5220 31 13 -95 -27 32 5 27 -123 35 -31 -51 -111 291 155 221 101 8 85 -83 46 -340 -47 114 19 272
5244B72j67r9m2L19j65k96KQ2j95L02J82k12M09j90n34K22k10L72J6j64O2k76
5266c10J89o8J99j64K98l6j61J3J8o8k32L35l04L25k66K43L43k01l03K7K65j7
5288A25J10j39k51K12J39p9p6j54K96l12r3L20J8J8L2l62J46O5Q7J94l59J01P
5311D5j18K79l54P8j20J41m8O4q3J80j9K73p5j79L5k15Q8Q9k18L3lL8K44O8k10
5336A3p6k2p6J30j07J26J19L2k40l19J92O51p05K63m03L21L88j51J17k27j58K22
5358I0J17j59j79J74j71J42p7K50n2j01Q4p9J58m49N13l42j8O2L35k02pj33J4
5381c0K41j34N1m50J49J43K39R5l90j31OL59o9K62l29j56j4k4K93k36K97K73l93
5404E2j28N2k00L27k30J78J20m66K18K88k42j2K07l92K52Q2M9o4p0j01J03k73
$$ plain form
5244 272 105 6 -36 283 118 -178 -176 -94 -289 13 195 -17 392 202 -332 -110 -320 52 68 -96 -34 -310
5266 -310 -121 -189 10 -154 144 108 -53 -40 -22 -90 -322 13 -291 34 -232 11 354 153 -150 -123 142 125
5288 125 235 96 -155 57 196 117 41 -113 183 -129 -222 98 116 134 166 -196 -50 15 102 296 -63 38 45
5311 45 -73 206 -148 -70 -190 -49 -97 -33 -116 64 45 318 243 64 99 -116 -28 61 -157 -124 -127 -89 155 223 13
5336 13 -63 -85 -161 -31 -138 -12 107 139 -101 -420 -228 423 -282 -19 -422 -101 287 136 253 26 -132 90
5358 90 207 48 -131 43 -128 14 -63 187 135 34 118 39 197 -252 261 -81 -99 -37 298 96 89 -44 -30
5381 -30 211 77 128 -322 -173 -30 209 304 -86 -217 -211 148 79 341 12 -144 -158 -182 111 -125 172 445 52
5404 52 -76 -24 -224 103 -127 51 171 -295 -77 211 -31 -43 164 -228 24 106 155 91 21 -80 23 -250
5426b50jK40r9J85r2J23k41K12j70j52R1L73l90J37j19J19L4m4J27k74K17J7k24
5449a81K66J41p8l01O17m40J43k68J39J37j17J49l38J88q7K83l26n6K58p8o3K39
5471B27o17J89K84k25q4M12l09J96j32J02O3j01K04l70O9j7qj07L65k58R1J16
5493I0Lk97R5j17L19r7J55j60J15O8l37K47m7r4J43K79l57j78J20n9K31J03l32
5516a07K28J47l56j0J05J65j74K11j85J58j66q3J8Q3l60L67j58J05Q0j5R7j47
5538CpK99l29o4K7L3L2q4J86k81K4o8j86K27m8K34K9J60k97R3j29P8K94l28J77
5563G5N0o8j52k6k0k9K12J2N4K09m26k16K39J14j78L69j90J74k72K27j04p2M07
5586C89l47P6k04K51l01J57j20J66j70J42J57j03k63L45p9m39J69K68k9n2K03
$$ plain form
5426 -250 -251 -11 -110 75 -17 106 -135 77 -93 -245 -154 219 -171 -34 -153 -34 0 -44 83 -191 26 43 -181
5449 -181 85 226 148 -153 464 24 167 -101 38 175 58 207 -131 57 -30 253 -73 -129 129 51 -12 227
5471 227 -390 -201 83 -142 -226 186 -123 73 -59 43 106 5 209 -161 -92 -109 -117 -224 141 -117 -26 90
5493 90 93 -204 -109 -226 93 -4 151 -9 106 174 -163 84 37 -57 86 365 8 -170 -50 -109 122 225 -107
5516 -107 121 268 -88 -98 7 172 -2 209 24 182 16 -67 -49 34 -326 41 -117 -12 68 53 150 3
5538 3 -4 295 -34 -98 -71 -38 -6 -90 96 -185 -161 -229 -415 -188 -236 -2 27 187 -110 -17 -146 -68 226 -102 75
5563 75 125 57 -95 -121 -141 -170 42 54 108 317 -109 -325 -86 28 -150 219 29 203 -69 158 54 -18 389
5586 389 42 118 -86 165 -136 21 -99 67 -103 39 196 93 -170 175 96 -343 -174 94 65 13 216
5607B16j52N5K02m03k14M09j83N1l23J47J32J86jl9o8r3J51O4j74q5J33J30k24
5630h3K30j88m0O8j00P7K18L1k85M44n46K44k00j32L05l69J11J60O6l1K79k47
5652A2P0M03q33K85J56j77k6M19k32o0j32K41N1j91J95k54J61r5J73j64Q5j72
5674h5K4L37k88M3R1k12O9j85p3M58m2q1k34j48M10J90j54r0j76J86L21j36j16
5697A09j22l8K56q9j14J05q4j21M31l15k06M30j60k09M9L49m95L4J96J60m31K27
5719c8k28L8L96j65oQk24J74N2j21k01K81J52l38J93l91M71k26K26j23J87j40
5741b3J99r6l29M64m18L34k5j07K7j52J39j64J05K5J65r8L5M3k40J18J86r5r7
5764do3J78p4p6J54l86M13j52K99n80K53L7j43L80n1o2n2O8l21l8K12J84nl22
$$ plain form
5607 216 64 119 321 -82 -296 113 -70 -19 -342 -195 -63 123 122 83 15 -78 73 137 -37 -122 11 141 -83
5630 -83 147 -41 -81 -13 -113 -36 182 213 -72 372 -174 70 -130 -262 43 -326 -215 -55 11 -20 259 12
5652 12 82 485 -348 -63 93 -84 -110 309 77 17 -115 126 177 -14 181 -73 88 -7 166 2 87 -85
5674 -85 -61 276 -12 31 122 -90 -21 -206 -279 179 137 56 -178 -326 84 274 120 30 -146 40 361 225 109
5697 109 -13 -51 205 116 2 107 23 -98 333 18 -188 242 82 -127 -78 271 -224 -190 6 166 -265 -38
5719 -38 -266 -228 168 3 -3 5 -219 -45 7 -114 -315 -34 118 -220 -27 -418 53 -173 53 -70 117 -23
5741 -23 176 80 -249 215 -203 131 106 -1 26 -126 13 -151 -46 -21 144 46 81 124 -116 2 188 93 -4
5764 -4 -67 111 37 -39 115 -271 142 -10 289 -291 -38 -1 -144 236 185 123 71 139 -182 -220 -8 176 171 -151
5788a51N7L11k44m0J08O5j44K93m27L5L78n31L96J07l45l4j8K96j72M0K25N2q8
5811A69l31L09j82j08r0M2j32J01r5N27j83k15n8J92j91J49q7J81K6K71l2L8n92
5834b91K83j19k01K18J06j57L17k95L54j68M2n2k85M3J95r3J11J80m20K98R5N2
5856B13m75K69J07O5o0k04K63l35M6K81k09K39l03j22K91n7j55J80j54Rk36L19
5878b8r8L58k71L33j12j20q3K97k11k40K99k72J46kK70m16J56r5N0Nj06N37k69
5901A28l99j05K39J84J37j83m9M8Q0Q6k48K9K08l62K10j6k6O8J97l03K5J27L2
5924A07M1k4K8l08L55k59L1K6M7k49J99jj11L52l89J40j7oO3J78k90P7J60j7k85
5949a52j75L43n8k02N21o22L00l0J31k05L15j31j57N3M90l88o4K28J2M6l24KO7
$$ plain form
5788 -151 -94 217 -27 -67 41 106 -38 255 -172 -137 241 -290 106 213 -132 -166 -184 112 -60 -20 205 257 169
5811 169 -162 147 -35 -143 -233 -191 -323 -222 -317 210 27 -188 -246 -54 -245 -96 -183 -2 24 295 263 301 -291
5834 -291 -8 -127 -328 -110 -4 -161 156 -139 215 47 89 37 -248 -205 -10 -103 8 188 -232 66 161 213
5856 213 -262 7 114 179 119 -85 178 -157 -111 170 -39 200 -103 -225 66 9 -146 34 -120 -111 -347 -28
5878 -28 -126 232 -39 294 182 62 -21 276 65 -175 124 -148 -2 -4 266 -150 6 -89 -39 -34 -140 397 128
5901 128 -271 -376 -137 47 184 1 -48 0 80 166 -82 -53 155 -207 3 -13 -39 29 226 -77 -52 75 107
5924 107 148 124 152 -156 199 -60 -29 -3 44 -205 -6 -7 -118 234 -155 -15 -32 -38 25 203 -87 -10 150 133 -152
5949 -152 -327 16 -42 -244 277 -345 -45 -75 56 -149 166 35 -122 -69 421 33 -31 197 209 255 -69 -67 0
5972@J17l41J70p7J88p8J34k0j21j08J19j27K21J11K29l47oJ15j79j08J72j82
5994a18K49l82L62L2m47K37J27j07o4n6j9J52L02l27K25k61K53J9l79J28o5j48
6016b87L64jj35K2j69L0K02j56P8J1K7n7q8K81k55J24J35J47Jl39rJ4K2L7j16
6041a17p5K05k29J25J12k38J55k1lj15J52J59J77o62M64J67k09Nj17J88j78k16
6063b71K52l6m1L5J36j53j5J64k82M23k23J03q4j45M78m87m6K27M1J49n09L49
6085F5m44L83n6J21j16k18O22l69J96m35J85q8J6N4K88l19L27l52L94o53L73j29
6107a55N3K37l32R2j28J09Q3L7O5J4K02q0k95j34J89l4k81R1K53j24j6N3K57l
6131A53n1k2l7N1k3K52k28o0P7k13J06q8J37j42P8k16K93k41J50K45j74j82K14
$$ plain form
5972 0 117 -224 -54 -131 57 -21 113 93 -28 -136 -17 -144 77 188 417 70 64 179 0 -108 64 -118
5994 -118 131 -251 111 143 -304 -67 60 -47 -111 -167 -186 -34 268 -59 166 -95 158 177 -202 -74 -139 -287
6016 -287 77 76 -59 -37 -206 -176 26 -130 -52 -41 -14 -71 -159 122 -133 -9 126 273 274 -65 -74 -60 -38 -1 -117
6041 -117 -192 13 -216 -91 21 -217 -62 -83 -86 -201 -49 110 287 -375 89 256 47 52 -65 123 -55 -271
6063 -271 -19 -55 -96 -61 75 -78 -93 71 -211 212 -11 92 8 -137 341 -146 -192 35 76 225 -284 65
6085 65 -379 4 -52 69 -47 -265 357 -12 184 -251 -66 -154 -138 -84 204 -115 212 -140 254 -399 -26 -155
6107 -155 -102 135 -197 -105 -233 -124 -41 -4 61 75 277 197 -98 -232 -43 -77 -358 -267 -14 -138 -154 -101 156 153
6131 153 102 80 43 94 71 323 95 35 112 -101 5 -83 54 -88 -10 -226 67 -174 -24 221 47 -135 79
6154G9R6k85J75j83J63Q2k07Rp9j79L34p6j00RL60l08M47l54K83j66j73J79l79
6177b73K06j12N04j39jl74L17M8n7J0j54j42K02m3P6M5j25L01l85J11j36J91j67
6200i7J49N1l36J20O08l94r8j15J52J8k60J77KQ3k18O8Q2jo4JJ54l59M71K2k80
6225f4L3K02j01j58J57M7j18j27K65k41M62l30j35k39J66J14NK10k27j6J29j8
6247A6k98L43k53K56P7j8k86J55O3k16J31K4m7J0K00k19J8K24m68L45j32O2J8
6270EJ3l21k0N77m04J40J00l31P4%J37K42k29j11K73q8P3Q4r8m0J66k61j69K92
6294A04j71J24J08r6n4j19L07j00l3N1j39Q9J05k4J09j29j37Kn4O1K44k96J99
6317A51k06p6J2K01k86J86j12J4J80k1o6m7L26J12m01l3P9J8J65j71K7J96j19
$$ plain form
6154 79 175 -110 65 -118 45 127 -80 -71 -150 -329 5 -71 -171 -162 198 -110 337 -17 266 100 -73 106 -273
6177 -273 -67 -179 325 186 185 -189 128 176 119 129 -25 -167 35 -8 68 113 -12 289 -96 15 -121 70 -97
6200 -97 52 103 -233 -113 495 101 3 -112 40 58 -202 -25 -23 60 -158 -90 -8 -9 -73 -72 82 -277 194 216 -64
6225 -64 -31 171 70 -88 69 116 -2 -129 136 -105 357 27 -108 -347 -181 -67 -62 148 -79 -95 34 16
6247 16 -282 61 -192 64 141 123 -163 -8 55 -161 -30 -6 -53 -43 157 -62 -44 180 -288 57 -75 -13 5
6270 5 18 -303 -323 254 -150 -10 90 -241 -167 -167 -30 212 -17 -128 145 57 130 214 116 76 242 -19 -188 104
6294 104 -67 57 165 69 15 -104 203 103 70 121 -18 71 176 152 261 132 -5 -3 -57 4 248 -48 151
6317 151 -55 -131 -119 82 -204 -18 -130 -116 64 43 -23 -70 256 368 -33 -66 13 31 196 25 52 248 129
6340A29p0k02K38k35K47l07l5L48l5j37m2Q4K88r4j30p4l7K38k99J69j90K62m10
6363b94M94l08L9J07j84kR8j06L34jl52J26K88J44l18j56K66k84J59l51L65J32
6385A96j94k26M48l14N0J7j05K64kj31K0q2J2J12N3J72m08J85R5o7k57K35j81
6408a08K40j66MK06j30k46K22J81k24r4L18k87N6r8J28j91K30j81K12j10O2r7
6430g3L42j85J08j16J29n37N06k51J82J00l34K20l86M08j58J2o6KL14r4o1Q5K3
6453A70j23N2j48J24j16q6o8J1p4J21K09J4j05l33K24L20j18K1kj0j12L5p0o8
6477a32K50j71K61J8k31K27l15J8k13J15K32p7L6j22K03j43L9q8M8J17K53k61
6499F4k45L8M27j38k62J55l54K26M6k04M57J5m78O24ol6r3k22n0J93j0l25J10
$$ plain form
6340 129 59 -143 95 -140 107 -200 -235 113 78 -59 -101 -17 271 177 47 -27 -64 174 -125 44 -146 116 -294
6363 -294 200 -108 -69 38 -146 -148 -50 -156 178 177 -175 -49 239 383 65 -91 175 -109 50 -301 64 196
6385 196 2 -224 224 -90 -40 -23 -128 136 134 3 23 -59 -47 65 118 290 -118 67 162 95 -162 73 -108
6408 -108 132 -34 -30 176 46 -200 22 203 -21 -115 203 -84 -28 -126 2 -189 41 -140 72 -38 24 -73
6430 -73 269 84 192 76 205 -332 174 -77 105 205 -129 91 -295 113 -45 -33 -99 -97 217 123 62 147 170
6453 170 47 99 -49 75 -41 -127 -195 -184 -258 -137 72 86 -19 -352 -128 192 74 95 93 83 -29 6 -64 -132
6477 -132 118 -53 208 226 -5 222 -93 -75 -288 -173 59 -18 18 -104 99 -44 -5 -93 -45 72 325 64
6499 64 -181 -143 284 146 -116 39 -315 -89 -43 -247 210 225 -253 371 365 329 236 14 -36 157 147 -178 -68
6522f8j94L85M5p5O8j34P0j48L32k22N6l7j84K61k19L6k57N33l4k02j9j81K84
6545I6k33J76k43K82J6j11O0j6l80J59K95l13J95k0P5k84J11J48j52N54n75J23
6567c7J83m5k62L10j01q3J31m0k25n2Q1L00p4K29k99k6J63n30O30m44K52lp6k02
6591b20J61J2Q8J12K8k59J59j95q2J15J04l6P1K56m53M28k87J53k47L07m7n86
6613d18M34j12l2K68j86p0K22K4k05j4L20q9k74L54p0k33K51l17K79j18K18o05
6635c73O69m02k6L12j94J1K44k49j87K41l20R3R4P9j83N7jJ07r3O6K19j08nj27
6659g6K79k32J73j3k43nL13r3P9p5l04J74p6j42L40m69K71L6L9K60l45J57k0l6
6683hn8P6O0R8p1j67J82k8j90J24J39l78J15l4O5L66n6k93J78J7j27j75K83K34
$$ plain form
6522 -68 -262 123 168 93 161 27 97 -51 281 59 115 78 -106 155 -64 -28 -285 248 214 12 -7 -188 96
6545 96 -137 39 -204 78 94 -17 43 27 -353 -194 101 -212 -17 -37 38 -246 -135 13 -139 415 -160 -37
6567 -37 146 101 -161 149 48 -35 96 56 -169 -221 -140 160 86 315 16 -10 153 -377 253 -191 61 58 -18 -220
6591 -220 -59 -47 41 153 181 -78 81 -114 -196 -81 23 -13 58 314 -139 289 2 155 -92 215 168 -418
6613 -418 16 -96 -128 140 -46 -116 106 130 -75 -89 231 142 -132 222 152 -81 170 -147 132 14 232 -373
6635 -373 296 -106 -132 180 -14 -3 241 -8 -195 46 -274 -181 -87 -8 -191 -134 -135 -28 -121 -55 164 56 51 -76
6659 -76 203 -29 144 131 -112 -117 196 103 182 107 -197 -23 -99 -241 99 -370 -99 -63 -24 236 -109 48 28 -8
6683 -8 -66 10 70 168 97 -70 112 84 -106 18 157 -221 -106 -140 -75 291 235 -58 120 137 10 -165 118 352
6707C52l08R6l11p6J54O9j97k3M41K04o00J08j45L73l32K31R2j34J46j82k87K76
6729e3J43j46L66n77K76k86J49J64L5l67N1L28p1J22P1k74nQ3k12J08N7l2K86
6752B16k93K27J82n49K45L7o9L1k28K69j27j27j04J29K63r4m5j6J46K1j42m4p1
6775a43K54l25K66r2L49m87K00m4j04N8n1J78j66L09l02J85j47N6J28q1J09m48
6797b98Q4N80n59K37p2j57L02k49j1K66o5J66m67K95j29j10R6O0k62N09j86K38
6819B68J3j71o7Q2k48rK97j44rJ3k77N1L63K9m57M56o3l77K18N5P2j91p0K9K25
6844H8j9J42l12j2L28m14M12k0l27K47m6K70j76l1j66rj59K51j6OQ7p3O1l57J56
6869h9Q6P6o1O6n5j40K54o2l8L2q2j9N6K90l22l7LJ93r2k29K53j19O8K97n90M14
$$ plain form
6707 352 44 140 -171 -247 -93 -24 -221 -244 197 401 -199 -91 -236 137 -195 36 128 -6 140 -42 -329 -53
6729 -53 90 -56 310 -267 9 -277 -128 36 71 -296 -245 83 12 134 205 -69 -74 9 -203 -95 -38 -70 216
6752 216 -77 150 332 -217 28 65 -4 27 -201 68 -59 -186 -290 -161 102 8 -37 -53 93 114 -28 -72 -143
6775 -143 111 -214 52 -40 309 -178 22 -22 -126 -68 -119 59 -107 202 -100 85 -62 -6 122 41 150 -298
6797 -298 -214 366 -193 44 -28 -185 117 -132 -143 123 58 224 -243 52 -77 -187 -91 -31 -293 216 30 268
6819 268 281 110 43 125 -123 -132 165 21 12 25 -252 -201 162 191 -266 190 127 -250 -32 23 95 -96 -166 -137 88
6844 88 69 211 -101 -113 215 -199 213 193 -134 113 67 337 161 130 -36 -45 -204 47 31 37 124 51 112 -245 -89
6869 -89 -3 73 12 78 23 -117 137 75 37 69 -13 -32 24 314 -8 -45 -42 151 59 -170 83 -36 32 329 -261 153
6895A53K30l79Q2R1p8J23p3j04j33j28K96k8m25N96r2j47n5K50k67L8J2P8j69
6918a29J81j74M52j94k67J82j65K07k94lL67k29L9Q0J16k21M8L0J66k91j8J30
6940A3k03L48j49k24L26k05K64l00l0q3Q7K55l82M26kk21P6J58k11K25j65K87
6962B90j74N2q9j35P4j31K30lj58j58J50K27j15j85JJ02o9K17j43Q2l49M20L0
6985A66k68L8J60O0l44n1K17k56N38l19M2k14k4L27j61JK45j10Q8j98mo2J30l1
7009c0k43L14j45L7J04L9l00L94r5L29m49J89k28K57l24Q9o7J71N8k45RJ66K17
7032B47l28k71N53j98l62M07j22j05J00q4J50K3Q9J46n79M24q2K5O2j20l17M74
7054A32l62J74p2K8q9L38P0k27N12l91R9j80J9l5K11j51j0j39q5k2M10l61J97
$$ plain form
6895 153 383 4 86 177 99 222 149 45 -88 -216 80 52 -373 223 131 -16 -71 179 -88 -50 -38 40 -129
6918 -129 52 -122 330 136 -131 51 -114 93 -201 -204 163 -66 -27 53 169 -52 -4 26 192 -99 -117 13
6940 13 -190 158 9 -215 111 -94 170 -130 -160 -243 -156 99 -283 143 141 -80 -4 154 -57 168 3 290
6962 290 116 168 79 -56 18 -113 117 114 -44 -202 -52 175 60 -125 -124 -22 -91 126 -17 65 -284 136 166
6985 166 -102 -64 96 156 -188 -239 -22 -278 260 -59 -17 -231 -255 72 -89 -88 157 47 135 -63 -67 -129 1 -30
7009 -30 -273 41 -104 -67 37 76 -224 170 75 404 -45 144 -84 173 -151 -62 -129 42 100 -145 -136 30 247
7032 247 -81 -352 201 3 -359 48 -74 -179 -79 -163 -13 10 99 245 -334 90 8 33 95 -25 -342 132
7054 132 -230 -56 -128 -100 -189 149 219 -8 504 113 212 32 51 16 227 76 66 -73 -158 -180 230 -131 66
7077F6K19l71K68l07J4K04j68J49o4M7R4m4l88L38P6k31L63l52j96M34k23j97
7099b69M18l0l38M02l36k7R4M1nJ31k73J75o0O2J47J6J4o4J30l30j47L33o8O7
7123H3n6j68N9J50J36ll94M33R1m17O5K95l38o5J42J43q5j56K50m38K14K4j24
7146a59l1K90k32O4J72k8J62j92j82m8L43J84l09j18J3n8J48l27M94l6j33J20
7168A37k02N5j34K49J18j72L6j00l9ON5L09j30j92j99K4J52k37L45J23k36j39
7190a71J25l1L25n12N7o7J89p3kJ62P1j52J49j64N4r5m5O9QJ90n8J91l20L1K51
7215A82nk24O4o6O9j1j16N0J11q5m7N5j8l6m5j72N13k42j4j83M57m47K31J32q
7240A45j06k43K06l45Q4J43j84M07k78K83N1j11mJ80k52K45k87N3j51J8N4Q5K07
$$ plain form
7077 66 285 -86 182 -125 -111 93 -75 74 10 57 151 107 -281 57 133 -98 265 -87 -283 151 -72 -269
7099 -269 149 119 -219 183 -153 -180 -86 -45 -50 81 -192 -17 -77 -15 132 148 162 98 228 -102 -249 84 16 83
7123 83 27 -141 -82 68 204 201 -193 240 331 -86 -21 274 -64 -129 13 156 71 -85 165 -273 -59 -35 -159
7146 -159 -190 100 -132 -68 104 76 238 46 -136 -184 159 343 34 -84 -71 -129 19 -308 186 150 17 137
7168 137 -65 -10 -144 105 223 51 87 -13 -52 -46 9 318 188 -4 -203 -179 -27 -264 81 204 -32 -171
7190 -171 -46 -77 248 -264 -207 -274 -85 -158 -160 2 73 -79 70 -94 -40 -135 -180 -111 -103 87 29 220 -100 -69 182
7215 182 177 -47 17 -49 20 9 -107 -57 54 -31 -78 -23 -41 -77 -122 -294 219 -23 -37 -220 237 -210 21 153 145
7240 145 39 -204 2 -343 -259 -116 -300 107 -171 112 163 52 48 228 -24 221 -66 -13 -164 -146 -92 -7 200
7263B00q1j89K6J61k52J44N9r4P9n8J10l1l8j64L6K91j47j27J18Q0o4J35j61R7
7287A30J64l6k63j73L11J30k64j53j1J93P5J35J28n49J41j57R2J18M0r5Mj30O6
7310a04K09l26M24J69m02J47q1J49k80j28L54k6k21Q3j51P5P3P3l19Q6M7K01J47
7333A99j76J36j75K12l00qj36L13l2l07mL39j4q4L17k22k5J01l53J67J22k02J26
7356fM5q5K15p1k15QM03n22L74n32M41q6j2N7J34J09m22QL39k36m3Q4j84j2N47
7381C38l88R6J36l62L92K8l48J11J4J39m1L5n8l16L30k23M92k63J2jk13k0K44
7404A34k98K28J00r8J11n1O6k66M41j50k82J92j64k54J83K03j63o3l29N93l27
7425a94l1R9L4K41m00J67j00O4R4J03q7l5K51l8j00m7J14k6j33k43K58J33k03
$$ plain form
7263 200 119 -70 -44 117 -135 9 68 -26 53 -5 105 74 36 -128 -92 199 52 -75 43 123 59 194 33 130
7287 130 294 258 -5 -178 133 263 -1 -154 -165 28 103 238 366 -183 -42 -199 -107 11 51 -44 -40 -170 -104
7310 -104 105 -221 203 372 -30 117 36 185 -95 -223 131 105 -116 -33 -184 -109 -36 37 -282 -196 -149 52 199
7333 199 23 159 -16 196 -104 -112 -248 65 33 -274 -278 61 47 -37 280 58 33 134 -219 -52 70 -132 -6
7356 -6 39 -46 169 98 -117 -109 294 -228 146 -386 55 -31 -43 14 148 257 -165 -157 182 -54 -97 -13 -197 -209 338
7381 338 -50 46 182 -180 212 240 -108 3 17 156 115 150 92 -224 106 -117 375 112 124 123 -90 -110 134
7404 134 -164 64 164 66 177 126 192 -74 367 217 -65 127 -37 -291 -108 95 -68 -131 -460 133 -194
7425 -194 -225 -126 -92 149 -251 -84 -184 -120 -26 77 -10 -45 206 168 68 21 135 109 -24 -267 -9 124 -79
7448g9j40R6p1l2L09l78M37J64j45r1k49J40J79m42K82K01k51m7j16J81J2j1J70
7471A19j77j02K94k00k31K52m6J61j26J15m11J97J24K04j32k3J87k54K75l81J52
7492cj41P7j10K8J47R4J6k39J69J93L7k21M3l15K2L51L0l14J41k64J50J04j88
7515a93J5J36o9L32l10K25J04j34k43K4l6n5K95j36l4M02k33l0q3q9R7%M1k73
7539b47L90RLL6q7j9j42J20J48l26k18L71m46P42l92J7Mk5j02J54j54N31n54J90
7563Cm1J87j58J18o1p3p8K7j6L57l37K80R8l08J2O5o5K61k34j20K12j21j91K94
7587A11j32M2J79j45P1rk82k0M34l4k72M89m34j15J36L0kO8K76q30M64j17P6J66
7611A50m49K6j11M19k97L49j47J63l54M19l14L61m10j46M1K32K41j39K65k60j65
$$ plain form
7448 -79 -219 -123 -194 -226 83 -295 142 306 161 70 -179 -39 140 -302 -20 181 -70 -117 -233 -52 -40 -51 119
7471 119 -58 -160 134 -66 -297 -45 -91 70 -56 59 -352 -155 -31 173 41 18 205 -49 226 -155 -3
7492 -3 -144 -67 -177 -149 -2 92 108 -131 38 231 268 47 90 -225 -203 148 178 -136 5 -259 -109 -5 -193
7515 -193 -178 -42 -111 221 -89 136 240 106 -137 -113 -149 -204 91 -45 -79 323 90 60 -23 -112 -15 -15 26 -247
7539 -247 143 152 155 191 104 85 -57 63 211 -115 -333 38 -408 334 -58 -41 -37 -62 -164 -10 -164 367 -187 3
7563 3 -38 149 -9 109 48 -25 -103 -76 -92 265 -72 208 306 -2 10 75 10 271 37 -83 129 8 -183 111
7587 111 -21 21 200 55 126 117 -165 -185 249 215 -57 432 -2 -117 19 49 47 115 391 -439 25 -92 -16 150
7611 150 -299 -273 -384 35 -262 87 -60 103 -251 168 -146 215 -195 -341 -300 -68 173 34 299 39 -126
7632a26r8P29n03O7q3j47K14r6J76j15k29L31j40j45k0N9N20j43k36j44K20l23
7654b32K28j21J57N0J1j31k02J40j38K65N1k83O7M50l73j03Q2R2m1K6l58n6M57
7677C8k27K49n8J36k46l7M43l63K14J0k34l4K02M0O7l21L73m27J30r7Q9K29KK39
7701D17m06l6J39J29l25J61k83M85m56J00P7P0q2J07m65K87J43L4k84K93k35L02
7723A72l18n0K9K42j07p9j7L05k62Q0M74m58l55J86K9K52p9k33M33j87J4j11J10
7746G0J0K08l81L58j36j30J62k30J27r1J84Rj96L0KK48l22P9N1%j43J01q4J04
7770C0j63J75j14k6K07j23J54j87LJ64L2n6P3n04N21j90J03o9J29j55N1k47M84
7793B92J58m29k0j75K3k3Q8k56L19L02k65J8l2j26j69K25K06l50QJ55j0J76l07
$$ plain form
7632 -126 -224 505 2 69 -14 -161 53 -43 133 18 -211 120 -20 -165 -185 -126 394 251 15 -129 91 -232
7654 -232 -4 -125 32 82 93 -38 -240 -100 -238 27 78 -205 -138 312 -61 -164 -82 10 -31 -5 -363 -419 38
7677 38 -189 60 2 138 -108 -145 298 -65 149 159 -75 -109 93 133 200 -121 252 -175 -45 -142 -53 176 178 417
7701 417 11 -25 114 243 -82 79 -204 281 -175 -75 2 72 -10 97 -368 -81 62 96 -188 105 -130 172
7723 172 -146 -196 -167 75 -32 -111 -128 177 -85 -5 469 11 -344 -158 -129 123 44 -189 244 57 71 -40 70
7746 70 80 288 -93 265 129 -1 161 -69 58 -33 151 160 -36 -6 -4 244 -78 1 52 52 -91 10 -74 30
7770 30 -133 42 -72 -98 109 -14 140 -47 -44 120 152 96 169 -335 186 -4 99 30 159 4 55 -192 292
7793 292 450 21 1 -174 -151 -174 -86 -342 -23 279 14 32 0 -126 -295 -70 136 -214 -206 -51 -61 115 -192
7816a92O5l2L27k32L68nl22K48m35J74K31k08J06Q4M6o79L20L04j21O7RJ1j31
7839Cj35L2J83j60J30K8k20L10M4k18N9j78j8L32l20L0M7J24k73M00J12m06j92
7862b86M20j62P5j6jj56J09qJ33j58P7j05k0K75k70N9K0m2O0j44M28K0p3k10P5
7887A00m12J45K17P5k8j24l3m8k6K52k15P9k55K60P9j5J10j62N7l7j45Q6j02J12
7911c0J9j26J11K3j22J93J15k86J1L59k99P3J5j86K72M4j66j59K37J21m31M0M3
7934a29q4M19m72M92j3j31O6p7J70j33O7q5k33j94K49l7N3N9K13n7q7Q5J29j99
7958G1k05J66Q0k31J03mRK4m4J52j28k68N01m63K37n9n5J87p1n60M62j7J72J8
7982G7k86P8K6L75j47m7N5k01K78M7l69O8J84k20K20N0L0lk87R2j71K70k15L81
$$ plain form
7816 -192 -127 -159 168 -64 304 299 -23 225 -210 -36 195 -13 93 177 223 -456 -136 168 47 114 123 134 3
7839 3 -132 -100 83 -77 53 81 -139 171 215 -3 56 -122 -140 192 -128 -98 -51 73 -200 200 312 -94 -286
7862 -286 134 -28 47 31 30 -126 -17 -25 108 -50 27 -78 -98 177 -93 -34 -14 -56 4 -140 288 308 235 25 100
7887 100 -312 -167 50 125 97 -27 -60 -108 -134 118 -97 -18 -273 -13 66 51 161 -1 56 19 -126 -40 -142 -30
7911 -30 -11 -137 -26 -3 -125 68 183 -103 -92 267 -32 41 56 -130 142 186 20 -139 98 219 -212 -172 -129
7934 -129 -213 206 -266 226 213 82 148 71 241 108 175 90 -143 -337 -88 -125 -72 -13 200 143 56 141 270 71
7958 71 -134 32 112 -119 -16 -20 -11 13 -31 121 -7 -275 226 -237 0 -59 -114 73 2 -558 -96 -113 59 77
7982 77 -209 -131 -105 270 123 76 131 -70 208 255 -114 -46 138 -82 138 188 218 215 -72 20 -151 119 -96 285
8006B85n46K43J77j42j98K7K08j20o8L61l9k03J27l81k7J43J70K21j33j59k94
8027c48Q6K47n9M63k76R4l70J12K62l28R5J5K08m22Q4J77l2k8j41J48j08K92j0
8050A61j60j8K94j18lk49K08j07L8Q5k00J58j32M8J89l44J43J74k20J02j6j59
8072a26P2m8K09m8Kq8JJ19k53r1L16l40O3J66r5J36l7J38M7J11l05K51k65O7r6
8097i4K98j00k87J23O7Q8L5K1j24j74J28K32jl33K65j14Q1o3J72j84o6O4l27K19
8121g4j68R9J66m4j34K38j29L07k35k12L36R2J36m00j06J65O7j94p2K17l9K21
8143B37l78L42K6j90q6O2J77l64K88k27J63j48m3K80k40j40L67l74L16O1Qk49
8165a12q0p9O3K13j26Q9J06N2j10L0J15l05M88o93M79k01q3m8L00n8M7o0k39L12
$$ plain form
8006 285 -261 -18 159 17 -181 -154 54 -66 -134 227 188 -15 112 -269 -296 -153 17 238 105 -54 -348
8027 -348 -262 -15 -74 389 113 207 -163 -51 211 -117 -22 -7 201 -221 -137 40 8 -20 -161 -13 -121 171 161
8050 161 1 -17 277 159 156 -93 115 8 46 131 -69 89 -43 5 194 -150 -7 167 -53 49 33 -126
8072 -126 -54 -102 107 59 61 -27 -26 93 -160 -251 65 -275 -212 -46 -141 -5 -42 96 143 254 -51 200 -65 2 -94
8097 -94 204 104 -183 -60 7 95 130 151 27 -147 -19 213 212 -121 144 30 111 48 220 36 -30 34 -293 -74
8121 -74 -242 -143 23 -21 -155 83 -46 261 26 -186 150 242 378 -22 -128 37 104 -90 -162 55 16 237
8143 237 -141 201 227 37 -49 13 190 -174 114 -113 50 -98 -141 139 -101 -241 126 -248 68 129 137 -112
8165 -112 -192 -271 -208 5 -121 -32 74 126 16 46 161 -144 344 -349 130 -71 -154 -202 98 40 87 27 -212 100
8189A00P3k9
$$ plain form
8189 100 173 144
8191A44
$$ Imaginary data points
##PAGE= N=2
##DATA TABLE= (X++(I..I)), XYDATA
0@%%%%%%%%%Qj6J6j6J6k3L1l4M2m9N7o8P8r1J04j20J40j59J79k02K28k58K92l26
33a71L63m07M54n05N60o20O88p63Q44r33J035j149J273j415J576j761J977k228
51a182K533k909L382m000M843o074Q051j1736K0904q2958j73888J40077J93432
64I0475M7548j28838j21728q911R8416P9463j0334p0264l1994J8829K8044R121
76a73J4007Q580k5190m3244L047N6302M6170k1647o1368l3232L4410O4917K4435
89F7014m3080n4481n314M2707M0264j12l5292l0007M143K8672K1803m068k5037
102G212k3274M125K9298K0339j3745l1950j3263J8241K5569K550k0378j9412K955
115a1733J7411Q597j2707j1980Q513R870r923j4204O736J7532N72j6814j2493
$$ plain form
0 0 0 0 0 0 0 0 0 0 0 8 -8 8 -8 8 -15 16 -18 24 -25 32 -36 42 -49 55 -65 75 -84 95 -107 121 -137 155 -171
33 -171 192 -215 239 -266 294 -326 362 -401 443 -490 545 -604 669 -746 830 -931 1046 -1182
51 -1182 1351 -1558 1824 -2176 2667 -3407 4644 -7092 13812 -69146 -243034 -102957 90475
64 90475 138023 9185 -112543 -121454 -23038 56425 46091 -24173 -56167 -37338 -9294 -173
76 -173 13834 22414 -2776 -46020 -42973 13329 59499 37852 -23516 -56748 -22338 42579 67014
89 67014 23934 -30547 -35861 6846 47110 46998 11706 -18301 -14158 14514 36317 32249 7212
102 7212 -16062 -11937 17361 37700 23955 -7995 -21258 -3017 22552 25102 4724 -14688 -11733
115 -11733 5678 14275 1568 -10412 -1899 7971 -1952 -16156 -9420 8112 8684 -8130 -20623
128b0623P579K0786O365k0299k1815P323K8770J0427k2105k3489O321K3422P986
141A0648j2599j2060K710R472K373o826m110Q256P810q089j2095M245J4775K580
155G090j4131q931J1172J7484m102k2783o907K1713K0490j0669k6051l170K4898
168F103J5667j8567k3710Q370L0654P147l1254k5192J9995M0280P37m1467k2857
181c4094L0743L8484r850m2965j5399L4176L6952j2524m4689j4981L4616L3863
193C4332j3430l8193q895L0326K3200j5715k8548j712K5131J6799j2910k3280
205a2895k609K0581J4374j0926j8366l44J5292J0395p537j4333l001J2383J0838
218A3852l449j2117n842N420J1210L522q434j0366N61J1564P829n280j4048n033
$$ plain form
128 -20623 -13044 7742 14107 -6192 -28007 -20684 8086 18513 -3592 -27081 -20760 2662 10648
141 10648 -1951 -14011 -11301 -1829 544 -6282 -10392 -2136 5674 -2415 -14510 -10265 4510 7090
155 7090 -7041 -15972 -4800 12684 8582 -14201 -21108 605 21095 10426 -15625 -18795 6103
168 6103 21770 3203 -20507 -12137 18517 25664 -5590 -30782 -10787 29493 30230 -11237 -34094
181 -34094 -3351 35133 25283 -17682 -33081 1095 38047 25523 -19166 -34147 469 34332
193 34332 20902 -17291 -26186 4140 27340 11625 -16923 -18635 6496 23295 10385 -12895
205 -12895 -15504 5077 19451 8525 -9841 -10185 5107 15502 7965 -6368 -9369 3014 13852
218 13852 10403 -1714 -7556 -2136 9074 12596 4162 -6204 -5643 5921 13750 8470 -5578 -10611
232a0611J1691J4582j997j7098j1228R591J9471L076j8858j5325J0592K0138N92
245A4616j8952j2592J1458K0350N43k1764j3742J3553K2546J86k2374j4147J3627
258f692K2677k062k2430j1328J5079J9596j816k2170j2342J5310K1777k859k2561
271i821j0013J5151J8220m588j9855o347J6574J4881q620j8040j780J5733R263
284A0758r003j2985K761J3633K104j2768o373J0369J1506n258j3975r98J4260
297D031O766j1481j1304P619J4570p71j5202o647J1659J4417m730j7768m022J6329
311C466J2490r839j7593k53J7459J0763j0935j6097J377J4572P330q502j1656
324g418R01J1593O259q309j0213J759J0549M608n869q521n63P389N416l409o231
$$ plain form
232 -10611 1080 15662 13665 -3433 -14661 -5070 14401 17477 -1381 -16706 -6114 14024 14616
245 14616 -4336 -16928 -5470 14880 15423 -6341 -20083 -6530 16016 16202 -6172 -20319 -6692
258 -6692 15985 13923 -8507 -19835 -4756 14840 13024 -9146 -21488 -6178 15599 12740 -9821
271 -9821 -19834 -4683 13537 8949 -10906 -17253 -679 14202 5582 -12458 -14238 1495 10758
284 10758 1755 -11230 -8469 5164 7268 -5500 -11873 -1504 10002 4744 -9231 -10229 4031
297 4031 10797 -684 -11988 -4369 10201 9430 -5772 -12419 -760 13657 8927 -8841 -12863 3466
311 3466 15956 6117 -11476 -11729 5730 16493 5558 -10539 -9162 5410 12740 4238 -7418
324 -7418 -6517 5076 11335 3026 -7187 -5428 5121 9729 3860 -4661 -5224 2165 7581 4172 -2059
339b059j536M033N013j07n806m505L454O667K234n287o470n75P761O765m175j0663
355e256l575R724J0297l215j3923o143J1204J3329l073j6143p243J0682J4694
368A1359p91j6464r280J0913J5440j676j6612q319J1405J5152k376j7144q084
381a6477J1939J5281k044j6839r900J2592J7419k396j9376q820J3898J7202k939
394I540j9374q868J4299J7611l926j9360p177J4347J5841m462j7804n574J4285
407f22J2835o088j4754j492J1560P560o224r251R83Q623L431n915m933K613N072
422C398M19l706j995K732J480j707r08J744P54k622j370K282K597p48m017r55
438b622M067L400l269m893L08M829L015l312n233J83N749K636l832m717J233M249
$$ plain form
339 -2059 -3595 438 5451 5344 -462 -4967 -1513 5154 7388 2101 -4369 -4944 2817 9582 5407 -5256
355 -5256 -8831 893 11190 7975 -5948 -12091 -887 12442 9369 -6774 -14017 -3335 11359
368 11359 10568 -5896 -15176 -4263 11177 9501 -7111 -15430 -4025 11127 8751 -8393 -16477
381 -16477 -4538 10743 8699 -8140 -18040 -5448 11971 9575 -9801 -18621 -4723 12479 9540
394 9540 -9834 -18702 -4403 13208 9282 -10078 -17255 -2908 12933 8471 -9333 -14907 -622
407 -622 12213 6125 -8629 -10121 1439 8999 2775 -6476 -5493 3130 6561 646 -4287 -1674 3398
422 3398 3817 111 -1884 848 2328 621 -287 1457 2211 -411 -1781 501 3098 2350 -1667 -2622
438 -2622 1445 4845 1576 -3317 -3009 1820 4835 1523 -3710 -3527 2222 4858 1026 -3691 -2458 1791
454A791J982k476l973N97L506J345j672k345J18J943J165j200j648J152Q85q46
470C24j68L77O46j989p13J227K139o11l232j905L292L621j606n853j925M976N796
487D396j926p299l663O397P342j945q413l666O162P483j568r022l832O790Q023
502E259j524r349m612O888R651j514j0915n030Q360J0526j914j1826n710Q873
516b837J2394k424j3711n930J0393J2303k960j3940n851J0886J2259l291j4072
529f781m198R851J0552k716j1286m427Q051Q870k473q749l127N479O553p70o014
544a185l131L170N294k21l488l984J326N087K367l187n231K28N133L554k488n943
560b699j602N740N412l079o812k447N884O250j836p869k952O188O440k102p136
$$ plain form
454 1791 3773 1297 -2676 -2079 1427 2772 1100 -1245 -1127 816 1981 781 -867 285 1170 324
470 324 156 533 1179 -810 -1523 -296 1843 1232 -2000 -3905 -613 3008 1402 -4451 -6376 -1400 4396
487 4396 2470 -4829 -8492 -2095 5247 3302 -5111 -8777 -2615 4868 3300 -5722 -9554 -2764 5259
502 5259 3735 -5614 -10226 -3338 6313 4799 -6116 -11146 -2786 7740 5826 -6000 -11710 -2837
516 -2837 9557 7133 -6578 -12508 -2115 10188 7228 -6712 -12563 -1677 10582 7291 -6781
529 -6781 -10979 -1128 9424 6708 -4578 -9005 -954 7916 5443 -3306 -6433 -954 5599 4829 -1185
544 -1185 -4316 -1146 4148 3927 439 -3545 -2219 2868 5235 2048 -3183 -2955 2178 5732 3244 -2699
560 -2699 -4301 1439 6851 3772 -3040 -5487 397 6647 4811 -3058 -6010 178 6618 4516 -2620
575b620l240N303O678j570p283k944N193N553j410n805l026M136M910j400n136
590b661j378L910L257j763m200l18K845K478j500k431k58J948R91q07j429MJ378
607F6M98j345j03P11l14k25l48O29P06k1j121q56J065J011O67j450j549P34K346
626A101L34k536k014J755L046M53l222l274K112N277N89n396l342L369N917p05
642C464o408k866N132O330j671p553k462N637O145j636p146k606N518N970j953
657C895o483k153M397N342j023n442k074K899M415J65l293l212J332M217J713
672D695l385l967J150M676K146l587m654L84N518K950l570n703j6N845L963l645
688B800o635l62O582M601m174p151j078O722M900k678p737j649O664N322k847
$$ plain form
575 -2620 -5860 -557 6121 4551 -2732 -5676 -483 5070 3660 -2145 -5171 -1035 3875 2475 -2661
590 -2661 -4039 -129 3128 1365 -2835 -3153 -308 2170 670 -1761 -2019 -71 920 113 -1316 -1312 66
607 66 564 -781 -884 -173 -487 -712 -1060 -431 275 254 -867 -1723 -658 353 1020 -430 -1979 -1245 1101
626 1101 1435 -1101 -3115 -1360 1686 2139 -1083 -4357 -2245 3032 3621 -1775 -5117 -1748 4169 3464
642 3464 -2944 -5810 -678 5652 3981 -3572 -6034 -397 5748 4112 -3034 -5640 -122 5848 3895
657 3895 -2588 -4741 -344 4998 3975 -1467 -3541 -642 3773 3938 645 -2567 -1235 2982 4695
672 4695 1310 -2657 -1507 3169 5315 1728 -2926 -2542 2976 5926 2356 -3347 -3363 2482 6445 2800
688 2800 -3835 -4197 2385 6986 2812 -4339 -5417 1305 6205 3527 -4210 -5859 805 6127 3280
703C280p368j967O213N592k713o962j730N309M839j840n986k025M515M716k155
718A718n363j031L888M225j234m915j887L439L800r73l841j850K353L645J76l383
734a233l058K779L468O20l228k855J584L866R09l517k167J428L401j68k601j905
750b677J582K748k02k630m87J351J325n24p50P1M48j58o01N18M59Nj110j69J088
769B87Q33o28j560j32J963J170j504j673N59J825P05j177j088n28J606R64n90
786A032j291m83O34J704K64j700j259P43J586P81j178k031J86K288J390j871k749
803a954L11K866K043k761l154K36L892K069k537l786p7L848K533k346m313k51
819c381M471K924k178n098q95M377L847k335n010r26M377L868k093m722j390M192
$$ plain form
703 3280 -4088 -6055 158 5750 3037 -3925 -5655 -346 4493 2653 -3333 -5358 -843 3873 1718
718 1718 -3645 -4676 -788 3437 2203 -2712 -4599 -1160 2640 1667 -2174 -4024 -1671 1974 2150 -1233
734 -1233 -4291 -1512 1956 2576 -652 -3507 -1923 1943 2852 -665 -2832 -1404 1997 1829 -772 -2677
750 -2677 -1095 1653 1451 -1179 -1666 -315 1010 486 -264 -193 255 97 -504 14 473 478 -632 -801 287
769 287 1120 492 -1068 -1200 763 1933 429 -1244 -685 1140 1845 668 -420 -948 658 1622 1032
786 1032 -259 -742 -108 1596 1860 160 -1099 -356 1230 2011 833 -1198 -1012 1276 2666 795 -1954
803 -1954 -1643 1223 3266 505 -2649 -2413 1479 3548 1011 -2775 -2852 996 3529 1183 -3130 -3381
819 -3381 1090 4014 1836 -3262 -4157 220 4067 1732 -3278 -4204 173 4041 1948 -2774 -4164 28
835B8L720j909m518j150L546L429j077m156j915L411L207n10m108j947K899L636
851B586M7m297k510K674M243K45l929l224J926M581R28m292l396K550M832K65
867C229m218l436K360M902M81l938l115K049L892P64l685k268J728L330K38k331
883a8j926J229K038M59j517j641P59J776O42j067j495n00J933J323q37j974k23
900a039J438J503n50j846q64J428J699j039j278m91J450J094n68j561k70J192
916B98P59m89n86l58M38P01l93n04P0K44K9k35L32j5J1o32j62Q07M07j90r76o77
938a121J510O89m63j761j01J452J212j239j828O11J498J215j026k003k74K057
954D28J229j226k332K70J770J193r85j790l69J808J476r26j780n37J114K246n02
$$ plain form
835 28 3748 1839 -2679 -3829 -283 3146 2069 -2087 -4002 -591 2616 2106 -2002 -3949 -1050 2586
851 2586 2633 -1664 -4174 -1500 2743 2988 -941 -4165 -2239 2342 3270 -1022 -4418 -1868 2964 3229
867 3229 -989 -4425 -2065 2837 3318 -620 -3735 -1686 2206 2970 -715 -2983 -1255 2075 2313 -18
883 -18 -1944 -715 1323 1782 265 -1376 -617 1159 1801 734 -761 -1261 672 1995 1158 -816 -1039
900 -1039 399 1902 1352 -494 -1358 70 1769 730 -548 -1039 411 1505 937 -624 -894 298
916 298 1057 568 -18 -376 62 763 370 -134 -64 180 209 -26 306 291 302 -330 -492 315 722 532 -444 -1121
938 -1121 389 1078 615 -1146 -1247 205 1417 178 -1650 -1039 459 1674 648 -1355 -1629 428
954 428 1657 431 -1901 -1631 139 1332 347 -1443 -1812 -4 1472 546 -1234 -1771 -657 1589 1087
971A087k167q35J251K318l19k293j653J472L206L5k964k129J645L456L89l529
987a030k159J774M090j5l728k283K216L721J46l452k468J686L593M63l112j951
1003b509J492K960M80k540k004J022K487Q40j757k392K31K762J577j947k385J17
1019a566K645J506j697k831J9K729J816j585k788m52K655K040j096k705q95K863
1035F58J442r30k460l26J698J788o59k248n85J788J488m39j849n57J136J426m21
1052I50j531m24R79J370o30o35j173R39R35Kq60p48Q78J69M7l94m31K24L04J13
1072H4j31l22K19J76L4j19r2j69j99P99m8p60j34L76L26j16k97L67L05n70J41
1093a30M24l21L16n61k1M83M39p31q16O73J018P0j152j023R36J733Q7j626j191
$$ plain form
971 1087 -1080 -1915 -664 1654 1335 -958 -2611 -1139 2067 2102 -862 -2991 -1346 2110 2499 -1030
987 -1030 -3189 -1415 2675 2660 -1068 -3351 -1135 2586 2732 -720 -3188 -1502 2091 2554 -558 -2509
1003 -2509 -1017 1943 2423 -117 -2121 -1099 1388 2228 471 -1921 -1690 1072 2649 702 -1683 -1566
1019 -1566 1079 2585 888 -1943 -1924 805 2621 1036 -1752 -2204 451 2491 1395 -1310 -2205 658
1035 658 2100 1170 -1290 -1616 82 1870 1211 -1037 -1622 166 1654 1215 -634 -1191 -55 1371 950
1052 950 -581 -1005 -26 1344 714 79 -1094 -155 780 782 -78 -826 52 221 268 -126 -557 -333 -29 84
1072 84 -47 -369 -150 26 60 -59 -151 -320 -519 280 232 -528 -662 -286 40 -76 -373 -6 299 -271 -130
1093 -130 294 -27 289 -272 -293 190 629 -102 -918 -245 773 843 -309 -1332 -396 1337 1424 -202 -1393
1112a393R67J852O0j616j608J348J760J07j845j172J163J953k75j666r33J037
1128b61J055Q07j315j354P71Q59Q18q15j404%J598P66j142j430j42K043J169j154
1146H69k245K01J829J596j255k058l97J991J801j016k730m56K547J368j248k036
1162a239n07K269J570j070k377m13J998J561p52j961p98J832J570o13j972m85
1178a387J387J377r0j927o92J164J342k62j497r64J178J478m97j175p86J126Q69
1195F44K52j186r06O84J108L82r33j062K15J233M57p43j378Q21R68M75j214n66
1213g49K15J577k20r35o50J06J001K90o40l64R1M26N56p80nK09l11M86j09p1j94
1234g1q5L8L67P5l36n01L67J71O04m54o05M34LJ82Q8k49J4r3M37O4n85m8k2N04
$$ plain form
1112 -1393 -426 1426 1486 -130 -1738 -390 1370 1477 -368 -1540 -377 1576 1301 -365 -1298 -261
1128 -261 794 1601 286 -1068 -297 562 1380 565 -839 -839 759 1525 383 -1047 -1189 854 2023 869
1146 869 -1376 -1175 654 2250 995 -1063 -1460 531 2332 1316 -1414 -1870 677 2045 797 -1239
1162 -1239 -1746 523 2093 1023 -1354 -1767 231 1792 1040 -921 -1719 113 1683 1070 -902 -1387
1178 -1387 0 1377 1287 -640 -1332 -168 1174 912 -585 -1549 -371 1107 610 -565 -1351 -225 644
1195 644 896 -290 -1196 -512 596 978 45 -1017 -802 431 888 145 -1233 -412 556 1031 -183 -749
1213 -749 -534 1043 823 -112 -762 -656 345 635 -5 -369 -278 148 704 -76 -81 128 -183 303 194 123 -71
1234 -71 -156 -118 249 324 -12 -513 -146 25 629 175 -430 4 7 189 277 28 42 -51 386 450 -135 -183 -205 299
1258B99J04n7p41P4Q75p4O6p98j90P19O83n99p58J6P39O67m97j249P4O62J420
1279A435r67j694M23J002J001q08j260j89R13J439p58j230p63J349J147l25j511
1296g96m42J075R21k18j405m56J527P28j83j458m84J054J205k86j417l84Q29Q72
1314F82L30j304r49P76J084M00j444o41M82J071N62j040j303P77J422R9j170p94
1332i60O2J691L69j184r58M99J482o1r63r39L65J289J26j055l59L6J087J69p82
1351h6o03J11Q15M66n92o04k26P17J034o32p96j65Q18O15m10p93o39R44O65j31
1371E08r31k40J177K79n74l57n87P07N25n3o93j4N3L91R5l75j10J60M09k08k10
1392d8J96r7k7q6KJ93Kj25j83j01K31J66j53J4R6L29j86p49J41K44N74k10m55
$$ plain form
1258 299 403 346 -395 -321 554 480 546 -252 -442 277 960 361 -397 -381 358 1025 528 -721 -647 15 1435
1279 1435 468 -1226 -803 199 1200 392 -868 -1057 -144 1295 537 -693 -1456 -107 1040 715 -796
1296 -796 -1238 -163 758 540 -865 -1321 206 934 751 -707 -1191 -137 1068 782 -635 -1019 -190 682
1314 682 1012 -292 -1241 -465 619 1019 -425 -1066 -584 487 1049 9 -1294 -517 905 1004 -166 -960
1332 -960 -898 793 1162 -22 -980 -481 1001 940 -23 -962 -597 692 818 -237 -596 -560 527 696 -86
1351 -86 -689 -578 237 703 111 -493 -719 -2 1032 400 -396 -561 257 872 462 -331 -970 -26 639 508
1371 508 -423 -663 514 793 219 -138 -725 -18 507 454 -239 -253 -200 191 286 -89 -199 -39 370 162 -48
1392 -48 148 51 24 -62 -60 133 135 10 -173 -274 -43 123 -30 -16 80 409 223 -526 -385 -141 433 223 -232
1415b32m03L10L56j23k40k59Q41J32m40j41l46Q15J55n7r49J95N23J16nn52l09
1436f13N62O52l35m88k77J88O26K11n01k92m44J285P2o61r96N12J132O6j107o20
1456a028O26R40K76j347l80N27R98K28p82j004M40J116K22o02q61M8J124L38q37
1475D2n74J58M24Q57m09r85k19N72N95m3o46n76Q23Q77m75r66j99P59J068l38
1495G45p92o54Q47N87l65q74j07O04O90o42l58k08K51Q74k71o10K7K60O17l17
1515C04p31m95P87P77l75l79j92L30L84j60k60p64L98N87L8j18m78N10j73K93
1535B83q4j79k80K44K58k7l39R0K49k97L34k63p0L79k78J66l30j99M46k11P4l2
1557f6k32L35J51k9k8J36l30J0j74K48K16l99j65R3N85P8m51m70L97N20q4l09
$$ plain form
1415 -232 -635 -325 31 -92 -332 -591 250 382 -58 -199 -545 270 425 368 -581 -386 137 253 248 -304 -613
1436 -613 -51 601 266 -222 -499 -311 315 526 25 -267 -711 574 646 -15 -1011 -499 633 699 -408 -1028
1456 -1028 -402 538 814 -533 -913 -386 612 840 58 -946 -506 610 832 230 -631 -583 541 879 42
1475 42 -532 -374 50 907 498 -487 -706 -134 461 418 -228 -804 19 896 421 -545 -744 15 1083 745
1495 745 -47 -701 146 733 368 -506 -613 -9 681 39 -319 -527 -276 598 327 -283 -256 4 621 304
1515 304 -427 -922 -135 642 267 -112 -304 26 410 250 -10 -774 -376 211 249 131 -347 163 -10 283
1535 283 199 20 -260 -16 242 215 -124 -34 215 -82 252 -11 -81 298 20 186 -144 -343 103 -108 -34 -66
1557 -66 -298 37 188 159 131 267 -63 -53 -227 21 237 -162 -327 -234 351 429 -22 -492 -95 425 341 32
1579C2m31L30K22K89o38m6M9O24R4o68p9m7N57l0M9p67L17K85J92j29l73m56J145
1602E21N39m81q14L6L46N00n84l41k29O74K40j06n80l23L90R64l31j012j74Q68
1622A03M33l38m15l01N53L30P8p34k41N62M37j6n06n02N03P49k83n87m09K65P11
1643C92J65j092R6O77J91ln43l69L70K79L77m93l69M91P3Q2k39p25K34N86O9k8
1665B21p37L3Q64M8m99Qm85O36L73k98n38K47J1N12j71o01J88L68J09m21p0n0
1687b52M69L5k38m28L41K49P1j46L01k18l52O00k93J91o13J39K30K75k64k21J73
1708D9j08K51j07j26k51M65j76J67l09L15J09l81J33Q5L52p06K87J92l9j89N1
1729F4K20l05J76r3k32k40L47N4K11j18k82L04J90q9n45J11J56K49j16k90j01
$$ plain form
1579 32 -399 -69 153 442 -196 -242 -193 431 525 -143 -222 -269 288 258 307 -460 -143 142 334 205 -168 -624 521
1602 521 1060 579 -235 -199 147 647 63 -278 -507 167 407 301 -279 -602 -212 752 421 -591 -765 103
1622 103 536 198 -217 -518 35 365 443 -291 -532 30 467 451 -55 -557 -54 695 412 -175 -584 -319 392
1643 392 557 -535 -439 238 429 426 -117 -486 -116 163 540 47 -322 169 242 324 85 -640 -406 180 249 221
1665 221 -516 -483 381 429 -70 -62 -547 89 462 164 -374 -127 -116 396 225 -376 -188 180 289 -132 -202 -252
1687 -252 217 252 14 -414 -73 176 247 101 402 184 -168 432 139 330 -283 -144 86 361 97 -124 49
1708 49 -59 192 85 -41 -292 173 -3 164 -145 170 279 -102 31 116 468 -238 49 241 202 13 64
1729 64 284 -21 155 62 -170 -410 -63 -9 202 84 -198 106 296 207 -338 -227 -71 178 62 -228 -329
1750c29L37M43k57k83l74N70K26m8o22J3L64M92O5p74K5K01L04k19n9l19P0M54
1772B80M7m41n95M27Q05j37l92k93j62P33j26j84l64p5P58K51m62k73j74L97M72
1793D92k64o36k65R19K22l18p86P58K76O6l43m21L55N0N50q40R8j9J95K15j18
1814A86l93q3L35K5M96j274K21M56M12j07n11PK09J20Km59L05j42N49q8l98o3
1836a95R3J34K87n16J52k69M74M7n00J40J10K32j11L1j67R0L6K5J59k84R8J93
1858B59j04p8j51m3K97j51o3J61J4k54M7n2R0J93R2m81L38j43J27m3k75K35j18
1881a03L59j27l78J10O08n80j19L4L88j44j31l8O2L74j16j09Q0n31N29K9j99L3
1903C1o1RQk5J82m77J40N38j86j49k26J88L16N8l86o26K07O28ol49j59J09L60
$$ plain form
1750 -329 8 451 194 -89 -463 107 333 285 -337 -324 40 532 597 -177 -152 49 353 134 75 -244 -174 280
1772 280 327 -114 -709 -282 523 386 -6 -299 -461 272 146 -38 -402 -477 281 532 70 -203 -377 20 492
1793 492 228 -408 -673 246 468 150 -636 122 398 464 121 -300 55 105 655 -185 -87 -106 89 304 186
1814 186 -207 -290 45 70 566 -708 -487 -31 381 274 -237 -230 -21 99 101 -358 -53 -195 354 266 -132 -195
1836 -195 -102 32 319 -197 -45 -314 160 207 -293 -153 -43 189 78 109 -58 32 68 93 252 -32 66 259
1858 259 155 77 -74 -117 180 29 -34 127 141 -113 -66 -118 -28 165 257 -224 114 -29 98 55 -220 15 -103
1881 -103 256 129 -249 -139 469 -111 -230 -196 192 48 -83 -121 -59 315 199 90 170 -361 168 197 -2 31
1903 31 -30 -21 -13 -38 144 -333 -193 345 159 10 -216 -28 288 346 -40 -666 -459 169 163 -186 -345 -236 124
1926A24M55q50J13k06P29n8m11j63M23L4L7l05L5j31K28R7j74j29r5K31N60k51
1948B93l49r7J36N86k52r65L51M41r0R8Q7l27J2L78kn49K1K17M32l06l22j68K81
1971i4M36o8l30l32O08K0o5m66J11K26J1J65n05kL41J05J19l62k56J63N06m28
1993i7L29j95l9J37N2N5l48K45n7J7m9m0k46L50p3J23j14j96L8K24r4k99L32o5
2017a0K00k11p8j27K31P0o1K29l05m9L8j28L16l05M50j50j42K29J34k29k67N1
2039a14L39l11L28l29P5p1K72k56j72K31J52q7l30K31k11kN59k35m03J90K52J96
2061C04k64l34L22j59L10j29k46K15J35J01k1k45j10L66J65n67j30pL42J89j30
2082A07l50J17J49K68o3k98K2j09K40p4k23l3K25N21l89J8k93p8N83m4m58j7K05
$$ plain form
1926 124 579 -271 -158 -364 365 307 -104 -267 156 190 227 -78 -43 -174 54 151 -23 -152 -247 -16 544 293
1948 293 -56 -153 -17 569 317 -648 -297 144 54 152 239 -88 -76 302 300 -249 -228 -11 421 115 -207 -375 -94
1971 -94 342 274 -56 -388 220 240 175 -291 -180 46 57 222 -283 -285 56 161 280 -82 -338 -175 331 -97
1993 -97 232 37 -2 135 187 242 -106 139 82 99 50 10 -236 114 41 164 50 -146 -108 116 22 -277 55 -10
2017 -10 190 -21 -99 -226 5 75 14 243 -62 -111 -73 -201 115 -190 260 110 -32 197 331 102 -165 -114
2039 -114 225 -86 242 -87 -12 -83 189 -67 -239 -8 144 57 -273 -42 -253 -255 304 69 -334 -144 108 304
2061 304 40 -294 28 -131 179 50 -196 19 154 255 234 -11 -121 245 410 -157 -287 -294 48 237 107
2082 107 -243 -126 23 291 228 -70 -48 -157 83 9 -214 -247 -22 499 110 128 -165 -243 340 296 -162 -179 26
2105B6L35k07m0m46M20J06j80J00m06K38M4L05n41L54o7K18j16k24r8J1R2O4N8
2128D6l09J31K50K34k06k31m3n4M93r6l67k0K49K40l63j00J84j54N6Mk04Q1N47
2151C68L1O4o14M9L37j33K5k41M11j68Nk40Q9r3K43l15L60j57k73J66N7K9J73
2174A73m54L67J33j96J38k64L56m97L05J51l04j51L14Kj48j72M82l45J71q0J3
2195fK1j91m5M37k33J56l05J04j49R9J43J2j04j32M28n79R6K35J52p3k94K55K94
2218C21l10l14J62O8k37N12J40m96j43j0K03N12p7n46L37j04j21J79j08k09M41
2239B00j89p0l5j22K28Q8N0k73j45R1K03J14K41n70Mj4M33j89k02j40J68K75j01
2262D5m56K43M14Rj53m28J06J73M15m44j39O1J60K48j00l59L67p7J52j77m08J77
$$ plain form
2105 26 361 154 114 -332 88 194 14 114 -292 -54 -10 295 -246 108 41 259 143 -81 -179 -168 -76 -12 46
2128 46 -263 -132 118 352 146 -85 -128 -182 311 215 -152 -172 77 317 -46 -146 38 -116 -60 -56 -260 -179 368
2151 368 399 463 -151 -102 235 102 127 -114 297 129 134 -106 -17 -110 133 -182 178 21 -252 -86 -29 0 173
2174 173 -281 86 219 23 161 -103 253 -244 61 212 -92 -243 71 73 -75 -247 235 -110 61 -19 -6
2195 -6 15 -176 -221 216 -17 139 -166 -62 -211 -112 31 43 -61 -193 235 -344 -248 -13 139 66 -228 27 321
2218 321 11 -303 -141 -73 -310 202 342 -154 -297 -307 -104 408 331 -215 122 18 -103 76 -32 -241 200
2239 200 11 -59 -94 -216 12 100 150 -123 -268 -177 26 140 381 -189 -185 -199 234 45 -157 -297 -129 146 45
2262 45 -411 -168 246 255 102 -326 -220 -47 368 -76 -215 -154 6 254 154 -205 162 85 237 60 -348 -171
2284a71P3L42j55L3k63M11j95k71P7p9K95l26L78j98r5J09K48m54L40m54M96l11
2306a70J54j41j16j04M29j1j3J24k40K28j55K68l74K95k4p0jk18M96j62k24K31
2328B02j05j91k10N69k05k6L7m5r5L89m16J56N6k36J30L7R2m9l5K6n5l8J68j81
2352b5K60k38r4K77j51P0m6l25M14k43K91Ol0l09N5l3K69j93K56j56j44M2J47
2375A00l4Np5M0K06q3k0k45K81l6M7n54J99n5K89j68k85L76L92r6k07j83p3N2
2399a27o0K80j44L16m57L14q5p7J6J17R5l31J9o9Q2J79J95o73M18k2J13pk25j36
2423b69K75j00J7r9JJ95K05n4k01K32k52J21j19j93L40J52j36O2k03J32l59K84
2445C1N6J12k97J23L34k60Q1k88K83k73O7Q0l29M98J3j46N1k96J33P4K61n58P2
$$ plain form
2284 -171 -98 244 89 122 -141 270 75 -196 -119 -198 97 -229 149 -49 -144 -35 213 -241 99 -355 141 -170
2306 -170 -16 -157 -273 -377 52 41 28 152 -88 140 -15 253 -121 174 150 80 79 -139 357 195 -29 202
2328 202 97 -94 -304 265 60 34 71 26 -69 320 -96 60 116 -120 10 47 139 90 55 81 26 -12 156 -25
2352 -25 235 -3 -97 180 29 99 53 -272 142 -101 190 196 166 -143 -88 -121 148 -45 211 55 -89 -47 100
2375 100 66 71 -4 36 242 159 139 -106 175 139 186 -368 -169 -224 65 -103 -388 -12 380 284 77 -106 -179 -127
2399 -127 -187 93 -51 265 -192 122 37 -40 -24 93 188 -143 -124 -193 -111 68 263 -410 8 -14 99 92 -133 -269
2423 -269 6 -94 -77 -176 -175 20 225 171 -30 202 -50 71 -48 -241 99 251 115 177 -26 106 -253 31
2445 31 87 199 -98 25 359 99 180 -108 175 -98 -31 49 -280 218 231 85 136 -160 -27 47 308 -250 -178
2468a78K69k14L54j75k38j89O02j88n0j36m37N36K82l25K32kn74L10M2p7K15Q2
2490A41k7j98K20l1j54k1M8R1O1j07j70q1M34j08j72j19j04M10j72K15l31L03
2512A28p7L0M9j80J80k18K45j48J6l67L05k2J88k46p4R0K43j82J91k41j31N56
2534C35k52P7o9K08k94K18k47Q4J32K80m22l0l7N2L7Q5m31L5K19L1j1k02M3K56
2558I7M3k16Q7M0r6K56j94m59L63m0O6K88l62K19m7K05l12o9o6J01M1K75j47R2
2582A65k18L7Q9q1p8J43J6J5L10m98j46L90M7k51j57Q9L75j40l74L73k66K00J49
2605A89J70o74k6M60m51J94j56k1M19K8j66j20o0K50l7O9m9l20J77R7k13k49O13
2628A24j40l3K06m7k2k99K41Kj58K03j39J10N6j54r2J85P0j50j7L19m21l4J53
$$ plain form
2468 -178 91 -123 231 56 -182 -371 231 43 -7 -143 -580 -44 238 -87 145 143 -431 -121 -79 -156 59 141
2490 141 114 -84 136 105 -49 -70 -22 69 130 23 -147 -228 206 98 -74 -193 -297 113 -59 156 -175 128
2512 128 51 81 130 -50 130 -88 157 9 25 -342 -37 -59 129 -117 -191 -101 142 -40 151 -90 -221 335
2534 335 83 160 91 299 5 223 -24 60 192 472 50 20 -17 35 72 157 -274 -239 -20 11 0 -202 -159 97
2558 97 140 -76 11 51 -45 211 17 -442 -79 -119 -53 235 -127 92 45 250 -62 -131 -197 -96 -55 220 73 165
2582 165 -53 -16 73 -8 -86 57 73 88 398 -100 -246 144 191 -60 -217 -128 247 107 -267 106 -160 40 189
2605 189 359 -315 -341 119 -332 -138 -294 -315 104 132 -34 -154 -214 36 -1 68 19 -301 -124 -27 -240 -489 124
2628 124 -16 -49 157 110 88 -211 30 32 -126 77 -62 48 104 -50 -142 43 113 -37 -54 265 -156 -190 -37
2651c7K10j10l51M11k05N3J32l2m8m19L83N2J15J8k4k76J9K50m15J16N7K50m65
2674c16K82j59J02p2L53l38K97J04j08J43l76Q6l94N83p1l19PM9L90j6j58jQ1
2697A49j37j29L69k35k94Q6K78k5k24R2q9P7J01O9o0J10R0K3m19J83r8J61j25
2720d7nk00P1J83j72o5k27L89K40Km81M4J71J36l2j79L64r5K95l84R8k63J64q3
2744g6N05o58M20R3J22k14j1l73M06j87L24m5n30K18j17K84j95j35j2J89R9p3
2766C4K7k27kJ47J39O0k90J48j90M5j36K06P3j41j5Q9k21L23J57o8j05l92K62
2789g7q3K07r8K5k27M90k82M3j05J20j29J41oj82L08r0p1J04L37o57Q8L2J71r9
2813d0K54j13j71J60k25K76M7j20j70J92j52J39k92K44Lm8J55J74l97jJ40m6j78
$$ plain form
2651 -37 173 63 -288 123 -82 -29 103 71 23 -396 -13 39 154 172 148 -128 -109 141 -274 -158 -101 149 -316
2674 -316 -34 -193 -91 -163 190 -148 149 253 145 288 -88 -2 -396 187 116 -203 -196 -147 243 227 69 68 149
2697 149 12 -117 252 17 -277 -191 87 62 -162 -70 -159 -82 19 88 28 138 228 251 -168 15 -83 78 -47
2720 -47 -52 -252 -181 2 -170 -235 -462 -73 167 169 -312 -268 -97 39 7 -172 192 97 392 8 106 -157 7 -76
2744 -76 429 -229 191 284 406 192 181 -192 214 27 351 306 -224 -6 -123 161 -34 -169 -181 8 107 34
2766 34 61 -166 -168 -21 118 178 -112 36 -154 -109 -245 -39 34 -107 -122 -33 -254 69 226 158 53 -339 -77
2789 -77 -160 47 -51 -26 -253 237 -45 -2 -107 13 -116 25 19 -163 145 55 -16 88 425 -232 -144 -112 59 -40
2813 -40 214 101 -70 90 -135 141 188 68 -102 90 -62 77 -215 29 32 -16 139 313 -84 -85 55 9 -169
2836a69P1k32L51j6k67L33j18j16N7jJ68j30l7L2j32J5R0J29o7j56J79L10k66
2859B8l57M9L61k45J50J51l02J3K53p4J9k75J73J21M8rl41J51L02M5m38Q8k23
2882c12K27n4K40k25J57k05J82o4K76j82J86j49k37M12q1R9j15J21j94j91r5M19
2904B15l05j13J41j57K36J84l23J07R0O1L8j24j19j9K38j00q5q5l5K56r6k00j11
2927c06K26j62L26m29m2N31j71K77k11k22K2K00K40l53j1P4r0J53O8k7k30K78
2949A41O6k28n6k1J27K75l17j13K08p1n0m9j37K09J34j45O7l5l2m0k4L2j6R1J9
2974C5J64j67j98J94p4kj03N7K14k08J89j42Q2l38J05K40O8O6l84N08j69l22O1
2997a24K58P5j41J3K3k8j41K4J99k8pJ7j41j59K33k27R3K05j5l55K79R1k22p2
$$ plain form
2836 -169 -98 -330 21 5 -262 71 -47 -163 -106 -107 61 -69 -106 -74 -206 -191 -101 28 -39 -195 -16 294 28
2859 28 -329 -280 81 -164 -14 137 -165 -152 101 27 46 -229 -56 65 113 104 -237 -86 216 261 -177 -89 -312
2882 -312 -85 -139 101 -124 33 -172 10 -54 222 40 226 77 -160 252 171 270 155 276 82 -109 -204 215
2904 215 -90 -203 -62 -219 17 201 -122 -15 75 136 174 50 -69 -88 150 50 -35 -120 -155 101 5 -195 -306
2927 -306 -80 -242 84 -345 -387 144 -27 250 39 -183 -161 39 279 -74 -85 -11 -101 52 120 93 -137 141
2949 141 207 -21 -77 -98 29 304 -13 -126 82 11 -39 -88 -225 -16 118 -27 40 5 -27 -67 -91 -59 -75 16 35
2974 35 199 32 -166 28 -46 -48 -151 -94 120 -88 101 -41 41 -297 -192 48 116 182 -202 306 137 -185 -124
2997 -124 134 209 68 81 104 76 -65 -41 158 130 123 140 -1 -160 73 -154 -61 144 129 -226 53 144 -78 -150
3021a50J21J9j0J5m8j62K50M1L6n00L59l1p5M16p09M28p0N6k26K94l1Q4J77m15
3045a31j41J93n9K20l54K97o5N4P8j54m6J28j95L18m19L01k7J00k04l0L20j6j04
3068F4j27J20k09J69k4L20m03O2J53q3k88K07l15J08K60J14O7j89k9k0p9j01m0
3091b63L21l3k02Q0K8k23K82l17N41j86J01q3L31k82m9K5j07k55L35m5j20q7J00
3114a08K71J2l08J62R1J00K12m57kL8q4ML11j77l29M84l12k4K01j47J65k93K36
3137D6N3m5J24k76J32N5q9K65l07J16Q5j11K6j4j25M2J16m58L38L08k29J72k47
3160b3N4J6k38J08K92m63K74P6j92J34J01k01jJ7m8J90K1O1r6l6K15j97k69q5
3184b90J93o1L23l71M16j64l06N24l74k89N04qk16N9K73l39K43K41k39k30K01
$$ plain form
3021 -150 -29 -10 -20 -5 -53 -215 35 76 112 -388 -29 -60 -135 281 -428 0 -70 -14 -240 54 23 107 284 -131
3045 -131 -272 -79 -138 82 -272 25 -40 14 92 -62 -108 20 -175 143 -276 25 -2 98 -106 -136 184 168 64
3068 64 -63 57 -152 17 -7 313 -90 -28 125 42 -246 -39 -354 -246 14 128 195 6 -23 -43 -122 -223 -263
3091 -263 58 25 -177 -97 -69 -292 -10 -327 214 28 129 46 377 95 46 71 -36 -291 44 -1 -121 -208 -108
3114 -108 163 175 -133 29 120 220 432 -25 -27 11 -73 -69 242 65 -264 220 -92 -116 85 -62 103 -190 46
3137 46 99 54 178 -98 34 89 0 265 -42 74 159 48 74 60 -65 -23 93 -365 -27 281 52 224 -23
3160 -23 31 47 -191 -83 209 -254 20 96 -96 38 139 -62 -63 -46 -94 96 117 178 82 46 261 64 -205 -290
3184 -290 -97 -158 165 -206 210 46 -260 264 -110 -399 105 97 -119 -60 213 -126 117 358 119 -111 90
3205I0M4j97J80l01NK54L3J48j01l2k55l1j52L89QJ32j3k17j8k24J94k86M87K
3229A39k45J05q1K94k59n5L1j3J5k60K09QlN2K5j00j94M34k05L57j26K1k57j37
3253b45K96N1l82K21K37K24k46k32jK8j41P0L49k86R8K3K05l80R5L16k93J44j18
3276C3r3J51l27J87J37J2R9k06L77l29L0j08N5J0J89k01J58l52K03R8p2K6J04
3299A81n8k65J1K7R9M4J87k99J31m8k75K18j0j2L53o12J33L33q9o8O1p3J7R1j37
3324f0L42p8l54N1K18O6l39J62J03k14L4m5M0j31K43L0N8J66l57nJ95P3l48RP6
3349f5J10K12k09Pr1J08m3oj30J60q6K01p02P09k28l5n7M90j93j93r5K69p2KP2
3374A35j42P3Mk04K3j1P2L00p4j20n1j96L13J14l71J32k02K69j47j10J36M00j10
$$ plain form
3205 90 134 -63 117 -184 -179 75 108 256 155 123 -132 -163 -315 74 82 214 201 -16 -34 -258 -64 -350 137 139
3229 139 -106 -1 -82 212 -47 -102 -71 -84 -69 -329 -120 -112 -115 -63 -38 -138 -332 102 -103 254 128 149 -108 -245
3253 -245 51 102 -280 -59 178 402 156 -76 -77 -49 -190 -120 229 -57 41 64 269 -111 -16 300 7 151 33
3276 33 -60 91 -236 -49 88 100 199 -7 370 41 71 -37 18 28 217 16 174 -178 25 123 51 77 181
3299 181 123 -142 -131 -104 -5 39 226 -73 58 10 -265 -47 -57 -69 284 -328 -195 138 49 -19 42 -31 -14 77 -60
3324 -60 282 204 -150 -99 119 185 -154 8 111 -103 -69 -114 -74 -205 38 68 126 292 -65 -70 125 198 -150 -141 -65
3349 -65 45 257 48 55 -36 72 29 23 -107 53 -33 168 -534 175 -53 -88 -145 345 152 -41 -136 133 61 63 135
3374 135 -7 66 70 -134 -111 -122 -50 250 176 56 5 -191 122 236 -135 -3 -205 64 -83 -193 -57 343 233
3397B33l45J54N5K5l12Q5j43L05O7l26K65k21L96l38M3k07J93l9Q1j40J41R4j06
3420d0J55P9k52L3K9p6K4O5q1J92j76L00k36J69o9m69L41k0j19K05L1o2P6J73
3444B72m04J91K2J79l38J13L03j57j89qK32j42m64K42J78k18r8L71j74J87M2o5
3466G5K02l97J1P1K90l63j75J33J6N46o11J81L3j86J46j32L09q0J9N5J17j18k21
3489g9J25J16j59j21K91l94L6J3jj50L28J37j54j4K25k94J36j10j42K79k83J93
$$ plain form
3397 233 -112 42 97 122 -190 -105 -248 57 124 -202 63 -158 238 -100 -57 -264 -71 -110 -29 -169 -28 66 -40
3420 -40 115 194 -58 -25 4 -72 -48 17 -64 128 -48 252 16 185 116 -353 -12 -32 -151 54 85 23 99 272
3444 272 -132 59 81 260 -78 35 338 181 -8 -16 216 74 -390 -148 30 -188 -286 85 -89 98 140 75
3466 75 277 -120 -109 -38 252 -111 -286 -153 -137 409 -202 -21 12 -174 -28 -160 149 69 88 143 260 142 -79
3489 -79 46 162 3 -118 173 -221 -185 -172 -173 -323 5 142 -12 -26 199 -95 41 -69 -211 68 -215 -22
$$ [...]
8191D4
##END NTUPLES=NMR FID
##END=
