##TITLE=1H_TG-2249
 CDCl3, 8 sc, 
 19.8.2019
##JCAMPDX= 6.0         $$ Bruker NMR JCAMP-DX V2.0
##DATA TYPE= NMR FID
##DATA CLASS= NTUPLES
##ORIGIN= UXNMR, Bruker Analytische Messtechnik GmbH
##OWNER= root
$$ XWIN-NMR		Version 3.5
$$ Mon Aug 19 13:53:11 2019 Russian Standard Time (UT+4h)  she@DPX200
##.OBSERVE FREQUENCY= 200.13155
##.OBSERVE NUCLEUS= ^1H
##.DELAY= (6, 6)
##.ACQUISITION MODE= SIMULTANEOUS
##.ACQUISITION SCHEME= undefined
##.AVERAGES= 8
##.DIGITISER RES= 18
##SPECTROMETER/DATA SYSTEM= spect
##.PULSE SEQUENCE= zg30
##.SOLVENT NAME= D2O
##.SHIFT REFERENCE= (INTERNAL, D2O, 0, 15.7039)
##AUDIT TRAIL= $$ (NUMBER, WHEN, WHO, WHERE, WHAT)
$$ ##TITLE= Audit trail, XWIN-NMR		Version 3.5
$$ ##JCAMPDX= 5.01
$$ ##ORIGIN= Bruker BioSpin GmbH
$$ ##OWNER= she
$$ F:/spectra/data/she/nmr/H-F/1/audita.txt
$$ ##AUDIT TRAIL=  $$ (NUMBER, WHEN, WHO, WHERE, WHAT)
(   1,<2019-08-19 13:51:44.20 +0400>,<she>,<DPX200>,
      <created by zg, POWCHK disabled, PULCHK disabled
       configuration hash MD5:
       00 E9 B6 7A A2 85 ED C7 34 08 36 98 17 FE 4E 26
       data hash MD5: 16K
       7C 69 20 D4 1E 9C 7C 62 AE 11 B4 78 7C B5 5F 47>)
$$ ##END=
$$ 
$$ hash MD5
$$ F1 E8 7F 14 B3 A2 F2 F5 F3 D2 8C F4 8A BB 30 D4
##$RELAX= 
##$RELAX= 
##$RELAX= 
##$RELAX= 
##$RELAX= 
##$RELAX= 
$$ Bruker specific parameters
$$ --------------------------
##$DU= <F:/spectra>
##$EXPNO= 1
##$NAME= <H-F>
##$PROCNO= 1
##$TYPE= <nmr>
##$USER= <she>
##$AMP= (0..31)
100 100 100 100 100 100 100 100 100 100 100 100 100 100 100 100 100 100 
100 100 100 100 100 100 100 100 100 100 100 100 100 100 
##$AQSEQ= 0
##$AQ_mod= 1
##$AUNM= <au_zg>
##$AUTOPOS= <>
##$BF1= 200.13
##$BF2= 200.13
##$BF3= 200.13
##$BF4= 200.13
##$BF5= 200.13
##$BF6= 200.13
##$BF7= 200.13
##$BF8= 200.13
##$BYTORDA= 1
##$CFDGTYP= 0
##$CFRGTYP= 5
##$CHEMSTR= <none>
##$CNST= (0..31)
1 1 145 1 1 1 1 1 1 1 1 1 1 1 1 1 1 1 1 1 1 1 1 1 1 1 1 1 1 1 1 1 
##$CPDPRG= <>
##$CPDPRG1= <>
##$CPDPRG2= <>
##$CPDPRG3= <>
##$CPDPRG4= <mlev>
##$CPDPRG5= <mlev>
##$CPDPRG6= <mlev>
##$CPDPRG7= <mlev>
##$CPDPRG8= <mlev>
##$CPDPRGB= <>
##$CPDPRGT= <>
##$D= (0..31)
0 1.2 0 0 0 0 0 0 0 0 0 0.03 0 0 0 0 0 0 0 0 0 0 0 0 0 0 0 0 0 0 0 0 
##$DATE= 1566208303
##$DBL= (0..7)
120 120 120 120 120 120 120 120 
##$DBP= (0..7)
150 150 150 150 150 150 150 150 
##$DBP07= 0
##$DBPNAM0= <>
##$DBPNAM1= <>
##$DBPNAM2= <>
##$DBPNAM3= <>
##$DBPNAM4= <>
##$DBPNAM5= <>
##$DBPNAM6= <>
##$DBPNAM7= <>
##$DBPOAL= (0..7)
0.5 0.5 0.5 0.5 0.5 0.5 0.5 0.5 
##$DBPOFFS= (0..7)
0 0 0 0 0 0 0 0 
##$DE= 6
##$DECBNUC= <off>
##$DECIM= 24
##$DECNUC= <off>
##$DECSTAT= 4
##$DIGMOD= 1
##$DIGTYP= 9
##$DL= (0..7)
0 120 120 120 120 120 120 120 
##$DP= (0..7)
150 150 150 150 150 150 150 150 
##$DP07= 0
##$DPNAME0= <>
##$DPNAME1= <>
##$DPNAME2= <>
##$DPNAME3= <>
##$DPNAME4= <>
##$DPNAME5= <>
##$DPNAME6= <>
##$DPNAME7= <>
##$DPOAL= (0..7)
0.5 0.5 0.5 0.5 0.5 0.5 0.5 0.5 
##$DPOFFS= (0..7)
0 0 0 0 0 0 0 0 
##$DQDMODE= 0
##$DR= 18
##$DS= 0
##$DSLIST= <SSSSSSSSSSSSSSS>
##$DSPFIRM= 0
$$ [...]
##$SUBNAM2= <"">
##$SUBNAM3= <"">
##$SUBNAM4= <"">
##$SUBNAM5= <"">
##$SUBNAM6= <"">
##$SUBNAM7= <"">
##$SUBNAM8= <"">
##$SUBNAM9= <"">
##$SW= 24.9336996594482
##$SWIBOX= (0..15)
0 0 2 0 0 0 0 0 0 0 0 0 0 0 0 0 
##$SW_h= 4990.01996007984
##$TD= 16384
##$TD0= 1
##$TE= 0
##$TE2= 300
##$TE3= 300
##$TEG= 300
##$TL= (0..7)
0 120 120 120 120 120 120 120 
##$TP= (0..7)
150 150 150 150 150 150 150 150 
##$TP07= 0
##$TPNAME0= <>
##$TPNAME1= <>
##$TPNAME2= <>
##$TPNAME3= <>
##$TPNAME4= <>
##$TPNAME5= <>
##$TPNAME6= <>
##$TPNAME7= <>
##$TPOAL= (0..7)
0.5 0.5 0.5 0.5 0.5 0.5 0.5 0.5 
##$TPOFFS= (0..7)
0 0 0 0 0 0 0 0 
##$TUNHIN= 0
##$TUNHOUT= 0
##$TUNXOUT= 0
##$USERA1= <user>
##$USERA2= <user>
##$USERA3= <user>
##$USERA4= <user>
##$USERA5= <user>
##$V9= 5
##$VALIST= <valist>
##$VCLIST= <CCCCCCCCCCCCCCC>
##$VD= 0
##$VDLIST= <DDDDDDDDDDDDDDD>
##$VPLIST= <PPPPPPPPPPPPPPP>
##$VTLIST= <TTTTTTTTTTTTTTT>
##$WBST= 1024
##$WBSW= 4
##$XGAIN= (0..3)
0 0 0 0 
##$XL= 0
##$YL= 0
##$YMAX_a= 882561
##$YMIN_a= -943796
##$ZGOPTNS= <>
##$ZL1= 120
##$ZL2= 120
##$ZL3= 120
##$ZL4= 120
##$ABSF1= 10
##$ABSF2= 0
##$ABSG= 5
##$ABSL= 3
##$ALPHA= 0
##$AQORDER= 0
##$ASSFAC= 0
##$ASSFACI= 0
##$ASSFACX= 0
##$ASSWID= 0
##$AUNMP= <proc_1d>
##$AZFE= 0.1
##$AZFW= 0.1
##$BCFW= 1
##$BC_mod= 2
##$BYTORDP= 1
##$COROFFS= 0
##$CY= 11.3945322036743
##$DATMOD= 1
##$DC= 2
##$DFILT= <>
##$DTYPP= 0
##$F1P= 20.1720416913024
##$F2P= 0.152960286110954
##$FCOR= 0.5
##$FTSIZE= 0
##$FT_mod= 4
##$GAMMA= 1
##$GB= 0.15
##$INTBC= 1
##$INTSCL= 1
##$ISEN= 128
##$LB= 0.24
##$LEV0= 0
##$LPBIN= 0
##$MAXI= 10000
##$MC2= 0
##$MEAN= 0
##$ME_mod= 0
##$MI= 1.114404
##$NCOEF= 0
##$NC_proc= 0
##$NLEV= 6
##$NOISF1= 3.799351
##$NOISF2= 2.8
##$NSP= 1
##$NTH_PI= 0
##$NZP= 0
##$OFFSET= 15.70392
##$PC= 1
##$PHC0= -9214.275
##$PHC1= 15.60097
##$PH_mod= 1
##$PKNL= yes
##$PPARMOD= 0
##$PSCAL= 0
##$PSIGN= 0
##$REVERSE= no
##$SF= 200.130013532006
##$SI= 16384
##$SIGF1= 3
##$SIGF2= 2
##$SINO= 400
##$SIOLD= 16384
##$SREGLST= <1H.CDCl3>
##$SSB= 0
##$STSI= 0
##$STSR= 0
##$SW_p= 3612.71676300578
##$SYMM= 0
##$S_DEV= 0
##$TDeff= 0
##$TDoff= 0
##$TI= <>
##$TILT= no
##$TM1= 0
##$TM2= 0
##$TOPLEV= 0
##$USERP1= <user>
##$USERP2= <user>
##$USERP3= <user>
##$USERP4= <user>
##$USERP5= <user>
##$WDW= 1
##$XDIM= 8192
##$YMAX_p= 0
##$YMIN_p= 0
$$ End of Bruker specific parameters
$$ ---------------------------------
##NTUPLES= NMR FID
##VAR_NAME=  TIME,          FID/REAL,        FID/IMAG
##SYMBOL=    X,             R,               I
##VAR_TYPE=  INDEPENDENT,   DEPENDENT,       DEPENDENT
##VAR_FORM=  AFFN,          ASDF,            ASDF
##VAR_DIM=   8192,          8192,            8192
##UNITS=     SECONDS,       ARBITRARY UNITS, ARBITRARY UNITS
##FACTOR=    0.0002004,     1,               1
##FIRST=     0,             0,               0
##LAST=      1.6414764,     0,               0
##MIN=       0,             -943796,         0
##MAX=       1.6414764,     882561,          0
$$ Real data points
##PAGE= N=1
##DATA TABLE= (X++(R..R)), XYDATA
0 0 0 0 0 -8 8 -8 16 -24 32 -40 48 -64 80 -96 120 -144 168 -200 240 -280 328 -384 444 -514 587 -676
26 -676 770 -876 989 -1122 1260 -1420 1588 -1780 1983 -2212 2459 -2733 3029 -3361 3721 -4122
42 -4122 4557 -5051 5596 -6210 6896 -7683 8585 -9633 10870 -12357 14178 -16478 19483
55 19483 -23597 29611 -39268 57390 -103344 460901 882561 234420 438502 685646 744347
66 744347 505663 505769 580997 506286 87894 -147478 32975 334110 221299 -85577 -241213
77 -241213 -209654 -273798 -419394 -483826 -323140 -187385 -353382 -684037 -723803 -520014 -457563
88 -457563 -586099 -587557 -437632 -383792 -556223 -735246 -633322 -310967 -188160 -372471 -480484
99 -480484 -321573 -198076 -273337 -311238 -132208 88605 83970 -132825 -214762 26716 270262
110 270262 202871 57203 146354 304363 251546 93150 118431 354152 502950 331031 77405
121 77405 135408 376829 371118 163881 150535 334413 366570 150342 -36998 50250 275470
132 275470 283718 54781 -50228 73043 107892 -54203 -131209 6687 136002 48752 -163630
143 -163630 -225194 -58520 48632 -86816 -193633 -51347 77814 -56005 -239971 -188033
153 -188033 25905 115055 -23641 -161074 -60589 108277 41048 -130009 -69805 137404
163 137404 161733 -6026 -95224 16020 152678 97024 -63128 -36604 148586 152863 -48999
174 -48999 -115220 39163 134339 25166 -112698 -79348 70636 82055 -107056 -199044 -34011
185 -34011 96097 -35089 -196267 -134544 20002 17559 -137153 -206797 -66034 68363 -36673
196 -36673 -196979 -119508 56024 26859 -130299 -142034 3254 89606 3434 -112260 -52256
207 -52256 102103 78119 -85271 -74279 113805 170690 19188 -90736 -448 156980 150222
218 150222 -12438 -56115 110770 196475 43355 -75287 38497 177478 123469 -20536
228 -20536 -34655 97676 159858 26493 -91261 15374 154397 74227 -78328 -51591 75662
239 75662 82869 -43673 -117561 -19594 107500 37131 -141831 -132095 40770 71292 -78636
250 -78636 -150233 -45273 57297 -837 -134132 -122469 32724 67616 -86823 -150705 -7111
261 -7111 92347 -2653 -112609 -65909 58097 76612 -37037 -90590 30643 128222 21231
272 21231 -102317 -21570 125210 105549 -32158 -74145 40549 135445 45639 -94702 -38521
283 -38521 126233 108053 -60205 -95652 32115 97533 7487 -91995 -45681 77026 61617
294 61617 -91079 -124256 20275 86256 -28546 -113304 -41825 49259 13416 -97798 -103745
305 -103745 33391 99828 -33902 -148533 -48990 86716 42652 -76508 -70114 42852 82763
316 82763 -21415 -110221 -18056 123007 75603 -71600 -62896 66104 88697 -11043 -58067
327 -58067 24900 116465 64471 -67639 -61588 82639 116294 -10190 -64132 35417 103070 26782
339 26782 -75385 -44825 86312 116518 -19969 -105166 -1210 96699 19609 -80459 -32133
350 -32133 73213 63500 -54512 -111679 -10608 96497 30006 -94476 -59536 55857 36620
361 36620 -75428 -84372 23530 83595 1276 -109050 -70489 61032 60775 -65767 -84168 35964
373 35964 79186 -22907 -103320 -42236 72092 72699 -44567 -88410 18520 82360 -13231 -88585
385 -88585 -6766 90961 49931 -59370 -74322 27591 90551 8070 -77328 -5055 95375
396 95375 36734 -78327 -52717 63828 90131 -4304 -77146 -17315 83399 52017 -64386
407 -64386 -57076 63812 84482 -24844 -80618 -5894 75894 43336 -56629 -63285 43767 77211
419 77211 -31712 -89666 5448 81686 14140 -75005 -49190 44206 59537 -33592 -86145 1506
431 1506 83199 9999 -90437 -44350 61566 55204 -40662 -76672 812 76612 24033 -77380
443 -77380 -47895 67422 63210 -48887 -71253 25878 79957 13001 -67922 -36700 63294 65413
455 65413 -41813 -68771 36937 84566 -7348 -76955 -18011 67662 52661 -39930 -68751 17547
467 17547 74961 -4998 -85100 -21596 71097 34123 -64175 -71509 12307 56906 -8667 -82324
479 -82324 -34974 57458 22850 -82762 -71311 33312 55737 -25546 -76556 -23493 50916 27283
491 27283 -60104 -54425 51843 76772 -22242 -70358 8735 82295 46320 -30391 -25562 61149
503 61149 90810 3140 -52957 30313 111950 54723 -34880 -12874 68263 77012 1782 -41236
515 -41236 22753 90713 33073 -65130 -37875 58819 53546 -38048 -67152 -2289 45234 -6944
527 -6944 -88000 -65274 31901 34220 -70487 -102620 -16223 31768 -29467 -89886 -55285 22090
539 22090 20989 -64683 -93622 -4120 55790 -11765 -77484 -26613 48149 29681 -40718 -47766
551 -47766 29659 79088 15359 -58965 -8124 83393 59169 -27707 -24142 56451 82052 16343
563 16343 -40260 3336 84920 65966 -28808 -36528 50797 72418 -5260 -49479 1508 59833
575 59833 32844 -47456 -59387 21041 53754 -26321 -80672 -19294 40748 -5733 -78796 -65670
587 -65670 9864 31791 -40649 -94741 -35004 38057 -4448 -81272 -52909 28639 31450 -38185
599 -38185 -67021 -7562 58223 29684 -44199 -26564 61567 68824 -8330 -25704 48914 97567
611 97567 54092 -8731 10030 89457 99887 19800 -7804 71193 114862 45860 -18201 18137
623 18137 84852 76771 2537 -29290 29081 71284 7020 -63519 -24674 44583 18037 -62351
635 -62351 -80434 -25139 8756 -41081 -104309 -75911 -4142 -25601 -112695 -117549 -39296 -11665
647 -11665 -68649 -113326 -78801 -18669 -30075 -97873 -97737 -12306 18138 -49647 -89604 -32969
659 -32969 27158 9455 -40428 -32883 36824 67600 5658 -39711 24529 99699 71319 6672
671 6672 20840 86409 101253 46896 13329 67616 133315 97737 17156 27517 102269 107237
683 107237 42743 19102 67038 102716 60246 -11134 -4710 68192 77799 -893 -38409 12227
695 12227 41894 -10058 -64903 -44156 15070 14639 -62649 -103772 -46745 732 -48965 -104201
707 -104201 -70032 -12859 -29726 -94464 -110807 -49839 2917 -33101 -92845 -66165 714 -10047
719 -10047 -69103 -62028 7706 40123 -3827 -53631 -26710 43212 46345 -13347 -15161 53636 73085
732 73085 11738 -24486 20799 79848 70387 8215 -9134 46675 74467 17281 -23451 25856
744 25856 76893 42059 -24468 -28953 24530 49029 695 -44845 -8299 42781 5026 -64691
756 -64691 -51089 16788 27808 -27498 -63048 -31057 14194 -6840 -62239 -47177 22709 26904
768 26904 -41753 -67411 -13535 33233 12280 -33544 -25580 30265 40662 -19216 -41563 25164
780 25164 74816 32760 -21160 -1687 52163 58906 11878 -7567 42867 83487 36874 -21721
792 -21721 6910 68307 60150 4627 -9230 31132 57160 18113 -35015 -15045 47015 39157
804 39157 -30840 -49091 522 21953 -20466 -59105 -36456 10554 -51 -64519 -80019 -19097
816 -19097 10274 -41916 -80281 -44373 -571 -17702 -64951 -66950 -12734 17281 -27976 -70856
828 -70856 -30385 26618 7739 -42834 -34458 19194 37670 -1884 -34823 743 55772 38666
840 38666 -19735 -10435 51724 60331 8017 -14052 26155 66049 43915 -8547 -6277 51795 64065
853 64065 5424 -21269 25677 59603 24672 -21830 -11564 37389 46798 -6974 -40630 2713
865 2713 45837 9304 -42012 -22707 25907 22254 -26176 -45989 -6630 30881 9 -51279
877 -51279 -32939 22390 15986 -37027 -44774 880 25811 -6019 -45820 -28320 24498 24446 -32514
890 -32514 -44215 11777 38264 -4611 -40907 -14759 30390 26843 -19756 -32982 15128 43323
902 43323 -627 -38881 -3363 42245 23151 -23278 -25312 17923 39109 1943 -36354 -6817
914 -6817 41883 20633 -33898 -27629 24172 34248 -8923 -38098 -8691 34424 18677 -34761
926 -34761 -33044 23512 34550 -17125 -40609 -1485 33124 12682 -30072 -27563 20280 35397
938 35397 -12151 -40087 2848 40908 10330 -31589 -17855 25260 31193 -9662 -33038 4378
950 4378 42513 10980 -37185 -17636 34182 30085 -16750 -30762 4607 34205 9900 -32492
962 -32492 -20147 29629 28029 -23440 -34984 9672 32730 1686 -32860 -18002 22986 23599 -22556
975 -22556 -36701 11088 36691 -5433 -40631 -11461 29743 19611 -22194 -31361 9102 34931
987 34931 -1157 -38532 -9050 36288 19582 -26258 -25777 15072 31951 750 -30341 -7384
999 -7384 35849 22361 -28900 -27616 23618 36570 -4591 -28936 -2063 30854 16778 -25055
1011 -25055 -23298 25557 37738 -11062 -37530 -278 34346 13445 -22831 -18822 17492 27790
1023 27790 -11522 -36795 218 38918 11769 -32838 -21946 18714 22250 -12267 -29200 715
1035 715 31079 6618 -37674 -23811 25146 24563 -20187 -31070 3346 25075 -263 -33713 -20850
1048 -20850 23808 26496 -22073 -38603 2757 27732 -1448 -29421 -11769 21671 17765 -22249
1060 -22249 -34587 7228 36907 3288 -33672 -10298 27456 15277 -20088 -20006 16554 35251
1072 35251 2940 -32370 -8619 36448 25604 -18406 -17941 21524 32043 -49 -24320 -2097
1084 -2097 35965 27634 -17842 -22680 21369 34840 -3912 -24808 4478 32342 15380 -21287
1096 -21287 -22062 16891 32206 -5695 -31578 -519 28957 4236 -29878 -19633 16690 22435
1108 22435 -13524 -37825 -9967 26106 5794 -35224 -24757 15865 15035 -22180 -34545 -5276
1120 -5276 22744 4317 -33293 -26523 15981 19925 -19867 -30333 5200 25018 709 -26635
1132 -26635 -14164 21865 26103 -11865 -27026 10610 35845 5064 -24639 -3378 31394 25248
1144 25248 -9919 -20784 12456 37640 9858 -24337 -4336 33017 20713 -17330 -18142 15139
1156 15139 29521 3049 -26176 -10663 25135 18224 -22068 -23924 14547 23928 -9797 -31703
1168 -31703 -8967 22079 14103 -23129 -29140 9540 25102 -11217 -33328 -3384 25692 8132
1180 8132 -24400 -22392 10507 24301 -5099 -29154 -3217 27694 8038 -25743 -16037 18547
1192 18547 22296 -7323 -25329 -2676 26222 11179 -25249 -17273 22169 23254 -14589 -27008
1204 -27008 2672 25200 7880 -22224 -17466 17565 22349 -14745 -28403 6450 27553 1869
1216 1869 -24703 -12720 16783 18717 -11122 -24338 5284 29496 2353 -28165 -8362 26310
1228 26310 19243 -13206 -19233 9561 28819 5757 -23286 -5874 31638 22938 -15607 -17313 16282
1241 16282 29197 4545 -17612 -3157 26251 21817 -14336 -19924 15857 29423 -2152 -23548
1253 -23548 -3393 20586 10303 -18906 -22196 8472 21304 -11052 -35291 -9866 18043 802
1265 802 -29088 -24743 3531 10101 -16033 -35655 -13461 16653 2085 -32460 -25553 8959 12577
1278 12577 -15362 -26396 -3967 19350 7181 -23251 -17616 19116 25764 -7901 -18712 10445
1290 10445 29341 10679 -12565 -3081 26905 31597 -294 -15466 14175 37054 13574 -12157
1302 -12157 1551 28413 24702 -4090 -15122 10562 32960 10906 -20772 -7598 23261 14876
1314 14876 -16075 -18865 7692 19310 -2454 -28356 -16653 14318 10181 -23889 -27285 3907
1326 3907 12991 -13700 -31779 -14628 11978 8060 -22119 -29439 947 16263 -10729 -29153 -5398
1339 -5398 19269 6553 -19577 -18986 8446 22395 -20 -19749 1044 26819 11495 -16520
1351 -16520 -7830 22443 26868 2416 -13445 3992 28038 17372 -12408 -7747 24903 26612 -5028
1364 -5028 -17917 4616 23907 10783 -15165 -13629 14068 17858 -14038 -26753 960 19143
1376 19143 -2019 -26000 -18200 5624 7648 -16944 -28573 -4246 15883 -5923 -32373 -17284
1388 -17284 11582 8476 -16569 -22813 -601 16818 128 -23909 -10467 21361 17368 -13428
1400 -13428 -15897 11557 23823 4897 -11594 11 24986 22342 -6967 -11371 18235 30367
1412 30367 5794 -11297 5341 25727 17898 -6590 -10278 15498 28262 2251 -19626 -343
1424 -343 23942 10355 -15668 -12992 9901 16521 -5617 -23989 -7801 16933 5235 -23719 -19896
1437 -19896 7147 9124 -14446 -25248 -8368 11004 1172 -24555 -22204 6809 11779 -15775 -25823
1450 -25823 -1622 15044 323 -20628 -15083 10247 16404 -8232 -21137 3583 22749 3853
1462 3853 -17431 -5464 17875 18121 -3971 -13567 5960 24613 8497 -15631 -3515 22670 17512
1475 17512 -8685 -12241 8986 20581 4737 -15338 -6129 19127 14781 -14303 -17416 9288 18802
1488 18802 -2927 -18938 -6706 13467 10038 -13666 -19158 5956 18390 -4919 -22558 -5364
1500 -5364 15554 7513 -13635 -14598 6133 17144 -2701 -20564 -3443 20177 8989 -15222 -11532
1513 -11532 11506 16186 -2483 -15211 -1122 19381 10984 -14930 -11861 14077 18008 -5688 -15353
1526 -15353 2019 16753 6604 -13708 -11815 12285 17436 -8251 -19694 2017 17875 1955
1538 1955 -16974 -9675 10451 12190 -8950 -20338 -656 17673 1663 -20491 -9785 12538
1550 12538 9650 -11186 -16840 966 15580 2267 -18741 -10420 14715 12450 -12388 -15094 6527
1563 6527 16417 371 -15121 -6254 15639 13790 -10050 -14710 9108 19182 -1172 -15316 -1280
1576 -1280 16224 10637 -9211 -13148 6891 19300 -229 -17770 -2424 17523 7930 -12973 -11643
1589 -11643 7411 14871 -1849 -17463 -4475 15943 7068 -16173 -12520 9986 12530 -6876 -16262
1602 -16262 -2419 13883 6113 -14683 -13354 10147 14635 -7653 -16640 1412 15339 4480 -12834
1615 -12834 -10000 10430 15316 -4985 -16595 2728 18793 3821 -14511 -5994 13189 12613 -4861
1628 -4861 -13146 2821 17684 4672 -15017 -6549 15159 11908 -8755 -12238 4089 14818 2909
1641 2909 -14194 -7575 13168 11819 -11184 -15301 5832 14585 -2141 -15456 -6529 10690 8748
1654 8748 -10825 -15988 4211 14564 -3234 -17824 -4637 11972 5348 -11356 -12747 4019 13260
1667 13260 -2335 -17658 -4845 14578 6848 -13733 -10488 7889 12439 -2937 -14225 -3000
1679 -3000 14717 8646 -12096 -10949 10419 14244 -4275 -12265 1857 14618 7069 -9716 -9473
1692 -9473 10463 15882 -3492 -13482 3384 16786 4808 -11181 -5892 10670 13715 -2932 -13018
1705 -13018 2025 16888 4592 -13565 -5445 12849 11035 -6599 -11864 1526 13782 3742
1717 3742 -13649 -7789 11866 10029 -10304 -13762 3161 12044 -107 -13841 -8254 8941 8876 -10685
1731 -10685 -15377 4153 13041 -3470 -15910 -5630 9219 6499 -9534 -13430 2291 12596 -2228
1744 -2228 -16592 -4497 12287 5698 -10481 -10207 4817 11608 -816 -13492 -3363 14106 8184
1757 8184 -11274 -9863 8913 12802 -1980 -11029 -328 13370 8064 -9191 -9270 10225 14972 -2801
1771 -2801 -11882 1916 13670 5377 -8237 -7023 8832 13216 -3123 -13762 1509 15071 3729
1784 3729 -11920 -6484 8873 9566 -4964 -12785 280 12931 3005 -14325 -7961 10321 8732
1797 8732 -7944 -11734 1524 10520 1675 -12392 -8064 9307 9584 -8312 -12927 3628 12142 -285
1811 -285 -11502 -4968 9154 8590 -6488 -12286 4018 13860 -145 -12904 -2829 11160 6613
1824 6613 -7590 -9484 3651 11930 199 -13410 -3840 12150 6868 -9481 -9220 5579 10124
1837 10124 -1277 -11437 -3476 11421 7066 -10171 -10547 7043 11428 -3821 -11554 -819 10442
1850 10442 5057 -8892 -9217 6647 12416 -3514 -12716 580 12143 3662 -9176 -6530 7306
1863 7306 10433 -2660 -11818 -201 13338 3913 -10906 -5895 9560 9389 -4277 -9882 1146
1876 1146 11999 4253 -10262 -6855 9737 9866 -6366 -10470 2942 10654 1546 -10106 -6208 7988
1890 7988 9475 -6016 -11826 3067 11524 -310 -11305 -4283 8344 6851 -6431 -10930 1788
1903 1788 11225 29 -12209 -3794 10171 5628 -7830 -8903 3738 9996 387 -10913 -3830
1916 -3830 10275 7014 -8643 -8754 5870 10171 -1648 -10079 -2238 9208 6682 -8004 -9070 5997
1930 5997 11313 -3097 -11378 -735 10068 4093 -7870 -7711 4739 9959 -2120 -11469 -1140
1943 -1140 11075 3203 -9633 -6753 6188 8674 -2816 -10215 -1254 10677 4298 -9977 -6408
1956 -6408 8587 9064 -4248 -8751 1488 9966 3818 -7707 -5690 8625 10005 -4350 -9782 3272
1970 3272 11585 2630 -7713 -3832 7600 8819 -3919 -9428 2972 12246 1428 -10013 -3308
1983 -3308 8680 6225 -5159 -8457 1849 9884 838 -10654 -4845 9117 5626 -7822 -8533 2568
1997 2568 7326 -1554 -10077 -5005 7336 5313 -8939 -10945 2926 7911 -3505 -10531 -2806 6975
2011 6975 3530 -7848 -9272 3573 9864 -2481 -11254 -1402 9173 3743 -6841 -5247 5368
2024 5368 9084 -938 -9109 -452 11119 5396 -7240 -4647 8124 8471 -1728 -6977 1075 10772
2038 10772 5222 -6932 -5325 8169 9431 -3077 -7218 2653 9283 2602 -7205 -5328 6527 8971
2052 8971 -3616 -9697 1459 8913 463 -9193 -4108 6225 6089 -4844 -9850 -242 8600 578
2066 578 -10363 -4808 7084 4322 -6755 -8359 1162 7659 761 -9760 -5400 7046 5536 -6700
2080 -6700 -8167 3777 7969 -706 -8258 -3075 7299 6473 -5340 -7802 4055 9611 -1356 -8715
2094 -8715 -1137 8728 4805 -5280 -6288 4080 9265 -699 -8809 -1071 9669 3942 -6970 -5427
2108 -5427 4760 7668 -1287 -8009 -1629 8600 4036 -7948 -6368 5753 7170 -3524 -7954 -268
2122 -268 7565 3040 -6953 -6491 5356 7638 -3706 -8705 975 8063 1610 -7195 -4449 5118 7005
2137 7005 -2770 -8424 1052 9139 1462 -7711 -3686 6653 5925 -3660 -7111 916 8260 2111 -8183
2152 -8183 -3591 7323 5901 -4939 -6321 2962 7822 835 -7428 -3755 6489 6285 -5120 -7372
2166 -7372 3318 7925 -736 -7692 -2114 6467 4850 -5156 -7021 2606 8154 -1054 -9073 -1735
2180 -1735 7844 3475 -6078 -5604 3020 7221 -822 -8393 -2053 7816 3566 -7026 -6017 4261 6275
2195 6275 -1938 -7338 -1796 6904 3904 -6815 -6036 5139 7235 -3117 -7747 -95 6901 2596
2209 2596 -6086 -5002 4530 6861 -3032 -8321 1032 8382 1776 -6343 -3810 5083 6157 -2284 -6996
2224 -6996 579 8471 2515 -7180 -3313 6877 5574 -3213 -6044 1506 7507 1680 -6185 -3580 6662
2239 6662 6366 -4159 -6291 3012 7148 550 -5963 -2646 5677 5362 -4048 -7387 2709 8077 -857
2254 -857 -7844 -1914 5825 3745 -4601 -6392 1700 6844 -812 -8290 -2681 6918 3118 -6044 -5789
2269 -5789 2591 5448 -1265 -7394 -2606 6425 3633 -6463 -6037 3989 6068 -2533 -6805 -963 6060
2284 6060 3303 -5634 -5639 4185 6945 -2391 -6796 758 7308 2131 -5004 -3624 4175 6661 -1251 -6559
2300 -6559 582 7928 2565 -5684 -2670 5777 5884 -1872 -5732 426 7508 2997 -5906 -3797 5812
2315 5812 5459 -3811 -5843 1847 6610 1277 -5882 -3555 4825 5503 -4011 -6792 2295 6400 -645
2330 -645 -6644 -2509 4425 4018 -4003 -6652 1085 6538 -604 -7825 -2346 5560 3319 -4687 -5612 1558
2346 1558 5845 -203 -7076 -2596 6412 3722 -5871 -4848 3264 5660 -1054 -5745 -1519 6031 4062
2361 4062 -4906 -5345 4333 6908 -1700 -6356 139 5950 3437 -4409 -4264 3397 6372 -1234 -6615
2376 -6615 -83 7050 2223 -5199 -3544 3981 5537 -2060 -5909 -386 6756 2350 -5945 -3840 4905
2391 4905 4853 -3109 -5572 147 5613 2145 -5788 -4095 4928 5281 -3577 -6135 1253 5692 563 -5567
2407 -5567 -2742 4424 5054 -2951 -6373 1529 6531 496 -5907 -2046 4926 3748 -3395 -5390 1412
2422 1412 6396 497 -6236 -1730 6033 3834 -4243 -4396 2885 5378 -97 -5688 -1750 5777 4050
2437 4050 -4392 -4958 3101 5431 -937 -5180 -1171 4664 3400 -4045 -4983 2682 5783 -1537 -6746
2452 -6746 -698 5345 1799 -4801 -4135 2505 5015 -1363 -6438 -735 5966 1601 -5804 -3522 3769
2467 3769 4084 -2193 -5420 -711 5685 2209 -5181 -3807 4348 4866 -2462 -4901 879 5572 1634
2482 1634 -4579 -3072 4337 5558 -2245 -5233 1751 5879 957 -4407 -1667 4106 4195 -2412 -5025
2497 -5025 1239 6222 810 -5620 -1621 4965 3379 -3473 -4246 1307 5125 628 -5875 -2564 5072
2512 5072 3265 -4702 -4726 2327 4610 -1092 -5000 -2089 4322 3318 -4134 -4902 2313 5097 -1415 -5441
2528 -5441 -920 4437 2373 -3758 -4369 2424 5515 -937 -5826 -10 5479 2144 -4388 -2871 3086
2543 3086 4711 -760 -5095 -446 5512 2555 -4704 -3280 4007 4333 -1745 -4554 -53 4763 2096
2558 2096 -4288 -3540 3820 4939 -2556 -5299 750 4606 743 -4608 -3381 3024 4061 -2346 -5536
2573 -5536 407 5318 241 -5253 -2196 3750 3163 -2610 -4805 1089 5238 891 -5613 -2293 4582
2588 4582 3260 -3366 -3968 1937 4729 618 -4447 -1897 4651 3855 -3455 -4184 2996 4889 -257 -4193
2604 -4193 -713 4401 3300 -2993 -4253 2435 5289 -351 -4975 -550 4874 2335 -3242 -3332 2000
2619 2000 4573 -603 -5458 -1177 4538 1823 -4554 -3216 2355 3760 -1723 -4904 -1288 3974 1738
2634 1738 -4791 -3995 3003 3643 -2497 -5043 -75 3784 1160 -3965 -3461 2942 3790 -2057 -5020 816
2650 816 4791 487 -4199 -2059 3246 4129 -1463 -4467 807 5281 1059 -4423 -1494 4267 3207
2665 3207 -1804 -3596 1031 4686 1265 -3834 -1759 4605 3557 -2853 -3443 2084 4453 156 -3992
2680 -3992 -1807 3445 3136 -3038 -4431 1760 4521 -959 -4714 -906 3549 2314 -3032 -3959 1322
2695 1322 4219 -789 -5207 -989 4321 1896 -3581 -3473 1823 3510 -727 -4496 -1209 4196 2097
2710 2097 -4189 -2927 2892 3547 -1201 -3681 -354 4176 1974 -3258 -2890 3009 4444 -1989 -4066
2725 -4066 792 4233 1168 -3281 -2548 2492 3929 -1497 -4604 561 4726 587 -4093 -2033 3099
2740 3099 2775 -1773 -4066 297 4105 415 -4281 -2276 3507 2747 -2629 -3582 615 3781 607 -3627
2756 -3627 -2435 3597 3094 -2894 -3783 1868 3750 -382 -3625 -922 3271 2567 -2396 -3459 1954 4585
2772 4585 -351 -3976 -493 3967 2046 -2426 -2869 1890 4257 41 -4338 -812 4417 2049 -3318
2787 -3318 -2612 2022 3434 -757 -3745 -899 3948 2305 -3397 -3125 2335 3486 -2033 -3831 -276
2802 -276 3356 1213 -3414 -2967 1873 3355 -1781 -4318 382 3754 658 -3489 -2156 2300 3011 -1550
2818 -1550 -4104 185 4084 709 -3927 -1776 2966 2661 -1412 -3170 577 3523 1056 -3528 -1890
2833 -1890 3698 2935 -2122 -2961 1364 3735 660 -3054 -1379 3145 2905 -1897 -3645 1608 3891 -375
2849 -375 -3345 -622 3199 2032 -2094 -3213 965 3893 -32 -4057 -744 3406 1771 -2673 -2703 1331
2865 1331 2960 -513 -3707 -999 3396 1620 -3419 -2818 2128 2945 -1241 -3244 -244 3038 1389
2880 1389 -3023 -2684 2152 3287 -1293 -3604 238 3360 1166 -2518 -2184 1991 3533 -903 -3751
2895 -3751 155 3827 766 -3087 -1407 2404 2455 -1415 -3123 277 3735 1031 -3434 -1564 3013
2910 3013 2208 -1940 -2593 450 3055 917 -2723 -1819 2697 2778 -1833 -3273 1124 3335 219 -3135
2926 -3135 -992 2489 2521 -1844 -3292 1145 3739 75 -3505 -812 2736 1588 -2027 -2513 902 3297
2942 3297 134 -3517 -1051 3172 1725 -2707 -2530 1382 2932 -438 -3219 -1001 3111 1653 -2707
2957 -2707 -2868 1601 3048 -1166 -3015 -457 2937 1214 -2348 -2496 1639 3128 -1161 -3596 -372
2972 -372 3154 813 -2569 -2038 1667 2500 -955 -3265 -445 3282 1070 -2943 -1781 2458 2211 -1130
2988 -1130 -2592 662 3162 1120 -2639 -1853 2763 2437 -1611 -2656 1045 2849 688 -2679 -1276
3003 -1276 2070 2889 -1488 -3161 1010 3311 31 -2805 -828 2400 1923 -1674 -2662 580 3363 162
3019 162 -3148 -890 2687 1593 -1924 -2256 716 2400 -201 -2971 -1377 2542 1945 -2169 -2369 1597
3035 1597 2722 -673 -2791 -699 2329 1776 -2056 -2429 1316 2821 -820 -3069 88 2698 1208
3050 1208 -1951 -2239 1274 2455 -636 -3185 -162 3138 747 -2380 -1754 1786 1962 -764 -2692 -406
3066 -406 2586 1126 -2528 -1997 2015 1932 -1371 -2452 208 2301 646 -2544 -1657 2078 2104 -1230 -2673
3083 -2673 651 3160 525 -2489 -1428 1932 2239 -1129 -2605 887 3287 386 -2458 -841 2502
3098 2502 1775 -1207 -2023 524 2988 557 -2531 -847 2776 1764 -1925 -2046 1415 2235 -106 -2130
3114 -2130 -1054 2400 1589 -1809 -2162 1264 2408 -626 -2709 -531 2165 1210 -1893 -2425 919 2419
3130 2419 -930 -3210 -442 2319 542 -2128 -1822 1110 2399 -479 -2325 -618 2767 983 -2142
3145 -2142 -1446 1547 2229 -786 -2493 -17 2397 1269 -1965 -1520 1918 2797 -1104 -1896 377 2460
3161 2460 1132 -1596 -1056 1721 2570 -585 -2462 508 2799 399 -1862 -1211 1757 1798 -859 -2264
3177 -2264 -50 2570 523 -2752 -1171 1970 1263 -1956 -2192 567 1839 381 -2459 -1410 1763
3192 1763 1501 -1883 -2319 894 1684 -583 -2173 -1150 1525 1600 -1420 -2419 796 2477 -461 -2557
3208 -2557 35 2066 1126 -1444 -1609 1200 2333 12 -2021 10 2196 1079 -1673 -1324 1490 1932
3224 1932 -205 -1886 -243 1994 1453 -1860 -1631 1804 2000 -754 -1982 -242 2163 1055 -1834 -1692
3240 -1692 1498 1797 -789 -2076 179 2444 600 -1717 -1838 1039 1627 -875 -2186 157 2096 424
3256 424 -2379 -1083 1417 1702 -1144 -1818 -37 1858 608 -2285 -1106 1926 1753 -1300 -1845 468
3272 468 1865 405 -1853 -1249 1449 1699 -1266 -1842 913 2236 1 -1708 -597 1581 1301 -1343
3288 -1343 -1884 765 2281 -18 -2250 -282 2006 910 -1376 -1653 551 2244 -364 -2142 -489
3303 -489 1891 1220 -1643 -1275 1031 1512 -241 -1959 -447 1548 1056 -1891 -1963 1280 1990 -201 -1822
3320 -1822 139 1950 683 -1160 -1262 1250 1832 -440 -1903 -87 2309 558 -1417 -1069 1314 1576
3336 1576 -434 -1879 145 2293 674 -1685 -1097 1815 1671 -1050 -1608 358 1783 87 -1843 -1313
3352 -1313 1574 1573 -1437 -1982 549 1580 13 -1366 -875 1048 1393 -972 -2093 301 1826 -167
3368 -167 -1883 -1018 1192 969 -1212 -1527 194 1818 99 -1776 -835 1930 1302 -1219 -1072 946 1476
3385 1476 152 -1721 -720 1815 1020 -1263 -1446 929 1919 -110 -1535 -49 1442 1216 -1208 -1356
3401 -1356 1366 1761 -304 -1683 63 1840 775 -1451 -1512 563 1644 -93 -1774 3 1752 376
3417 376 -1614 -1030 1205 1253 -587 -1650 -121 1510 723 -1562 -1239 1270 1285 -778 -1693 107 1347
3434 1347 393 -1599 -1108 1531 1441 -575 -1780 321 1881 37 -1453 -479 1057 1338 -734 -1351 479
3451 479 2212 514 -1715 -429 1307 1165 -1057 -1245 257 1724 253 -1288 -680 1418 1144 -1147
3467 -1147 -1396 681 1275 -115 -1439 -335 1298 893 -1082 -1327 779 1560 -363 -1689 -261 1360
3483 1360 396 -1026 -1441 543 1625 -175 -1806 -431 1678 487 -1531 -1436 891 1211 -218 -1851
3499 -1851 -535 1579 909 -1397 -1120 1069 1580 -212 -1347 145 1330 535 -1264 -1172 965 1607 -615
3516 -615 -1451 218 1322 498 -1163 -520 865 1104 -312 -1732 -52 1385 153 -1452 -1210 1031
3532 1031 1069 -478 -1486 -32 1722 363 -1897 -1085 1355 1085 -826 -1254 421 1206 -9 -1148
3548 -1148 -1054 1279 1266 -822 -1222 556 1634 33 -1218 -550 1251 1055 -601 -1262 692 1852 -10
3565 -10 -1560 -238 1304 974 -1162 -933 328 1202 -126 -1416 -352 1581 918 -1163 -979 952 1027
3582 1027 -668 -1424 -513 1370 406 -1188 -1099 646 1495 -471 -1780 -288 792 788 -1006 -1310 592
3599 592 1183 -760 -1485 -416 1240 410 -1070 -927 825 1171 -160 -1195 -412 1565 477 -1484 -662
3616 -662 1092 1095 -579 -916 -19 1322 453 -948 -231 1161 1430 -436 -1096 502 1479 335 -1220 -836
3634 -836 996 1283 -350 -1297 245 1572 -276 -1134 -540 789 709 -889 -1277 353 1284 151 -1530
3651 -1530 -618 1101 709 -975 -1075 348 1195 -62 -1603 -470 1001 1128 -945 -1054 829 926 -58
3668 -58 -1349 -545 907 719 -793 -918 756 1355 -133 -1396 -157 1377 625 -979 -758 688 1050
3685 1050 -174 -1533 -55 1335 389 -1176 -1086 781 781 -407 -1212 -6 1315 806 -1028 -1045 1126
3702 1126 1120 -351 -1410 124 1400 425 -893 -951 725 1243 -508 -1249 526 1416 285 -1133 -490
3719 -490 652 929 -400 -1156 60 1198 341 -1279 -391 1132 1123 -641 -683 104 1378 230 -916 -851
3737 -851 1451 1148 -675 -1376 239 823 1 -936 -631 794 1008 -664 -995 342 991 -65 -1177
3754 -1177 -367 1142 710 -734 -1272 179 1131 -169 -1239 -358 1036 454 -739 -887 214 1087 -279
3771 -279 -1082 -214 1340 464 -818 -631 329 1110 -407 -748 -122 944 589 -557 -621 990 1171 -394
3789 -394 -873 26 1063 445 -694 -604 526 1184 -412 -1528 -20 932 399 -1108 -589 931 816 -564
3807 -564 -1306 -379 935 211 -1526 -498 661 766 -619 -997 185 1068 32 -828 -550 799 827 -779
3825 -779 -1192 48 1078 8 -762 -680 888 571 -563 -1237 309 1212 17 -965 -509 1102 533 -584
3843 -584 -728 314 994 125 -1173 -392 770 409 -835 -594 533 1108 -75 -1073 -332 886 667 -667
3861 -667 -677 406 870 -600 -1053 -71 603 563 -967 -980 443 1342 -426 -1107 -183 817 384 -893 -687
3880 -687 551 927 -153 -1022 138 1253 533 -1075 -732 843 573 -206 -729 13 1065 148 -853
3897 -853 -682 672 919 -470 -778 315 892 193 -590 -568 814 875 -419 -867 231 900 -123 -866
3915 -866 -421 430 564 -704 -925 -246 861 180 -1163 -419 880 595 -484 -948 260 772 384 -1188
3933 -1188 -477 1056 367 -668 -859 626 715 -50 -831 -489 489 429 -720 -774 301 1037 -95 -1024 35
3952 35 976 237 -806 -553 607 1030 117 -866 -199 1238 470 -659 -634 867 809 -419 -441 -124 849
3971 849 397 -808 -755 672 923 -608 -593 -42 737 347 -810 -594 645 787 -561 -1083 -152 999
3989 999 87 -880 -354 476 860 -453 -606 -191 1131 80 -789 -492 604 697 -517 -567 -230 744 209
4008 209 -929 -570 774 187 -452 -740 288 1004 294 -723 -254 878 878 -776 -699 264 470 9 -920
4027 -920 -193 817 586 -398 -866 159 685 -551 -935 -184 723 299 -636 -671 156 952 -41 -806 -225
4046 -225 982 312 -379 -581 632 576 -439 -601 -205 581 669 -515 -595 555 824 -294 -764 -43 603
4065 603 244 -537 -603 465 691 -235 -1101 -172 748 165 -577 -202 492 379 -9 -622 -81 835 254 -645
4085 -645 -580 493 606 -499 -826 354 690 383 -927 -625 352 522 -278 -773 184 903 40 -684 -355
4104 -355 594 936 -380 -479 121 919 88 -700 -241 578 339 -397 -751 154 1031 322 -595 -308 692 330
4124 330 -695 -517 137 691 119 -766 -304 771 781 -697 -778 290 653 151 -679 -289 728 527 -759
4143 -759 -857 301 818 -305 -524 -79 751 427 -799 -234 281 854 -96 -735 -86 784 357 -626 -267
4162 -267 586 815 -189 -723 -250 137 229 -662 -611 559 727 -52 -641 -147 776 328 -456 -333 400 497
4182 497 -518 -594 211 598 -74 -705 -514 512 693 -330 -768 -283 978 -1 -715 -68 -31 443 -560
4201 -560 -900 245 671 -17 -604 -346 438 449 -402 -807 143 701 -101 -485 -355 548 450 -693 -664 735
4221 735 536 3 -568 -482 605 343 -452 -919 137 528 -30 -802 -238 888 340 -439 -609 416 822
4240 822 -456 -667 -22 847 376 -774 -971 500 357 -413 -645 -130 593 99 -427 -299 386 659 -388
4259 -388 -812 86 626 170 -211 -561 512 515 -264 -497 -26 436 169 -649 -373 446 538 -33 -456 -166 592
4280 592 701 -339 -352 682 390 -248 -582 250 528 -239 -663 -207 339 455 -342 -296 -33 629 342 -446
4300 -446 -278 152 519 -368 -589 182 666 84 -887 -268 819 348 -472 -327 75 559 153 -875 -273
4319 -273 817 227 -271 -194 549 624 123 -695 -177 742 323 -322 -431 383 536 -132 -528 -56 522 340
4339 340 -234 -412 152 933 205 -1089 -188 889 171 -525 -667 202 665 -234 -572 -371 628 301 -335
4358 -335 -453 791 524 -130 -644 -185 682 362 -363 -595 218 545 -78 -723 274 629 258 -692 -519 70
4378 70 670 -59 -457 32 499 133 -622 -459 286 12 -198 -517 250 545 28 -621 -244 613 222 -209
4398 -209 -513 151 542 375 -453 -443 520 565 -400 -262 169 596 228 -537 -29 212 439 -164 -692 232 611
4419 611 123 -448 -90 716 509 -349 -503 99 706 137 -652 -243 476 68 -415 -390 559 449 -176 -640
4439 -640 -421 439 177 -893 -293 529 304 -72 -396 56 469 149 -635 -521 348 252 -46 -374 57 355
4459 355 -132 -593 -407 333 563 2 -626 -191 315 161 -898 -167 312 597 -299 -534 -18 851 259 -448
4479 -448 -371 467 309 29 -639 -8 629 46 -728 -379 473 396 -550 -771 -38 712 83 -462 -200 27 375
4500 375 -103 -664 227 560 423 -853 -55 782 416 -549 -537 -28 573 374 -730 -216 997 809 -374
4519 -374 -480 631 303 12 -510 159 668 146 -409 -493 357 376 -151 -612 70 446 281 -271 -440 142
4539 142 416 -56 -699 -200 572 390 -688 -420 480 302 -351 -280 -515 322 464 -534 -457 502 504 -97 -280
4560 -280 333 826 269 -848 -310 -38 588 -96 -566 -99 566 94 -641 -429 247 408 -119 -428 106 521
4580 521 287 -691 -318 189 460 -176 -505 23 804 262 -794 -410 540 388 -457 -390 160 29 179 -324
4600 -324 -194 524 829 -439 -465 207 758 198 -412 -183 300 214 -132 -5 278 605 121 -590 -49 592
4620 592 153 -169 -441 337 680 85 -664 61 374 361 -650 -422 329 707 -214 -588 -98 504 37 -339
4640 -339 -372 678 427 -230 -392 -193 744 140 -537 -430 155 341 129 -620 110 753 248 -194 -474 76
4660 76 273 -26 -620 -17 295 233 -658 -175 276 237 7 -319 -69 357 298 -588 -324 483 520 -235 -437 121
4682 121 530 17 -242 -168 267 273 -363 -393 -75 488 224 -308 -136 564 386 -235 -607 -2 427 -217 -733
4703 -733 109 392 295 -459 -384 53 694 15 -521 -383 374 38 -498 -351 365 681 100 -531 -57 418 20
4724 20 -223 -397 347 384 5 -538 -108 449 349 -234 -246 71 604 -139 -614 -397 759 122 -160 -239 389
4745 389 659 3 -609 76 748 31 -279 -363 85 409 -58 -308 -109 438 33 83 -236 322 417 -434 -441 275
4767 275 595 -180 -413 -461 403 243 -391 -536 165 484 -204 -411 -527 523 312 -43 -418 114 395 47
4787 47 -622 -333 687 389 -234 -152 14 454 106 -62 -125 372 218 13 -208 46 548 -140 -286 -188 196
4808 196 439 -110 -605 265 410 -374 -439 -109 586 258 -47 -203 250 449 -106 -394 129 197 390 -509 -297
4829 -297 544 488 -88 -311 -200 159 399 -580 -218 11 552 -123 -574 114 434 -43 -588 -116 182 337
4849 337 144 -435 22 462 270 -505 -115 437 450 -59 -229 -124 561 56 -305 -177 233 288 -441 -833 10
4870 10 734 258 -366 -153 429 137 -124 -375 91 255 -78 -427 -405 238 148 -353 -414 167 462 -254 -466
4891 -466 -212 525 278 -310 -199 -49 297 393 -406 -129 671 283 -168 -412 373 296 181 -549 77 444 407
4912 407 -560 -641 426 234 17 -243 -61 541 31 -333 -261 146 538 -308 -308 -78 466 236 -452 -384 27
4933 27 255 212 -467 66 604 41 -439 2 46 79 -106 -576 3 200 -106 -408 -304 256 549 -152 -300
4954 -300 151 756 156 -174 -151 106 519 -252 -378 254 358 -24 -168 101 554 172 -401 -341 194 621 376
4975 376 -403 -177 373 125 -341 -476 316 339 123 -194 -247 278 380 -275 3 76 187 -204 -438 -56 318
4996 318 214 -446 -425 70 74 -66 -447 -139 269 -61 -184 -296 260 490 150 -388 222 462 43 -638 -338
5017 -338 379 458 -163 -579 134 428 248 -407 -410 514 437 -168 -374 -7 269 260 -144 -427 250 342 -286 -17
5039 -17 340 143 -301 -276 -105 -16 295 -99 -430 206 500 264 -443 -83 41 326 -145 -324 320 535 -50
5060 -50 -498 -185 687 11 -498 -323 355 238 -241 -242 -116 550 145 -491 -512 315 517 -254 -166 81 372 357
5082 357 -403 -164 441 511 82 -395 86 213 72 -402 -118 270 99 94 -517 -181 591 397 -475 -369 226
5103 226 296 -216 -316 -124 584 57 -731 -299 212 365 -307 -304 -16 549 -8 -417 -464 523 336 -215 -355
5124 -355 181 333 -80 -565 -252 170 312 72 -381 113 216 113 -501 -360 395 235 -424 -340 350 225
5144 225 114 -247 125 475 166 -263 -304 353 358 -104 -439 254 375 459 -428 -252 308 232 -256 -276 -26 284
5166 284 302 -158 -194 121 394 153 -526 109 460 84 -366 -447 159 361 -357 -177 -30 513 113 -179 -304
5187 -304 -149 359 -82 -375 84 305 153 -535 -429 297 486 105 -441 278 289 29 -432 -99 -120 475 -83
5208 -83 -371 128 320 -62 -328 -241 494 189 58 -249 -31 225 331 -515 -243 584 151 -264 -265 -8 377
5229 377 -1 -422 -151 253 147 -352 -598 -103 343 78 -175 -182 415 465 -538 -417 -11 336 -246 -448 -82
5250 -82 599 203 -97 -221 223 475 33 20 85 185 79 -339 -622 183 307 -181 -218 -173 243 -45 -301 -175
5272 -175 219 468 -193 -295 1 344 -22 -475 -355 140 141 21 -454 -50 171 -56 -427 -118 170 279 105
5293 105 -242 291 367 327 -284 12 459 407 -386 65 206 188 -72 -313 10 264 255 -545 -153 129 369 -70
5315 -70 -296 -250 90 199 -175 -371 84 227 -128 -217 -140 -29 197 -205 -68 218 382 101 -545 174 188 262
5337 262 -720 -150 207 390 -173 -333 100 231 63 -195 -101 303 239 -197 -123 38 367 -62 -128 -149 248 410
5359 410 -100 -135 23 33 165 -71 -137 290 118 38 -215 -38 499 -89 -365 48 23 -20 -138 13 196 65
5381 65 38 -379 -135 112 -36 -296 -380 56 187 22 -440 127 204 58 -183 -29 100 139 -43 -123 -437 112
5403 112 190 -76 -269 -31 438 -8 -351 -49 73 -35 -67 -257 189 221 125 -229 -84 404 266 -140 -199 108
5425 108 185 -54 -242 -147 251 280 -502 -164 48 328 69 -647 21 34 296 -228 -18 174 352 3 -285
5446 -285 270 391 -25 -356 -439 10 188 -38 -56 -224 -8 191 -295 -41 502 237 64 -373 -242 403 -87
5467 -87 -90 -123 124 353 -12 -364 242 451 -6 -300 -198 258 107 41 -108 96 198 -64 -326 -204 569 -65
5489 -65 -101 -386 -18 476 -127 -249 -213 345 291 -217 -422 -73 -107 -21 -307 -297 338 46 -154 -290 80 424
5511 424 -430 -249 31 156 372 80 -407 54 155 -210 -42 -124 137 233 -314 -84 86 316 226 -347 -278
5532 -278 363 -18 -402 -92 128 214 16 -314 62 207 158 -208 -216 56 425 -3 -265 11 225 55 -208
5553 -208 -290 109 309 -97 -292 113 467 -111 -329 -134 111 251 190 -213 300 85 71 19 -218 261 390
5574 390 -58 -153 142 335 -115 -592 -17 505 -24 -129 -218 -170 131 -166 -331 125 256 80 -171 -139 -18
5595 -18 375 -279 -299 -156 283 39 -506 -571 169 274 -165 -261 -55 136 167 -152 -272 45 381 -198 -386 -83
5617 -83 558 108 157 -30 -180 307 61 -322 -29 386 210 -221 -93 256 225 -135 -184 -143 280 -183 -127 152
5639 152 51 106 136 -361 41 534 -267 -46 -71 147 154 -22 5 253 67 -62 -158 100 359 -152 -81 -145 88
5662 88 547 337 -192 124 297 170 -122 -103 87 143 -75 -332 -396 126 307 -401 -287 22 80 -18 -398 -25
5684 -25 373 -14 126 -151 -83 133 -19 -179 -72 433 183 -359 -197 -71 206 188 -105 17 183 313 67
5705 67 -202 496 346 -109 86 -70 79 217 -301 -235 151 354 291 -317 -23 250 51 -162 -312 283 112
5726 112 -144 -257 -28 524 16 -184 -196 408 56 -208 -141 -162 251 229 -83 298 35 70 -179 -282 181 347
5748 347 -25 -28 -140 244 34 -195 -352 88 282 -171 -517 -272 462 -198 46 -21 -51 445 70 -90 -178 369
5770 369 469 -44 -127 -32 234 -35 7 -265 132 50 -246 71 259 274 -205 -184 401 103 109 -145 -278 -79 334
5793 334 -37 -99 224 436 529 -96 -125 268 163 -138 -249 75 230 74 -407 -98 197 238 -7 -194 -238 259
5815 259 272 -376 118 145 368 -128 -219 135 42 -104 -252 -102 311 299 315 -273 -60 115 -91 -124 -164 -38 177
5838 177 11 -463 88 119 401 -312 141 239 324 161 -145 -15 710 -128 -228 -76 227 238 -384 93 134 441
5860 441 -162 -227 185 330 269 -69 -223 -83 366 131 -115 -215 221 203 -164 -356 101 321 13 -351 -116
5881 -116 503 -14 -505 -222 118 12 -40 -199 -258 87 29 -234 -142 74 -82 -374 -34 5 85 -75 -214 95
5903 95 48 20 -169 -213 187 431 220 26 40 506 229 -284 -428 -26 317 -73 -222 15 313 17 -245 -268
5925 -268 187 475 -117 -430 -153 153 146 -338 219 146 31 86 -370 -117 101 108 -177 -94 190 350 -228 -103
5947 -103 7 396 103 89 -6 131 349 -154 -229 -20 189 232 -207 -556 313 106 99 -155 -163 97 -9 -420 -106
5970 -106 95 287 -215 -275 147 77 100 -321 31 -12 285 7 -245 -148 188 241 -102 -103 -203 -89 222 -158 -91
5993 -91 375 -98 20 -37 124 119 -158 -182 43 401 -77 79 -22 222 -205 -98 -206 -48 302 -5 -97 3
6015 3 -16 -60 191 -47 152 190 -55 -113 -223 -14 108 -89 -241 412 108 222 -292 -80 98 -127 -187 -211 133
6038 133 395 62 -408 -88 113 154 -44 -392 136 185 -46 -207 71 301 136 -53 -442 303 214 -178 -397
6059 -397 141 352 52 -343 -300 256 251 6 -92 0 -39 34 -266 5 33 159 -11 -227 -68 519 -10 -208 -206
6082 -206 380 29 -89 -283 -94 254 249 -229 -58 283 50 -239 -429 219 123 379 75 8 230 163 -234 -283
6104 -283 82 2 -190 -203 -312 -169 381 -275 -263 369 38 27 -70 61 427 -89 -159 -18 -81 248 135 -254
6126 -254 23 136 30 2 -128 101 -147 -60 -45 58 196 79 -78 -216 95 71 88 -204 239 155 5 -121
6148 -121 -128 -69 279 12 -313 114 356 -20 -66 -136 33 245 -30 -454 328 514 37 -42 -144 117 42 -207
6170 -207 -284 111 215 -77 -170 14 321 -104 -160 -74 128 -173 20 -425 -287 190 71 34 -198 147 224 -230
6192 -230 -149 -132 84 52 170 -316 -110 75 -41 -120 -99 169 -3 -272 -203 35 119 -143 -92 266 184 -37 -468
6215 -468 -24 63 372 90 -131 -31 160 150 -371 -140 123 270 138 -205 148 89 68 -2 -210 190 91 -108
6237 -108 -1 -16 204 -60 149 109 47 178 -11 -97 -428 104 -262 -199 -129 151 189 -140 194 9 -38 55 -255
6260 -255 -46 347 283 -129 -109 167 299 -34 -135 -82 57 43 -137 -148 19 183 104 29 242 205 -184 80 -189
6283 -189 56 87 -79 141 25 16 431 -186 -62 -43 462 -92 -173 -32 323 278 -90 -170 -103 222 -104 -49 -129
6306 -129 50 -239 149 94 77 447 -187 -202 145 111 -111 -300 -206 53 67 -205 -142 -228 171 -105 -636 112 241
6329 241 -13 -11 -97 -132 284 10 -211 -340 263 56 -163 -45 455 310 174 -305 -119 485 94 110 -176 -258
6351 -258 271 65 -101 163 -87 166 -60 -436 134 -62 -208 -270 -380 280 142 4 -179 -184 -77 -208 -113
6372 -113 -350 158 211 88 -112 69 217 -392 -237 -93 60 22 -173 -193 -197 15 -149 84 -183 302 -21 -159
6394 -159 79 46 -14 -185 -160 294 373 -103 64 109 -30 33 12 -380 -224 84 291 -88 -105 37 284 -103 -433
6417 -433 195 28 -209 -215 -178 70 -88 -22 -111 72 -18 114 -103 162 76 197 -96 -157 -29 -102 -267 -235 37
6440 37 285 56 -214 -190 55 491 -175 -243 -155 64 327 -267 120 173 57 -87 -167 -223 412 145 -30 84
6462 84 -39 102 -6 -42 363 162 -12 -121 -190 250 230 -65 229 34 241 -218 -545 279 -186 216 -111
6483 -111 -277 202 117 -91 -383 -412 -150 -52 -106 -77 145 112 191 -153 86 251 152 -410 -395 -109 206 119 -192
6506 -192 -300 -83 -9 -153 -219 -86 313 57 -167 114 84 4 21 3 -87 -11 144 -198 -34 -131 -153 -417 7
6529 7 207 211 -259 -167 -267 76 39 -311 210 183 -242 64 -20 -252 43 -146 -187 29 339 -5 -141 -125 0
6552 0 351 -194 41 90 83 109 -150 333 -68 174 -31 -570 -68 363 190 129 -168 -180 -188 -47 -99 27 304 134
6576 134 -220 10 -75 411 48 -87 173 89 176 65 144 300 225 175 -153 -249 -48 39 -150 -29 -104 77 17
6599 17 -246 71 215 11 -33 -137 15 198 -18 77 -20 162 47 72 63 110 -14 105 -398 45 396 46 -35
6622 -35 138 217 11 -74 139 8 105 -95 -288 -202 66 53 -164 57 277 117 157 -107 -106 220 -90 -76 -314
6645 -314 217 -164 -322 28 -89 143 112 -121 -208 -31 -25 -122 -110 -141 221 -39 -24 361 226 -153 -52 -40 349
6668 349 166 -165 75 73 52 -18 -117 -432 86 393 -128 -4 -81 -9 250 137 -253 326 -250 -255 -25 -405 73
6691 73 32 -57 -212 272 214 154 -170 -151 56 259 -31 63 -88 80 178 -464 -236 182 -131 -47 -23 -23 -230 46
6715 46 -52 -107 88 46 -220 -398 148 -179 25 -114 60 94 -52 54 -274 102 -168 107 -308 -15 -63 -7
6737 -7 -91 138 167 -32 85 -378 317 49 -158 -112 157 158 147 107 -14 138 96 299 -305 -227 275 -102 27 -157
6761 -157 -10 161 -35 -300 99 91 160 -11 -105 153 -85 -79 -97 167 394 128 -10 -214 73 133 -14 -303 87
6784 87 -95 -31 -154 -40 -111 -117 -46 -265 -141 169 307 -84 -67 22 143 -213 -21 331 -136 -153 -140 -39 -9 80
6808 80 -34 -238 -151 205 114 -181 91 169 141 62 -162 237 204 221 -236 64 -259 2 80 -326 -180 228 65
6831 65 -129 25 213 136 -84 -22 30 325 86 -211 -78 196 181 8 -125 -55 -72 -126 -347 -354 -48 34 -340 -28
6855 -28 96 -5 62 -70 -34 200 38 -314 48 145 -98 1 -254 69 169 58 85 39 80 99 -126 -82 41
6878 41 127 112 -85 -300 195 -52 -163 11 68 -62 74 274 51 144 75 29 -129 184 -219 131 -186 -327
6900 -327 -54 421 19 -216 -152 90 15 -121 321 472 311 -59 -25 57 389 -70 31 81 -76 28 -50 107
6922 107 169 -43 94 -56 -68 25 -7 -11 -369 193 25 -290 -123 -97 96 10 -244 -2 155 59 -192 27 -122
6945 -122 244 18 -60 94 222 249 132 -319 159 299 76 -280 -5 305 -180 -39 -184 -175 45 215 -140
6966 -140 -182 167 17 85 -255 35 460 52 121 -105 382 -54 -100 15 25 77 -6 -62 -172 37 129 -35 101
6989 101 210 70 84 -39 -46 164 275 88 259 22 -204 -100 -109 -51 170 247 -108 -178 250 235 281 -9 208
7012 208 -52 -19 -140 -106 159 -90 -61 -315 457 -136 50 -70 -99 -276 235 191 63 166 377 -101 -160 72
7034 72 287 190 -133 350 -87 -125 162 45 -36 -107 71 258 -88 69 -136 177 -338 -134 90 211 -8 29
7056 29 -35 197 -196 141 -83 70 231 -170 -14 31 -175 230 -200 -66 206 205 303 9 112 -91 204 -31
7078 -31 33 274 255 120 104 151 -43 -154 17 257 -41 147 47 -158 -84 200 134 16 190 347 150 -202
7100 -202 -24 160 101 -1 130 35 635 16 -126 -99 -71 257 -37 24 -23 6 25 -111 198 195 -201 134 -165
7123 -165 182 2 193 -313 -234 39 161 -145 -89 151 131 -38 -166 -303 -18 72 24 -382 -99 227 -221 -24
7145 -24 25 179 -63 -67 -144 -41 -220 205 -89 -285 118 191 54 57 -220 73 56 41 -33 236 61 184 -225 -56
7169 -56 166 47 -81 -77 -15 -3 27 -18 98 175 -463 -111 -8 331 82 -319 -238 31 193 -164 -3 -232 -55
7192 -55 240 -179 175 233 -60 -120 -190 -132 6 -60 -62 202 -36 -263 101 -158 -30 -66 -276 -86 154 -175 -261
7215 -261 -40 -6 213 133 -88 -171 10 248 -186 -157 58 393 129 -87 9 84 -282 136 -49 87 161 62 -182
7238 -182 -285 162 232 66 27 -180 -13 -67 175 7 222 149 -249 337 -105 73 360 -217 -425 140 427
7259 427 63 -282 280 8 241 -33 -41 -121 214 467 -127 -317 98 14 -37 -47 74 281 270 -85 -26 -88 -139
7282 -139 281 -348 295 55 -120 -242 -192 115 -41 1 -280 -196 247 386 -105 40 96 324 -118 -234 263
7303 263 138 54 -314 -403 242 22 243 114 135 47 -18 -69 107 -83 -241 27 -229 -228 -50 -401 -296 -115 80
7326 80 -127 -8 -242 159 19 -190 -150 61 88 81 -309 -172 211 32 -185 -38 288 404 114 -88 -49 102
7348 102 171 -116 -28 -115 81 -146 -278 -97 -34 22 -27 29 -3 385 63 -52 -76 31 155 79 -37 -5 242 93
7372 93 -265 -284 -57 337 185 -533 110 454 42 -255 195 275 282 -52 2 -240 -213 107 -87 252 268 -125 58
7395 58 220 38 -1 -186 9 -203 23 109 -177 66 248 304 -86 -247 -9 49 269 27 -73 268 89 -119
7417 -119 -72 127 -112 -221 -88 -191 -257 -274 76 -279 -54 9 203 174 -175 189 -198 -22 87 -38 113 341
7439 341 100 -372 -14 376 -119 148 -51 103 221 -7 -121 245 136 -61 -309 130 190 -179 -33 -213
7459 -213 7 294 -38 -150 190 40 -107 -219 279 105 81 168 129 -50 218 -58 -211 -243 177 221 -110 -12
7481 -12 62 74 -61 -122 -187 -86 231 -328 -312 -56 -3 -5 -186 168 150 241 84 -27 344 91 145 -128 -144 22
7505 22 -16 -117 -7 104 457 146 -540 -71 -46 127 47 -188 235 329 8 -222 -122 22 -67 47 85 184 141
7528 141 -174 -161 -192 51 -354 -231 -211 329 212 -149 -185 -206 156 -160 -41 221 303 323 -209 -74 156 110 71
7551 71 -278 41 230 -274 -192 -214 -119 223 51 376 -243 117 407 -105 -145 32 296 -142 -32 24 180 281
7573 281 38 81 286 44 -8 -181 -82 160 49 -23 -114 -149 249 -127 -10 -9 -216 12 66 80 114 366 -5 -121
7597 -121 193 310 -57 -100 -432 278 240 -64 -175 -134 -139 224 -315 -325 266 46 -111 -68 -216 348 -151 -165 126
7620 126 168 318 158 -288 113 425 149 -413 -129 24 281 -167 -245 155 86 -66 -492 46 58 82 -335 -108
7642 -108 84 60 -67 27 1 -42 9 119 -63 -37 22 164 -27 -13 263 -39 -323 -89 159 51 -122 -456 -294
7665 -294 96 -112 -97 49 71 120 41 23 -8 359 479 25 -95 253 191 -109 117 -284 268 149 -120 -107 365
7688 365 -46 -7 -16 105 219 53 -130 -337 41 200 -145 -107 4 176 262 -260 -23 196 142 99 156 -93 267
7711 267 -228 -66 164 26 49 -124 -79 38 351 -135 -73 -113 224 -16 33 -9 -188 68 287 32 -39 10 -61
7734 -61 -190 -100 -329 224 192 -354 -205 184 485 91 -18 -184 213 34 -236 30 -6 129 -156 -52 -164
7755 -164 129 -113 -359 -268 52 -39 -280 -105 116 -242 -193 -239 300 113 -65 -145 181 43 316 -199 -242 -11
7777 -11 -31 14 52 59 248 278 -45 59 30 -43 -156 -288 -111 -98 109 -247 -252 -92 172 8 -382 -320 -119 130
7801 130 -202 -170 164 215 121 -379 -60 150 300 -289 0 90 -106 299 -278 138 373 -55 14 -225 161 169
7823 169 51 -71 -386 235 -1 -78 37 49 413 -302 -350 25 245 259 49 -282 177 291 71 -210 -8
7844 -8 68 45 -148 -413 263 117 -103 -90 27 239 19 100 -21 39 336 -25 -330 339 36 104 48 -82 188
7867 188 239 74 -143 338 179 73 -15 49 169 -67 -167 105 13 156 -178 -195 -52 172 56 -177 162 152
7889 152 -258 -249 -331 -219 266 48 -265 11 -34 230 241 -103 -138 -135 84 -181 -125 26 168 53 45 96 -77 231
7913 231 -114 -76 82 -11 -346 -179 59 -28 226 -332 4 265 140 3 -75 -64 166 428 16 -50 -175 169
7935 169 -35 -85 -67 128 55 -157 -234 46 184 9 198 73 -9 -112 -41 -313 242 -349 -114 -329 148 47
7957 47 182 -215 46 211 410 -218 -82 325 14 201 90 12 124 439 -8 -108 -136 203 -47 -303 -121
7978 -121 330 107 62 -230 172 174 144 -348 95 22 -104 -307 -134 -90 326 272 -22 263 407 7 -162 22
8000 22 255 -19 62 -5 29 -68 17 -171 -161 39 144 -115 -289 71 337 58 156 38 224 80 -166 -64 -271
8023 -271 299 -149 -4 -4 -49 -83 -46 -161 -1 -148 246 -41 295 169 -53 -453 -256 35 412 331 -96 -190
8045 -190 379 171 -352 -233 148 28 1 -92 -62 226 138 -163 -130 79 155 -84 -147 -31 216 370 92 -100
8067 -100 156 341 -168 44 -52 183 -166 -5 -152 206 437 -364 1 165 -164 41 -154 145 69 -102 144
8088 144 -144 80 162 74 -184 -172 75 191 -26 -278 -16 413 -101 -4 -35 77 95 -54 -113 -352 173 185 -396
8111 -396 -111 290 75 -37 -392 49 -15 -7 -342 258 -35 256 -49 -342 -106 107 -244 102 117 390 145
8132 145 -103 146 156 163 -44 -133 -142 -63 253 144 36 100 88 261 -377 -36 190 320 -183 -228 5 352 -94
8155 -94 -134 -127 125 241 -74 -218 378 109 -48 -166 39 143 -70 -45 -293 238 275 -149 -195 127 27 167
8177 167 -220 -149 263 326 -192 70 121 254 -50 109 -248 247 127 22
8191B2
$$ Imaginary data points
##PAGE= N=2
##DATA TABLE= (X++(I..I)), XYDATA
0 0 0 0 0 8 -8 0 -8 8 -16 16 -24 32 -40 41 -59 64 -80 96 -115 133 -157 181 -210 238 -275 316 -359 406
28 406 -463 521 -586 660 -738 825 -919 1025 -1140 1264 -1401 1556 -1719 1905 -2108 2337
44 2337 -2587 2873 -3193 3562 -3983 4480 -5067 5778 -6653 7774 -9255 11318 -14403 19522
58 19522 -29561 56836 -286370 -943796 -578154 -188920 -185660 -459774 -487067 -391245 -439341
69 -439341 -703901 -742619 -402359 -74938 -210030 -509122 -539004 -344905 -261715 -283245 -225605
80 -225605 -22474 100646 -45974 -268364 -168865 149350 256276 130172 125275 272141 300321
91 300321 143151 48237 214073 493550 511761 243508 103572 260298 369937 252444
101 252444 170844 287796 389107 259009 3535 -59639 158811 312925 135237 -95633
111 -95633 -54029 65136 -30703 -201085 -167532 19225 60234 -171640 -396938 -289668 -33724
122 -33724 -57274 -277972 -279555 -84873 -65338 -261514 -354379 -174754 62249 45042 -173334
133 -173334 -223258 -28800 68646 -42297 -63336 116881 237917 134317 -26120 3451 219000
144 219000 330277 197646 98398 240838 356758 212374 56454 157130 360732 373386
154 373386 179937 42328 139880 276355 174458 -15922 28422 195049 146326 -76055
164 -76055 -163332 -49293 40480 -65525 -239009 -223053 -72420 -106667 -323017 -373365 -202857
175 -202857 -130267 -270073 -392221 -322858 -177721 -184917 -348949 -390743 -196102 -65999 -200038
186 -200038 -330172 -212120 -31134 -40020 -170340 -178320 -2869 127204 28603 -98029 17403
197 17403 210817 178030 29747 59574 230972 296383 192448 98712 178865 321996 286022
208 286022 130593 151209 328162 344047 162319 70375 185865 312980 253606 77558 41359
219 41359 191171 239846 59487 -61292 57749 169978 65745 -96844 -96117 24386 45835
230 45835 -103711 -210582 -103188 14949 -91993 -252117 -208487 -75252 -92233 -223057
240 -223057 -264350 -151436 -49790 -134861 -288345 -242446 -54760 -34673 -189517 -230973 -91525
251 -91525 8213 -60563 -166609 -118448 41705 68424 -74828 -111824 53330 148788 38309
262 38309 -57272 24701 152225 147709 34988 3119 124938 204125 90123 -19837 77519
273 77519 214223 159343 10966 -4414 117343 182031 74075 -51686 15599 164063 117588
284 117588 -60974 -77269 66713 111696 -3907 -93403 -32273 72390 35255 -109721 -122898
295 -122898 26333 74699 -60614 -140671 -50388 35773 -18431 -117524 -100218 25399 61752
306 61752 -77143 -168820 -46574 86080 17364 -108904 -81908 35892 54608 -50377 -110223
317 -110223 -5326 115860 47373 -99309 -69772 73880 84761 -26356 -57740 35614 104252
328 104252 35912 -77281 -46356 97226 113618 -24066 -70629 41394 100392 10353 -73910
339 -73910 -18035 99500 96857 -43784 -106696 14082 108390 17392 -83299 -21238 78035
350 78035 44783 -70158 -93516 19105 103744 18927 -102295 -54311 66014 39089 -73056
361 -73056 -64901 46566 79357 -18921 -106097 -43902 81639 65715 -64294 -73972 50384 79616
373 79616 -33341 -92862 -6804 93611 63735 -54600 -80365 32506 88911 -11298 -80166
384 -80166 10946 96759 31507 -74619 -61733 45924 87053 -5413 -82493 -7379 84889 17099
396 17099 -92270 -48084 69678 67743 -41121 -93505 -17359 71240 26162 -84508 -65719
407 -65719 54258 59554 -58857 -96963 -2535 67919 14796 -77361 -64182 40860 62607 -45335
419 -45335 -90049 15658 84548 3260 -78927 -29552 64293 61334 -30813 -63439 29652 99282
431 99282 18843 -72157 -9474 96524 70218 -31664 -45765 42528 99675 34412 -56569 -16601
443 -16601 92949 74978 -42074 -52566 52394 88060 2220 -68601 -21541 67803 51066
454 51066 -56522 -74390 30121 64769 -38787 -99934 -25079 51180 11222 -82040 -91663 -3116
466 -3116 40949 -43772 -113674 -40471 46657 -5102 -101633 -84683 10214 39552 -32512 -90731
478 -90731 -31423 55872 17297 -77998 -49250 62689 72140 -18637 -51876 20078 87871 54807
490 54807 -22371 -4523 96690 108056 5316 -29788 62919 125691 68336 -7889 10721 90431
502 90431 100882 10278 -35698 48232 114128 37408 -54987 -20414 60945 49413 -33968 -65256
514 -65256 -783 49387 -17908 -107520 -68136 27867 8115 -90787 -105788 -29534 6952 -52760
526 -52760 -117536 -78558 12594 3553 -98808 -114600 -14528 29794 -40872 -91972 -39500 33113
538 33113 18938 -59073 -69048 25328 75633 384 -60113 4126 78759 47135 -21850 -12343
550 -12343 65464 96343 26597 -35179 24519 110271 73655 -17005 -2377 81225 90403 15269
562 15269 -27395 25903 94641 60878 -32533 -30044 59203 71046 -15789 -51975 10046 57877
574 57877 14352 -58777 -54080 24408 45452 -38239 -85251 -15555 40733 -15784 -83323 -52682
586 -52682 22369 26714 -48329 -87181 -18909 47927 -1612 -75387 -37278 45146 33104 -40929
598 -40929 -53883 14458 65786 23831 -44906 -20087 63146 59738 -22272 -32554 45340 78820
610 78820 18509 -38625 -8231 63062 58492 -23464 -44576 33325 66619 -11550 -68545 -16733
622 -16733 47249 22349 -51748 -67884 -3501 31844 -30996 -89739 -38382 31494 -3635 -80619
634 -80619 -76839 -7202 20195 -31172 -79608 -39345 29778 6764 -72270 -60317 26855 46283
646 46283 -19371 -54071 -5834 49738 30540 -29733 -20441 59816 77922 1373 -32840 33540
658 33540 86601 51747 -1577 11930 72810 83988 17448 -20399 44699 106560 58179 -14598
670 -14598 5018 68299 66611 4750 -20545 31838 78794 29027 -50053 -30152 46566 41674
682 41674 -31397 -49424 2951 27876 -21510 -78255 -55470 16584 17249 -63317 -90281 -27058
694 -27058 5405 -46564 -87520 -49631 7881 -3180 -72551 -92725 -22645 26010 -24168 -73782
706 -73782 -29133 29092 4539 -54143 -49679 18175 57151 10814 -45641 -13671 52152 35938
718 35938 -24798 -13063 53979 66065 7296 -35150 258 62281 51829 -14129 -18890 44084
730 44084 52077 -15949 -44553 10134 58156 28856 -34942 -42408 15528 38624 -17420 -51396
742 -51396 2499 48185 3767 -56856 -40605 22212 39489 -9802 -45006 -1888 47868 10955
754 10955 -48526 -18638 54268 54546 -7069 -30958 13484 55772 31732 -16367 2706 66163
766 66163 59373 -12484 -27208 35984 73094 34877 -13178 -1515 46638 45986 -13940 -31836 31141
779 31141 65584 5586 -50947 -23102 28866 20329 -32319 -48517 -2756 23826 -28876 -81945
791 -81945 -45451 14593 -5654 -66779 -71657 -25101 -6224 -46067 -85054 -54056 5436 -7445
803 -7445 -74165 -78162 -15041 8308 -34437 -60450 -24565 21904 8119 -44749 -42646 26076 53286
816 53286 183 -30709 17356 62381 38310 -3508 7091 60695 79082 29743 -6884 37736
828 37736 89176 58981 4128 17681 68293 71602 22570 -5773 29523 71466 41653 -19423
840 -19423 -9733 48283 44052 -17854 -36541 7350 35029 459 -49723 -40237 13973 16563 -44732
853 -44732 -66222 -14474 15138 -27488 -68297 -44911 3268 3094 -48379 -69920 -18916 21988
865 21988 -17234 -62917 -32919 19332 9753 -36963 -42474 4384 35611 2289 -40661 -13585
877 -13585 42722 31941 -21288 -19568 31334 48425 10670 -21077 4700 52181 43403 -12207
889 -12207 -18375 38498 57898 6598 -26291 7965 47983 32225 -15789 -22144 23765 43714
901 43714 -4531 -39993 -377 40405 10785 -37195 -30123 14040 24947 -16305 -47647 -14927
913 -14927 28605 2552 -50421 -36102 17958 19830 -28605 -48060 -10363 26910 5091 -43066
925 -43066 -33468 23276 29414 -24723 -41249 6055 36528 7106 -30429 -18045 28288 36202 -11638
938 -11638 -32975 13590 47538 10744 -29826 -7087 36326 32630 -9899 -24869 14022 44673
950 44673 9724 -34598 -8684 41788 28714 -21944 -27920 13352 35075 4429 -32435 -14672
962 -14672 31512 23969 -28018 -33212 15537 32418 -6403 -35561 -12540 25020 18250 -25781 -33581
975 -33581 13969 33975 -11817 -42309 -5410 33411 13754 -28263 -28004 14002 31655 -6921
987 -6921 -38854 -4604 37856 14021 -32504 -23555 20991 29450 -6539 -30599 -3685 33481 15445
1000 15445 -32614 -24960 27223 33363 -13930 -32806 718 29570 8994 -27987 -19884 25497
1012 25497 30614 -20085 -39955 4349 35653 6421 -29283 -17460 18518 21302 -16146 -34152
1024 -34152 5168 37508 4494 -38240 -18934 24543 21282 -15976 -26162 5849 29417 2187
1036 2187 -35861 -16023 32797 25862 -22026 -27509 12791 28969 -469 -27379 -7750 32049
1048 32049 26871 -21266 -31035 14848 36717 1408 -24945 -1401 28797 17633 -18984 -23498
1060 -23498 18312 40498 1515 -33075 -4470 32396 14257 -21589 -15485 20171 29032 -6751
1072 -6751 -35015 -6520 34967 17290 -28760 -23935 18399 22364 -13952 -31635 -3959 27466
1084 27466 11731 -31339 -30284 15447 25267 -16799 -33695 348 24803 1313 -31252 -22844
1096 -22844 15928 24940 -13900 -34941 79 28575 956 -30736 -12341 23422 21095 -14810
1108 -14810 -30212 2731 34305 10693 -28824 -12955 28856 23403 -15849 -21111 12837 33669
1120 33669 9454 -23612 -11288 29551 28435 -13992 -21187 16937 31659 760 -23041 -4710
1132 -4710 26686 22114 -16059 -26704 11097 31107 -4487 -32489 -6671 25187 10637 -25197
1144 -25197 -28338 5886 23840 -6550 -38038 -13913 23000 5993 -31711 -25490 10956 18583
1156 18583 -11318 -32888 -11105 22862 12251 -25857 -22461 18408 24626 -11701 -25877 3518
1168 3518 30983 16392 -17911 -16464 22598 34078 -3417 -21963 11467 37493 13113 -18021
1180 -18021 -8164 24340 30359 -1280 -21114 5863 32809 9167 -24768 -9890 24117 20018
1192 20018 -13343 -25385 51 23115 4111 -30041 -18820 19306 14836 -25169 -32067 2542
1204 2542 19848 -3900 -30639 -19895 13151 13640 -22574 -31428 5618 23353 -6860 -30352 -10686
1217 -10686 18566 14532 -14888 -21610 9033 28612 244 -26373 -1374 32209 18730 -14399
1229 -14399 -12816 17756 30781 5138 -19068 1535 35583 22363 -16817 -13909 22475 29627
1241 29627 -130 -18640 -407 25319 15014 -19394 -21183 15409 24095 -11685 -30169 -4675
1253 -4675 16811 956 -26111 -23565 6116 13723 -18351 -37790 -8410 18306 -3253 -32582
1265 -32582 -21085 8819 10006 -16111 -29099 -3714 22644 4856 -27103 -15387 20341 19884
1277 19884 -10408 -16958 8919 27497 10510 -15729 -6498 28489 29809 -5802 -14672 17500 32762
1290 32762 7971 -12615 1563 27958 25447 -6934 -17742 13525 32229 4841 -20541 -2541
1302 -2541 23191 13638 -15049 -19678 7288 23418 -1178 -29480 -12341 18583 8081 -23970
1314 -23970 -21257 7667 14084 -10839 -30136 -13009 16178 8782 -24471 -23899 9120 15295 -13848
1327 -13848 -26842 -3827 19518 9026 -19806 -21632 9786 21999 -6095 -22935 3573 25030
1339 25030 6679 -18810 -11868 15824 23738 -1416 -18882 2699 25742 7410 -20136 -7278
1351 -7278 21832 19160 -8519 -19559 888 21111 7057 -20677 -13300 17828 15656 -17929 -24854
1364 -24854 2755 18816 1275 -22073 -15342 11918 13258 -16882 -24914 5981 21941 -2720
1376 -2720 -23366 -8485 16081 13997 -9197 -15932 8987 25233 2446 -20609 -883 27506
1388 27506 18342 -8848 -10130 13664 25738 6333 -14493 365 28886 19349 -13164 -12432 16784
1401 16784 23318 -764 -15541 -1040 19738 11071 -16998 -18665 11197 18637 -9745 -25171 -4692
1414 -4692 13027 315 -22375 -20682 4559 12555 -14252 -32245 -8894 14720 -1694 -26368
1426 -26368 -18280 6474 8578 -13517 -25794 -5489 17218 3699 -23071 -14329 14677 14132 -10068
1439 -10068 -16009 4924 21013 8111 -13879 -7825 20560 22900 -5513 -12337 13864 27176 7341
1452 7341 -11571 -860 22428 22455 -3283 -12999 11542 27087 4486 -16430 -1145 21242 13640
1465 13640 -9654 -15173 4998 18559 -247 -22168 -8771 16393 7245 -20022 -19704 3784 11519
1478 11519 -7313 -23603 -11052 11646 5186 -22194 -21553 7127 14006 -9985 -22577 -5149 13444
1491 13444 6509 -15349 -15733 9946 19603 -4775 -19728 1808 21612 9322 -11092 -7356 13937
1504 13937 20276 168 -14459 4494 25676 10952 -13769 -5804 17873 17657 -3369 -12299 3859
1517 3859 20387 8025 -15545 -10566 15705 15893 -10182 -17168 2536 14880 530 -17954 -12002
1530 -12002 10301 11613 -13743 -22803 907 15121 -4179 -21824 -9681 10062 7236 -14044
1542 -14044 -20519 876 16462 -2002 -22297 -8474 14486 8141 -13570 -14058 5944 16410 905
1555 905 -17197 -5754 18435 13376 -12002 -11658 11860 18077 -729 -12952 -51 18493 13254
1568 13254 -10087 -11734 12477 20138 -2318 -14564 2671 18235 8394 -10630 -10213 9744 17747
1581 17747 -2478 -17735 -691 18437 5679 -15118 -9839 10292 12920 -4977 -17136 -2303
1593 -2303 15986 4734 -17565 -11003 12346 11356 -10248 -15788 1130 13844 3172 -15417 -11237
1606 -11237 11089 13019 -10145 -17130 3898 15585 721 -15205 -8098 11102 12249 -8046 -16553
1619 -16553 3652 17435 224 -17347 -5020 13936 9265 -9219 -13234 3796 15820 1266
1631 1266 -16848 -5498 15383 9304 -12176 -12051 6882 13676 -546 -14483 -4716 14283 10250
1644 10250 -12307 -13412 8962 15768 -3564 -14960 -1604 13433 8038 -10078 -11924 7917 16304
1657 16304 -3289 -16402 -431 15444 5045 -11532 -8621 8037 13552 -2909 -15335 -1400
1669 -1400 16945 6093 -14450 -8853 10834 11918 -5367 -13728 -283 14485 6297 -13843 -10109
1682 -10109 11352 12673 -7167 -13383 3313 13524 2858 -12028 -8264 10396 13162 -6405 -14478
1695 -14478 3929 15894 673 -13591 -5316 11582 10224 -6727 -13615 2407 15367 961
1707 961 -15503 -4789 13426 8072 -10044 -11849 3689 12602 301 -14677 -6516 12296 8477
1720 8477 -12237 -12896 6062 12275 -2503 -13840 -5416 10513 7522 -10708 -13397 6839 13381
1733 13381 -4652 -15498 -2023 11947 5486 -9752 -10414 5336 12885 -2460 -15084 -1114 14887
1746 14887 5766 -11393 -8359 8343 11680 -2175 -12071 -633 14947 6614 -12013 -8040 11180
1759 11180 12685 -4452 -10960 1738 13132 5305 -10320 -8114 10553 13119 -5749 -12804 3237
1772 3237 13472 2291 -10268 -5673 8762 10428 -5718 -13628 2300 14635 1189 -13866 -5429
1785 -5429 10596 7679 -7211 -11444 2027 12742 1089 -14233 -6003 11905 8020 -9935 -10896
1798 -10896 4301 11059 -214 -12069 -5555 10353 8675 -9423 -12128 5930 12312 -2538 -12140
1811 -12140 -3033 9800 6804 -8637 -11436 4664 12617 -2765 -14267 -1868 11677 4244 -9834
1824 -9834 -8617 5285 10404 -2345 -13626 -2483 12843 5380 -11428 -8097 7907 9772 -3043
1837 -3043 -10487 -372 12142 6021 -10192 -8152 10198 12193 -4435 -10271 2810 12242 4310
1850 4310 -8082 -5945 9016 12107 -3940 -11333 2946 13567 2680 -9877 -4247 9246 9440
1863 9440 -4118 -11007 1426 13113 2189 -12509 -5249 9924 7194 -7686 -10320 2194 9885
1876 9885 839 -12746 -6837 9272 6910 -9701 -11596 3195 9052 -2118 -12074 -5489 7741
1889 7741 6552 -8398 -12386 3466 10609 -2803 -12249 -2843 9364 5043 -7701 -9190 4131
1902 4131 11406 -606 -11696 -1539 11916 5261 -8539 -6644 6657 10297 -450 -9247 -1029
1915 -1029 11921 6945 -8450 -7121 8815 10669 -2561 -9045 772 10894 5409 -8009 -7082 7578
1929 7578 10914 -4313 -10978 1588 11177 2336 -8769 -6145 6168 8878 -3827 -11308 275
1942 275 11259 1842 -11135 -5332 7585 7170 -4786 -9898 426 10067 2373 -11051 -5636 8939
1956 8939 7503 -7125 -9432 2637 9129 1019 -9359 -5095 8113 7432 -6975 -10498 3752 10345
1970 10345 -474 -9647 -3403 7605 6094 -5964 -9604 3219 10666 -735 -11229 -2548 8836
1983 8836 4838 -7032 -7588 3471 8752 -858 -10736 -3006 10121 4978 -8616 -7530 5014 8223
1997 8223 -1889 -8865 -1649 8984 5379 -8071 -8189 6429 9970 -2683 -9129 496 9141 3917
2011 3917 -7058 -6269 6545 10311 -2395 -10335 423 10407 2881 -7776 -4173 6424 7849 -2840
2025 -2840 -8993 105 10596 3185 -9372 -4984 7343 6491 -4960 -8208 1029 8833 1894 -9389
2039 -9389 -6078 7459 7409 -6371 -9100 2864 8246 -346 -9123 -4318 6571 6914 -5346 -9323
2053 -9323 2231 9488 -301 -9183 -2253 7905 5280 -5383 -7826 2551 9612 712 -9513 -2248
2067 -2248 9263 4898 -6836 -6491 4708 8489 -225 -8308 -2520 8508 5700 -7167 -7029 5511
2081 5511 7867 -2565 -8693 -1592 7480 4196 -6731 -7383 4669 8158 -3656 -10006 -217 7988
2095 7988 2228 -7566 -6453 4090 6970 -2617 -9697 -387 8791 2266 -8559 -4825 5715 6708
2109 6708 -2849 -7807 76 8959 3446 -7748 -4782 7675 7807 -3553 -6773 2733 8967 2937
2123 2937 -6044 -3922 7541 8129 -3262 -7366 3770 9651 845 -6740 -2443 6747 6308 -3536 -7470
2138 -7470 1916 9255 506 -8957 -2593 7093 4099 -6003 -7109 1479 6985 -481 -9862 -4288 6593
2153 6593 3773 -7745 -7713 2571 5722 -2266 -8772 -3831 5624 3815 -7068 -7716 3191 7280 -3024
2168 -3024 -8613 -828 7092 3487 -6037 -6151 3928 8220 -1261 -8023 516 8952 3135 -6127 -3883
2183 -3883 5953 8044 -798 -6354 410 9182 4309 -6742 -3524 7083 7238 -2286 -6015 1007 7913
2198 7913 3529 -6104 -4713 6461 6880 -3757 -7166 2012 7378 1078 -6742 -3865 4813 5618 -4320
2213 -4320 -8308 1387 7629 -462 -8447 -3300 4893 4155 -4648 -7479 641 7161 324 -8698 -3634
2228 -3634 6479 4162 -5780 -6461 2345 6498 47 -7203 -3017 6700 4914 -5261 -6281 4040
2242 4040 7234 -1037 -6400 -1401 6347 4657 -4615 -5906 4000 7996 -1020 -7367 111 7306 3352
2257 3352 -5085 -4833 3749 6978 -714 -7420 -590 8120 3167 -6200 -4272 4704 5538 -2149 -6705
2272 -6705 -1096 6422 2967 -6667 -5238 4928 5862 -3473 -6667 528 6122 1980 -6412 -4953 4579
2287 4579 5973 -3558 -7201 1366 7046 631 -6148 -2773 5078 5397 -3185 -6386 1419 7732 1370
2302 1370 -6786 -2384 6381 4647 -3294 -5490 1769 6922 1572 -6789 -2582 6651 5054 -4518 -5475
2317 -5475 3069 6613 -173 -5940 -2155 5299 4696 -4432 -6048 3010 6750 -1751 -6927 -1412 5289
2332 5289 3085 -4710 -6045 2259 6321 -1066 -7858 -1552 6496 2423 -6205 -4927 2795 5127 -1326
2347 -1326 -7036 -1595 5845 2671 -6314 -4640 4155 5439 -2062 -5989 -331 5891 2882 -5141 -4687
2362 -4687 4791 6259 -2508 -5963 1120 6553 2245 -4670 -3331 4624 5956 -1825 -6001 1186 7819
2377 7819 1549 -5492 -2453 5069 4474 -2316 -5274 945 6797 1651 -6186 -2778 5945 4502 -3959
2392 -3959 -5069 1556 5550 584 -6081 -2902 5293 4286 -4739 -6152 2237 5594 -700 -5871 -2425
2407 -2425 4561 3469 -4146 -6260 1852 6320 -1041 -6658 -1412 5206 2510 -4370 -4863 2175 5935
2422 5935 -406 -6460 -1534 6195 3180 -5374 -4055 3455 4966 -858 -5448 -656 5840 3220 -4941
2437 -4941 -4594 4377 5613 -2155 -5495 327 5252 2273 -4371 -4254 3589 5681 -2051 -5909 743
2452 743 6113 1076 -5060 -3075 3643 4388 -2113 -5765 340 6264 1322 -6348 -2611 4784 3988 -2933
2468 -2933 -5031 719 5391 1276 -5606 -3174 5157 4330 -3642 -4952 2025 5298 398 -4895 -2324
2483 -2324 4676 4378 -3432 -5584 2368 5895 -466 -5284 -975 4834 3294 -2935 -4780 1767 5908
2498 5908 -198 -6150 -1472 5347 2679 -4009 -3988 2330 4959 -494 -5817 -1562 5371 2791 -4976
2513 -4976 -4278 3407 4526 -1722 -5236 -928 4544 2246 -4538 -4486 3118 4998 -2261 -5131 -54 5044
2529 5044 1634 -4200 -3577 2931 5066 -1541 -6063 290 5738 1160 -5065 -2396 3987 4146 -1595
2544 -1595 -5202 180 5519 1818 -5287 -3058 4498 3930 -2853 -4536 868 4848 1001 -4804 -2726
2559 -2726 4054 4130 -3127 -5095 1907 4872 115 -4667 -1997 4054 3408 -2694 -4883 1905 5709 -227
2575 -227 -5429 -1265 4402 2666 -3060 -3753 1366 4982 47 -5155 -1545 5156 2723 -4316 -3686 2671
2591 2671 4237 -1022 -4688 -1207 4932 3093 -4003 -4281 2960 4597 -1470 -5105 -355 4377 1751
2606 1751 -3414 -3554 2444 5068 -1908 -5099 38 4898 1196 -4066 -3017 2665 4102 -1368 -5190
2621 -5190 -282 5088 1480 -4843 -2682 3574 3470 -2007 -4579 354 4306 1460 -4291 -3087 4097
2636 4097 3985 -2659 -4012 1268 4557 784 -3901 -2218 3593 4117 -2421 -4362 1614 5257 47
2651 47 -4774 -1207 3650 2998 -2199 -3745 1283 5047 328 -4765 -1361 4420 2669 -2976 -3329 1802
2667 1802 4264 469 -4359 -1633 4604 2938 -3572 -3587 2773 4151 -1208 -3806 -913 4051 2867
2682 2867 -3388 -3909 2454 4569 -1602 -4455 -306 4112 1504 -3523 -3105 1978 4068 -1143 -4962
2697 -4962 -265 4415 1180 -4431 -2620 2624 3475 -1338 -4271 -253 4207 1388 -4278 -2685 3408
2712 3408 3516 -2373 -4072 542 3650 1070 -4017 -2819 3150 3461 -2407 -4406 1241 4374 426
2727 426 -3636 -1571 3197 3225 -2165 -4057 951 4813 91 -4551 -1323 3921 2745 -2018 -2922 1293
2743 1293 4376 627 -4293 -1002 4244 2907 -2691 -2874 2184 3911 56 -3634 -1046 3680 3129
2758 3129 -2785 -3738 2396 4239 -1121 -3913 -642 3395 1731 -3175 -3597 2001 3881 -955 -4805
2773 -4805 -338 3591 930 -3450 -2800 1894 3503 -1021 -4382 -856 4067 1269 -3903 -2546 2690
2788 2690 2708 -1627 -3657 -296 3688 1546 -3530 -2557 3282 3119 -1793 -3678 679 3716 967 -2929
2804 -2929 -1969 3192 3748 -1667 -3617 1087 4572 371 -3333 -1026 3358 2619 -1676 -3266 1073 4003
2820 4003 162 -4047 -1127 3579 2395 -2400 -2641 1263 3283 254 -3663 -1571 3366 2349 -2750
2835 -2750 -3149 1175 3181 -884 -3762 -1483 2586 1830 -2910 -3462 1719 3664 -1216 -4132 -563 3087
2851 3087 970 -2667 -2591 1716 3388 -790 -4052 -170 4045 1283 -3211 -1869 2699 3059 -636 -3206
2867 -3206 -342 3655 1954 -3176 -2065 2916 3208 -1318 -3286 344 3360 1411 -2844 -2319 2856
2882 2856 3346 -1468 -3532 456 3349 687 -3276 -1757 2025 2550 -1552 -3719 495 3589 71
2897 71 -3726 -1556 2481 2024 -1748 -2960 341 3468 266 -3480 -1341 3203 2097 -2702 -2799 1518
2913 1518 3196 238 -3005 -1086 3084 2140 -1680 -2893 2039 3608 -168 -2792 -366 2876 2033
2928 2033 -1751 -2669 1469 3566 -485 -3375 -307 3301 1351 -2551 -2359 1395 2851 -733 -3561
2943 -3561 -842 3004 770 -3375 -2405 1774 2460 -1269 -3131 -688 2980 1012 -3064 -2461 1868 2756
2959 2756 -1695 -3766 450 2857 544 -2836 -1830 1812 2763 -1417 -3007 757 3470 776 -2878
2974 -2878 -1128 2533 2602 -705 -2603 636 3725 1006 -2663 -674 3538 2249 -1485 -1739 1206 2869
2990 2869 948 -2524 -1138 2926 2554 -2158 -2696 1460 2654 133 -2890 -1326 2157 1756 -1857 -2815
3006 -2815 977 2942 -674 -3189 -1069 2227 1187 -2321 -2840 642 2478 -577 -3736 -836 2729
3021 2729 795 -2643 -2221 1414 2120 -602 -2786 -621 2294 1483 -2510 -2251 2203 2604 -1079 -2327
3037 -2327 158 2521 1498 -1822 -1817 2213 3102 -765 -2741 658 3279 738 -2042 -1721 1885 2643
3053 2643 -642 -2586 221 3285 890 -2757 -1287 2156 2137 -1151 -2673 202 2521 820 -2974
3068 -2974 -1706 2196 2126 -1705 -2517 584 2298 4 -2654 -1578 1817 1901 -1699 -2850 1155 2877
3084 2877 -231 -2763 -861 1986 1819 -1349 -2357 948 3053 -10 -2944 10 2519 1335 -1576
3099 -1576 -1672 1289 2399 -124 -2332 -523 2688 1457 -2333 -2015 1504 2147 -395 -2361 -682 2204
3115 2204 1223 -2313 -2089 1768 2503 -1165 -2571 -115 2134 1073 -1991 -1989 1553 2244 -571 -2696 49
3132 49 2647 524 -2345 -1159 1327 1941 -600 -2427 76 2631 714 -2394 -1379 2424 1595 -1295
3148 -1295 -1640 661 2310 815 -1749 -1788 2545 1972 -1279 -2011 919 2279 28 -2141 -954 1829
3164 1829 1783 -1160 -2523 696 2768 75 -2407 -748 1823 1684 -1626 -1975 764 2462 -74 -2549
3180 -2549 -693 1948 1516 -1964 -1635 843 1873 -478 -2075 -435 2212 1643 -1618 -2127 1236 2323
3196 2323 -687 -2270 -444 1882 1203 -1493 -1875 1059 2508 -534 -2329 128 2204 918 -1441
3211 -1441 -1530 1111 2131 -319 -2362 -20 2844 1070 -2098 -1020 1619 1819 -470 -2154 -268 2253
3227 2253 952 -2087 -1441 1693 1839 -1116 -2158 301 2014 454 -1760 -1361 1729 1869 -1089 -2280
3243 -2280 401 2056 -76 -2198 -753 1286 1322 -971 -2157 305 2312 55 -2333 -841 1785
3258 1785 1236 -1284 -1643 464 2031 26 -1950 -933 2110 1292 -1743 -1681 743 1800 -356 -1741
3274 -1741 -598 1687 1334 -1212 -1739 1201 2067 -248 -2095 -17 1776 1020 -1412 -1748 707 2246
3290 2246 -447 -1895 -105 2382 904 -1800 -1033 1255 1714 -92 -2113 -269 1995 1022 -1919 -1162
3306 -1162 1511 1931 -627 -1435 -14 1599 935 -1753 -1498 1575 1763 -811 -1763 232 2152 474
3322 474 -1394 -901 854 1448 -912 -2041 300 2156 204 -2171 -787 1650 1041 -1267 -1612 246
3338 246 1802 158 -2234 -1159 1540 1085 -1433 -1754 585 1561 24 -2155 -994 1500 1367 -1322
3354 -1322 -2041 716 1563 -138 -1624 -396 1368 1301 -1202 -1683 782 1807 -242 -1950 -300 1915
3370 1915 863 -1353 -909 888 1504 209 -1831 -145 2244 623 -1327 -1213 996 1698 -229 -1253
3386 -1253 -198 1898 1250 -1506 -1324 1159 1772 -838 -1616 144 1873 429 -1337 -1307 1086 1630 -640
3403 -640 -2139 408 1750 542 -1763 -1012 910 972 -558 -1727 -134 1703 497 -2023 -982 1389
3419 1389 1101 -778 -1670 223 1728 239 -1557 -1176 1487 1272 -1096 -1778 641 1509 301 -1731
3435 -1731 -955 1195 1660 -724 -1834 873 1779 -23 -1626 -356 1400 1051 -1067 -1491 628 1697
3451 1697 266 -1594 -405 2054 885 -1435 -1044 688 1355 -303 -1689 -673 1332 947 -1412 -1265
3467 -1265 1069 1570 -497 -1439 -179 1254 950 -1025 -1518 941 1492 -501 -1494 283 1533 535 -1438
3484 -1438 -1225 946 1468 -179 -1967 -3 1749 386 -1691 -971 914 1241 -605 -1466 125 1815
3500 1815 414 -1456 -955 1203 1203 -867 -1534 138 1358 206 -1645 -1016 1022 1525 -1018 -1683 283
3517 283 1612 -98 -1509 -805 1189 1118 -900 -1580 95 1703 268 -1441 -268 1241 836 -853
3533 -853 -1263 313 1466 253 -1717 -557 1521 1039 -956 -1113 1175 1369 -195 -1252 -571 1143
3549 1143 839 -896 -1270 639 1475 -241 -1550 -390 1261 495 -866 -1109 295 1566 -454 -1644
3565 -1644 -366 1229 463 -1192 -920 736 1413 -152 -1476 -225 1309 335 -1466 -1200 761 1162
3581 1162 -574 -1517 -339 1283 750 -1306 -1276 1152 1393 -712 -1160 93 1339 452 -915 -606 1193
3598 1193 1536 -532 -1365 338 1793 303 -1195 -525 1240 1218 -476 -1111 78 1505 547 -1362 -704
3615 -704 1305 1002 -747 -1117 22 1446 253 -1165 -771 801 1110 -1158 -1290 432 1071 -539 -1345
3632 -1345 -288 1145 816 -696 -1396 448 1496 -392 -1506 -514 1218 715 -924 -889 508 1313 -178
3649 -178 -1606 -324 1220 688 -1070 -888 743 908 -180 -1084 -305 1355 592 -1063 -927 709 1250
3666 1250 -374 -1104 -215 1241 646 -957 -765 839 1088 -505 -1634 -214 1384 70 -1117 -717
3682 -717 753 1090 -480 -1450 68 1046 493 -1355 -578 1037 749 -340 -1119 157 1140 522 -943
3699 -943 -567 1239 910 -737 -1027 -194 1096 142 -977 -723 1108 1340 -519 -954 674 1565 592 -1014
3717 -1014 -384 905 915 -568 -1277 465 1299 -65 -1320 -307 1203 402 -785 -1018 -19 1181 13
3734 13 -1360 -532 774 729 -1175 -1080 513 842 -288 -1234 -501 631 593 -993 -1035 479 1431 -321 -1307
3753 -1307 111 1017 552 -562 -886 664 1418 -89 -1231 -54 1363 451 -1067 -389 892 1180 -101
3770 -101 -963 -34 1251 766 -911 -520 808 1181 -522 -978 -236 916 570 -1073 -683 632 963 -384
3788 -384 -1023 22 1035 184 -1189 -372 594 587 -534 -1213 319 923 141 -814 -639 946 868 -457 -797
3807 -797 310 1146 75 -1297 -507 697 617 -836 -869 390 871 -291 -1055 -868 982 746 -497 -1202
3825 -1202 558 1124 -231 -963 -38 1030 639 -679 -785 262 1395 -153 -1539 -48 1222 678
3841 678 -682 -727 609 950 -253 -1051 -6 1183 425 -988 -511 299 705 -154 -926 -293 998 775
3859 775 -491 -501 631 805 -471 -890 449 951 209 -779 -388 421 772 -539 -1053 -198 1164 182
3877 182 -1074 -620 652 849 -176 -714 78 1036 172 -771 -249 968 611 -678 -831 362 701 268
3895 268 -1047 -674 700 539 -674 -697 132 785 -63 -899 -403 707 769 -816 -1255 86 944 -75
3913 -75 -1202 -341 697 392 -706 -889 271 1188 -77 -1052 -402 806 513 -590 -409 381 894 -194
3931 -194 -682 -391 868 620 -662 -523 566 832 -53 -398 -61 903 387 -682 -718 634 808 -136 -1064
3950 -1064 -169 935 407 -754 -585 623 873 -204 -1053 142 939 113 -924 -507 750 623 -275
3967 -275 -741 -65 824 283 -1087 -363 540 620 -193 -956 58 872 270 -677 -711 682 726 -380 -1180 64
3987 64 955 -236 -683 -160 758 1067 -361 -1046 26 875 50 -737 -186 731 216 -657 -725 41 686 137
4007 137 -904 -604 946 589 -705 -872 651 715 -1 -724 -308 919 646 -407 -719 269 895 -132
4025 -132 -1012 12 566 404 -629 -330 334 847 -44 -1032 -206 561 307 -837 -402 427 576 -440 -849
4044 -849 -158 489 82 -772 -810 756 844 -393 -507 62 824 497 -783 -751 719 981 -268 -1124 261
4063 261 940 162 -728 -702 625 549 -441 -769 81 662 -183 -674 -568 759 389 -313 -886 128 651 28
4083 28 -1097 -593 587 589 -724 -868 3 505 -54 -605 -399 830 347 -713 -726 407 686 66 -910
4102 -910 -359 353 338 -334 -563 530 787 26 -922 -127 892 389 -640 -761 376 1019 -62 -898 -169
4121 -169 549 256 -871 -559 498 522 -139 -665 -26 721 443 -490 -691 627 934 -153 -534 68 550
4140 550 396 -371 -395 110 707 -154 -659 -65 830 328 -684 -375 180 733 -216 -728 -322 827 27 -962
4160 -962 -355 750 571 -450 -404 216 403 260 -742 -381 460 414 -498 -513 284 998 377 -454 -321 468
4180 468 450 -497 -576 -80 905 40 -718 -337 460 455 -170 -833 75 592 -138 -759 -303 629 5 -736 -728 404
4202 404 645 273 -835 -399 900 410 -493 -579 234 575 -158 -698 -222 519 224 -478 -682 695 660 -232
4222 -232 -672 -62 581 585 -577 -557 494 397 -251 -473 208 728 323 -521 -495 511 350 -125 -390 -333 656
4243 656 459 -599 -409 815 704 -501 -731 -28 540 178 -748 -295 546 680 59 -473 -28 993 146
4262 146 -766 -419 530 529 -355 -788 370 627 232 -606 -219 517 641 -447 -220 248 753 195 -540 -434
4282 -434 452 548 -242 -395 407 852 -96 -868 -418 487 440 -320 -533 160 482 -132 -716 -112 479 483 -64
4303 -64 -622 130 864 193 -453 -306 740 285 -534 -407 -31 161 -250 -837 -179 257 318 -690 -544 302
4323 302 745 -495 -811 -95 413 391 -393 -502 193 608 -328 -664 131 749 252 -451 -558 346 604 46
4343 46 -815 11 712 321 -392 -325 364 573 -221 -664 196 366 221 -661 -701 398 432 -440 -592 -89 464
4364 464 -130 -414 -274 696 511 -337 -520 50 269 437 -161 4 284 -41 -598 -645 297 762 28 -607
4384 -607 -333 297 517 -251 -545 74 554 32 -840 -236 1048 532 -513 -476 133 414 97 -798 -24 489
4404 489 291 -494 -458 514 67 -28 -636 139 488 443 -297 -523 473 572 -53 -458 255 708 527 -483 -469
4425 -469 381 597 135 -456 -8 580 53 -373 -368 360 539 -144 -234 -101 489 142 -437 -521 275 341 -150 -668
4447 -668 353 542 120 -547 -272 157 184 -270 -553 117 644 252 -428 -608 505 290 -412 -309 512 271
4467 271 -48 -823 -230 581 553 -452 -553 217 443 357 -827 -139 176 543 -524 -486 103 315 -84 -672
4487 -672 -303 315 265 -387 -491 226 614 -51 -356 -110 501 447 -126 -242 221 530 -16 -510 122 616 226
4508 226 -668 -308 89 521 14 -566 -82 198 436 -522 -502 245 493 -85 -303 -11 379 277 -266 -557
4528 -557 303 672 -204 -377 -379 565 126 -606 -443 123 937 -66 -366 76 520 361 -431 -339 545 468 -20
4549 -20 -389 72 600 307 -438 -229 461 406 -227 -429 -89 502 65 -598 -194 515 530 -367 -278 221 470
4570 470 -57 -552 -238 274 600 -56 -388 -64 335 17 -344 -67 483 221 -189 -376 45 444 -9 -634
4590 -634 -106 363 339 -88 -486 362 701 -11 -516 -241 180 546 -204 -222 95 414 -84 -863 -45 610 321
4611 321 -149 -296 90 784 -93 -648 5 603 26 -210 -358 120 303 101 -688 -171 765 -102 -579 -271
4631 -271 166 511 -196 -249 72 422 265 -499 -623 645 454 -309 -409 -58 250 32 -539 -581 240 253 -120
4652 -120 -667 293 572 -126 -277 -514 283 556 -497 -451 42 661 172 -600 -513 453 319 -255 -190 134 360
4673 360 66 -624 -61 485 132 -38 -326 135 524 -154 -365 -206 335 163 -209 -454 182 271 -348 -617
4693 -617 99 365 319 -214 -483 -78 536 -151 -678 -41 552 322 -305 -176 468 314 -100 -446 41 413
4713 413 347 -601 -169 227 608 -124 -540 44 409 276 -61 -186 123 515 -10 -479 7 386 38 -216
4733 -216 -205 352 379 49 -422 115 586 264 -567 -130 424 220 -239 -442 -187 379 316 -426 -265 599 534
4754 534 -281 -529 129 205 131 -527 -272 185 503 -313 -795 340 620 -96 -495 26 285 346 -605 -692 58
4775 58 606 -10 -742 -194 444 265 -388 -314 303 733 -79 -615 162 263 606 -367 -275 647 643 218 -670 -338
4797 -338 149 310 -240 -239 314 330 14 -607 -70 627 382 -303 -95 -43 260 4 -714 -288 117 387 -503
4818 -503 -356 573 86 -120 -367 11 121 235 -561 -407 30 349 -148 -472 48 260 245 -470 -318 331
4838 331 549 -23 -525 284 641 -96 -552 -134 290 198 -256 -418 79 213 -38 -194 -313 319 321 -188 -355
4859 -355 178 570 8 -252 -466 493 224 -524 -481 318 210 -208 -357 106 427 303 -270 -258 327 436 -50
4880 -50 -425 111 438 90 -260 -329 537 500 -14 -559 -298 592 415 -515 -323 205 613 50 -423 -241 851
4901 851 202 -438 -383 241 211 -536 -322 264 429 235 -270 -503 193 505 -210 -472 -205 403 253 -455 -116
4922 -116 274 80 -376 -553 209 358 327 -161 -6 336 323 -214 -798 44 578 28 -884 -247 367 402 -115
4943 -115 -368 -82 452 118 -487 -104 588 291 -601 -479 252 341 49 -504 -12 436 427 -308 -406 247 478
4964 478 -139 -641 -203 461 420 -14 -429 114 702 -141 -549 -237 386 -181 -598 -349 103 526 -349 -268 -164
4985 -164 234 -11 -440 -403 359 498 -187 -467 19 358 115 -88 -249 512 228 -548 -551 98 462 94 -86
5006 -86 -241 308 396 -289 -133 -317 233 -51 -294 169 297 141 -231 -520 85 468 115 -692 -321 134 412
5027 412 -266 -462 1 153 119 -544 -318 289 414 -615 -732 101 573 -50 -813 158 701 415 -189 -517
5047 -517 -54 543 148 -284 62 237 457 -190 -390 294 339 -6 -472 -19 374 254 -663 -282 112 253
5067 253 -122 -543 -26 558 255 -22 -550 236 498 -441 -348 153 -7 377 -247 -519 272 291 -134 -792 209
5088 209 340 -21 -653 -256 242 106 64 -561 -341 393 12 -345 -18 150 484 -446 -436 -132 477 388 -152
5109 -152 193 46 376 -501 -414 -30 164 -242 -525 -132 405 616 -267 -304 238 643 -235 -525 -103 353 208
5130 208 -234 -706 -18 489 72 -337 19 268 -119 -155 -77 237 226 28 -466 -63 424 183 -307 -309 63 308
5152 308 -88 -717 169 415 127 -315 -208 387 282 -90 -391 74 667 -111 -610 -342 269 403 -103 -63
5172 -63 -231 260 351 -500 -112 266 488 -26 -518 -193 341 9 -367 -156 474 211 -361 -133 31 382 0
5193 0 -567 197 191 477 -262 -177 258 319 -94 -485 -199 347 161 -249 -628 -27 110 204 -525 127 622 -219
5215 -219 -213 -253 252 591 20 -134 137 243 139 -579 -192 192 578 -161 -36 20 281 237 12 -146 317 235
5237 235 -375 -287 191 277 194 -157 -169 238 410 -242 -391 51 644 -158 -237 -113 609 218 -460 -289 -126 30
5259 30 240 -167 -90 246 117 -339 -168 121 172 26 -367 -462 69 -125 -95 -253 -36 449 -144 -194 -197 633 469
5282 469 -194 -580 -163 239 -194 -156 -238 175 43 -294 -231 82 524 312 -196 -14 432 267 -122 -387 206
5303 206 141 -223 14 -414 403 20 -337 -154 120 486 -53 -208 -129 529 130 -259 -158 218 253 -340 -489
5324 -489 270 414 105 -416 -47 16 165 -10 -334 -179 251 135 -458 -227 -61 512 -102 -370 212 295 108
5345 108 -404 62 264 331 -225 -369 205 340 105 -72 -129 209 435 -92 -194 -133 251 54 -191 -442 286
5366 286 310 -120 -222 -79 311 163 -650 210 552 259 -213 -520 10 434 113 -196 -53 42 123 -142 -188
5387 -188 -79 210 -211 -269 -156 358 226 -217 -283 574 196 -7 -516 -77 280 73 -329 -421 -93 372 106
5408 106 -324 142 380 -238 -122 -241 145 384 -135 -212 -101 533 156 -282 24 390 207 -190 -391 178
5428 178 265 255 2 -81 253 198 100 -139 64 338 -33 -217 83 199 330 -413 -135 52 415 -42 -201 -246
5450 -246 107 137 -16 -531 126 430 -12 -169 121 334 -10 -438 -175 152 -64 -114 -70 -26 417 372 -395 -238
5472 -238 388 423 -65 -227 -282 447 1 89 -453 53 537 174 37 295 459 -8 -174 25 75 489 25
5493 25 -307 196 102 252 -181 -271 280 37 -355 -365 67 348 -17 -226 -223 516 130 -10 -506 -214 174 75
5515 75 77 68 164 560 117 -118 -100 261 -171 -94 -91 269 2 -75 -541 -140 441 119 -226 -83 339 -31 -177 21
5539 21 -208 238 91 -431 -35 208 44 -87 -297 195 -32 -64 -211 -279 152 207 -72 -449 478 232 258 7
5561 7 103 550 160 -160 -244 134 277 191 -52 -255 481 -14 -108 -124 29 9 -191 -189 -16 168 62 -155 -574
5584 -574 330 211 75 -294 -3 438 -18 24 -477 -18 200 -52 -383 142 373 -115 -364 -362 -36 341 -26
5605 -26 -109 101 437 -236 -345 -101 112 163 -105 -459 -52 260 191 -195 -399 54 200 -322 -419 118 -97 48
5627 48 174 106 -147 52 -150 -507 48 150 129 -115 -67 239 22 -95 -229 43 539 197 -303 -265 336 144
5649 144 9 -306 278 364 -112 45 -286 380 171 -247 -294 152 -35 175 -470 -308 323 198 -83 -297 271
5670 271 292 -146 28 126 491 220 -252 -178 -163 298 -34 -380 -118 149 8 -469 25 -113 325 -40 -154
5691 -154 214 -239 218 -136 -157 195 62 -382 -388 -145 149 133 -259 -137 338 236 -146 -90 -172 44 -114 -455
5713 -455 -290 32 263 -24 -258 127 233 -106 -202 -252 140 -41 -300 -216 -274 244 -105 -207 3 -199 119
5734 119 -224 -20 375 226 88 -350 -204 302 171 -294 -55 165 144 -89 -346 29 153 -32 18 -591 98
5755 98 154 272 69 113 233 203 -430 -394 219 236 113 -390 27 223 110 266 -45 -48 450 105 -383 -130 378
5778 378 356 -93 -282 31 346 155 -195 18 129 194 -99 -243 103 286 -282 -295 -101 -11 2 -199 -269 59
5800 59 306 -149 -421 69 161 265 -246 -36 83 184 -301 -476 141 179 149 -140 -65 49 219 -121 -143 132
5822 132 351 86 -117 12 16 -149 20 -422 586 159 -183 -101 -161 134 68 19 -54 10 226 -110 -175 -104 504
5845 504 126 -285 -84 113 479 15 -504 -29 271 250 -142 -65 -46 271 -317 -115 71 294 126 -199 -161
5866 -161 196 -35 -232 -238 -228 72 30 -231 -27 143 404 -90 -234 10 445 398 -333 -318 152 401 -105 -216
5888 -216 91 160 132 -201 -219 293 4 26 -362 113 313 159 88 1 140 546 -2 -7 -13 226 -3 -246 -96
5911 -96 -39 253 -194 270 -134 217 -215 -435 61 54 209 -197 -46 -34 360 -260 -365 -293 222 -50 19 -240
5933 -240 179 236 -219 -82 16 -9 149 -425 -341 253 368 48 -324 -24 348 181 -49 -134 -14 450 -71 -270
5955 -270 -197 313 26 -448 -116 69 268 229 -393 118 178 -74 -323 -249 -9 99 -170 -149 114 269 111 -283
5977 -283 -265 471 288 -110 -266 -295 72 -141 131 -155 195 333 -246 -179 24 135 69 137 -122 -15 -189 148
5999 148 -309 -198 91 30 -219 -100 233 185 -80 -66 402 42 78 105 -60 246 207 -147 -738 -33 77 57
6021 57 9 -64 43 290 -175 -148 164 227 23 -260 35 213 338 61 -295 101 20 -102 -470 46 90 -112
6043 -112 -284 -46 146 211 214 -301 99 316 -17 -445 -226 205 643 -216 -335 -182 381 169 -283 -4 129
6064 129 251 -489 -193 158 356 205 -303 -69 279 57 -188 -83 522 -146 253 -358 -187 -212 253 -75
6084 -75 -151 -185 -76 307 29 23 -26 196 -168 -23 9 -36 -118 -250 54 127 138 -4 -16 117 212 74 -146 -307
6108 -307 70 -20 -295 -230 315 19 -97 30 -179 160 -136 -216 31 -82 50 -5 -287 -25 202 -96 -94 -333
6130 -333 295 228 -150 -308 136 434 -78 -108 -25 50 343 133 -134 194 -76 -82 -321 -147 -19 180 -263 -319
6152 -319 229 -5 56 -183 132 106 142 -431 -21 -11 209 -171 -42 8 188 144 -419 16 131 -26 73 -81
6174 -81 -48 14 -206 -242 197 298 335 55 -335 -200 78 237 -226 -445 223 178 -215 -333 98 381 13 -177
6196 -177 -298 -4 178 127 -182 141 126 113 -243 -83 -114 57 36 -271 5 383 38 -274 14 -157 103 -288
6218 -288 -245 -151 96 195 -250 38 62 60 -84 7 -77 -131 -139 -100 -154 238 466 -156 -145 -90 600 -11 51 -286 312
6243 312 -1 -348 -337 217 438 214 -376 -264 337 411 -191 -39 212 135 -40 -154 15 598 268 -114 -134
6264 -134 -94 420 -231 4 211 79 -30 -227 -109 310 17 109 -20 -222 -36 228 -198 -44 55 -106 57
6285 57 -5 -156 212 26 -422 -196 15 337 -110 15 99 -5 17 100 74 185 201 -107 -48 -23 174 111 -238
6308 -238 -259 200 270 -179 -358 271 598 -15 -258 -273 164 245 -309 10 64 133 164 -289 -38 267 398 -82
6330 -82 -300 -321 -184 279 -117 -195 216 -71 -60 -75 331 -92 27 -180 85 233 -26 -8 55 13 -19 54 56 14
6354 14 19 238 145 -126 -199 142 150 -67 38 604 -39 -351 246 95 227 -113 -198 -54 130 82 -462 96 166
6377 166 143 30 -19 -81 431 123 130 -76 -68 337 -51 -267 81 210 32 -214 -228 115 106 -160 -8 -284 352
6400 352 -72 172 -48 120 59 -14 -54 -93 216 -140 -235 -101 244 -119 18 109 222 -117 -272 -18 -19 -14 66 -254
6424 -254 -41 268 193 121 1 4 55 78 53 -223 179 471 -60 -101 -63 143 17 -191 -151 -137 292 -157 -20 379
6448 379 66 86 -91 -239 -148 116 27 -47 80 183 -215 -320 396 204 237 61 -210 151 318 -218 -281 76
6470 76 -103 160 -244 -339 310 228 105 -302 -77 167 239 -62 60 -335 -98 105 -143 -4 40 111 -157 57
6492 57 48 -279 -171 -54 -32 207 -341 -202 -11 2 196 -11 -323 24 -124 66 -42 -115 146 60 -51 -141 22
6515 22 30 -100 -237 -116 -161 113 -69 -109 184 285 3 -202 -350 23 175 10 110 127 59 -289 -65 -38 66
6538 66 124 -364 -395 93 -53 174 -250 34 35 55 -46 -1 50 199 45 -106 -27 146 124 -22 -94 -56 -194 282
6562 282 -301 -133 127 78 -118 -77 139 133 -49 29 203 210 73 -98 -245 42 176 66 -320 134 161 77 70 -120
6586 -120 87 -66 7 -94 233 111 130 38 -139 187 87 -111 -268 -84 123 -33 -339 9 2 -103 -91 -227
6608 -227 -29 65 16 -265 -65 626 -52 -27 -279 131 307 -133 -251 52 178 61 76 -83 244 369 82
6629 82 -145 197 84 -89 -131 -347 207 223 132 6 -225 150 106 -61 -13 -45 174 20 -125 132 5 -94 84
6652 84 -100 57 136 46 -59 -189 19 68 -209 -167 43 57 -32 -151 -151 -156 37 -211 -30 30 128 -143 -160 -59 149
6677 149 352 -133 34 6 178 -69 -101 -105 -103 -135 -194 -25 34 208 -241 65 -135 101 279 -129 -119 140 24
6700 24 -138 -170 205 150 -118 -315 22 -283 -215 -120 -191 103 421 352 -204 130 9 252 -301 -329 -61 55 -95
6723 -95 -34 -101 324 14 16 -62 210 10 -231 -79 88 204 -241 -51 102 13 -1 -297 -337 76 83 5 -127 -229
6747 -229 42 -124 -173 8 -191 132 6 -58 -119 242 239 -149 -134 -92 136 -410 210 -39 172 47 180 -133
6769 -133 29 267 -86 -243 -95 305 43 -85 -132 119 139 -100 52 349 263 264 16 -118 -41 204 134 -95
6791 -95 -11 -16 -223 -136 -43 57 91 27 -90 -508 5 171 -32 -80 60 61 -49 -65 -11 -46 85 -3 -36 80 39 -253
6817 -253 -105 106 62 -184 11 5 -60 186 -159 196 -17 49 56 125 -82 296 371 -516 -54 320 86 44 -8 154
6841 154 -9 310 37 -159 210 65 -200 -382 -52 258 -30 49 81 28 118 23 -230 23 257 171 -83 7
6863 7 298 12 24 -202 153 120 -171 -111 -32 -24 223 36 -351 56 130 -76 -79 67 -66 83 -210 -26 -18 -60 46
6888 46 148 -140 -139 180 201 -176 30 133 -116 -3 -296 -79 158 -363 16 245 -162 182 -102 -125 196 -224
6910 -224 227 77 268 -48 156 -5 -157 -115 -22 167 -156 -108 197 -22 -112 -20 295 126 -270 17 -87 -14
6932 -14 -263 -208 3 328 -83 71 103 186 306 145 66 170 309 3 40 2 -106 -28 -37 92 -111 58 -58
6955 -58 -241 -73 19 190 134 208 168 48 189 -129 51 193 297 -144 -277 76 181 -90 -135 184 214 74
6977 74 -122 117 -303 36 -89 -22 8 -18 201 -193 -268 28 80 227 -79 54 -101 -15 122 32 150 123 136
7000 136 -181 124 202 83 -79 17 67 342 -71 -178 214 126 39 12 -99 206 11 169 -258 -96 361 194
7022 194 184 -43 106 60 -178 99 99 -86 -169 -262 331 -68 13 -146 88 -230 132 131 26 -183 -102 177 -164
7045 -164 -158 -85 285 83 -48 -91 358 89 -289 13 -103 371 -193 -240 -17 -2 144 -127 -118 214 144 209 -121
7068 -121 49 -67 57 -153 25 48 236 -18 -105 78 175 -120 -126 -185 -135 17 112 20 -36 220 279 -177 -17 20
7092 20 234 216 -144 -63 -59 163 -87 54 -69 -13 166 -14 88 87 98 -268 -69 -299 -36 64 -79 -125 -190 339
7116 339 -96 106 -44 -34 -68 40 100 5 99 0 67 -211 132 -258 122 -390 113 -171 -268 -110 65 -149 -324
7139 -324 199 185 148 -70 -102 154 14 101 -205 -36 94 -175 -272 35 0 251 351 9 -80 163 473 -84
7161 -84 33 53 -246 -124 16 -255 155 49 176 -218 341 44 176 -246 -174 382 155 35 4 16 168 -100
7183 -100 -218 -100 32 -189 -17 -381 -13 -74 61 -48 -145 -117 2 -17 -64 -287 195 -198 -46 -36 -122 -20
7205 -20 31 198 26 15 -265 27 323 101 138 -29 -159 -116 343 -229 -4 131 -483 -51 -44 -334 -113 73
7227 73 -93 -365 -65 28 419 106 -232 114 219 476 -150 -251 -154 -308 -93 -36 -119 41 137 -193 293 118
7249 118 38 -195 -214 -145 -30 -84 -358 48 19 36 -112 -20 24 154 128 -318 -38 192 55 -69 69 70 185 -180
7273 -180 164 170 -77 48 -410 -5 -199 203 -16 -172 128 342 206 -139 192 145 197 -153 -4 112 -129
7294 -129 113 -149 -103 36 73 -271 14 57 83 -38 -153 -144 17 235 -86 60 -15 196 3 -5 -143 319 87
7317 87 -314 108 -230 312 14 -130 95 -153 260 -174 117 -193 104 -58 -309 -75 212 203 -163 -220 260
7338 260 -229 -222 -301 285 186 72 68 9 335 -323 146 20 89 83 54 134 -136 -10 92 -52 -123 -47 81 -1 -183
7363 -183 -151 241 175 -202 3 -55 57 82 85 213 247 108 -357 -362 190 -198 -256 -99 100 108 -43 -25 -235 359
7387 359 47 104 -316 472 399 211 -167 -130 111 -121 -375 119 -248 -12 147 -104 -301 -89 -4 23 -131 -190
7409 -190 79 80 108 49 -44 -14 230 -109 244 8 -71 -391 -94 -82 263 -63 105 102 30 -376 -319 9 -14 0 40
7434 40 59 320 458 10 -241 -213 -89 -71 -103 -418 112 -57 -91 -309 -70 18 -193 -137 -97 -123 3 88 74 19
7458 19 83 -142 -86 5 -74 -2 -190 80 -73 184 171 131 -156 15 208 105 -32 121 463 16 -48 -93 285
7481 285 143 61 -37 250 282 308 19 104 -125 60 -194 -14 -80 -32 73 -271 -4 234 263 -8 -254 104 62
7504 62 -145 -245 -167 115 -56 -57 -390 -172 468 -189 -68 -138 -8 21 33 -274 7 -97 -92 -63 100 19 140 -36
7528 -36 -99 552 -302 -169 -463 -93 -81 2 -384 -113 262 374 40 -343 189 106 -10 -11 -228 228 261 -264 -1
7551 -1 -38 462 -123 6 -174 204 -20 -39 112 221 214 -43 -60 95 20 251 66 -146 207 122 -65 -62 -283 7
7575 7 185 -208 -81 -102 381 -123 234 44 164 150 -164 -242 -263 26 -379 -124 -297 44 32 157 146 294 -127
7598 -127 -84 -263 -264 137 227 -113 -174 68 69 11 -370 167 32 245 -272 -81 -82 237 17 -117 29 167 -20
7621 -20 -93 68 267 119 -396 -337 144 131 128 -112 -115 0 213 102 -160 145 373 159 -18 -119 -209 105 -106
7644 -106 -241 11 123 151 -290 154 -53 -69 149 -93 -209 65 329 -123 -185 161 104 -217 -162 -236 -39 -40 145
7667 145 -40 258 -106 -5 -228 108 149 273 -98 -79 4 54 -137 42 253 303 257 -206 -233 170 51 210
7689 210 -90 -86 101 41 -45 -260 -3 153 36 -117 -7 408 -303 -424 -86 117 162 49 -146 156 157 89 -131
7712 -131 144 -69 -153 -50 -221 339 392 129 -159 46 -26 -99 -87 -200 121 13 22 -184 -284 344 -22 103
7734 103 -125 379 18 -67 -252 -161 200 -102 -126 -310 97 167 -122 -162 -157 231 -29 -116 63 -68 227 -178 -407
7757 -407 82 384 -22 147 -105 404 221 69 -324 25 147 65 148 -7 168 305 -136 44 134 22 238
7778 238 -274 -243 162 51 64 -40 202 417 6 -88 -335 304 -182 -108 153 -116 -225 -29 -87 -83 450 -92
7800 -92 -413 86 109 -36 -103 64 183 -49 84 -241 -22 233 199 -81 -239 -34 51 277 -120 154 294 30
7822 30 129 -141 -104 48 -107 -209 -102 492 310 74 -60 -31 15 -67 -27 -172 94 313 -195 -64 -150 190 -4
7845 -4 -222 -158 -264 74 -18 -91 201 5 -449 -212 -22 359 244 -41 -325 -97 -7 -97 -376 -10 246 153 -266
7868 -266 -45 -4 220 -46 241 68 106 -8 -160 -483 55 54 310 -183 -113 86 -95 -85 -33 110 338 155
7890 155 -230 235 262 146 70 -148 -23 197 -267 -68 122 -62 -53 -298 -188 -9 55 -4 -118 73 -59 122
7912 122 -7 77 -35 17 19 -132 -75 -145 -20 91 -220 111 118 190 66 168 -154 -50 -197 -163 87 368 188
7935 188 -75 -66 177 -19 110 18 -57 134 237 -365 -279 234 -116 -268 -10 262 20 -187 66 146 128 410
7957 410 -194 8 261 -65 -116 -182 -111 -65 72 -174 100 248 192 -298 28 -130 185 -60 -152 -69 -186 306
7979 306 132 -113 322 171 -86 -26 44 239 44 -169 1 -13 295 -99 -281 439 345 -155 -49 93 -196
8000 -196 538 -145 -464 -39 -7 199 -110 -206 26 150 -226 -206 78 118 71 94 -66 279 254 -152 -260 -127
8022 -127 186 103 -164 -72 235 243 -324 -227 109 72 264 -204 -201 114 152 -152 -247 101 282 88 -179 -134 308 38
8046 38 -243 -230 49 219 -19 -115 -26 7 111 91 -330 403 119 -174 -81 66 81 433 -371 -146 320 462 19
8069 19 -294 125 244 54 -116 -7 77 420 112 -398 -142 -13 -116 -69 78 73 92 -176 -214 -105 -10 148 -271
8092 -271 -46 43 201 48 -243 283 188 253 -64 -422 108 323 -268 -133 -75 153 -175 63 -151 352 92
8113 92 -189 57 294 141 -76 -64 114 -39 235 69 -63 211 -61 -326 79 52 -68 95 85 -43 4 188
8135 188 -314 -210 -56 -32 -109 -414 -373 35 72 -42 -237 -203 85 284 -184 -416 -28 33 -108 -284 -288 308 69
8158 69 -2 -393 41 209 -162 -230 -56 320 71 -304 84 75 401 208 97 107 202 -80 -139 102 149 90 -226
8181 -226 -425 -21 32 176 -280 -223 -60 75 -42 -110
8191a10
##END NTUPLES=NMR FID
##END=
