##TITLE=1H_TG-2249-3
 CDCl3, 8 sc, 
 20.8.2019
##JCAMPDX= 6.0         $$ Bruker NMR JCAMP-DX V2.0
##DATA TYPE= NMR FID
##DATA CLASS= NTUPLES
##ORIGIN= UXNMR, Bruker Analytische Messtechnik GmbH
##OWNER= root
$$ XWIN-NMR		Version 3.5
$$ Tue Aug 20 13:49:15 2019 Russian Standard Time (UT+4h)  she@DPX200
##.OBSERVE FREQUENCY= 200.13155
##.OBSERVE NUCLEUS= ^1H
##.DELAY= (6, 6)
##.ACQUISITION MODE= SIMULTANEOUS
##.ACQUISITION SCHEME= undefined
##.AVERAGES= 8
##.DIGITISER RES= 18
##SPECTROMETER/DATA SYSTEM= spect
##.PULSE SEQUENCE= zg30
##.SOLVENT NAME= CDCl3
##.SHIFT REFERENCE= (INTERNAL, CDCl3, 0, 15.7039)
##AUDIT TRAIL= $$ (NUMBER, WHEN, WHO, WHERE, WHAT)
$$ ##TITLE= Audit trail, XWIN-NMR		Version 3.5
$$ ##JCAMPDX= 5.01
$$ ##ORIGIN= Bruker BioSpin GmbH
$$ ##OWNER= she
$$ F:/spectra/data/she/nmr/H-F/1/audita.txt
$$ ##AUDIT TRAIL=  $$ (NUMBER, WHEN, WHO, WHERE, WHAT)
(   1,<2019-08-20 13:47:51.85 +0400>,<she>,<DPX200>,
      <created by zg, POWCHK disabled, PULCHK disabled
       configuration hash MD5:
       00 E9 B6 7A A2 85 ED C7 34 08 36 98 17 FE 4E 26
       data hash MD5: 16K
       F6 77 B3 BA F6 0A 79 64 26 1A 7D 16 03 9B 02 57>)
$$ ##END=
$$ 
$$ hash MD5
$$ C9 FA 1A 3D 27 4C CA 97 60 A5 9E 8A F1 3B DC 21
##$RELAX= 
##$RELAX= 
##$RELAX= 
##$RELAX= 
##$RELAX= 
##$RELAX= 
$$ Bruker specific parameters
$$ --------------------------
##$DU= <F:/spectra>
##$EXPNO= 1
##$NAME= <H-F>
##$PROCNO= 1
##$TYPE= <nmr>
##$USER= <she>
##$AMP= (0..31)
100 100 100 100 100 100 100 100 100 100 100 100 100 100 100 100 100 100 
100 100 100 100 100 100 100 100 100 100 100 100 100 100 
##$AQSEQ= 0
##$AQ_mod= 1
##$AUNM= <au_zg>
##$AUTOPOS= <>
##$BF1= 200.13
##$BF2= 200.13
##$BF3= 200.13
##$BF4= 200.13
##$BF5= 200.13
##$BF6= 200.13
##$BF7= 200.13
##$BF8= 200.13
##$BYTORDA= 1
##$CFDGTYP= 0
##$CFRGTYP= 5
##$CHEMSTR= <none>
##$CNST= (0..31)
1 1 145 1 1 1 1 1 1 1 1 1 1 1 1 1 1 1 1 1 1 1 1 1 1 1 1 1 1 1 1 1 
##$CPDPRG= <>
##$CPDPRG1= <>
##$CPDPRG2= <>
##$CPDPRG3= <>
##$CPDPRG4= <mlev>
##$CPDPRG5= <mlev>
##$CPDPRG6= <mlev>
##$CPDPRG7= <mlev>
##$CPDPRG8= <mlev>
##$CPDPRGB= <>
##$CPDPRGT= <>
##$D= (0..31)
0 1.2 0 0 0 0 0 0 0 0 0 0.03 0 0 0 0 0 0 0 0 0 0 0 0 0 0 0 0 0 0 0 0 
##$DATE= 1566294471
##$DBL= (0..7)
120 120 120 120 120 120 120 120 
##$DBP= (0..7)
150 150 150 150 150 150 150 150 
##$DBP07= 0
##$DBPNAM0= <>
##$DBPNAM1= <>
##$DBPNAM2= <>
##$DBPNAM3= <>
##$DBPNAM4= <>
##$DBPNAM5= <>
##$DBPNAM6= <>
##$DBPNAM7= <>
##$DBPOAL= (0..7)
0.5 0.5 0.5 0.5 0.5 0.5 0.5 0.5 
##$DBPOFFS= (0..7)
0 0 0 0 0 0 0 0 
##$DE= 6
##$DECBNUC= <off>
##$DECIM= 24
##$DECNUC= <off>
##$DECSTAT= 4
##$DIGMOD= 1
##$DIGTYP= 9
##$DL= (0..7)
0 120 120 120 120 120 120 120 
##$DP= (0..7)
150 150 150 150 150 150 150 150 
##$DP07= 0
##$DPNAME0= <>
##$DPNAME1= <>
##$DPNAME2= <>
##$DPNAME3= <>
##$DPNAME4= <>
##$DPNAME5= <>
##$DPNAME6= <>
##$DPNAME7= <>
##$DPOAL= (0..7)
0.5 0.5 0.5 0.5 0.5 0.5 0.5 0.5 
##$DPOFFS= (0..7)
0 0 0 0 0 0 0 0 
##$DQDMODE= 0
##$DR= 18
##$DS= 0
##$DSLIST= <SSSSSSSSSSSSSSS>
##$DSPFIRM= 0
$$ [...]
##$SUBNAM2= <"">
##$SUBNAM3= <"">
##$SUBNAM4= <"">
##$SUBNAM5= <"">
##$SUBNAM6= <"">
##$SUBNAM7= <"">
##$SUBNAM8= <"">
##$SUBNAM9= <"">
##$SW= 24.9336996594482
##$SWIBOX= (0..15)
0 0 2 0 0 0 0 0 0 0 0 0 0 0 0 0 
##$SW_h= 4990.01996007984
##$TD= 16384
##$TD0= 1
##$TE= 0
##$TE2= 300
##$TE3= 300
##$TEG= 300
##$TL= (0..7)
0 120 120 120 120 120 120 120 
##$TP= (0..7)
150 150 150 150 150 150 150 150 
##$TP07= 0
##$TPNAME0= <>
##$TPNAME1= <>
##$TPNAME2= <>
##$TPNAME3= <>
##$TPNAME4= <>
##$TPNAME5= <>
##$TPNAME6= <>
##$TPNAME7= <>
##$TPOAL= (0..7)
0.5 0.5 0.5 0.5 0.5 0.5 0.5 0.5 
##$TPOFFS= (0..7)
0 0 0 0 0 0 0 0 
##$TUNHIN= 0
##$TUNHOUT= 0
##$TUNXOUT= 0
##$USERA1= <user>
##$USERA2= <user>
##$USERA3= <user>
##$USERA4= <user>
##$USERA5= <user>
##$V9= 5
##$VALIST= <valist>
##$VCLIST= <CCCCCCCCCCCCCCC>
##$VD= 0
##$VDLIST= <DDDDDDDDDDDDDDD>
##$VPLIST= <PPPPPPPPPPPPPPP>
##$VTLIST= <TTTTTTTTTTTTTTT>
##$WBST= 1024
##$WBSW= 4
##$XGAIN= (0..3)
0 0 0 0 
##$XL= 0
##$YL= 0
##$YMAX_a= 120189
##$YMIN_a= -129533
##$ZGOPTNS= <>
##$ZL1= 120
##$ZL2= 120
##$ZL3= 120
##$ZL4= 120
##$ABSF1= 10
##$ABSF2= 0
##$ABSG= 5
##$ABSL= 3
##$ALPHA= 0
##$AQORDER= 0
##$ASSFAC= 0
##$ASSFACI= 0
##$ASSFACX= 0
##$ASSWID= 0
##$AUNMP= <proc_1d>
##$AZFE= 0.1
##$AZFW= 0.1
##$BCFW= 1
##$BC_mod= 2
##$BYTORDP= 1
##$COROFFS= 0
##$CY= 11.3945322036743
##$DATMOD= 1
##$DC= 2
##$DFILT= <>
##$DTYPP= 0
##$F1P= 20.1720416913024
##$F2P= 0.152960286110954
##$FCOR= 0.5
##$FTSIZE= 0
##$FT_mod= 4
##$GAMMA= 1
##$GB= 0.15
##$INTBC= 1
##$INTSCL= 1
##$ISEN= 128
##$LB= 0.24
##$LEV0= 0
##$LPBIN= 0
##$MAXI= 10000
##$MC2= 0
##$MEAN= 0
##$ME_mod= 0
##$MI= 1.114404
##$NCOEF= 0
##$NC_proc= 0
##$NLEV= 6
##$NOISF1= 3.799351
##$NOISF2= 2.8
##$NSP= 1
##$NTH_PI= 0
##$NZP= 0
##$OFFSET= 15.70392
##$PC= 1
##$PHC0= -9217.582
##$PHC1= 21.80096
##$PH_mod= 1
##$PKNL= yes
##$PPARMOD= 0
##$PSCAL= 0
##$PSIGN= 0
##$REVERSE= no
##$SF= 200.130013532006
##$SI= 16384
##$SIGF1= 3
##$SIGF2= 2
##$SINO= 400
##$SIOLD= 16384
##$SREGLST= <1H.CDCl3>
##$SSB= 0
##$STSI= 0
##$STSR= 0
##$SW_p= 3612.71676300578
##$SYMM= 0
##$S_DEV= 0
##$TDeff= 0
##$TDoff= 0
##$TI= <>
##$TILT= no
##$TM1= 0
##$TM2= 0
##$TOPLEV= 0
##$USERP1= <user>
##$USERP2= <user>
##$USERP3= <user>
##$USERP4= <user>
##$USERP5= <user>
##$WDW= 1
##$XDIM= 8192
##$YMAX_p= 0
##$YMIN_p= 0
$$ End of Bruker specific parameters
$$ ---------------------------------
##NTUPLES= NMR FID
##VAR_NAME=  TIME,          FID/REAL,        FID/IMAG
##SYMBOL=    X,             R,               I
##VAR_TYPE=  INDEPENDENT,   DEPENDENT,       DEPENDENT
##VAR_FORM=  AFFN,          ASDF,            ASDF
##VAR_DIM=   8192,          8192,            8192
##UNITS=     SECONDS,       ARBITRARY UNITS, ARBITRARY UNITS
##FACTOR=    0.0002004,     1,               1
##FIRST=     0,             0,               0
##LAST=      1.6414764,     0,               0
##MIN=       0,             -129533,         0
##MAX=       1.6414764,     120189,          0
$$ Real data points
##PAGE= N=1
##DATA TABLE= (X++(R..R)), XYDATA
0@%%%%%%%jRj6J6j6K4l2M0m8N6o5P4q9J05j25J48j69J94k26K58k92L32l78M26
31B25m78N37o01O70p50Q37r29J030j142J268j404J551j716J903k110K343k607
48a373K907l254L661m144M732n466O404p660R442j2187J7028k8142J02654L5587
62A20189r6409L8546Q212R711k485k868k1718R87l1130k6965J7634K5571k7576
75A1699j4221k085k3466j5493J6442q034r199J5613p675l5110O651J7706j2363
88e9535k258J3466j1296l48J8106j0273j4577K1152P105j1985J5138J3228j4736
101c6813P966J7638j5431j098L1703N143j2222R475j619j2638J7469J6171p171
114A8573R831P667k5510l709K7486l352j1194J7550m02k1473N177M481j6163J1448
$$ y = [0, 0, 0, 0, 0, 0, 0, 0, -1, 8, -8, 8, -8, 16, -16, 24, -24, 32, -33, 41, -48, 57, -68, 80, -89, 105, -121, 137, -155, 177, -201, 225, -253, 284, -317, 353, -397, 440, -489, 541, -601, 667, -737, 814, -902, 1001, -1109, 1234, -1373, 1534, -1720, 1941, -2203, 2529, -2937, 3467, -4193, 5249, -6938, 10090, -18052, 84602, 120189, 23780, 62326, 70538, 80249, 77764, 74896, 53178, 54165, 23035, -3930, 13704, 39275, 11699, -2522, -4607, -28073, -43566, -27124, -35158, -44357, -28744, -36419, -71529, -64878, -47172, -59535, -61793, -48327, -59623, -59971, -41865, -52138, -66715, -45563, -38458, -50443, -35305, -22077, -36813, -28847, -11209, -26640, -27738, 3965, 9108, -3114, 6361, 4742, -7896, 9573, 25744, 18573, 28404, 36071, 10561, 6852, 34338, 30986, 19792, 37342, 36940, 15467, 20644, 25125, 8962, 20410]
128B0410K0500j7326j6207N297p778j845J9872n173j8191J0246j02k3307P389
141f215J7251j4329l068J6226j2236j4731J4427J002j1020J4056M518j8520N574
154g065J1598j3807L73J4850j1879m923K2052l202j8499J1827N326j6310Q531
167a128J4563j2909k155J1514j1970p433J5629l333r385J5473n65k1544P406J2707
181F870j3822J689J4898j4061j0063J5572k585j1537J3626M621j3517N975N555
194C221j4990O038J5242j3425n110J6696p613j2541J7315L341j7761P714J1293
207I420j2751J646J1042j2885m671J6120m209j0091J3022j727j4766J1448P206
220H804j7140M598J5822j3615o701J5112n936j0605J4443J239j4086Q211M368
$$ y = [20410, 40910, 23584, 7377, 12674, 4896, 3051, 22923, 17750, -441, 9805, 9703, -13604, -6215, 11036, -3293, -6361, 9865, -2371, -17102, -2675, -1673, -12693, 1363, 5881, -12639, -7065, 4533, -9274, -8901, 5949, -5930, -10853, 11199, 7997, -10502, 1325, 6651, -9659, -1128, 13435, 526, -1629, 9885, -2085, -9518, 6111, 2778, -6607, 8866, 8301, -13243, -5837, 6870, -6952, -5263, 9635, -4426, -14489, 1083, -1502, -13039, 587, 5208, -8309, -2334, 3221, -11769, -5731, 9511, -3914, -9024, 7672, 59, -12482, 4833, 8174, -9587, -1873, 9420, -3331, -1685, 9357, -3528, -8199, 7921, 3712, -6379, 6643, 4916, -9850, 1598, 8804, -8336, -3738, 12084, -1531, -8232, 6880, 944, -9661, 4782, 6021, -8065, 146, 4514]
233D514j4243O607J3129j3216k271J4864j0481j1008J6051J124j3208J1848O500
246A0210j7393J313J2947r797p14J2897p777q219J3255k695j2869J2599N222j5021
260f042O486J1126j5490k054J6727p113j0122J2347r38j0694J1111M209j4541
273d988M412Q405j1603J116J3244j0952p857J5148k887j3430J1918N228j5183
286g429L678Q780j2397M22J4019q139p250J1656n095j0277J2699L000j2791Q188
300i36P417j5466J182J4630r551p000J4633k703j1530J0604K899j1743P103P239
314F778j2527K813J1617j1202m357J4478m587j0909J2653K374j3480Q048P356
327I055j3546J886J3399q656o167J0677m869p018J1696j00j1632R730N286j5954
$$ y = [4514, -9729, -3122, 10007, -3209, -5480, 9384, -1097, -12105, 3946, 5070, -8138, 3710, 10210, -7183, -5870, 7077, -2720, -3434, 9463, 1686, -6533, 6722, 4027, -8842, 3757, 8979, -6042, 444, 11570, -3920, -5974, 10753, 3640, -6482, 5865, 4927, -5767, 5344, 9553, -4988, -576, 7829, -3774, -2658, 10586, -366, -8223, 6925, 4038, -9392, 2526, 7754, -7429, -3751, 5029, -7368, -6946, 7073, -1066, -8316, 3340, -1755, -12032, 667, 3667, -9124, -936, 6481, -8985, -7803, 6827, -2724, -9724, 4909, 2206, -9324, 1280, 4179, -7564, -461, 6778, -5749, -2936, 8681, -2521, -6878, 7600, 3013, -7896, 4757, 7131, -6349, 1699, 9055, -4491, -2605, 10794, 2138, -4029, 6648, 1779, -5239, 6457, 6357, -5275, 4455, 9741, -6213]
341f213J529J3141q908l277J2787o691j0677J0975Q65j1358Q536O108j2177K187
355c173P992j1157l53J3318p021r333J2542o40j2806R144O881j1924K478R496
369E444j0485k313J2575n336p017J1801j495j0488R346L615j1841O110R834j2395
383b645j216J3372p545q315J2471N05j0719Q026L844j0722M773O926j2009k8J2544
398I262p320p120J1381k794j0093J0198K426j3164N369R596j1778k336J0991o066
412a448m991J0291l880r639R540K549j1106O749P657j2298j90J1663q216n418
426h737J2360j494r403Q438J841j0587O498P772r874M50R661q135l606J1559l982
441B761p874J0489J091j2800O522Q602r982M9R148p759m342J0038l877p365R899
$$ y = [-6213, -4684, 8457, -451, -3728, 9059, 2368, -8309, 2666, 3531, -7827, 709, 6817, -5360, -3173, 4819, -6338, -6691, 6627, -394, -9727, 2815, 2175, -10631, -1487, 5394, -6530, -4052, 5444, -5041, -7354, 5221, -115, -7132, 4669, 3174, -7314, 2032, 5647, -6194, -84, 9750, -2645, -3861, 9511, 1966, -6349, 6122, 6627, -4092, 3934, 7778, -2944, 1829, 8755, -3254, -3282, 9262, 1942, -5178, 6203, 3409, -6684, 3514, 5940, -7224, -1855, 7741, -4037, -6373, 4618, -1448, -6439, 3852, -28, -9667, -127, 2422, -8684, -1935, 5722, -6576, -6766, 4897, -3319, -8737, 3623, 2129, -7274, 1164, 3005, -7582, -1084, 6688, -3186, -2736, 6925, -1210, -4816, 6743, 2761, -5113, 5376, 6467, -6333, 189, 8791, -1191, -1142, 8006, 247, -4095, 5943, 2066, -5299, 4600]
456D600J494j0559N616M356j1384K991J0111r492l623J1552m470r770R572J783
470B777j0045O160N027r727K413P724r261j970J1526m574p452J0318k6j0094P900
485F96N470j1214L570R452r080k991J0136l953n594R855m89r831O955L366j0290
500c942N261Q607r860k814J0887n753o776Q869n16q769Q269L438j1570J580P552
515D463p552r09Q208o932m716R990k506r976Q042M077j0324L176P713r476j291
530h013R754m754m637Q999k054p922Q833K844r377M355P117q321J007R089p656
545g36m393J1498j109q314P744K916r663M329O213q385Q82Q251o785l300R137
560H285l914q117R008K343r678L872N591r861Q63Q680p529m873R436k622p803
$$ y = [4600, 6094, -4465, 1151, 5507, -5877, -2886, 7225, -2267, -5890, 5662, 1192, -8578, 994, 2777, -7268, -1108, 3919, -5808, -3395, 4329, -4932, -6902, 4624, 50, -7402, 2916, 2890, -7204, 696, 6166, -5048, -1478, 7974, -1106, -4097, 6039, 2086, -3508, 6347, 5858, -3973, 2982, 6348, -3942, 1319, 9926, 66, -2748, 8139, 2386, -4390, 4479, 3963, -4806, 3463, 6901, -4669, -3089, 4463, -3089, -3998, 4210, -2722, -7438, 2552, 46, -9930, -1888, 2189, -8135, -4959, 2754, -6722, -8013, 1741, -3013, -7650, 1349, -705, -8627, 206, 3050, -6327, -1972, 5145, -3176, -2169, 6920, -736, -5129, 6369, 5260, -3054, 4690, 7606, -2057, 2272, 8485, 100, 982, 9233, 2448, -852, 8285, 4371, -3746, 5262, 7605, -2073, 1799, 7390, -2471, -1608, 7072, -457, -5330, 4106, 1484, -6319]
575f319P131P85q680N987M300j0042P45Q321p109k589J0010l736p585Q261J615
590A095q594N315N146q333K347P667o894l066R065l031m923Q717J5q778O774M740
606G262r384J839Q276o748k507Q446l671n888Q189K09q013N379K835q454K463
621B33O702p687j945Q410n840n653Q381o99q555N639M615q780J116N710p432k82
637f067Q494n551n658R077k56p612O523J986q442M468P286p710j441Q996m869
652g76m771Q608r06p063O713L331p552L393M939q124J536R292o518m914P992p46
668D434o327O644K328q359L329N426q069l56P567m188l070P325l691o868O677
683B802J762p427M275M496r053j61P616n546m056P475j502o097O247L24q789M504
$$ y = [-6319, 812, 1597, -7083, -1096, 3204, -6838, -6093, 2228, -4881, -7470, 2540, -1196, -8781, -520, 1095, -7499, -2184, 2962, -5371, -3024, 4643, -2251, -5317, 3748, 717, -4206, 4511, 4526, -4252, 2522, 7262, -2122, -283, 7993, 1245, -1262, 7184, 3513, -2375, 5814, 6023, -1990, 3389, 6224, -2230, 233, 6935, -752, -2697, 5713, -127, -5780, 2601, 1902, -6653, -1014, 3601, -5179, -4063, 1647, -5785, -6067, 2427, -3124, -8782, 295, 39, -7573, -1050, 936, -7506, -3038, 4248, -3462, -4903, 4093, -776, -5547, 3061, 2155, -4908, 1805, 5136, -2416, 977, 5916, -2208, -672, 8620, 2102, -2812, 5180, 4434, -1893, 4751, 7079, -1280, 2049, 7475, -594, -950, 6617, 2429, -641, 6684, 2993, -3875, 2802, 4564, -2863, 1412, 5908, -3145, -3306, 4310, -1236, -5292, 2183, 681, -5416, 831, 1155, -7634, -3130]
699c130N206p047N03O014o230k284Q906l222o751P436R14p534M494M400p626N62
715e389P974m707l031O747l384m642Q377O11q047N386N162p324Q99N758o316j267
731c193J0159k853o110N512Q66o481N202L799p269K803N852p229j852P309l611
746B904m495Q032l29q555M408L723o741K225N582p220k355O988l569m639N978
761A937J6o077M717J821q616K646O236o037j923P143m212m890O588k52o426N013
777b316K841o496K668N337o777p18P295l568k734O952j809o630P088L219q036
792c684K140O203n244n11O377m764l147P498j167o268N585J303o847L679M900
807F053p092J52O860n010l876P011j707o294N847K335p132K108L915n783O03O017
$$ y = [-3130, 2076, -4971, -4468, 1546, -4684, -6968, 1938, -1284, -8035, -599, 315, -7219, -2725, 1675, -5951, -5389, 2585, -2122, -5153, 1594, -1790, -6432, 1945, 2556, -5491, -105, 5057, -2267, -1368, 4390, -1926, -3193, 6966, 4113, -1997, 3515, 4381, -2100, 3102, 6901, -368, 2435, 8287, 1058, -794, 6515, 2904, -1591, 6441, 6112, -2443, 1965, 5688, -1053, 1172, 6754, -466, -2821, 4167, 598, -4041, 1937, 1953, -4124, 593, 2414, -6202, -3556, 2680, -3357, -5280, 1863, -2349, -7239, -651, -903, -7329, -2316, 525, -5971, -3303, 2034, -4743, -5461, 1834, -1734, -4468, 2484, 675, -5955, 1133, 4352, -3684, -1544, 4659, -585, -1096, 5281, 517, -2630, 4868, 3701, -2567, 3018, 4321, -2526, 1153, 6053, -1039, -887, 5973, 963, -2913, 4098, 2391, -3903, 1944, 4279, -2853, -745, 3170, -2613, -2010, 4007]
823D007n172k976P798k106o804N845J699o995M285M646o743k13O409m228k886
838c434O478k016n019O364Q63o569L757L415o490J755O449o164k972P264j732
853A949n253N793O57o417L698L486o817R52N172m639j357O431l963n231O907O73
869B041o348L997K761o651J466N955m901k823O159j970l679N813p92o066N112
884G4L491o847J619N467n300q01O910l732m356O426M22o077M180K756o058K132
900C06M710n282r15N951l943l714O885j334o570N263K844p012J425M330n414n41
916c011O061l316m353N712p61m883M375J594o358L496M041o121l83O246m159l224
932e044O915o12o100M595K376n424K778L687n344k1O413l580k939N842j684l929
$$ y = [4007, -1165, -4141, 3657, 1551, -5253, 592, 2291, -4704, -419, 4227, -2516, -2729, 3680, -548, -3434, 3044, 1028, -3991, 2373, 3236, -3333, 424, 3839, -2651, -896, 5553, -611, -3583, 3681, 1949, -3304, 2489, 3146, -3271, 427, 3913, -2904, -1952, 3220, -1419, -2776, 3655, -308, -5539, 1368, 2041, -4307, -310, 2451, -4200, -2734, 3221, -1680, -4503, 1656, -314, -3993, 1820, 1028, -5038, 74, 3565, -3282, -1663, 3804, -1496, -2297, 4613, 881, -3475, 2951, 3373, -2704, 1476, 4232, -1826, 306, 5016, -266, -1181, 4770, 827, -2887, 3998, 2664, -3906, 1357, 4201, -2811, -1386, 2944, -2470, -3011, 3050, -266, -4619, 1093, 332, -4551, -176, 1418, -4940, -1444, 2597, -3524, -3907, 2339, -1820, -5044, 1871, 1259, -4841, -246, 2130, -3294, -516, 3171, -2173, -2194, 4219, 639, -2300, 3542, 1858, -2071]
948b071N637J074p149L301M902n702p93O025l864k702N208j882m654M899Q25n587
964b533L209L393o619M25N298m330k391N986k096m987M703J213n945K659L953
979A938n431O36M296m040j557O279l051m033N668P65o373M138L839n938J154N176
995C466m241j781N603k087m041N612J071n389K942K893n468J351N115n090j009
1010a053O503l018n297N382Q35n608L859K688n799O92M463m859r71N251k938l507
1026c377N051r28n417M250K433n607J510M351m965k004O068j890l429M671l67
1041C50m593L752J718n232K687M665n279p92N443l038l155N980p5n165M310K396
1057C972o083K001M417m581n34M967l302k012N125j917m748N068K090o428K249
$$ y = [-2071, 3566, 4640, -2509, 792, 5694, -8, -801, 5224, 1360, -1342, 3866, 1984, -2670, 2229, 3054, -2533, 676, 4069, -2550, -2125, 3173, -1157, -3548, 2438, 342, -4645, 58, 1271, -4674, -2015, 1938, -3493, -2857, 1439, -2601, -4158, 2121, -930, -4963, 705, 1470, -4903, -765, 3074, -2864, -1710, 3466, -775, -2556, 3047, 960, -3081, 2531, 3602, -1787, 1155, 4048, -1420, -69, 5046, -44, -1053, 5450, 2432, -2865, 2517, 3352, -2256, 1603, 4291, -1508, -816, 3647, -1212, -2183, 3068, 130, -3377, 1674, 746, -4671, -421, 2012, -3595, -2085, 2266, -2699, -4703, 1365, -525, -3954, 717, 350, -4243, -491, 1227, -4005, -1318, 3347, -1932, -2724, 2719, -319, -3474, 2506, 2431, -2734, 1576, 3972, -2111, -110, 4307, -274, -808, 4159, 857, -1155, 3970, 2053, -2695, 2373, 4463, -1965, 284]
1072B84L781n002o28N359l382l162M830n70m657L781J124n036K477L420n194K1
1088b554M860m056k481O065j237n176M412J815n629K091L834m477N91M014l182
1103a110k486N437j411l836M971Q11n470L477L082n192N27N346l693k778N306
1118B981r25m210M477P11m514K684K468n069Q10M634m304j329N267k450m522N180
1134A889P44n348K176L694n086J5M669l946j703N019k273l629N178p91m897M252
1150c7K413n728R96M817m043j432N167k262l099M951j91m919L734K070m414J519
1166d58M033m561m33N151l517l166N754k03n470L846K481n016Q40M144m224p01
1182a500N019l091k705M649j083l848L477J819n583J762M183m934p55N236k966
$$ y = [284, 4065, -937, -1565, 3794, 412, -2750, 2080, 1510, -3147, 634, 1758, -3278, -801, 2619, -2575, -2554, 2306, -1750, -4231, 1834, 597, -4579, -167, 1648, -3981, -1890, 1944, -2533, -1942, 2072, -1110, -3596, 1841, 430, -3406, 1565, 2376, -3094, 383, 3465, -1727, -1200, 4146, 453, -2325, 2981, 2056, -2154, 2323, 3034, -1480, 1204, 3672, -1397, -587, 4047, -257, -1586, 3681, 1231, -3291, 1889, 2633, -2715, -539, 3155, -1931, -1916, 2753, -1193, -2896, 2123, -150, -3779, 1399, 608, -4289, -37, 2376, -3352, -2356, 2461, -1582, -3014, 2153, -109, -3208, 1743, 1552, -3367, 367, 2437, -1977, -458, 3575, -986, -1419, 3732, 215, -2951, 2803, 2600, -2870, 976, 3457, -1559, -719, 3425, -799, -1500, 3519, 428, -2277, 2372, 1289, -2559, 918, 2737, -2846, -1084, 3099, -1835, -2590, 2646, -320]
1197c20l162M827l84m453L246J705m251K129K640m478J0M851l263k621M945k96
1213A125m223L916J392n248K137L887m227n22M843l007j987M429j004l785M472
1228B198N17m877K799L473n172k3N087l418k428M663j132m082M216J012n215K493
1244A11L180n008N83L835m013j324M934k134m011M329J077n048K605K967m635
1259b552K20M187l534j229M291k066k813M544M55n110L339K729m464R02M185l811
1275g27j744N378j281l890M074P11m143K860J791m020J268L893m008j090M521
1290C593k458l191M549j3m369L147K357n064R41L517l715j268M255j902k808L579
1306A150q45l754L451J952n426J459M162m742q79M619k365l089M424l48l501K994
$$ y = [-320, -3482, 1345, 961, -3492, -246, 1459, -2792, -663, 1977, -2501, -2491, 2360, -903, -3524, 1421, 1125, -3098, 818, 2210, -3038, -901, 2986, -1241, -1763, 3080, 73, -1914, 2515, 1511, -2274, 2198, 2715, -2162, 637, 4110, -1062, -1085, 4002, 584, -1844, 2819, 1687, -2395, 1821, 2833, -2382, 111, 3291, -1717, -1134, 2701, -1312, -2636, 2298, 164, -3847, 482, 1559, -3489, -884, 2083, -2552, -2332, 1855, -1679, -2908, 1383, -683, -3496, 1048, 1503, -3607, -268, 2461, -2003, -1101, 3084, -727, -2471, 2907, 1626, -2264, 1810, 2521, -1622, 1238, 3029, -991, 277, 4170, 162, -928, 3593, 1135, -2056, 2493, 2480, -1889, 1258, 3615, -1449, -508, 3009, -706, -1974, 2281, 379, -2429, 1150, 305, -3449, 2, 1954, -3472, -2013, 2149, -2593, -3472, 1147, -1218, -4307, 117, -231, -3732, -738]
1322g38J507m503K240L639m718m2M509k483k376M821j059l714L818K362m777J122
1338c92L689l262n89M300k566k187M332r29l703L491R77m281K438L073m556n32
1354f97M555l216k217M565p70m433L261J192m166J449K603m311N40M038l784j882
1370c273M586j201l781M006M68m579K187K934l788j52M087l100j308M114j439
1385b39l127L888M93l894K887K147m760J425M594l530k131M643j192l019L731
1400A916K62m182L028K092l862N13L524l279j050M159j970l480M242J64m658L079
1416D98K094m679J028L861l914j224L761j976k437M087o78l926L349J627m452
1431b981J463L551l762m97M333k004k975L849K11l728K730K169m203J293L116
$$ y = [-738, 769, -3734, -1494, 2145, -2573, -2615, 1894, -589, -2965, 1856, 797, -2917, 901, 3263, -1514, -392, 3297, 35, -554, 3746, 1180, -1007, 3325, 2396, -1307, 2184, 3161, -1120, 1318, 4391, -165, -697, 3858, 642, -1575, 2990, 2220, -2213, 1048, 2240, -1926, -477, 2126, -2185, -1645, 2393, -1391, -3273, 1313, 112, -3669, 337, 805, -3774, -1587, 1347, -2441, -2593, 1494, -1606, -2914, 1200, -239, -3366, 522, 1015, -2879, 8, 2155, -2605, -1180, 3414, -116, -2247, 2396, 1204, -1815, 1916, 2178, -2004, 1024, 3116, -746, -233, 3291, 12, -1038, 3121, 1151, -2329, 1913, 2077, -2581, 498, 2592, -2087, -1059, 2802, -1112, -2336, 1425, -551, -2988, 1099, 421, -3505, -156, 1471, -2981, -1518, 2033, -1729, -2226, 2107, 103, -2872, 977, 1188, -2540, 190, 2359, -1844, -551, 2565]
1446B565l184k11L891k482k360M784p59m069L082J773m077J454K674l486m36L915
1462C074k209k398L534m74l285L221M92m427K369K714m029l55L924l195k182M179
1478I53n87l990L225J429m256K069K518l975N01L944l024j331L578j398k649L893
1494I00N84m607K757L094l850j85L789k368j893M271j047k864L424K10l344K300
1510A171K404m334M92L669k953j541M003j810l122L827Q05m485J616K605l608
1525a261O89K568l179j010L828j794k798L405N9m010K866K237l998L32L272k648
1541a442j330L961j775k516L567K71l572K589J688l709J532L177l770n55M266
1556B382j465k994L486N86l848K776K003l743J154K786l143n43L336k209k161
$$ y = [2565, -619, -830, 3061, 579, -1781, 3003, 2244, -1825, 1257, 3030, -1047, 407, 3081, -405, -841, 3074, 865, -1533, 2001, 1527, -1758, 1463, 1955, -2472, -103, 2611, -1418, -1773, 2151, -1044, -3226, 953, 366, -3624, -399, 1030, -3226, -1157, 1361, -2614, -2113, 1831, -1193, -2524, 1054, -344, -2993, 900, 1484, -3123, -366, 2728, -1122, -1307, 2482, 114, -1779, 2492, 1445, -1419, 2005, 2215, -1129, 1171, 3575, -759, -267, 3402, 449, -1092, 2911, 1101, -2021, 1806, 2611, -1874, -258, 2347, -1261, -572, 1996, -1183, -2193, 1635, -159, -2957, 448, 507, -3503, -637, 1600, -2398, -2066, 1206, -1442, -2772, 1189, -586, -3102, 465, 736, -2836, -247, 1441, -2268, -736, 2441, -1329, -1884, 2382, 917, -2077, 1409, 1995, -1853, 923, 2926, -817, 337, 3123, -20, -563, 2773, 564, -1597]
1571a597M054l36l644K824J261l966J043L773l955j082L734j709k337L017l69
1586G11l251K850J058l983J601K342l614K60L906k822k337M019j85l471K951R32
1602I67l531J289L068l494K90K762j960j328L784j188l306M201O55l642J284K880
1618B731l185j41L748k945j603L449p02l032K831P62l116J903J988l733M22L493
1634B870k942j813M338j211l667L371N43l755K160J439l257Q04K877k998j203
1649b444L708j292k891L581J20l624K194K375m011M41L526k861j013L805j314
1664C00k850L233N88l167K543J229l803J591L079l154o13L226j363k341L677j13
1680B062l756K702J715l375K41K875k822m35L038j555k277L516o63l204K669R79
$$ y = [-1597, 2457, 2121, -1523, 1301, 2562, -1404, -361, 3412, -543, -1625, 2109, 400, -1937, 1080, 711, -2540, 310, 1368, -2615, -1014, 1328, -2286, -2026, 1880, -942, -3279, 740, 555, -2916, 35, 967, -2564, -1275, 1793, -1701, -1411, 1351, -609, -1937, 1847, 659, -2647, 1554, 2209, -1433, -149, 2731, -454, -595, 3153, 208, -1395, 2054, 1352, -1680, 1151, 1913, -1203, 700, 2688, -1045, -623, 2870, -72, -1885, 2453, 1242, -2425, 946, 1489, -2266, -106, 1333, -1924, -1120, 1757, -1241, -2444, 1264, -28, -2919, 662, 782, -2842, -648, 1727, -2284, -1843, 1683, -1178, -2191, 1614, 300, -2550, 683, 1271, -1896, 647, 1876, -1927, -336, 2743, -411, -1024, 2202, 839, -1502, 2175, 2062, -1694, 1008, 2723, -652, -411, 2464, -358, -793, 2245, 690, -1587, 1929, 1266, -1938, 731, 1710]
1696A710l748J322K848k908j080L165k062j443L184p24k787K349J084l465J544
1711a011K528l520K4L415k111j957L626m86k708K307J521l576J587K247k857J00
1727h71K958j793j530K975k87k800K649N01l107J977K326l437j32L197k018j708
1743a100K785l03k647K392O70l314J803J751l209J21L035k757j391L260q56k675
1759b435K926L60l273J503K214l185K70K772k106j236L064j425j773K963K18k884
1775b027J727K256l358L08K783j946j132L072r77k014K729K15k977J901K022l304
1791g22P92K546l028j72L012j603k188L031R8k979J793J413k974O36K450k941
1807h36n59K856j468j832K748l24k828K317J094l307J063K578k966o39L357j775
$$ y = [1710, -2038, -716, 2132, -776, -1856, 1309, -753, -2196, 988, 264, -2523, -174, 910, -2555, -1011, 1517, -2003, -1979, 1436, -675, -2632, 994, 508, -2200, 107, 1628, -1948, -361, 1886, -971, -871, 2087, 294, -1236, 1739, 1452, -1348, 1301, 1802, -1305, 672, 2998, -439, -571, 2626, 608, -1100, 1685, 1382, -1265, 1127, 1797, -1517, 286, 2037, -1172, -1051, 1984, -773, -2164, 1096, 240, -2435, 491, 851, -2422, -919, 1295, -1890, -1620, 1152, -954, -2190, 874, -551, -2324, 639, 857, -2027, -300, 1956, -1402, -1094, 1689, -257, -1389, 1683, 706, -1308, 1421, 1636, -1341, 560, 2582, -722, 70, 2616, -412, -584, 2428, 825, -1363, 1668, 1766, -1213, 580, 1993, -981, -345, 2105, -836, -1395, 1461, -7, -1839, 909, 585, -2243, 74, 1168, -2139, -1076, 1502, -1464, -2103, 1254, -521]
1823e21j892K760J05k549K099Q64k506R72K077k397k34L175j944j733L277n91
1839I62k452K725O78k585Q77K076k433k07K699j810j394K579o27k249K658K01
1855A698k984J058K325k844k62K926j890j627K551o33k404K444N41l131J504J702
1871I74k408j49K562k087r68K950j264k153K405P28k448Q51K342k555K15K219
1887A214j731p09K383n34k072K470N37k737J620J525k534L43K558j803j436L144
1903B238r25k589K791M51k755J355J437k723P42K211k597l79K669j449j986K325
1919H16P2k803J444J841l078O03K190j864r24K138r87j617K342l58k141J965Q33
1936D72k605J037K192k298p16L104j204j650K294Pk252J949J157k574O65K088
$$ y = [-521, -2413, 347, 452, -2097, 2, 866, -1640, -668, 1409, -988, -1222, 1953, 9, -1724, 1553, 962, -1490, 1235, 1913, -672, 205, 2281, -152, -359, 2340, 530, -864, 1715, 1088, -1161, 1497, 1698, -1286, -228, 2097, -747, -1009, 1917, 27, -1600, 951, 318, -2086, 358, 899, -2232, -728, 974, -1434, -1583, 979, -1108, -2076, 874, -390, -2543, -138, 590, -1858, -1007, 1335, -1220, -1005, 1214, -517, -1226, 1157, 623, -1449, 1021, 1558, -1179, 441, 1966, -568, -225, 2333, 530, -906, 2238, 1313, -1276, 1515, 1966, -789, 566, 2003, -720, 22, 2233, -364, -743, 1926, 477, -1509, 816, 888, -1915, -471, 1370, -1708, -1105, 1085, -779, -1703, 435, -552, -2169, 173, -185, -2326, -361, 472, -2133, -1096, 1096, -1202, -1918, 1186, -18, -1668, 626, 633, -1619, 330, 1487, -1087, -422, 1666]
1952A666j715n92K436j285j355K710n41k179J972Q98k567P92J675j921n98K781
1968B177j860r69J904m80j915J542J229l019J390J294k528L36K133j734j309K694
1984H85m59k043J493N10k188J269J538k485K37K373k121r88K947q74k025J885
2000d6Q00k442J682J308k271J01K499j676j216K460n15j794K216M7k116J564J129
2017A730k223J00K369j858q36K487r23j728J764N10k546J435J154k525N74J831
2033A315j603p82K208j019j905K521l74k066J546J058k493N64K268k146r08K323
2049E07q48j630K483m10j939J892N79j955M98K329k176m26K462j459j415K505
2065I97J46k271J501J305k061M75J498j602j53J710q72j515K174k29j900J313
$$ y = [1666, -49, -641, 1795, 510, -845, 1865, 1324, -855, 1117, 2015, -552, 240, 1915, -6, -604, 2177, 317, -652, 1252, 772, -1143, 399, 1628, -1391, -1, 1293, -1235, -899, 1234, -500, -1809, 885, 426, -1617, -124, 386, -1802, -533, 1005, -1480, -1243, 1130, -991, -1979, 968, 94, -1931, -46, 754, -1688, -6, 1302, -969, -868, 1631, -45, -1261, 1199, 684, -1110, 1106, 1153, -963, 601, 1730, -493, -393, 1976, 118, -718, 1769, 846, -882, 882, 1392, -1154, 281, 1435, -1090, -516, 1315, -288, -1070, 1138, 119, -1786, 735, 361, -1705, -159, 899, -1594, -1030, 1238, -908, -1816, 507, -341, -1971, 512, 102, -1837, 55, 634, -1321, -823, 1506, -670, -1096, 1366, -93, -1508, 997, 1143, -1128, 373, 1678, -383, 92, 1590, -12, -165, 1545, 673, -842, 1332, 1103, -797, 516]
2081E16J110k467N02J778j821m57K403j456j269J931j19k184J872K91k182J081
2097d71J781k586j97K509j593j034K090k43k092J623R87k494J289J195j744O1
2113i19K049j524o40J764jk030J959M15k008J026J637k165m99K331j239m69J876
2130A563n02k075J881L74j802Q60J277k181K49K126k074r16K276n54j984K196
2146G14J11k037Q67J410k008K60J252j417j64J513o79j628J866K43j538Q84R31
2163E80j779K75K127j744j042K207l18j399J634L36k133J458J053k035P28J679
2179A627j757m21K325j138j394J922j57j822J272R50j915M26J599j461p11J747
2195A092j101q87J994n90j732J550N96j948M05J527j621p38K194p68j004J066
$$ y = [516, 1626, -841, -339, 1439, -382, -839, 1564, 108, -1161, 770, 651, -1533, 339, 630, -1552, -471, 1310, -1276, -1473, 1036, -557, -1591, 499, 256, -1836, -213, 774, -1720, -431, 764, -980, -919, 1130, -394, -1034, 730, 729, -1301, 658, 1073, -935, 91, 1728, -437, -936, 1395, 156, -313, 1563, 1061, -1014, 867, 1241, -561, 299, 1576, -605, -356, 1770, -304, -1220, 1056, 502, -1482, 714, 825, -1212, -345, 1065, -943, -683, 569, -848, -1012, 501, -178, -1806, 60, 303, -1235, -351, 580, -1199, -924, 1203, -541, -1583, 624, 306, -1093, 541, 877, -1256, 202, 1255, -780, -52, 1627, -130, -551, 1774, 636, -758, 1164, 1007, -815, 457, 1407, -508, -82, 1517, 56, -655, 1092, -9, -896, 1098, 508, -1224, 326, 922, -1026, -621, 906, -715, -1453, 741, -27, -1031, 35]
2211C5P5j719J388N83j585N22J393j495j0J772j305j050J959q5j871J456P91j731
2229h77R41J128j486l04K148j191j012J773o56j133J296R14k276R76J433j750
2245g6k74J809j532q97J988m05j596J478M10j961P58R73j541J71J662j659m51
2262a143J576l57j594J496N07j923P88J242j744K99J181j022n57K278j122j299
2278a394J930j44j787J609Q30j924J34J991j402p71J912l27j293J577O7j775J314
2295E47O90j538K64J521j499m84J936j030j399K206k60j840J321P34j790NJ341
2312G25j080l43J227q29r64J812j90j829J261Q75j872M11J618j287j005J904p01
2329b67j126J768j6j903J541J060j955O63J067j412k5J565q57j114K334l33j965
$$ y = [35, 110, -1609, -221, 362, -1223, -701, 692, -803, -813, 959, -346, -1396, 563, 478, -1393, 63, 854, -877, 64, 1192, -294, -598, 1550, 359, -653, 1120, 464, -669, 627, 1541, -735, 241, 1674, -76, -350, 1459, -73, -970, 1018, 613, -983, 495, 905, -1056, -298, 675, -866, -695, 967, -692, -1143, 433, 76, -1518, -22, 485, -1438, -650, 592, -1152, -853, 328, -694, -1251, 1027, -95, -1394, 536, 392, -1395, 214, 1044, -880, -746, 1245, -157, -928, 984, 657, -636, 941, 1008, -767, 547, 1237, -301, -37, 1484, -15, -499, 1437, 407, -992, 1214, 954, -886, 435, 1169, -621, -616, 725, -355, -698, 529, -300, -1264, 548, 358, -1471, -210, 665, -1207, -796, 822, -465, -1470, 434, -267, -1393, 375, 359, -1544, -3, 1057, -898, -235, 832, -580, -605, 960, 103, -1011, 1323, 990, -975]
2346i75J230J120j843N57J387j643K4J387p80r61J521l90j468J284R45k066P17
2363D6J345j616n85J925j004j210J822n02j067R34P05k043J186P60j724j95J958
2380G35q87q66J714p03j540J576O23j677Q13P86j424p8J613q47o38J980q82r83
2398f85J454P6j570J052J258j678l03J884j311p12J648p26r62J644r6j318N90
2415B45J131j839J80J486j348m04J327p43j142J530j41j286O96J043j583N0J555
2432G57j511m90J967j013j225J749j9j663J345P66j621O02J058j372k64J508n70
2449Dj018J588J49j308J098K34j379M8K228j668l69J429o32p74J159P9j697J597
2467G68M51j771O07J597j553m22J409p47j089J535j74j471J127M43j534N93J150
$$ y = [-975, 255, 1375, -468, 89, 1476, -167, -143, 1244, 464, -497, 1024, 634, -834, 450, 1395, -671, 46, 1391, -225, -810, 1115, 111, -1099, 723, 221, -846, 88, 793, -1250, -64, 696, -1028, -1223, 735, -152, -1018, 696, -7, -1547, 29, 652, -1025, -212, 574, -850, -928, 685, -162, -800, 1180, 298, -685, 769, 845, -725, 327, 1585, -93, -396, 1488, 177, -535, 1113, 387, -575, 1069, 973, -345, 245, 1376, -463, -283, 1203, -145, -549, 778, 35, -1107, 423, 282, -1004, -308, 735, -848, -798, 757, -754, -1244, 723, -290, -1515, 234, 215, -1448, -103, 663, -958, -356, 702, -670, -934, 574, 4, -1014, 574, 723, -585, 513, 747, -632, -584, 1644, -24, -393, 1036, 404, -370, 789, 868, -829, 768, 1219, -552, 55, 1652, 99, -323, 1086, 339, -750, 785, 611, -860, 267, 710, -824, -231, 919]
2484I19j669r7J579j158j065J901k53j606J173P45j628L95R14q52l00J491j085
2501e96n54J964o48j174J007P66j470O09J193j323k68J774j128q30J551j33j271
2518e31J059N31j584O29J255j517oJ357j125p55J657m23j422J404P45k032Q83
2535A25O42j604L09J614j557o66J705n18j217J183M26j398Q53J109j817M9J281
2552E19j162m92J660n89j294J371M35j676R80J363j775J71J612j293r02K244r42
2569B30q69J424j65p65M12Q56j455N55Q03r09k87J406r60j086J509r8j620J342
2587C23P10j782M22J204r75m58J170o98q75J348k74j420J425K51j309M75J314
2604H51j833j33J714o86r89J468k99j283R87P03j501P37R76j275p5J351q39m98
$$ y = [919, -750, -847, 732, -426, -1491, 410, 157, -1449, -276, 469, -1159, -764, 150, -702, -1002, 489, -596, -1150, 814, 166, -1008, -1, 765, -705, -96, 1097, -226, -494, 1280, 152, -678, 873, 740, -531, 528, 1059, -525, 104, 1359, -158, -164, 1193, 68, -687, 970, 547, -875, 529, 1274, -758, 125, 767, -837, -528, 1086, -471, -1137, 568, 50, -1167, 16, 442, -956, -103, 1006, -811, -762, 519, -643, -1135, 525, -64, -1358, 13, 448, -1228, -248, 1115, -660, -489, 1123, -170, -1072, 1172, 230, -639, 785, 620, -145, 267, 1123, -332, 223, 1026, 117, -170, 1236, 276, -810, 699, 601, -1019, 323, 1033, -749, -327, 877, -98, -556, 614, -84, -959, 389, 115, -1305, 120, 371, -938, -463, 851, -982, -1115, 599, -87, -1076, 392, 93, -1190, -203, 500, -1001, -264, 712, -563, -638, 713, -126, -624]
2622f24J526l18j296J374L42j654P28J150j280kJ319r63j013J538l26q45Q96L62
2640I14j422P06O38j389r5J802j243o57J189l89j178J197M35j535M99Q76r56R5
2658e13J369j079q67J080j99p92J396l90j115R61P37j409r9J700j200k35J307
2675F52o43p17R98K75j275P20Q90j408N75R40j279l92J615m32j184J340J77j373
2693e21J000N00j519L45J227j222k49J208r21m97Q05J33j246R56Q61j889M22J287
2711F80j190m69J570p39r95J276K91j375P06N85j296N77J258j317m24J827j108
2728a43r60J497K03j132O23N14j101j6J264o91o65J770q04q26J340k20j448J342
2746E47M87j590N49J082j318k99J541r91m93R76j19j126J017L13j153N28Q51j085
$$ y = [-624, 902, 584, -712, 662, 1004, -650, 78, 1228, -52, -54, 1265, 302, -711, 827, 501, -344, 552, 914, -508, 198, 836, -553, -648, 1154, -89, -746, 443, 54, -1124, 73, 508, -1027, -528, 348, -608, -513, 856, -223, -1090, -10, -209, -1001, 395, 5, -1110, -149, 588, -821, -920, 780, -420, -655, 652, 9, -708, 290, 565, -710, 10, 900, -508, 67, 1007, -272, -664, 951, 519, -665, 675, 852, -521, 479, 979, -540, -195, 1032, -190, -439, 769, -152, -649, 156, 289, -957, -1, 860, -1029, -607, 680, -510, -979, 591, -148, -1143, 133, 424, -951, -245, 340, -956, -379, 879, -438, -862, 965, -143, -1103, 394, 597, -535, 88, 602, -499, -515, 749, 58, -607, 1163, 359, -467, 873, 653, -795, 547, 1034, -556, -7, 1075, -243, -542, 999, 8, -485, 491, 372, -754, 263, 576, -577, -49, 802, -283]
2764b83n57J352q31l81J110l27j162R67Q07j517J97R10j096J76J048m79o61J298
2782E71m09j294J528K57j372O23P74j367N17J163j130n01J604k04j430J251M82
2799A063j503Q28P95j536L73P60q56n21J515m76j166J263L06j409P73O91j240
2816c40N4J305j352m50J314m84j001J085Q4j258J160O07j851L79J554j032o86
2833i12J542p15r71J332M2j088Q18N87j656R61R07j101m90J629r95n02J142L1
2851E61j380J179O43j273J94J218j112k44J147n08r61J243J12j339P92N94j278
2868d12K37J135j379PR51m26p78J263l70r09M67N32j006M90O22j103J68J078q44
2887b77q41J492k73j252J053N51j391P52R95j467L51R45q67j7O85M7j316J477
$$ y = [-283, -840, 512, -319, -700, 410, 83, -1079, -112, 695, -822, -625, 285, -811, -635, 413, -66, -727, 571, 162, -1132, 396, 653, -719, -96, 678, -689, -172, 991, -139, -640, 964, 760, -670, 581, 1063, -440, 388, 1183, -353, 20, 780, -76, -597, 918, 442, -724, 539, 845, -564, 209, 900, -340, -286, 1019, -333, -783, 531, 47, -954, 131, 215, -1043, 117, 724, -1127, -748, 806, -226, -912, 630, -85, -1056, 276, 318, -770, 48, 635, -1021, -60, 847, -254, -744, 885, -110, -612, 530, 561, -819, 360, 1003, -270, -76, 1142, 30, -214, 933, 425, -536, 707, 819, -520, 272, 866, -412, -175, 960, -419, -412, 539, 113, -665, 598, 228, -681, -214, 318, -688, -198, 424, -679, -511, 567, -277, -1118, 374, 101, -1151, -98, 453, -938, -186, 809, -658, -307, 638, -229, -246, 439, 486, -830, 647]
2905F47q2j349J015P53j444L13J027p03q65J429l30j058J129J35j153O37Q04j212
2923c07p7J144q76m37J134n88q82J358J15j518P97N83r47N9J042j014k19R79q06
2942d60l86J089m0j405R80O70j180K85J307j241n37J572m65r52J312j07r90O96
2960A48M46j018L37J148j447J25J159p18p01J230J67j705J145O00j299L42Q19
2977G78j027j53J417r35o78J116j55j058R92K49j617O54R19j163j43J501r96o68
2995i67J256j70p19M45K78o41K39O68j104p4J459o13o38J244o28n76R76M86j659
3014g38M19J326j133l69J287p68n01J470o07o02P65L29j123O32N13j010j48J443
3032A185j344l08J108j66j035J116m6j340O79P50r10l55J257r14m32J287k89j117
$$ y = [647, 565, -784, 231, 984, -460, -147, 880, 177, -688, 741, 411, -647, 482, 617, -536, 101, 905, -307, -384, 760, -116, -553, 581, -7, -889, 469, 584, -934, -137, 446, -501, -442, 600, -414, -633, 346, -460, -846, 243, 203, -1202, -222, 448, -732, -447, 860, -381, -918, 654, 189, -763, 549, 442, -548, 148, 594, -424, -87, 1061, -386, -261, 898, 180, -521, 709, 876, -829, 316, 916, -383, -41, 778, -249, -402, 1015, 80, -598, 518, 363, -695, 297, 546, -1071, -417, 502, -661, -804, 697, -299, -967, 289, 119, -600, -155, 123, -518, -279, 389, -715, -789, 670, 57, -581, 663, 35, -541, 435, 921, -738, -319, 1007, -126, -495, 792, 24, -477, 993, 386, -216, 549, 878, -245, 387, 900, -110, -258, 1185, -159, -467, 641, 475, -560, 556, 510, -830, -151, 599, -311, -666, 591, -323, -755, 532, 243, -874]
3050h74J081J08j055K29J149j323O1J396j215l87J121n53o55J199L60j690J312
3067B64N95j261K13J143q58n42J386o45o80R77l7j291R93L78o73K27O38r56p4
3086b03J020n61r82J368O3j710J138N80j076K10P41p75p01J229k66q30J001l34
3104h8r24R54R14j833M08J170r86j39R44m52j114J230j70o35P95K62r96P5J404
3123H19r06l22J119p57n69J027l9q81R56K27j248Q05Q00j193O0J011o29p82J239
3142G37l80o46Q69J45j063J39P33q07j84J138p70p77J209%j215J139J70j145O15
3161i3J84q45L20R10p87m76J170k17r12O88K93j041M12J131j278K2J105p80k47
3180d41O44J98r98Q87M60j391O58P95q06RR51j020k65Q77j43o45Q92J05j404P65
$$ y = [-874, 207, 315, -740, -511, 638, -685, -624, 772, -443, -830, 291, -262, -917, 282, 642, -1048, 264, 859, -402, -189, 954, 96, -446, 940, 295, -385, 592, 555, -736, 257, 635, -38, 189, 827, -129, -203, 817, 256, -726, 642, 705, -1005, 133, 713, -363, -153, 588, -187, -888, 341, 75, -755, 246, -88, -1012, -58, 856, -977, -569, 601, -385, -524, 420, -32, -1146, 84, -86, -721, 74, 336, -660, -585, 819, -87, -409, 710, -47, -616, 411, 372, -509, 447, 674, -574, 231, 1031, -162, -102, 909, 280, -502, 737, 357, -289, 580, 725, -338, -199, 534, -273, -457, 681, -89, -866, 343, 343, -872, 267, 437, -708, -93, 91, -754, -434, 476, -311, -787, 383, 166, -746, -58, 235, -806, -394, 737, -541, -519, 586, -194, -441, 203, 401, -597, 290, 750, -641, 17, 812, 6, 15, 966, -54, -319, 558, 415, -230, 662, 767, -637, 128]
3200A28O38j090J60J050q91n83J486j75j449R07L39j189O87O88j406L73R41q93
3218b79l85J401j064p45J291Q0j537J016P17j177K6J337j187l94J505n45p91J086
3236C55J03r84N18M82j144Q35M30p53m4J092p57q93J429k99r25Q66K71j279Q70
3255A73P95r87k86J049n83o20P53j66p76J186r3j363O00Q78j336K23J031q58o28
3274a008J318j11j153Q10Q48j442N10P50j222J56J246r11l36J005m86p62J112
3291C24J65j279P67P13n96l89Q46m50m35J106k72q76R53L26j227R45L28j123K7
3310a47Q76o23l25P79k8j152J249P1j324Q77M88j016k72Q06o06j60J055o81o64
3329g97Q34J41o49J56P86j137o3J243r27k10Q88l90n59O89j7q33Q16N15r44p7
$$ y = [128, 766, -324, -164, 886, -5, -588, 898, 723, -726, 181, 520, -669, 18, 706, -700, -327, 614, -279, -664, 737, -327, -1072, 219, 299, -1238, -222, 495, -682, -656, 681, -506, -900, 605, 60, -731, 355, 458, -526, -8, 474, -670, 165, 595, -158, -202, 890, 133, -760, 669, 370, -555, 311, 582, -697, 173, 968, -19, -305, 744, 161, -459, 294, 128, -648, 538, 445, -918, -318, 560, -776, -553, 478, -380, -1008, 310, 199, -954, -144, 704, -738, -228, 522, -700, -544, 702, -209, -545, 460, -26, -788, 324, 489, -790, -23, 690, 94, -295, 551, 101, -334, 772, 500, -376, 577, 903, -324, 621, 949, -174, -147, 729, 106, -219, 560, 532, -620, 629, 700, -624, 253, 741, -275, -547, 259, -347, -507, 548, -133, -797, 37, 178, -471, -315, 471, -666, -729, 514, -413, -623, 265, -125, -684, 5, -12, -845, -29, 486, -458, -535]
3349e35J218o85m86J132m21r42J510o13o26R18K25r39L56Q16j175J11R05l91o73
3368b95R55j84j167Q51O17j527P56M13o76k12J491j103n36O68J06j026O08N03
3386B42j003M57O59j094J78Q06l20o94Q53q0q78R43L62r31K83P37j066L77J179
3405A010r04p03J245l38q71Q97K10o37M08Q23j281J57Q96p55l17R00j23q74N89
3424C32L46j050Q2Q44j020K23Q94r88o2R13m56o60J040q4j380N90N47q60M38O82
3444C71q28j80O83k65m91J025m2r86P24J88m63k82J136j037j90J078o26j38Q50
3463E27j49r30R09N79j393O48N54n64n91J199k50r15Q27l1q01M84N70r08O6P09
3483E40n63m55J053l57n69L59J73r88Q63L33o58q2Q91j039m15J119l38p56R62
$$ y = [-535, 683, -2, -488, 644, 223, -719, 791, 178, -448, 470, 695, -244, 112, 928, -247, -136, 769, 378, -295, 660, 476, -691, 160, 777, -750, 6, 419, -257, -469, 1022, -81, -617, 51, 157, -869, -261, 242, -761, -304, 355, -739, -561, 245, -75, -769, 84, 4, -874, 69, 431, -500, -217, 520, -546, -169, 1010, 106, -597, 648, 310, -561, 336, 546, -91, 317, 1140, -141, 16, 912, 157, -160, 740, 617, -257, 332, 678, -372, -290, 554, -466, -243, 651, -337, -399, 514, 58, -602, 438, 354, -1026, -436, 111, -749, -311, 371, -457, -637, 46, -219, -710, 315, 273, -713, 11, 199, -264, -546, 590, -447, -637, 441, -185, -323, 527, 378, -552, 357, 936, -457, 191, 745, 181, -410, 789, 539, -376, 451, 420, -381, 103, 673, -235, -169, 540, -23, -478, 575, 218, -351, 8, 181, -807, 56, 389, -269, -351, 540, -499, -914, 205, -133, -889, 73]
3502G3j37n32N43K56r08L71M95l82k07P82j65o02R15k74p63Q90J30p65K90M40
3522D50o60J51O53m82l96O29J27j076J080L15j243O58M98r52O1J062p31o42Q37
3541C39k74q03J013R2q53M21L27n53j81O58o75m45J211l47n71N29J38q00O19L72
3561B17n03k95J108o79n47O64np03P47N40j004L65N13o14Q9R09r20l52R37l77
3581I0n77N48L81o75N42N11o52k32N60l18j44M58k32o38R01P2j082M94L69r28
3601e52J81Q36o16l46Q64l94o15Q52j9o59K23L97m79J1N13o64l32J014l81m57
3621f23R87k74m17N1O96j009N26N91o85m16P02L50r03N02K87n95N09J17p25L17
3641a2Q33q02l93R21n18q59J372l94m65N97J44p12P3N65q25K52J012n72q21J248
$$ y = [73, -64, -596, -53, 203, -705, -334, 161, -221, -428, 354, 189, -413, 502, 228, -535, 355, 485, -280, 10, 450, -210, -59, 594, 112, -284, 345, 472, -604, 476, 791, -452, 206, 704, -248, -187, 875, 144, -498, 339, 65, -738, 275, 367, -486, -65, 262, -291, -472, 186, -489, -934, 277, -70, -641, -112, 26, -774, -155, 217, -286, -581, 527, -152, -699, -35, -40, -743, 4, 544, -460, -95, 418, -196, -107, 802, -118, -470, 467, 90, -487, 61, 442, -233, 309, 820, 168, -64, 496, 178, 34, 492, 260, -378, 523, 595, -487, 7, 376, -552, -371, 465, -151, -497, 367, -27, -642, 210, 191, -468, -245, 152, -327, -316, 197, -467, -799, 215, -166, -623, 364, 90, -327, -276, 420, -589, -63, 528, -157, -573, 129, 479, -424, 78, 365, -230, 279, 396, -329, -12, 821, 19, -374, 547, 29, -830, 542, 148, -317, 280, 424, -288, -215, 350, -475, -223, 789, 217, -604, 644]
3661F44n63q95O88N51q93J00P82p77r1P50o08k22Q07j10r83P51N71j138L27Q71
3681E62r53K0Q65q02k52J172m51l98P64k38n73L35P50j074p4R61n97l90R71q3
3701E15q90Q15J35n88K15L03r06J72O47m85o38J086k31o49O44p7o29M70M74r36
3721e53J68P02m59n19P72j00o23N58J19p77Q34J06o56l2J177q29m91R69n27n37
3741f98Q27K86n88L14K07n11J47P31q71l14P21j54m87J030k04o94O11K44n65l0
3761BN22n81j18P83o29k51K94K37q62P62M48j140J90O99q47Q8R45p99j41N38J38
3782B78q62L91N86p88J95Q40j156o6R75n63k73N22M5o35L50N31o61J29P01p61
3802b22Q0P86n73n28N72J69k87M64J98j154P13N18p55J3L49j80p23R49l68n83
$$ y = [644, 81, -814, -126, 425, -468, -368, 414, -363, -454, 296, -312, -534, 273, 163, -820, -69, 502, -636, -309, 562, -391, -371, 494, -308, -560, 612, 161, -237, 527, 289, -284, 51, 801, -273, -347, 614, 17, -373, 598, 515, -375, 440, 575, -13, 202, 505, -401, -229, 418, -67, -705, 381, 150, -499, 145, 68, -561, -91, 383, -553, -385, 317, -142, -661, 111, 11, -612, -54, 65, -712, 122, 228, -428, -460, 717, -112, -603, 366, -161, -698, 129, 415, -173, 141, 348, -163, -16, 715, -156, -470, 251, 97, -390, 640, 436, -258, 353, 597, 32, 2, 524, -57, -175, 608, -21, -272, 22, 259, -603, 159, 607, -533, -343, 356, -491, -403, 542, -257, -398, 140, 278, -584, -193, 393, -395, -200, 640, -516, -582, 393, -170, -443, 79, 124, -511, -161, 370, -291, -162, 539, -222, -142, 644, 71, -457, 115, 284, -3, 461, 659, -495, 218, 736, -19, -6, 343, 163, -560, 389, 21, -562]
3822e62N56K67n94K93J77l05j10N08m92r5O19m15n12P66R8r39O22K48o22L50N52
3843D10p81j34P14j44n14M77L32q80P46Q9o48J32M79k78l8O66n74l90O33K60r58
3864d01L39O43q15K44O75n94k49P24o86m61Q40J03o75N98N32r83Q5J060j025k17
3884b63O92m05l63M33Q0p76M86N89r94L12O79q62j35P81m03k67O86J68q42J39
3904b65L84p67M23O18m24l92R23m52n22P79n6l41K34J11n22J58N91l05m51Q76
3924F00m94l79N61j48l10K07M79r17M44%j88q3M29j94k71M62J3o77M55L80q31
3945d62M14N21j052L24O61r08k43R86j36p82P58p3l19J63L57k94j48M94j48n41
3965d28O17L2p03L94M40p23K11N97o91L77L68o62l5O85m22m53O63J68o78L09L89
$$ y = [-562, -6, 261, -333, -40, 137, -168, -278, 230, -262, -357, 262, -153, -665, 101, 199, -740, -118, 130, -492, -142, 410, -371, -505, 209, 65, -449, 28, 360, -520, 226, 315, -333, -201, 278, 0, -38, 628, 54, -336, 297, 557, -401, -62, 581, -234, 10, 685, 91, -158, 566, -120, -581, 259, 362, -313, 285, 817, -166, -81, 979, -46, -263, 429, 24, -339, 94, 174, -602, -116, 473, -521, -209, 470, -392, -527, 254, -149, -416, 270, 438, -404, -265, 119, -648, -225, 393, -31, -423, 500, 48, -474, 305, 249, -92, 142, 253, -269, -111, 480, 175, -276, 600, 106, -273, 288, 140, -170, 37, 516, -401, 43, 43, -145, -228, 201, 7, -264, 198, 211, -466, -11, 369, -462, -48, 473, -579, -255, 406, -502, -745, 241, 105, -677, 81, 8, -311, -148, 209, -85, -233, 261, 113, -428, 189, 221, -482, -88, 352, -371, -160, 437, -254, 123, 491, -171, -206, 479, 57, -396, 267, 435, -243, 66, 455]
3986D55o93M5O22q88K21N83l55l80M25J02n32L25K80n60J06N89o58K1O01j43n49
4007c83M09J02o66N18M26p11j9L37l7k87O07k79m66J045k48p66N32J61o98L34
4027h9L96m10j91O69l53n61O70K3k47P2M36m62J27O54o31m91R15n19n38P38J41
4048C49q43L33O50r91K94N70n81j86P50m00m40P47k29o59N92J38o64N77J02l52
4068b43J33J93n5o30Q82Q3p66L31K68m69J60M89l31l56N13k68k82P93k19n13L21
4089C4L62n92J53P70o56j50L96k90k50M28j40j59L62Qn30P9N17l88j64N18l09
4110ap66J028k98n26N38L56p80M7P45p34J89M97m41j30K22J07n62N90L31j003
4130e91Q42K4l79k78M87n16J78P32k41n88M79J8JR4K90p23L79N56q80O3M45k55
$$ y = [455, -238, -193, 429, -459, -238, 345, -10, -390, 35, 137, -395, -70, 210, -350, -244, 345, -313, -292, 309, 166, -383, 26, 128, -538, -20, 406, -305, -324, 13, -24, -311, 296, 17, -449, 596, 348, -418, 114, 275, -423, -89, 307, -103, -294, 375, 22, -539, 131, 154, -93, -21, 415, -47, 80, 734, 103, -388, 527, 8, -530, 208, 349, -494, -161, 489, -502, -208, 362, -219, -405, 345, -55, -495, 252, 23, -636, -44, 94, -570, 7, 109, -243, -110, 83, 28, -602, 280, 363, -403, -72, 196, -273, -113, 376, 45, -311, 202, -66, -348, 445, 226, -287, 34, 396, -196, -43, 727, 71, -79, 317, 27, -223, 205, 65, -94, 268, 276, -254, -175, 342, -46, -210, 308, -1, -767, 261, -37, -563, -25, 331, -449, -402, 343, -391, -202, 295, -146, -276, -54, 53, -509, 81, 412, -591, 251, 275, -104, -382, 105, -411, -233, 499, 258, -330, 149, 167, 168, 262, 552, -171, 208, 764, -116, -53, 392, 137]
4152A37n52N71K86q50O94K55p28j38O17m70K2L24k65p42J113J71p36K08O53q31
4172b61J93J81m66M9O07m25l39O32k03o64Q24J25p03O13O5m16p1M48l08m31N93
4193D3K33o62O08J66m06L6K69l21k55P32l41j11K24j26n78L98Q42q91M32L01q86
4214b93O8N85n33j72N64j18q18N64M72p14Q3N32m02l67O56n9l93N11m23m35N80
4235a12K6l23P6M09l22j88P12m13k82Q40l38m28K76K86l12l2M46l26j26R54r29
4256a06l08J116l39q41P61j23n67N78N54p63l2N80n70j89M30J67o89P09l27m65
4276d24N65J66r11K65N44n32r7N90n83l27P61J38q74M14L23n81K48M39k59k63
4296c98N69l38q5M68n0n79M96J44m96L99N58p16r5O34l00l76N07k02m2N5M81q53
$$ y = [137, -415, 156, 442, -408, 286, 541, -187, -325, 292, -178, -156, 168, -97, -839, 274, 445, -291, -83, 570, -261, -68, 113, -353, -304, 303, -122, -461, 171, -32, -696, 128, 253, -450, 163, 228, -188, -259, 189, -119, -550, 43, 276, -386, 222, 388, -18, 18, 287, -34, -289, 443, 102, -9, 215, 89, -489, -91, 751, -140, 292, 593, -293, -225, 360, -173, -345, 219, 101, -717, -153, 319, -395, -312, 220, -182, -549, 107, 48, -345, 166, -257, -692, -112, -86, -409, -333, 76, -246, -434, 278, -135, -417, 423, 85, -343, -67, 219, -93, -125, 321, -5, -131, 823, -106, -414, 702, 363, -478, 283, 160, -407, 171, 725, -38, -70, 510, -60, -249, 181, 348, -341, 368, 41, -424, 141, 307, -604, -339, 205, -327, -424, 166, -417, -744, 17, 155, -719, -305, 18, -563, -315, 124, -135, -398, 171, -167, -252, 216, 166, -413, 83, 227, -269, 130, 688, -28, -123, 511, 211, -165, 342, 140, 98, 153, 634, -219]
4318b19J9Q13r04J90O57o08j47M25j93l36K41J27l75K46N24n72K7M81o97o7M84
4339A16O9o77K35N02p03L54K82o32k2Q11m51l58O60l73j6L47J33p24K26M45p38
4360e14L19Q59m18n92O61M5l99L76K8l45J77L42o03J05L58k34l08O26m43m1L55
4381C54M5o20K39J77o8l41N92m33n22R21j14r83P22K6k82Q0L03m77j66Q24o12
4402c35j1L83r9k59L89J18o61N91J07k34l67Q74p02j92Q19l53l71P01K1q12N39
4423A46K64n58L21N18o36o4N12o14l93N50J77m72O41J48o05N2M12o23J68M33n28
4444a51K0M48m21l83M86K24k71k45M14j64l51N19m06k85Q63k33o56O85J49q21
4464e79L46P14o54O1M28j69n83O38j34j88K91M5m29K38M59p95J29P94l49n03N63
$$ y = [-219, -200, 613, -291, -101, 556, -52, -199, 226, 33, -303, -62, 65, -310, -64, 460, -112, -85, 396, -301, -368, 116, 185, -492, -257, 245, -458, -104, 178, -454, -476, 335, -116, -474, 186, -187, -203, 144, 277, -447, -221, 224, -514, -195, 664, 246, -346, 315, 360, -39, 337, 365, 20, 197, 539, -64, 41, 399, 165, -143, 483, 40, -1, 354, 399, -221, 18, 195, 127, -214, 378, -55, -577, 344, 230, -753, -31, -5, -287, -207, 96, -381, -547, 277, -335, -346, 37, -62, -321, 68, 186, -475, 116, 223, -11, -378, 496, -206, -398, 421, 68, -303, 398, 419, -393, 146, 410, -148, 173, 691, 55, -9, 503, -111, -504, 46, 223, -249, 392, 540, -65, -13, 399, -224, -56, 377, -151, -131, 317, -104, -487, -1, 223, -48, -293, 121, -43, -394, 125, -281, -566, 297, 64, -592, 93, 242, -579, -233, 481, -173, -112, 316, 147, -436, 202, 68, -120, 171, 216, -213, 25, 484, -311, -182, 612, 263, -240, 323]
4485C23j70l27J73M70l98q0K93o56J70O34l30n32M32J32n30M61o3l12K51N26r54
4506d87J28O60l51m00M36L67j086P40j3n27N72J85l80J32K29k76k64P52l69m17
4526c69N58J89p74M24L4k62k3Q01n18m99P68j45k18P67l20p25P04J63q92M23K20
4547C06k62k88O47j43p60N79j74k92K83L16o52M37K11m93l8N44l12k51M54p0j76
4568a34Q2M54m70k46N30m09k29O30r0l57N37j90o90N18M69p10K16L28n48J04P22
4589E17m31n03O78k9l48L45K0m06K46K35m02j51Q35o86q2M66Lq11P25p9l43J45
4611e6L48k96n9M34n22k91O26J00q78N17L94p64M05J28l69r5O32m33j71N83k74
4632d1n55N61j61l65N86L79p25K04N28m85m51O71K31l63L78j69m51L37O01p93
$$ y = [323, 153, -174, -1, 469, 71, -9, 284, -372, -202, 432, 102, -430, 2, 134, -396, 65, 2, -310, -59, 467, -487, -359, 301, -50, -450, -14, 353, -733, 7, -6, -533, 39, 224, -156, -24, 205, -71, -335, 417, 48, -369, 189, 378, -396, 28, 62, -200, -223, 578, 60, -439, 329, 184, -34, 733, 413, -312, 392, 555, -337, 86, 306, 44, -244, 403, 260, -500, 79, -95, -387, -104, 212, -440, -3, 208, -285, -323, 221, -91, -342, 112, 42, -134, -52, 402, -68, -314, 216, -193, -422, 208, 118, -239, 298, 108, -582, -64, 405, -305, -89, 239, -309, -205, 517, 86, -417, 261, 232, -116, 229, 249, -157, 89, 324, -78, -229, 606, -80, -162, 304, 307, -504, 221, 142, -201, -56, 292, -4, -63, 371, -151, -442, 184, 284, -594, -77, 317, -447, -42, 86, -283, -378, 254, -179, -350, 233, -41, -596, -35, -196, -561, 25, 404, -321, -117, 411, -74, -525, 146, 377, 14, 392, 223, -228, 109, 710, -83]
4652h3K07L62m50l36P40k17l31J59L15n02Q5N24n42l10O23j60l11K61O6k63M88
4673C25k43m49J67K04m73J94M43m50k93P49l43k92O22k3m56Q0N25n97R8K13j24
4694a23l65P15k62j15M58k7k24j26K23m31K60N32p62J44L56k68j37K44J51l93
4714a50L65rk73q1O20p99j10R72o28j88M23J09m87L64L2m32K34K27l17k93P24
4735C03l44k46O64l95m70M64M68p81L12K67q13N59L55m84m7M62J70r30P65L11
4755E90n54J04L31m89%M47n21l7K44K77n79L07J4j16J77Q7l18RL74m34K0K82k61
4778d6j63N83q2m95K18L4n34K47M20m54N6N50np45M17J05n19N16j08m89J97M95
4800A98l82q5L10Q1m36N05K68r28M82J27j19OL35n52J48M69l60k84L11O9k74K61
$$ y = [-83, 124, 486, 36, -300, 440, 223, -108, 51, 366, -136, -51, 473, -69, -379, 244, 84, -227, 34, 100, -163, 325, 82, -367, -200, 4, -469, -275, 168, -282, -575, 174, -169, -461, 161, 138, -318, -238, 287, -310, -212, 1, -123, -488, 227, -35, -150, 308, 281, 57, -69, 154, -277, -17, 515, -247, -103, 253, -15, -152, 92, 243, -150, 215, 206, -67, -148, 472, -327, -437, 535, -93, -281, 142, 251, -236, 128, 160, -272, -38, 189, -128, -421, 303, -41, -287, 377, -18, -488, -24, 444, -337, -25, 242, -571, -12, 343, -141, -188, 274, 444, -486, 279, 590, 36, 140, 471, -18, -18, 429, -92, -129, 115, 392, -187, 120, 134, 18, 195, 282, -36, -27, 347, -87, -67, 215, -46, -209, 374, 292, -203, 15, 49, -485, -238, 182, -272, -216, 334, 329, -416, 1, 106, -413, 103, -5, -494, -297, 198, -184, -269, 41, 122, -314, 191, 459, -469, 13, 140, 21, 27, 362, -190, -42, 427, 67, -217, 94, 163, -111, 150]
4822A50J86m38L7O17o63J49L18m0k71K15J33n16j94P60n66J99K28k69l07M81m93
4843b84O8L58o9m42K4N85n31o3O06m32J27L16n23J63L37k19q0K93j41k10L07J36
4865C26l74K15J45l51k16P44l87k74M17J14o18M66K0l55J96j83K99l57M08j71
4885F4n92N21j20m6L15K40p38K49M38m42n2N80j39n90M62n8k18R6J46l78J39K83
4907A60j48m83N78k10j37L7N46o97L78L08p82J37N09l36J48J01J38n80M10N14
4927E91p50J65M25k79oK49m18k6M25l61m28Q18On59K25L02l89j77N87n67L6L02
4949A71n12M09P2k39k90J88N12n84J56K77o56K35M42j14m19P90n15k2K64K00q48
4970d83L13L26l90KN97l38n07O53p1mL25j22l11K3L98m39j26L66j43j47M74j16
$$ y = [150, 336, -102, -65, 552, -111, 38, 356, 316, 45, 260, 393, -123, -317, 443, -123, 76, 304, 35, -272, 209, -284, -216, 142, 73, -369, -345, 240, -291, -354, 252, -180, -53, 263, -260, -97, 240, 21, -59, 234, 93, -117, 190, 326, -48, 167, 312, -39, -255, 489, 102, -172, 245, 359, -259, 207, 227, -128, 68, -115, 184, -173, 235, 64, -528, -7, -127, -173, 142, 382, -356, -107, 331, -111, -163, 417, 278, -312, 150, 92, -126, -30, 116, -262, -123, 160, 12, -471, 107, -103, -240, -203, 343, -354, 24, 332, -450, -313, 196, -140, 8, 109, 247, -333, 77, 591, -159, 6, 431, 152, 146, 395, -23, -49, 376, 15, -413, 405, 411, -148, 77, 379, -10, -187, 400, -167, -131, 171, -341, 68, 140, -99, -389, -201, 311, -273, -117, 160, -496, -261, 181, 67, -352, 438, -77, -99, 165, 365, -483, -170, 156, -234, -232, 365, 27, -480, 173, 102, 98, 423, 301, -10, 13, 411, -28, -154, 212, 69, -78, 396, 280]
4992B80l61J79K42m60K37J13l12Q1L12p9m39K97j6l45J25K68k54O3Q0l39j01L94
5014c5l2k21L85P4r05O19L39p45O09J01l05K8N18o50K22J87L94r34O36J44m00
5035B9k2L9j25k36R91r82%Q50j64j62K5J26p90O19N1l70j04N50l15J26j06Q0n34
5058d24M54J28l99K33K9k53J41M1j69J11J49k94o1M15ol86N22l61l09J52J64l08
5080d31K54J79K70p74O30j13o3J23J62m60K07K70j30m32N08o5m11L64L0j38NN17
5102E02p14K74K70l05j0M27m96K05l5R2n12K78K01n88q3O00n50J96J60j28RL96
5124A89m96j73N31r5m67K18J10PJ46J13K8l82N69l06j90K4J34j61k07R19n86K40
5146A65Q2j73m25P09m30q5L48J28l40J47K59l74p1N13l12k20L22j39l70R9L78
$$ y = [280, -81, 98, 340, -120, 117, 230, -82, -1, 311, 232, -207, 90, 74, -271, -146, 122, -132, -69, 11, -328, -429, -35, -67, -288, 97, 171, -734, -115, 224, -521, 88, 189, -116, -88, 430, -220, 2, 189, 583, -351, 285, 429, 29, 7, 46, -79, -315, 676, -306, -306, 544, 380, 218, 243, 369, -421, 198, 249, -121, -225, 325, 10, 136, 30, 110, -424, 30, 158, -241, -8, 21, -232, -91, -50, -219, -108, 41, -253, -314, 101, 95, -291, 231, -130, -439, -287, -123, -431, -177, 2, 272, -502, 128, 15, -48, 75, 237, -223, -16, 254, 124, -308, 200, 135, -276, 88, 118, -20, -15, 502, -212, 62, 332, 27, 17, 444, -52, 153, 118, 210, -302, -24, 177, -411, -494, 106, -444, -248, -88, -216, -207, 189, -307, -480, 51, -44, -511, -293, -183, -176, -30, 83, 111, -271, 298, -8, -198, -174, -40, -201, -408, 511, -75, 165, 247, 74, -351, 358, -72, -157, 191, 319, -21, 126, 385, 11, -60, 453, 141, -79, 243, 104, -266, -167, 211]
5167B11l08J30K46n29qL70l90L0P65n70l03J79K40n2j74L96n03N3M18k60k13K45
5189b7j34j83O37k55l86N41j62m43L47M09m99j13L23K55m30P2K47m41K95K54o11
5210c04p8Q46p65P2M69j74k00M71l3l10L0L67l24k11L69k14QJ58n23J7O42l54
5232d1k67N09l2j95P9j17J50l97L87j48m86Q83k5o22J34K12k89l7O54n13L33O1
5254B33j31j59L90k03k67J88K24m14K44J12j52q1J76Q3l09M84j96m10K99J2l79
5275b56J26K06l12L90M7j90j28L29l50n60Q12J1m89M96O1j2k38J53j04l99M33
5296B6k39J2J41N54n09k62N50p59J88L95j53j14N55k43m26M27q0k58L34N22n96
5317F5p7N08m83j88L48j43l32N05l23l9k7N86m18k24M84o9k14K92j31l89K22L76
$$ y = [211, -97, 33, 279, -250, -258, 112, -278, -248, 517, -53, -356, -177, 63, 11, -163, 233, -270, -217, 201, -59, -272, -27, -161, -344, 293, 38, -348, 193, 31, -412, -65, 344, -155, -268, 55, 310, -120, -48, 199, -242, 53, 307, -304, -382, 464, -301, -229, 240, 66, -134, 337, 304, -6, 24, 391, 67, -144, 225, 11, 19, 177, -346, -329, 313, -41, -308, 201, 169, -26, 53, -64, 86, -311, 76, -72, -558, 325, 300, -322, -188, 24, -265, -302, 352, -161, 172, 233, 102, -57, 333, 130, -137, 51, 275, -139, 105, 217, 65, -16, 160, 243, -66, 418, 222, -188, 111, 123, -256, -130, 76, -236, 154, 201, 11, -117, 212, -138, -698, 114, 125, -364, 132, 193, 181, -57, 96, -8, -407, 26, -213, -201, -60, 494, -15, -277, 273, -486, -298, 97, -56, -170, 385, 142, -284, 143, 63, -195, 139, 661, 65, -12, 496, 13, -175, 173, 30, -302, 203, -120, -159, -186, 400, -18, -242, 242, 173, -41, 251, 120, -269, -47, 329]
5339C29j79k39K91k89o7M75m39j43M69k58j87O2L02l61J00K74m39J29O81o52M7
5360i4K57k6l49K87J40n70M75l0R4K54j90k68K8L03m83K89p8J00j09j09Q5j02
5382i6O8L41l62p9L11k69j95N61m66L07J21k34N1j77K49k02j19K65p1l13M29Q2
5404B02p36K11M45k94k7N96m21M3J38l96k26N30J20n33L22K73n32K83J67n91L43
5425h3J41n8MJ6L05n97K94K88o76L64L45l18l02M55M1l19M8r2r2J80J93l87K11
5448c9J80k02q4L78m00J64QJ35l59K65j18m32J50K68l87K05K35J7k15K81j40r8
5470a88N19k68j88n3K14k66n5N27l11k38L4L16m37M93P0k52K39J07k52l1K20m61
5492b61K44L77m40r8M09m5n54K47K14m55K90K38l47M9N5K49m25N26N7r08P00J86
$$ y = [329, 150, -89, 202, -87, -154, 321, -118, -261, 208, -50, -237, -175, 127, -234, -134, 140, -299, -170, 511, -141, -94, 163, 137, -212, 75, 215, -355, 120, 90, 184, 438, 248, -20, 8, 311, -172, 117, 39, 139, 30, -79, 6, -96, -28, 313, -49, -128, 183, -86, -281, 280, -186, 121, 242, 8, 59, -118, 131, -71, -190, 75, 4, -309, 120, 202, -534, -323, 122, -172, -199, 397, -24, 19, 157, -239, -465, 65, 185, -348, -26, 247, -285, -2, 165, -426, -83, 58, 0, 4, 20, 325, -272, 22, 310, -366, -2, 343, 25, -277, 178, 219, -100, -52, -144, -236, -56, 137, -250, -39, 141, -61, -145, 233, -167, -3, 5, 140, -219, 46, -72, -504, -354, -86, -473, -268, -33, -16, -231, 50, -90, -188, 331, 63, -125, -178, 36, -230, -285, 242, -69, -307, -273, 43, -394, 99, 169, -83, 156, 263, 11, -20, 200, -261, -17, 360, -80, -178, 231, 186, -368, -121, 93, -362, -72, 166, -181, -132, -77, 172, -253, 273, 330, -578, 122, 308]
5514C08o63J10L69k25o3M3L6j36J99J88o88N22M37o76L27J23l15n1K60J06k90
5535g9L14j53m09K49J67l90M72J43j71k19M67l90k9L14k84j91M30j79o8J73J74
5556C41k74k90N64l70P7J9K60n06L55j97jm51N83m11J80L77p4k20Qj47k64O84
5578B43l5o11L72N32o48m3K40J50l43J34j31j78J53J83j76J33J20j90O3L62m08
5599g8N7L45j25k66K24j18R1kK05o61L16M76m09j69J53K68p61O18l36j68M44J67
5621B71l31j2L76l26K3J40l35j14K63K6j59L5L66p18L27M53k49m18L79p7l14O32
5643B38j37k86K24j47k05K21J84R4j1j64o7q1J82M27p04M67k7m42K38K06m19L63
5665A54J94l56k67L87K93p21M89j4m79K63J59j83m3J97k14m9K36k23j00J18O0
$$ y = [308, -355, -245, 124, -101, -164, -121, -85, -221, -22, 166, -522, 0, 437, -239, 88, 211, -104, -155, 105, 211, -79, 235, 82, -327, -78, 89, -301, 171, 314, 143, -76, 391, 1, -28, 286, 2, -189, 241, 62, -6, 167, 341, 67, -223, 341, -29, 48, 67, 327, -179, 176, -21, -22, -473, 110, -301, -121, 256, 182, -38, -30, -177, -441, 243, 208, -403, -31, 501, -147, -190, 50, 200, -143, -9, -140, -318, -165, 18, -158, -25, 95, -95, -32, 330, -78, -21, 324, 199, -67, 157, 39, 130, 128, 333, -328, -12, 464, 55, -114, 39, 307, -454, 164, -172, -340, 104, 271, -60, -72, 304, -22, 1, 141, -194, -308, -45, -19, -178, -143, 223, -495, -168, 285, 36, -382, -3, -80, -394, 238, 101, -185, 39, -108, -313, -92, 92, 186, 175, 11, -56, -137, 45, 472, -232, 235, 208, -234, 4, 210, -209, 154, 348, -8, -275, 112, 405, -316, 173, 159, -320, -57, 102, -81, -124, 73, -141, -190, 46, -177, -277, -159, -99]
5686i9n7K75O9m27K80J25l27m68R15l27Q0L8L32o52K06K76o9q7Jl0m9KJ38k42
5710i7J05K62m99m0L95l82J26M18l08k18M70K3n06J97M88n95m0J23j94R8K38j82
5732a18P6M22j98l94K09J13l40J3K16j39RL66j16m80N59l65k12O61K19o40J90
5753E1J84l26k38N76j7n59N04k59R4pK73l82K99J01n96L49J01r0o7J46J13l67
5775a17L32k3l09l8N38k37l55L27j51k03O01l63l53L66J8j34J84J97n27j60N22
5796A15j95r3K14k2k42L28J68m00K41J12n76L20K72l89k7K74j12p5K24j44k4J24
5818I3Q6m88N6M37l27j07N09l35n5L81p9m35L18M7m22M95n8k45r4K65p9j61M81
5841B83m59j2L60q7n15M41J64k39J81j53K52l64M5P3j33J86j21n56O25J83k98
$$ y = [-99, -156, 119, 188, -239, 41, 166, -161, -629, 286, -41, 39, 77, 409, -243, -37, 239, 170, 83, 84, 54, 5, 7, 145, -97, 8, 270, -229, -269, 126, -256, -130, 288, -20, -238, 232, 255, -251, -54, 434, -161, -201, -78, -272, -174, 64, -118, -42, 380, 182, -212, -3, 110, -230, -217, -1, -140, -131, 235, 119, -361, 198, -167, -379, 282, 501, -139, 51, 235, -91, -329, 247, 230, -329, 175, -84, 10, 3, 276, -106, 193, 294, -302, 47, 148, 58, -9, 137, 250, -117, 215, 192, -117, -155, 383, 146, -209, 118, -33, -236, 365, 2, -351, 15, 33, -101, 83, 280, -247, -407, 115, -80, -173, 41, 19, -223, 105, 273, -127, 114, 226, -350, -30, 242, -147, -174, 100, -12, -87, 137, -7, -31, 93, 179, -309, -253, 184, -143, -250, 259, -76, -131, 250, 171, -264, 54, 101, -321, 174, 116, -129, -223, 42, -37, -198, 283, -176, -188, 172, 85, -430, 11, 175, -64, 117, -36, 216, -148, -103, -30, -163, 23, -98, -654, -29, 154, -144]
5862a44Q2M25k48m23M37j59j1K26J4l42n1M36k47o5J51k14Q3J22K50l95j96O26
5884C57k82j59L22m09L37J9l40K79P1k11j66Q6J2l7LL99j33m15L70o52N16M23
5906C90m65k16M57l04OM60j14o62J46K96L9m02M19j32j90K56p7l23N00j01j52
5927a69K13J30j28m1K32P9k82Q1J59n46J86L74j51j96K18j16k64M30j51k98K36
5948dJ98o61O78k29j91K71J64k09k57M84k13j64K31k67J90R2K16l38K23j98l11
5969b95J8M08q3m12M24j30j73J21N26n79J08O3k9j45R1q9O3N59k65o03M23J57
5991A58j03q8L44j60l34N68n62n5K77K28q56O97L0k16N0J17j39KJ17k17P6L19
6013B53l41j28K79J34l08J54Nk23Q9J81l64J29J56j82M2K63p4l03M33j26k71O2
$$ y = [-144, -62, 363, 115, -308, 129, -30, -41, 185, 199, -143, -194, 242, -5, -70, 81, -133, -50, 72, 322, -73, -269, 357, 75, -84, 238, -171, 166, 185, -155, 124, 195, -16, -182, -96, -84, -121, -118, 281, 148, -267, 103, -549, -33, 390, -75, -291, 166, -138, -132, 328, 214, -448, -302, -6, 33, -369, 50, -82, -272, -16, -93, -416, 84, -17, -169, 44, 174, 46, 5, 237, 316, 34, 115, 274, -272, -86, 288, 137, -59, 159, 43, -221, 209, 58, -240, -4, 194, -467, 211, -18, -209, 62, 226, 17, -240, 244, 31, -133, 98, -169, 21, 113, 329, -9, 214, 16, -295, -277, 131, 48, -364, 60, -70, -243, -122, 404, -175, -67, -4, -33, -178, -87, -176, -113, 446, 181, -422, 1, 158, 55, -33, 311, 151, -183, 385, -177, -232, 45, 273, -583, 114, 144, -72, -22, 95, -44, -42, 75, -142, -66, 253, -88, -216, 63, 197, -111, 43, 48, -175, -86, 95, -269, -140, 16, -166, -124, 139, 65, -238, 195, 69, -202, -140]
6035a40N32m35j83N42k81j97J36K25k00l86O10l45L38K66n65j33M04k26L1K11
6055B04j12k51K14L09m63K75P8r6m27L19L2q6K7q7j74J9L16k17K7J55n5n89N61
6078b1J2m94K06K90j71J08K84m44K47J63l05k44M20k62J16K93j49o6K48P4m65
6099a60J01L38k08n43M95k8o4L87j62l85L67K8j45J44Ml18j11L64j79p7M11n9
6121B00j88J00o7n23O29k45O6Jl7m0q1L02k07p4N8J15n31L36M0K1k55K50l4R7
6145f7j30L97k86K74nk37j6J55l1J5J53k38O3M2Q7j87J00Q0l09L85m28K72l77
6168b88P84o90j16L89k20J15J83k84q2j6K01j24K9L24k05k78N67j36m60L73j43
6189g7o5k5K54p6K7L06n24J74J20j92O5J54m8k98K45L1k69L96K77q34K26L19p0
$$ y = [-140, 392, -43, -226, 316, 35, -162, -26, 199, -1, -387, 223, -122, 216, 482, -83, -216, 188, -38, -7, 204, 92, -159, 55, 364, -99, 176, 254, 158, -269, 50, 82, -4, 23, -64, -238, -219, 97, -120, -93, 62, 7, -582, -21, -9, -503, -297, -7, -178, -70, 214, -230, 17, 180, -125, -369, 51, -211, -95, 198, 49, -17, 231, 305, -160, -59, 279, 71, -472, 23, -5, -69, 318, 156, -229, 138, 166, 21, 165, 169, -149, -260, 104, -75, -152, 259, 200, 12, 112, 45, -478, 151, -94, -28, -27, -64, -104, -185, 117, -90, -164, -106, 9, -522, -186, -146, -125, -380, -130, -164, -67, -197, 200, -86, 188, 183, -54, -70, 85, 54, 69, 222, -16, 47, 89, 176, -11, 89, 169, -140, 245, -183, 89, -288, 496, -194, -310, 79, -141, -26, 157, -127, -209, -225, -24, -148, -119, 205, 0, -278, 289, 153, -307, 66, -77, -142, -167, 87, 11, 38, 344, -180, -6, 114, -78, -13, 141, 93, -205, 40, 71, -198, 198, 475, -359, -133, 186, 116]
6212A16m38N04N4l61M50l3l35K75n2m14n1Q98n38m30O31j79k8J05r2J27m5L1j17
6235G8J26M7k42k20K19K87m93J86j30r8K71J65k90J66j24K7j82O3O5j28J39j24
6257a92j21L94k8l05M16O3j09l52O48j36m56R2L77m51K87K53p63M28K94k07m95
6278c63N27J51m02J77J35m36N18o5k55m7J37l27o1N88j42k30K70j63k83P1K07
6299Gk92K10J05k56r0N26l23P4K63k82j18K1N20l57K3p0j00n7K33L7L7O0r3l70
6323b92M75N4l03r3K08k31L22j18k74J70K21L6m09J45L48m5j97J68J55n99N25
6344B66m03m6N03l14k98J34J90k50n8L23k14R2M04l96M7O4K12o73N37K02o06o5
6366c49K64k35P8M11l28j90O32l81l29N13K06k88P3k2j50RN90m85q6L9K29l74
$$ y = [116, -322, 182, 236, -125, 325, 292, -43, 232, 180, -234, -285, 613, 75, -355, 276, 97, 69, 174, 82, 209, 164, 195, 78, 204, 251, 9, -211, 8, 295, -198, -12, -142, -240, 31, 196, -94, 72, -52, -25, -207, -144, -79, -207, -68, -192, -313, 81, 53, -252, 164, 227, 118, -234, 414, 278, -178, -86, 291, -160, 127, 380, -383, 45, 339, 132, -363, 164, 315, -87, 90, 225, -211, 307, 242, -13, -60, 77, -250, -311, 277, 135, -95, 175, 12, -271, -200, 7, -285, -75, 30, -226, -316, 210, -113, -39, 224, -58, -176, -155, 365, 8, 31, -39, -139, -196, 37, 74, 111, 171, 78, -292, 183, 237, -66, -159, 49, -182, 140, 22, -252, -82, 139, 175, -234, -89, 259, 214, 17, 185, 340, -259, 266, -137, -183, 320, 6, -292, -158, 32, -218, -276, 47, -167, -75, 329, -67, -20, 44, 256, -417, 120, 322, -284, -349, -85, -320, -242, 169, -159, -349, 283, -98, -427, 86, 292, 4, 77, 55, -95, -86, 504, 19, -67, -28, 201, -173]
6388a73L99k9k57K8L17l77qL68j45m14L99O2k45R2K1j94p5O42l70m82M80l5k78
6411b74M56m18l4M11q9l25L11P6m82J45K50j51j36L80j04k73K60j35L59m28J86
6432a5m18L50K40j69k62M92m73J01K10L43m24L3j29j7L69L67m45l82P68m18k41
6453a20K27j02P4r6N02l37k21J28l74p1O49j69j89K52j54k03m0K82m16L54J03
6474G9K14k69j52j50N1L08q6j77K26k5m24L64ok25J73K70o4m61J65K62l0R9J65
6497C07o0k39o2q8l1N63m97j11P76k71l74K2K31j08l0J0l30J81K47j94N1K5P8
6520I6l00K8L14j07K74j72j12o7J46j5j26K15j65q8J30k15l06K50J62j1j4K23
6542A40k35p9M34m50K79P1J01m91L09j07m8J35J05m5J86n1k87K9PJ07j09l3P1
$$ y = [-173, 226, 197, -60, -32, 285, -92, -100, 268, 123, -291, 108, 170, -75, 17, 38, -156, -231, 411, 41, -441, 39, 4, -274, 182, -236, -270, 141, 52, -273, 38, 114, -368, -223, 27, -124, -260, 120, 16, -257, 3, -132, 227, -201, -15, -433, -83, 157, -12, -274, 218, -255, -154, 56, 399, -25, 8, -121, -138, 231, 598, 153, -229, 539, 121, -120, 107, 5, 79, -17, 485, 148, -73, 55, -319, -390, 259, 90, -99, 153, -1, -204, -244, 38, -378, -24, 79, 293, 24, -128, -278, -227, 81, -5, -182, 44, 19, -405, -41, -47, -272, -99, 171, 107, -354, -189, 73, 43, 142, 307, 247, 8, -54, -142, -173, 390, -107, -218, 558, 287, -87, -65, 166, 58, 28, 38, -292, -111, 136, -58, -7, 18, 96, -204, -176, 138, 31, 305, 133, 21, -46, 100, 85, -41, 174, 9, -79, 51, -164, -470, -220, -58, -69, -83, 140, -95, -174, 260, -190, 89, 160, 261, -230, 79, -28, -76, 59, 164, 119, 305, 254, -33, -4, 3, 110, 1, -32, 39]
6565C9R6l48O74o09J9J70P7l88K03K56n24N30k28l13R8J54j30J13L07j39l98L79
6587C8Oj10K19J1k28J02J29l87j46N97q5l03K94o5l93J21L78p4k30N44m96j33
6609b11M65k58J4n7K04k44L1L83k53oM09m05m19N00k99J37k21L48o6o4j8k57K3
6632b64L30l18K70k9M7q3j80O7m10N50J4k05J42P7l85K90K7j93J94M2o6N5K15
6655A87R7n45R3M26m17j17L09r5k73M86l36j11L10L25k40m62M47J39k70Q1k30
6676a96Q8L36k53j52J99M2k37J80M3l34J72J50r0j90R1J17J2L48k52n0J26l43
6698a93k56K46M15l48j08N12k65j20L51q7l56K00J31j97j7K62j23k79L93j35p5
6719d9J83r7j5q7K81m03M1M13m95L68KK8j22k61M68o85L26L83m22N8K75j17j62
$$ y = [39, 135, -213, 461, -148, -129, 41, 118, -270, -67, 189, -335, 195, -33, -346, -248, -94, -224, -111, 196, 57, -341, 38, 44, -66, 153, 164, -64, 38, 167, -220, -366, 231, 146, -157, 137, 72, -321, -200, 178, 104, -126, 418, -78, -211, 254, -4, 10, -47, 157, -87, -56, 327, 74, 68, 477, 72, -347, 153, -146, -9, -230, 118, 52, -12, -30, -287, -264, 66, -252, 18, -11, 36, -47, -227, -160, -570, -20, -6, -211, -69, 8, -377, -87, -60, -253, -59, -17, -83, -28, 187, 284, -261, -168, 258, -159, -276, 33, -62, -335, 151, -185, -296, 14, 339, 99, -363, 84, 223, -47, 34, -196, -108, 228, -25, -177, 22, 64, -173, 7, 50, -284, -112, 38, -52, -242, -151, -34, -22, 326, 74, 24, 150, -193, -449, -203, 212, -136, -244, 268, 3, -117, 234, 147, -209, -9, 122, -75, -92, 170, 47, -232, 161, 26, -49, 134, 37, 22, -65, 216, -187, -146, 267, -228, 140, 142, 170, 48, -213, 255, -430, -104, 279, -143, -85, 190, 73, -89]
6742h9L0j84K14k25K91k04L94j75Q6k04n5J51j36J56k07J81K90m76O2J55Pl85
6764c23J68L86k42j82M67k73k93K29O0nK21l25J02R8L11n65l1L30P7l23n6L29
6786A60k88J47O5J41m14N02l03J26k6J66k34L2K46o57K99Q3q7j25J43J32l06O8
6808a30J8l3K35j66J8L08k24n67L88L56j87K40j86m75J60L02jj51J00K14k59Q6
6830D6j76J1m6M18k98j74L55K3k93M20J1j64k41K13j31O1M10o58J49Q5Q4qq2Q7
6854A02m61M78J43l98K20J68k15l90N85j80R7L1k06j84m7J81m23K87K07J20r0
6875B5J36j64l16K25l3J24J11M7k31R2j36jJ54K5M10n52N82o5o70K86j96J19K43
6898B15j66P6m08M89n75J68N26k55j03J27k48No4J84J32m76M31j98J27k18K47
$$ y = [-89, -59, -243, -29, -254, 37, -167, 227, 52, 138, -66, -121, 30, -106, 50, -157, 24, 314, -162, -100, 55, 62, -323, -155, 231, -11, -193, 274, 1, -292, -63, -3, -8, 213, -112, -10, 88, 399, -166, -197, 133, 210, -113, -169, 160, -128, 19, 84, 225, -189, 313, 10, 136, 110, 276, 42, 74, 320, -337, -38, 45, -42, -167, -24, 108, -198, -130, -112, -145, 90, -76, -58, 250, 26, -541, -153, 203, 16, 256, 70, -405, -245, 57, 56, -95, 5, 219, -40, 46, -130, -119, -165, 253, -45, -219, 136, 159, -134, 286, 297, 133, -108, 105, -26, 35, 445, -213, -64, 21, 105, 97, 15, 102, -359, 119, 262, -136, 84, 252, 37, -353, 232, 52, 149, 180, -26, -210, -257, -76, -499, -212, -5, 115, 25, 161, -3, -319, -94, -127, -3, 108, 155, -76, 16, -120, -121, 33, 58, 468, -84, 498, 433, -237, 49, -147, -28, 215, 49, 125, -283, 206, -369, -201, 325, 70, -33, 94, -154, -149, -213, -29, 103, -373, 58, -140, -13, -231, 16]
6919A6j3K88l24Q4k89M39l32mL91n23k46L06o2L32l09K98l83K66M83m18j07R6
6941a1R5j70J74K49n41J5M93n35K40K54l53K36m2j30K72j97m7k92L00j75k94K35
6963b24L29k23J05J25q9k63N38m05j64K31K85m28J53J31m65K18J7k00J04J32L15
6984B22n37K46J5j37J65K02j04l18K63j95K67J71M0l53L42J23n08M12l13j56l5
7005a88K62L5j89J90j64j01M51j61l78L29l5J35j00K75m70n6L34p7j27K11qj94
7027b6K06q0m59K97J39j10j92M46j16l38Q3L60l77J97l3k06L25K1l67J21O37n11
7049A7k0R4Lk25NJ19k6J82k7k24J16K92m19q5L73j70k0k00L40l18L51j10J22m84
7073c14M58k15k14L64N5k82J79L44n75Q0K05k58J05N60n14k04K93ol71O72k82
$$ y = [16, 3, 291, -33, 51, -238, 201, -131, -135, 256, -267, -513, -207, -269, 63, -246, 52, -331, -65, 418, 0, -107, -11, 84, -86, 88, 337, -204, -189, 304, -231, 9, 263, -90, 146, 104, -26, 246, 49, 2, -290, 10, -165, -459, -224, 105, -118, -13, 112, 23, -240, 298, -107, -271, -40, 245, -183, -30, 101, -364, -146, -129, -329, -225, -93, 222, -315, -69, -54, -191, -26, 176, 72, -246, 17, -178, 89, 260, 300, -53, 289, 412, -96, 316, 3, -153, -188, 74, 109, -80, 110, -54, -155, 296, 135, -243, 86, 51, 186, 86, 361, -109, -165, 169, 92, -35, 176, 168, -26, 180, 100, -359, -62, 77, -33, -225, 221, 105, -233, -150, 210, -167, 30, -3, -209, 116, 137, -230, -109, 528, 17, -3, 91, 94, -131, -126, -7, -33, 149, 122, -102, 14, 306, -113, -198, 175, 5, -15, -215, 125, -193, 158, 48, 170, -314, 144, -71, -285, 79, 134, -148, 31, 375, -200, -120, 85, -173, -68, 492, -22, -226, 67, 61, -310, 362, 80]
7094H0k75j01N44o83L07L47m19K22j09K11r6j52M97l55k3r5K0K25L7k09j91M93
7116B75k94j03L35r2j50q4L37j14m65O25k10q0J59k53L8L4L66m34m3L15k66j82
7138b86N69l18L1L02l55J49n41P79l58m6J69j52K67j72l64J85K63l6Jk88M41k77
7160c7J11J40l96L78n8k48L2O1p8lL4J94k56L70l0l65J72K89m57j33M43k38j44
7183b19L20J48n73N37k7n29M75k60l0k2K24N9k80L35O6l84J10J12R9m09L44rl94
7206c07M07m17J86L73l43l18M2K17L8J36J66l79J1L92m8l71L52k01K2K04K1j67
7228A6l5J61j60P7L51n41j3L36l9m90L50J51k47J54K39l13k00J83R0l79J01M47
7250B39m92L64J47k38j95J64l5J10J11k63p3OJ53j25L30j07m40J36K59J3k59K72
$$ y = [80, -195, -296, 248, -435, -128, 219, -200, 22, -87, 124, 28, -124, 373, 18, -5, -100, -80, 145, 182, -27, -218, 275, -19, -122, 213, 121, -29, -113, 224, 110, -355, 270, 60, -20, 139, -114, -76, -42, 324, -110, -153, 162, -104, -286, 283, -35, -4, 298, -57, 92, -449, 330, -28, -74, 95, -57, 210, 38, -326, -141, 122, 86, 87, -201, 240, -37, 74, 214, -182, 196, 138, -110, -78, -17, -95, -98, -64, 130, -126, 244, 214, -151, 21, 310, -147, -280, 163, -75, -219, 101, 249, -324, 213, 186, -343, 132, -128, -158, -180, 44, 103, -177, 158, 224, -160, -50, 62, 161, -248, 96, 87, -307, 100, -317, -131, 242, -101, -419, -377, -160, -122, 14, 180, -199, -188, 204, 156, -215, 137, -64, -42, 162, 183, 16, -19, 142, -18, 59, 410, -131, -144, 192, 153, -337, 13, 164, -83, 71, 310, -3, -203, -20, 70, -309, -208, 239, -253, 111, 258, 20, -175, -11, -46, 64, 175, -88, -161, -155, -2, -127, 203, 96, -344, -208, 51, 64, -195, 77]
7272G7l20K47O7l0j20J77N6j35R4L8l14J54K81j71q7K03k41r6J72K98j67J88m37
7295f6j21q0M35j80NK97k28j42K14J59n15Q1J04j11J60K96m82K81Q2k18K13k29
7317d5J29l64L29J47l19j43K48r2j77L61l3o0Q0J07l46K22J78k54K01J52j89J5
7339A47q9M7j34rM4k2R0J40l36N9J70p7J1p7L3l00L69j96P9J06J52l86k5L93j73
7364A6l27M56j72J37j66j10J8J92R6o21M11J33Nj99P3l51N36j82k3j17R3K63l41
7387a80r2N19m41N4J61k41K3L76l01J97K62n10j15N15k14m7j28M56l21q2J88p9
7409@l8ll1j69N20j47J51m29M88n71J87J22k82K1K10J2m08M99L3j77n8L57l94
7432a07k1K93k44k3J93J27m48M02l49l8M27j3o8j84K63j79K20j08p8l00K47K6
$$ y = [77, -243, 4, 71, 41, -79, 98, 154, 19, 113, 151, -163, -9, 272, 101, 14, 217, -24, -120, 52, 350, 183, 371, -66, -187, -267, 168, -12, -7, 290, 62, -80, 134, 293, -222, -141, -37, -148, 12, 308, -174, 107, 189, -29, 184, -45, 84, -280, 49, 196, -123, -266, -18, -110, -287, 74, 41, -19, 61, 168, -178, 44, 222, -32, 169, 321, 132, 147, 58, 105, -29, -38, 6, -16, 74, 214, -122, -63, 107, 30, 41, -36, -3, -303, 66, -130, -51, 55, 207, -179, -204, 189, 16, -311, 145, -27, 110, -56, -166, -148, 44, 140, -481, -70, 63, 68, -131, -58, -409, 127, -55, -78, -195, -102, 161, -180, -272, 247, -194, -140, 21, -220, -197, 179, -122, 75, 337, -173, -288, 227, 13, -34, -162, 294, -27, -109, 79, 0, -38, -41, -72, -241, 279, 132, 283, -146, 342, -229, -42, 80, -202, -181, 29, 41, -367, 132, 165, -12, -70, 287, -107, -128, 165, -79, -102, 91, 218, -230, 172, -177, -215, 212, 199, 131, -53, 210, 31, 251, 143, 65, -235, 12, 38]
7454C8j90K4L11m0n7K12L2k97N3O6J16Q2j47k22k10N47k28l31N47l90P3J78l09
7477a42O0K67l47n2j3K74k41K49L60n42K6j41K10k48J46K02m18L75K21m24J12
7498f6K63k26n1lK2j35K7M45l30R9J0j16j34M87k67K2R7L2m48M33Lj97K76L8m04
7523a23k14N93m68L9L92o7k19R4L50m87L14k48K6o9J05q0r1N90o18O9n5M34l49
7546h2J33n8l20K53J31r3j41L28j79nJ30N3k35L8K15m0l63K29Q6l03M95m7l07
7569h2J69M1m35K37J73l55K53M7o9L45l77J12k25K44P0l31J62J40m0k34J40J82
7591A67l36N30n98K60j56R2n8N18j67j43j91J84r1J47l5j08J2k80Q6j65K36N7
7613c9k15J89J22k62J23M14l53j43N43j35l38Lq3om0N1N96m07J33k70M8J39J52
$$ y = [38, -152, -128, 183, 143, 86, 298, 330, 33, 86, 152, 268, 350, 203, -19, -229, 318, 90, -241, 306, -84, -11, 167, -142, -82, 185, -162, -214, -227, 47, -194, 55, 415, -127, -101, -242, -32, -280, -134, 68, -350, 25, 246, -178, -66, 197, -29, -80, -83, -61, -196, -169, 276, -54, 45, 55, -61, -195, 292, 25, 47, 144, 176, -272, 161, 164, -33, 243, 281, -123, -337, 256, -212, -173, 219, 152, -67, 27, 377, -110, 204, -44, -18, -87, 18, -62, -153, 437, -181, -112, -167, 267, -82, 51, -7, -327, -74, 57, -36, -177, 151, -28, -33, 97, 150, -85, -47, 168, 128, -235, -6, 80, -223, 272, 225, -82, 87, 128, -307, -70, 103, -252, 1, 48, -21, 324, -53, 59, -166, 78, 148, -183, -21, 119, 79, -155, -15, 167, -169, 361, -237, 23, -133, -41, -99, 419, 252, 109, -82, 102, 11, 158, 123, 15, 27, -253, -167, -332, -96, -39, -254, -65, 57, -205, -82, 332, -21, -164, 379, 244, -94, -91, -174, -180, -220, -169, 427, 20, 153, -117, -69, 70, 222]
7636B22p7K0j17k64N99j82k50k01L01P3j21L02n18R9P8P0k33k7O84n04j24K58
7658H8m6q6K59k50j48L07l09l7K69M76m45n9Q8k19J59M4l78K32J84J65k37J99
7680B56J14l92K66k32K7K9p0L63q73O14k6k81K25r5K81j31j07k54oM52k93o4K75
7703G8Nj71R8j29m0j81K98q4k12M83n5j94K60L6o72N51j47J52j91L96m09k77M92
7726H7j26Mo1K83m06L62j6k72rL56N1k76K94j93k32L39m7k64j74L21L2j70J78
7749F1k72L7K35j7l77N72j33j66L49l04k76j89P01n90L23J72m8k07M44j23l87
7770a95J92Q5l29K29L5k98K02J71j84l37M71o9j81j8K53K9k16M98m33m2L27j99
7792iJ20J5j63r1J83J1k29p8M62ql32L35m02K10k06K39j48K4k2L0l9K20l71O2
$$ y = [222, 145, 165, 48, -216, 383, 201, -49, -250, 51, 124, 3, 305, -213, -114, -36, 34, -199, -226, 458, -46, -170, 88, 42, -44, 215, -35, -183, 124, -185, -222, 47, 523, 78, 19, 107, -112, 47, 91, -287, -55, 129, 294, 57, 256, 370, -22, 244, 12, 39, 68, -2, 361, -512, 102, 76, -205, 20, -75, 206, 75, -32, -286, -292, 160, -133, -197, 78, 83, -88, 10, -119, -159, -340, -42, -126, -338, 145, 90, -104, 156, 192, -480, 71, -76, 76, -115, 281, -128, -405, 87, -39, -35, -96, 187, -219, 143, 127, -145, -154, 202, 253, -23, 271, 78, -154, 185, 138, -126, -300, 21, 53, -117, 61, -211, -174, 61, 44, -333, 239, 106, -60, 289, -15, -291, -480, 221, -369, -46, 126, 78, -129, 315, 192, -195, -3, 82, -247, -18, 17, -281, -79, 92, -92, -429, 42, -27, -208, -226, 27, 56, -160, 338, -95, -137, 190, -9, 111, 126, -37, -128, 55, 66, -163, -241, 221, 213, -119, 216, -186, 24, -182, 57, -91, -67, -89, -59, -98, 122, -249, -187]
7816a87K24o6J30j61J96j32L67m31j77M16J09m84J11J62k59K03L8R9k92L30k3
7837A73q4M6Jj77pM1k22R0L90l60J13R7k26M3n5K78r9kR9k36K09ok00k44M53j17
7863bl08K48Q0l41R6K30l53K08M23l24L5K41j92N9P3J04k57J44j55l03P2K31P
7886A6l6j47m2L72k36K01MQ4L8j11l45N54m25J12J93k20j38k4L35k86j6K98%l85
7910b04L68J02j59L3K28o39K42J88l11L65o9k00O1q5j71n1L75k45K20rqm8M7l2
7934brk2N37n49J04J0j24j30K48K0j63K2J1JM2J4j9l69N11j62K9L48j19k98R7
7959B8J75l83J90K14l92k5J77K77o31L51m0j47J51K89l26pK09k2j83QL7j1J46
7982H5l8o9P7P5r5m9K15j79q6p9O2J5J37K33n26L74p0l52K88j7Q7j51L8m5j20
$$ y = [-187, 37, -29, 101, -60, 136, 4, 371, -60, -237, 179, 288, -196, -85, 77, -182, 21, 59, 158, -134, 196, 173, 89, 135, 136, -41, -48, -7, -229, -139, 251, -109, 4, 101, -125, -82, -137, 141, 42, 40, 139, -97, 112, 106, -94, -338, 115, -2, -310, -62, 18, -323, -227, 3, -350, -142, 281, -43, -8, 233, 41, 100, 173, 277, 20, 164, 9, -294, -222, 9, 16, -20, -167, -209, 163, -73, 128, 132, 216, 254, 143, -202, 352, -73, 39, 232, 12, -126, -150, 185, -101, -117, 181, 181, -204, 164, 266, 107, 140, 368, -271, -29, 159, -152, 213, 144, -56, 5, -80, -251, -302, 73, -172, 48, 39, 31, -17, 30, -2, -11, -33, 504, -45, 59, 69, -55, -185, 63, 83, -80, -58, -47, -46, -4, 10, -9, -378, 133, -29, 0, 348, 229, -69, 28, 203, -180, 10, 224, -168, -193, -16, 261, -370, -19, -59, -206, -55, 234, -92, -99, 110, 88, -95, -87, -50, -61, 85, 47, -22, 55, 130, 35, -14, 201, 22, -64, -143, -81, -66, 71, 304, -222, 152, 82, -270, 18, 1, 88, -63, -25, -70, -190]
8007a90L11j44q5J31J18k31L26l99O0o8M14l39N7K02J5k76J62j68l81L27K99j39
8029Bk56K91j15k9L27n12J99M20l78j71O6L86m07n1K56j8j88J58k34K71Lp0j22
8052a72J61R0r7j71K29q1j99K60M0m45N65k7j45J57O2n21L57Q6j5j22K06o1l26
8075a69L24k97NN5K25k08J37P6l0r8Q6k8k62j6L95k90j52M42k06J16J03L6o51
8098d07M15j40L29m37J63k87N00j0l47L74P9k19r1K22j83pJ46k78n0K20K31l07
8120h4j2L36l43K16j71J58p9o6k36L03L58j77k44K69j97MK3J85j95r0J72L15l69
8143G6L7r8M0L6K59j69k70M33n83J6M90l91m4NJ31k3m3J07j36m9M7J02j48N00
8167C25j48k43L42k53q5L10j80k11J35K87n27L81J92m07j79L59K10p18L91P4J06
$$ y = [-190, 121, -23, -108, 23, 141, -90, 236, -163, -103, -171, 243, -96, -39, 163, 178, -98, 64, -104, -485, -158, 141, 2, -254, 37, -78, -107, 220, -292, -93, 327, -51, -222, -156, 230, -177, -228, 28, 10, -178, -20, -254, 17, 20, -50, -172, -11, 79, -18, -189, 40, -41, -240, 20, 60, -385, 180, 153, 8, 165, 227, -294, 63, 149, 134, 12, 218, 157, -169, 155, -142, -137, -82, 143, -65, 72, 148, 118, 20, 106, 78, -184, -200, 195, -95, -247, 195, -11, 105, 208, 244, -407, 8, -132, 197, -240, -77, -364, 136, 126, -221, 153, 232, 13, -78, 144, -39, -46, 100, -178, -228, -8, 223, -84, -96, 240, -103, 113, -58, 100, 21, -45, -281, 22, 380, 203, -41, 228, 31, 35, 58, 243, 48, -42, 130, 445, 76, 113, 15, 55, 91, 350, 181, -89, 344, -239, -223, 267, -124, -168, -163, -32, -55, -98, 9, -127, -176, -129, -27, -175, 325, 177, -66, 276, 23, -62, 248, 68, -143, -8, 279, -248, 133, 325, -82, -261, 98, 308, -410, -19, 55, 161]
8188A61P9P2n4
$$ y = [161, 240, 312, 258]
8191B58
$$ Imaginary data points
##PAGE= N=2
##DATA TABLE= (X++(I..I)), XYDATA
0@%%%%%%%%%%%Pj5J6j6J6j9K7l2L3m1M8n6O6p4Q7j00J12j26J44j63J80k00K26
34A20k53K81l13L49l87M27m72N24n81O43p12P91q79R77j092J227j384J572j802
53i64K093k475K994l748M950p170J2611m8412q9412O0690L9328l443q977n310
67d7245j9543J959o567j0114K7782L2667k2727j8781J3294j715l609K8451R168
80a6980q497J5456M197k4039J2268L2289n639n990J7602k501n089J6833l544j6065
94A0301J8324J3088j6588M831J2678j7282l791J6062j3091j0901K3518K75k6759
107A0665q29K148j3566R049J4455j5386p557M305k1600p907K7377l32k1111R396
121a0893L794k2511K811J4814j0099N664K0391j5646j9137J3270O695j314J8288
$$ y = [0, 0, 0, 0, 0, 0, 0, 0, 0, 0, 0, 0, 7, -8, 8, -8, 8, -11, 16, -16, 17, -24, 24, -32, 34, -40, 47, -53, 59, -67, 77, -86, 94, -106, 120, -133, 148, -165, 184, -203, 224, -248, 276, -305, 338, -374, 417, -462, 515, -577, 650, -734, 838, -964, 1129, -1346, 1648, -2100, 2850, -4320, 8291, -40121, -129533, -68843, -29515, -32958, -41935, -47245, -66788, -64829, -71396, -81510, -53728, -21061, -43788, -62569, -49275, -50990, -54599, -26148, -16980, -25477, -10021, -5824, -29863, -17595, 14694, 9055, 3065, 20667, 18166, 13077, 29910, 26366, 10301, 28625, 41713, 25125, 29956, 42634, 25352, 21561, 37623, 24532, 13631, 37149, 37424, 10665, 9836, 11984, -1582, 7467, 21922, 6536, -1021, 3284, -18316, -26223, 1154, 822, -20289, -10893, -7099, -29610, -26799, -11985, -22084, -16420, 3971, -11675, -30812, -17542, -10847, -12161, 6127]
134F127O51j9762R017J1161j5942O473K5194r382r330J7232m459j5529J5667R304
148B6422j2330P765P929j8302k92J5561j1150o516J4487p245j2103J6463j395
161A9294k4074N519J0227j6336M28J4017j3682j1504J0814p535j1977J3949J381
174i479j4558Q909L293k0140L936J8425j0746n656J5685p944j2835J7200N743
187h167j2560J0487J0237j3809K213J2164r601K179J7758q303r504J6585J4j3815
201d122J4259R701j7332K890J6529j0682m671J2939p626q903J6285j32j3992Q785
215A3928L711j5690O920J1111j6032j859J6605j0960j3305J4543r01j4297J0250
228D024N113j6193K409R342j2595N96J4051j0858r218J3626m356j4114J4202O521
$$ y = [6127, 6778, -12984, -3967, 7194, -8748, -2275, 22919, 13537, 4207, 21439, 16980, 1451, 17118, 26422, 14092, 21857, 29786, 11484, 11192, 26753, 15603, 9087, 23574, 16329, 4226, 20689, 19294, -4780, 739, 10966, -5370, -4942, 9075, -4607, -16111, -5297, -12832, -24809, -10860, -9479, -24037, -15128, -11835, -31975, -28039, -9614, -20360, -26016, -10331, -18275, -31110, -13910, -8167, -20727, -10240, -3, -13812, -11599, 565, -9036, -6857, 10901, 2598, -6906, 9679, 9693, -4122, 10137, 19838, 2506, 5396, 21925, 11243, 6572, 19511, 11885, 2982, 19267, 19135, 5143, 13928, 17639, 1949, 8869, 19980, 3948, 2089, 18694, 7734, -5571, 8972, 8071, -6226, 4024, 9137, -7056, -4647, 4695, -7900, -7304, 6747, -4111, -13329, 297, -4059, -18173, -3971, 2550]
242B550j5855N880J0139j5858k746J6829n524o540J3052l969j1120J2092L380
255B310j3500R011J0136j3705J301J3814j0883o447J8240k746j3988J0643N414
268I600j2562P045Q066j3987n6J2174q290m097J3490p032j1528J3686J847j5324
282f968Q183R038j4838j207J2428q702m808J4320n196j1751J0089O71j1899R863
296g77P513j3889J952J1010j2980l463J6350n576j1417J2764K689j3933P162P888
310E293j1859K663J0569j0309k457J3406p350q467J4078K38j3155R374P329j3550
324d197L035J1007j1451k610J4611n845j0461J0422N48r683Q821M423j3166M670
338A24Q868j4080k073J5691n592q808J1028k217j3242R578O203j1813L677R394
$$ y = [2550, -13305, -7425, 2714, -13144, -15890, 939, -4585, -11125, 1927, -2042, -13162, -1070, 2310, -11190, -2179, 7957, -5748, -4447, 9367, -1516, -7963, 10277, 7531, -6457, 4186, 9600, -2962, 4083, 12149, -1838, -1894, 10280, 1990, -2107, 11383, 4351, -7177, 6509, 8356, -6968, 1215, 10253, -4585, -5792, 6636, -2066, -6874, 7446, 2250, -9501, 588, 1259, -10640, -777, 6736, -7153, -5201, 5809, -7171, -10634, 5716, 140, -11277, 1487, 4176, -9757, -2595, 5293, -6566, -3903, 6666, -3643, -6100, 7306, -44, -8511, 5567, 5805, -7350, 2024, 9353, -4197, -1162, 9845, -1606, -4216, 10395, 4550, -5911, 4511, 5059, -4624, 4197, 8620, -4546, 124, 8992, -5088, -7161, 8530, 2938, -5870, 5158, 2941, -10301, -723, 5480, -6333, -2656, 6738]
352F738j0999k309J0483p161m470J3435l536j2201J0434M922j3288N465J0612
365H125j1017k064J1644p196o033J2969j725r988R043K675j1591N784Q057j1573
379b890J155J1502r268o288J2674k970j1843J0901M668j2576L881P316j0199j21
393d058R352r098m118J3037m035j0513R950K098j1708O576O852j2130R05J2131
407E241q871n968J2321j759q531R079P17j0563P820O508j0364K652R780j0091
421b029l569J3084l627q844J1043K454j1315N394N805j0196K710J0141q929m050
435a928J0651n320o753J0093o5j0634O991M541j2812K769J1257r299m958J0336
449D869n210p710R239K37r693P445M207j1525J880P646r164q29J1931o721p305
$$ y = [6738, -4261, -6570, 3913, -3248, -7718, 5717, 2181, -10020, 414, 5336, -7952, -2487, 8125, -2892, -4956, 6688, -508, -6541, 6428, 4703, -5285, 3758, 6433, -5158, 626, 8683, -2890, -1735, 9767, 499, -5789, 6885, 3915, -7928, 2973, 7641, -4935, -1054, 6262, -3937, -4058, 5294, -3804, -7922, 5115, 1080, -9433, 517, 2615, -9093, -2517, 4335, -7795, -6890, 5241, -3630, -9598, 2723, 964, -7567, 1512, 2229, -8334, -514, 5994, -4370, -1718, 8062, -2029, -5598, 7486, 3859, -4985, 6058, 8512, -2803, 2591, 8396, -1800, 910, 11051, 2122, -1928, 8723, 3403, -3350, 6743, 6678, -3956, 3035, 7576, -5236, -2467, 8790, -509, -5467, 4869, -341, -8051, 1188, 1425, -8268, -823, 3384, -8141, -6261, 1385, -7779, -8608, 3323, -3398, -10703]
464a0703J0973k32j1421Q188O157j0498K656R062q388j252R902n678m482J1428
478E712j482r504Q874M149j0550M394Q879r724j043J1284o309o776J0141o15p985
493e55P371K219j0624L829O464r023K64R926q471o668J0720k824r164P147L061
508C672r721M322N892j1616j192R817n046m532Q063l369p020Q382J731j1039O167
523e489P125r487j74R881o551l955J0463j363p414Q080J405q141O077O187q570
538a926J007R059o609k668R456m175o721J0230K294j0412M568N713r301J065Q758
553A0338o928k971Q776m206p071Q331n96r575P082M979j0502P10P616p811k758
568d586R433m601p964Q768L96r349N053M142q316K210O765q508j990R813m351
$$ y = [-10703, 270, 38, -11383, -3195, 2962, -7536, -4880, 4182, -4206, -5458, 4444, -1234, -5716, 5712, 4230, -5274, 3600, 7749, -2801, 1593, 10472, 748, -295, 10989, 4680, -2096, 8045, 7430, -555, 6816, 9035, -1589, 2240, 8704, -319, -55, 9871, 1400, -5268, 5452, 2628, -6536, 611, 3672, -6049, -1727, 4165, -7451, -8643, 1174, -3872, -8404, -341, -3710, -10730, -2348, -617, -11656, -5489, 1636, -7851, -8025, 1856, -4695, -8650, 1813, 450, -6964, 1116, 2521, -5620, 457, 6644, -1926, -919, 8140, 1531, -1137, 8319, 4144, -2577, 7653, 9947, -465, 4103, 9816, 515, 1580, 10338, 3410, 439, 9215, 5009, -2062, 6269, 5673, -3902, 3180, 8159, -2343, -1633, 5983, -1828, -4586, 4847, 246, -7718, 1050, 1446, -7903, -2850, 1292, -7024, -4814, 1951, -6557, -8547, 1266, -3085]
583c085n609R250n70r517O851N157r083K049P982p207j163Q556m668n740R140
598B343L94p281O660K751r064L838P142q472j252R751m196n802Q166r00p482O509
614C105L294q912K876O202p540p40Q256n271m842Q428j832q484P726L254r506
629c986L707O762q096j573P192m265l104Q371k848p477P491K992r052L659N067
644D840p907R52Q327o514n019Q717j631p760P244K381q820L896N577p863MO634
660C058n958j770R458m164q194Q128K572p880M151M898p842P28P362o101l195
675d749Q995j676n901N810l27p801N814N352p804J728O477p655k562R365l213
690A853n904O899J508p443L836L198p953K556P167n982k967O997l991m177P578
$$ y = [-3085, -8694, 556, -14, -9531, -2680, 2477, -6606, -4557, 3425, -3782, -4945, 3611, -1057, -6797, 2343, 2737, -4544, 2116, 4867, -4197, -359, 6783, -1689, -2941, 6810, 2614, -3188, 4978, 4078, -3404, 3105, 6399, -2513, 363, 6565, -975, -1715, 6541, 1270, -3572, 4856, 3024, -5460, 2266, 5520, -3986, -279, 6483, -1613, -3186, 4006, -259, -3363, 5008, 2160, -5317, 2174, 5166, -3886, -227, 4840, -3067, -2115, 6212, -302, -5321, 3396, 1765, -5995, 1249, 3630, -5190, -1294, 4283, -3580, -3576, 3058, -2900, -4670, 4788, 624, -7570, 558, 3130, -4750, -599, 4299, -3543, -2815, 4547, -1554, -4749, 4246, 2570, -3331, 2479, 2152, -5649, 165, 5517, -2287, -559, 5918, -1737, -4299, 5066, 1853, -4051, 2848, 4356, -3087, 749, 3947, -4006, -1450, 5717, -265, -3232, 3765, -226, -4403, 3175]
705C175k89q221N111M137q118J526O133o455j853Q272l097n465O181o32n449O192
721A148L252q709K447O380o251j892O900l780l291Q555p54q552M957L575o876
736b891K687N847o183q74O719n194m197Q123p32o585O169K391q993K092O403n227
752d45r70O293m990m670P390n19o921N573K107o880K952L813p570P81P981m582
768f57m439O897j164o794N897K671p000L133N130o674L90O693n361l413P934j293
784A950n950N766R85p372M599N162p726n23P450l917l798O419j982n089O260J042
800C276p527L475M387o536R67O728n524k784P496k284o080O560J143o886M489
815I00M509p123j01N767m179j416O659l337m652O992L00p598M031M438o549J525
$$ y = [3175, 2886, -5335, -224, 3913, -4205, -2679, 3454, -3001, -4854, 3418, 321, -5144, 1037, 405, -5044, 1148, 4400, -4309, -1862, 4518, -1733, -3625, 3275, -505, -3796, 4759, 4005, -4547, 410, 3985, -2891, -204, 5643, -540, -1414, 5305, 111, -4086, 4037, 3305, -3280, 2889, 5280, -3713, -1621, 4782, -445, -1415, 4878, -112, -4782, 2608, 2089, -4832, 741, 2848, -4032, -1080, 2733, -4837, -4056, 3925, -657, -5096, 1801, 637, -6157, -260, 2411, -4589, -1456, 3674, -3000, -2610, 4083, -1278, -4691, 3243, 1950, -4000, 1766, 2751, -4621, -22, 5140, -2586, -3109, 4341, 424, -3374, 3045, 1063, -4026, 2234, 3276, -4251, -776, 3611, -2925, -1958, 4770, -754, -3538, 3958, 1674, -4406, 2154, 3297, -3589, 900, 5409, -1714, -1815, 3952, -227, -1643, 5016, 1679, -2973, 4019, 4319, -3279, 752, 5190, -1359, 166]
831A66N850n716l091O961k281m631N606k8n699M149L052p033J024N229n665j444
847c551P350m799n156P185O47o559L560K467o441J893N207n427j711O489k737
862a583l537N857j393o081N926L487o621J500M990n326p35P096l178m114O100
877B388M42m795M004J862n888L022N084o010q35O445l435l525O250j387o497N729
893B854K473o739J762M609n471q53N486l682l390N798k158m802N395R84p129K942
909a921M666o117n08N822l888k777O105j487n868N592J550n463K948L454n408
924c300O77N972m655k872P159j867m510N664J121o594L041M724n567O06M817m359
940E7j765O109j928n141N192J249o199M075K558o597J243N730m713k905N926j746
$$ y = [166, 6016, 300, -2791, 4170, 1889, -2742, 2864, 2836, -2863, 1286, 4338, -2695, -1671, 3558, -2107, -3551, 3799, -1000, -6156, 1029, 1676, -4883, -1323, 1144, -5297, -3404, 1803, -3624, -5335, 1154, -1583, -5120, 737, -656, -6737, -811, 2676, -3945, -2445, 2545, -2781, -3516, 3580, 402, -3712, 2388, 2830, -1965, 2039, 3901, -1987, 1035, 6119, 109, -726, 5719, 2284, -1241, 5009, 3622, -2875, 2854, 5327, -1412, 350, 4959, -512, -1365, 4121, 439, -2951, 2847, 689, -4113, 1282, 2266, -4863, -1921, 2745, -3372, -3880, 1942, -1946, -4723, 1382, -105, -5973, -381, 1169, -4294, -1346, 2108, -3300, -2623, 3349, -1306, -4178, 2981, 1114, -3396, 2268, 3389, -3205, -164, 4560, -1007, -401, 4416, 57, -1708, 4401, 2473, -2668, 2524, 3773, -2426, 1649, 4207, -2390, -1147, 4583, -130, -3035, 2891, 1145]
956A145m894M789L08n438L574L102n923J289M530n577j547O752k670m175N614
971H79L01o140L992L450n899J154N450l989k527N981k478l403O047k85n563M698
987A668K325o254K107N397m776j852N802k771l951N305L78n321L979K298o008
1002a674J090M386m700p24N323l703l481O114q33o663M601K802n980J796M013
1017B367n159j011N125k438l247N697j181m836M550J569n871K786M494n082o29
1032b866N267l031l590O463j56m566L318J999n103K442L667m815O14N571m363
1047H51k809N261r31m578N306J219n702K118L653n424l83N453k954k909M410j192
1063A389m141M178L12n752L814L375n966n6M969l679k407N676j847m696M451J754
$$ y = [1145, -3749, 1040, 1348, -4090, -516, 2586, -3337, -2048, 2482, -3095, -4642, 2110, -560, -4735, 879, 1180, -4960, -968, 2482, -3417, -2263, 3187, -802, -3329, 2652, 174, -3229, 2818, 2533, -3030, 1668, 3993, -2261, -154, 5243, 467, -1385, 4417, 1646, -2305, 3000, 3378, -1943, 2036, 4334, -1674, -584, 3802, -898, -1622, 3701, -2, -3483, 2631, 1798, -4865, -264, 2538, -3442, -1646, 2367, -2792, -3803, 1322, -1116, -4363, 1334, 153, -4683, -133, 1436, -4435, -1649, 2845, -2237, -2866, 2401, -630, -4220, 2243, 2087, -2479, 839, 2838, -2265, 177, 3844, -971, -357, 5214, 851, -1958, 3303, 2372, -2206, 3100, 4319, -1383, 735, 4388, -1036, -1419, 4034, 1080, -1829, 2581, 1389, -2752, 1426, 1738, -4014, -200, 3175, -2791, -2847, 2122, -1557, -3964, 1712, -135, -4831, -380, 1374]
1079A374n843K791K822m320P85M390m131j591N668k170l926N665Q40o148L167
1094f27L826m850J42N040l278k023N338k112l604N082L0m857L694K196n140J273
1110A30M598m827j300N492k337m047M213R56m724K703J593m616J328L937m833
1125a734j041N395k729l454M759m31n060M086K173n275J129M390m445j528N106
1140A341k127l335M945m08m101L866J451n065K309M649n463n55N797k495l384
1155b575M666J1m544L886J660m666J793L712m378m28M989l129k871M880j084m565
1171b643M733J737o120J972M319m784j060M512k339k862M819j329m275M166J031
1186A877m650J889L143m651o7N145m176k385N712j120m706M214J456n084K260
$$ y = [1374, -4469, -1678, 1144, -3176, -2391, 1999, -2132, -3723, 1945, -225, -4151, 1514, 2354, -3794, -627, 3199, -1651, -1509, 3531, 253, -1770, 3568, 1456, -2148, 2934, 2964, -1893, 1801, 3997, -1143, 130, 4728, -99, -1399, 4093, 1756, -2291, 1922, 2878, -1846, 857, 2450, -2166, -838, 3099, -1734, -2775, 2620, -109, -3563, 1196, 765, -4295, -209, 1964, -3311, -2182, 2208, -2237, -3765, 1341, -786, -4121, 824, 416, -3685, 181, 1632, -3433, -1124, 3525, -1938, -2493, 3304, 809, -2575, 2091, 2102, -2442, 1444, 3104, -1562, 231, 3943, -435, -863, 4126, 997, -1874, 3006, 1922, -2643, 2090, 3827, -2293, -321, 3998, -786, -1846, 2666, 327, -2535, 2284, 955, -3320, 846, 1877, -2773, -884, 2259, -2392, -2459, 2686, -1490, -3875, 1837, 717, -3989, 225, 1681, -3403, -1143]
1201a143L168m127L36M024l392j841N665k020l919M528R79m818K661L032m408
1216a275j6M996l825j794M377r35l259L483P14m548L070K222m822J070M516m492
1232e18j692N124j562l778M084J53m636L098K377m714L75L932l210j373M807k554
1248h7l167M892m95m590L248L023n179Q16M192l601j884N052k285k684M201j39
1264A313l996L680J305m630J616L660l746q07M442k338l140N035l82m939L092
1279A65K723m367Q23L377l881n09M094k711k489M513j096m179L950J580m545J266
1295a286L701m301q15M706k529k567M194k32m102L321J189m272K621K881m798
1310b289N98M485l147k912N358o59l905L513J759m542J466L487m134L84L935k843
$$ y = [-1143, 2025, -2102, -1766, 2258, -1134, -2975, 2690, 670, -3249, 1279, 2258, -2560, 101, 3133, -1275, -1291, 3705, -120, -1914, 2463, 1528, -1731, 1752, 2466, -2082, 988, 3210, -1612, -542, 3974, -518, -2210, 2914, 1352, -2426, 1658, 1811, -2825, 273, 2650, -2064, -1689, 2243, -967, -2340, 2467, -87, -3254, 1638, 1143, -3447, -199, 2824, -2355, -1539, 2653, -948, -2832, 2220, -65, -2749, 1452, 1313, -2683, 997, 2302, -2328, -712, 2948, -798, -1605, 2837, 499, -2641, 2394, 2012, -2927, 165, 2888, -1479, -656, 2721, -1160, -1669, 2425, -286, -2775, 1738, 642, -3537, 413, 1993, -2552, -1286, 2415, -1886, -2701, 2005, -524, -3091, 1103, 871, -3231, 90, 1279, -2993, -372, 2509, -2289, -1691, 2794, -353, -3265, 2093, 1434, -2471, 1042, 2801, -1741, -275, 3212, -922, -538, 3397, 554]
1326E54j897M364j224l210L780O32n118K724L600n260l38M960k817k315M033j074
1342A394l767L583N48m408K327K271m354Q12L895l968j544M578j575l684M293
1357D01O32m531K270K571l855K26L701k864j158M513j877l292M534K19m458L062
1373I4K566m541O14M704l597j351M917k185l049L781Q61m379K680K146m178J410
1389D93L059m302n74M654k235l456L963J36l868K460J631m408J253L741m110p59
1405b322L944k022k473M077q87m128L926J156m538J545L421l617j085M757k186
1420d32l075M144L11l621L460P83l993K426K904l972Q7M157k372k136M166p56
1436B081l594L612J161m170J557L583m073k90L960k744k084L897j273l589L876
$$ y = [554, -1343, 3021, 1797, -1413, 2367, 2999, -2119, 605, 4205, -1055, -1393, 3567, 750, -1565, 2468, 1394, -2373, 1210, 1758, -2650, -323, 1948, -2406, -1594, 2301, -1667, -3211, 1367, -208, -3892, 401, 1033, -3498, -1228, 1343, -2512, -2286, 1415, -1449, -2607, 1906, 29, -3263, 1271, 1490, -2968, 94, 2660, -1881, -1267, 3437, -160, -1511, 3406, 1221, -1828, 1953, 2814, -1565, 1115, 3261, -917, 493, 3552, -750, -1324, 3330, 1095, -2361, 1602, 1738, -2130, 330, 1961, -2447, -1194, 2547, -1563, -2322, 1622, -400, -2873, 1204, 317, -3811, 115, 1271, -3267, -1722, 1699, -1918, -3003, 1754, -432, -3507, 637, 948, -2673, 787, 1570, -2423, 3, 2907, -1065, -978, 3179, 807, -1329, 2837, 2081, -1513, 2099, 3260, -910, 647, 4230, 157, -133, 3827, 1083, -1001, 2896, 1623, -1966, 1910]
1451A910Q54n296K348L031m122o31L762k728k105M234j166l983L343J093l945
1466c401K003K126m348J009L997l708j300M244j399l495M209R34m056K325K826
1481A966l812K15L933l061q29M151j403l017L552O51l822K819K263m437J201L625
1497C995l066j717M034j276k848L315j74l632K743J574l851P90L414m001j282
1512a982M552k036l276L987l78l731K644J964m408L81L670l038r43L327k129k168
1528c564L884l81l488K904J807l962J362L283l527j036M319j684k303L716j65
1543A165l224K977J412l566J202K821l106K73L398k801j925M160j66m057K932
1558A495J646l968J364K952l606o45L320k110k048L739j109l097K997R59m179
$$ y = [1910, 2764, -2532, -184, 2847, -1275, -1906, 1856, -872, -2977, 1257, 91, -3892, -549, 544, -3401, -1398, 728, -3620, -2611, 1386, -2322, -3622, 622, -777, -4272, -63, 871, -3185, -860, 1966, -1846, -1631, 2302, -759, -1588, 2563, 1160, -1857, 1695, 2346, -1476, 1343, 3606, -831, 370, 3995, 929, -788, 3246, 1970, -878, 2437, 2263, -1369, 1374, 2948, -903, -113, 3301, -700, -1982, 2570, 534, -2742, 1245, 867, -2864, -220, 1744, -2664, -2283, 1387, -1651, -2594, 733, -1396, -3564, 320, -61, -3549, -645, 1162, -2800, -1438, 1845, -1682, -2718, 1601, -83, -2386, 1330, 1165, -2059, 918, 2330, -1236, -34, 2787, -319, -46, 3352, 551, -1374, 2786, 2620, -1437, 1495, 3141, -827, 537, 3489, -117, -762, 2558, 448, -1600, 2139, 1030, -2067, 930, 1889, -2290]
1573b290J825K423l844L5L878l128k144L984m00l071K822O94l553J667K455l432
1589b079L88L277k850j218L881j095l246L774J107m022J681K843l609K80L351
1604B463k106j820L415r34k507L142N76m063K600J959l408K30K879k462j074L381
1620B271j403k779L020N59l453J642J579k929O39K459k800p83L618j944k431L571
1636H36l2l742K292K304l960P71L010k694p75L616k275j942L861r5l366K292J689
1653A790l562J200L188l754o15M154j594k430L475M8l522K425J630l068P02K429
1669B496l324K07L557k610j893L426l45l441K795J233l673J252K639l398l87L052
1685A586k033j460K786l81l149K631J177l323J516J699k975l9K964j891k030L565
$$ y = [-2290, -465, 1958, -1886, -1851, 2027, -1101, -3245, 739, 339, -2732, 90, 784, -2769, -1102, 1353, -2079, -1691, 1586, -1264, -2482, 1399, 304, -2942, 832, 1939, -2083, -402, 2441, -1168, -888, 2463, 357, -1463, 1952, 1018, -1489, 1653, 2229, -1834, 766, 2725, -683, -453, 2426, -36, -1110, 2271, 868, -1911, 1109, 1668, -1785, -143, 1436, -1493, -854, 1605, -1195, -1978, 1640, -304, -2735, 836, 804, -2938, -646, 1658, -2302, -1531, 1479, -1215, -1990, 1626, -649, -2591, 1270, 1175, -2191, 101, 1790, -1772, -572, 2616, -1138, -1753, 2401, 807, -1623, 1852, 1900, -1622, 803, 2433, -635, 67, 2496, -828, -621, 2936, 326, -1567, 1859, 1514, -1927, 868, 2101, -1572, -320, 2319, -1079, -1466, 1586, -447, -1907, 879, 498, -2651, -20, 1157, -2166, -650, 1049, -1926, -1965, 999, -892, -2922, 643]
1701F43j45l001K431J186l235J575K188k792J30L278k441j266L507r22k864L206
1717A478N93l303J748K266l170l13L052j855j163L112j126k804L022L62l294J815
1733D20J699l180O01K833k953j733M066j304l113L158K01k935J940J487l043N99
1749a257K639k549q42K971j259k607L211M40l208K074J756l138Q47K741k584j052
1765a817L572j329j894K695J72k837K208J281l133J386K425l072l96L405j581
1780A085k146L027k33k776K189J005l165J117J938k442p19K963j618j688K685
1795A222o78k822K701J097l636J169K241k450p18K637j692j501K808m11k351K006
1811c78R52k901J339K476k988J26K662j706j517L204n16k776K930J045l167J311
$$ y = [643, 498, -2503, -72, 1114, -2121, -546, 1642, -1150, -1020, 2258, -183, -1449, 2058, 1136, -1728, 1478, 2071, -1232, 516, 2782, -388, -701, 2351, 496, -667, 2445, 1319, -1485, 1537, 1899, -1395, 420, 2119, -1061, -460, 2373, -580, -2313, 1753, 449, -2664, 494, 695, -2240, -300, 1187, -1856, -1257, 1382, -1167, -2009, 962, -297, -2904, 307, 747, -2461, -387, 1369, -1769, -922, 1819, -765, -1817, 1755, 426, -1468, 1227, 1399, -1438, 770, 2051, -1082, 304, 2729, -343, -739, 2666, 1085, -1061, 1966, 1733, -1043, 1146, 2151, -1014, 103, 2041, -401, -1120, 1843, 225, -1463, 1222, 544, -2278, 423, 1520, -2116, -947, 1294, -1156, -1874, 763, -929, -2430, 378, -33, -2384, -378, 574, -2327, -988, 1488, -1500, -1374, 1288, -418, -1935, 1269, 753, -2023, 907, 1952, -1215, 96]
1827I6K237k763J6K594j946r53K911o75k395K520O55l314J370J657k626r6K749
1844B037k086j496L099q47k430K806k21k739J884J632l289K20K602k121j094K816
1860G73r98k245K595M59k738J394J910k680K56K480j849j191K780p88k184L012
1876I86k3k775J906J430k415K75K492j721j345K871q40j876K590k09k320J721
1892G47J661l339J040K142k588m57K909j623j976K932k28k649J849J025k435K62
1908g28K216k285o18K562j334j886K862l20k743K166Q50k939J081K185k542K7
1924a446K260j042j735K847n61j963J895R45k874J370J730k295j39K996j794j804
1940a610K769k2k174K042N41k569J005K191k474k14K345j683j022K351p71k119
$$ y = [96, 2333, -430, -414, 2180, 234, -719, 2192, 1517, -878, 1642, 2297, -1017, 353, 2010, -616, -712, 2037, -49, -1545, 1554, 707, -1723, 1083, 862, -1877, 7, 1639, -1650, -1430, 1172, -949, -2043, 773, -225, -2470, 125, 584, -2154, -760, 1150, -1530, -1274, 1206, -643, -1834, 946, 158, -2026, 986, 963, -1812, 94, 1524, -891, -616, 1876, 155, -1190, 1681, 841, -1035, 1555, 1346, -974, 747, 2408, -931, 109, 2251, -337, -794, 2115, 492, -1484, 1448, 1220, -1429, 420, 1445, -990, -728, 1488, -797, -1415, 1147, -187, -2073, 789, 469, -2274, -108, 742, -2197, -1116, 1069, -1473, -1446, 814, -228, -1963, 884, 323, -1640, 255, 1200, -1674, -304, 1426, -869, -1008, 1988, 194, -1610, 1159, 1137, -1037, 1005, 1546, -1023, -18, 2173, -301, -515, 1830, 147, -875, 1476, 705, -1414]
1956a414K340O48k668R69K118k700m39K834j843j345K237k50k212J780P26k497
1972a716J267J728k534K24J675j295j164L077j217j989K293O51k882J602J517
1987A237k355K41K256j525p10K190r75j267J876O14k982J835J326k446L20K189
2003A824j617q04K158j022j401J754O20k720J498J131k468Q21J440j783o71K567
2019A327j253j753K531r2k555J377J366k396O67J795j883r13K790j455j394K377
2035E36k98j995J635Q37k006O24J975j941m95K332j219j468K508k65k169K200
2051G91P33k248M42J941k082k24K428j512j352K644l48k257J888Q49k486J099
2067C06J286j903o8J920j476j041K050n97k058K066L23k429R99J662k267m7K021
$$ y = [-1414, 926, 1574, -1094, -125, 1993, -707, -1146, 1688, -155, -1500, 737, 487, -1725, 55, 781, -1716, -449, 1279, -1255, -1031, 644, -651, -1815, 1262, 45, -1944, 349, 1000, -1882, -280, 1237, -1118, -877, 1379, -146, -856, 1334, 359, -908, 968, 1582, -1400, 435, 1761, -685, -365, 1824, 207, -597, 1561, 539, -862, 892, 1512, -1208, 290, 1421, -1047, -226, 1214, -569, -1240, 1327, 74, -1679, 852, 760, -1795, -418, 948, -1448, -781, 1014, -869, -1782, 1008, -447, -1841, 536, 238, -1757, -122, 715, -1291, -667, 1308, -633, -1128, 1204, -15, -1483, 1025, 760, -1409, 791, 1524, -724, -282, 1659, -423, -647, 1781, 269, -1083, 1561, 1213, -1044, 844, 1693, -793, 306, 1592, -311, -379, 1541, 65, -976, 1074, 477, -1581, 485, 808, -1621, -622, 1040, -1227, -1274, 747]
2084G47j313j243K273k10k059J631P06j970Q42J215j968M95J701j454j061K888
2100A220j062j319J618N87k478J740J314k225O0K172j587q60K338p43j774J669
2116F70L47j880J150J298k364M13K196j648r29J855n81j345J223J90j718R93J171
2133A041k217L43J713j418r95K441j139j681K106k18j386R51J253k363L75J986
2149G92j420p32K035r78j050K108j32j835J262J317k089M63J474j381m83J861
2165A212o58j373K269p83j532J452N57j675O64J568j661m89J788r59j435K708
2181A653o17k101J179R77k180R24J163j872k62K178j666r86J874j08k011K084
2197B29K95k117R37J381j770m6J940j355q78J872j01j975J668O61j854J017J078
$$ y = [747, -566, -1809, 464, 254, -1805, -174, 532, -1438, -596, 619, -1349, -854, 847, -607, -1668, 1220, 158, -1161, 457, 1044, -1434, 306, 1620, -605, -545, 1627, 40, -820, 1518, 775, -999, 670, 1017, -863, 287, 1585, -779, -366, 1830, 182, -747, 1108, 527, -818, 405, 595, -1123, -130, 1041, -1176, -833, 880, -538, -1533, 908, -231, -1912, 194, -24, -1410, -459, 794, -1569, -1194, 792, -628, -1360, 675, -303, -1353, 755, 623, -1212, 50, 1367, -722, -259, 1215, -166, -649, 1212, 554, -819, 1450, 667, -865, 587, 1144, -531, 133, 1701, 40, -449, 1339, 380, -1055, 1653, 1036, -1065, 114, 1091, -1089, -165, 998, -874, -1136, 1042, -624, -1610, 264, 156, -1855, 229, 524, -1593, -656, 725, -1045, -1091, 849, -506, -1384, 488, 387, -1588, 80, 741, -1113, -96, 982]
2214I82j747L6K063j162j105J860k18j693J630P61k000P35J589j883P8J439j431
2231f6n60J708o46j635J687L17j715J147J023k007J45J447j110j098K028o55j548
2248a538J879J70j756O44J233j756L82J531j609n62K250r66j691K095J71k082
2264a605J335J162j842J52K125j556m53J807r76q20J598Q8j760J085R07j987O09
2281a31K014j840n40J730n23j780J837L9j514J290N23j811L94J399j224p08J482
$$ y = [982, -765, -729, 1334, 172, -933, 927, 709, -984, 646, 1407, -593, 142, 1731, -152, -74, 1365, -66, -626, 1082, 436, -1199, 488, 805, -910, 237, 1260, -747, -602, 845, -265, -1363, 665, 10, -1538, 341, 511, -1245, -601, 632, -1124, -742, 789, -820, -1382, 868, -98, -1789, 306, 477, -1605, -270, 892, -950, -798, 1327, -229, -682, 1125, 149, -671, 927, 1015, -745, 340, 1247, -740, -131, 1883, 43, -497, 1233, 710, -1070, 767, 806, -708, 582, 1105, -706, -312, 1087, -137, -845, 637]
$$ [...]
8191b10
##END NTUPLES=NMR FID
##END=
