##TITLE=1H_TG-2249-2
 CDCl3, 8 sc, 
 20.8.2019
##JCAMPDX= 6.0         $$ Bruker NMR JCAMP-DX V2.0
##DATA TYPE= NMR FID
##DATA CLASS= NTUPLES
##ORIGIN= UXNMR, Bruker Analytische Messtechnik GmbH
##OWNER= root
$$ XWIN-NMR		Version 3.5
$$ Tue Aug 20 13:41:07 2019 Russian Standard Time (UT+4h)  she@DPX200
##.OBSERVE FREQUENCY= 200.13155
##.OBSERVE NUCLEUS= ^1H
##.DELAY= (6, 6)
##.ACQUISITION MODE= SIMULTANEOUS
##.ACQUISITION SCHEME= undefined
##.AVERAGES= 8
##.DIGITISER RES= 18
##SPECTROMETER/DATA SYSTEM= spect
##.PULSE SEQUENCE= zg30
##.SOLVENT NAME= CDCl3
##.SHIFT REFERENCE= (INTERNAL, CDCl3, 0, 15.7039)
##AUDIT TRAIL= $$ (NUMBER, WHEN, WHO, WHERE, WHAT)
$$ ##TITLE= Audit trail, XWIN-NMR		Version 3.5
$$ ##JCAMPDX= 5.01
$$ ##ORIGIN= Bruker BioSpin GmbH
$$ ##OWNER= she
$$ F:/spectra/data/she/nmr/H-F/1/audita.txt
$$ ##AUDIT TRAIL=  $$ (NUMBER, WHEN, WHO, WHERE, WHAT)
(   1,<2019-08-20 13:39:47.67 +0400>,<she>,<DPX200>,
      <created by zg, POWCHK disabled, PULCHK disabled
       configuration hash MD5:
       00 E9 B6 7A A2 85 ED C7 34 08 36 98 17 FE 4E 26
       data hash MD5: 16K
       2A DD 3F 73 DC 6B ED 3F AF 21 AC 7A BC 0C DF C8>)
$$ ##END=
$$ 
$$ hash MD5
$$ 86 A9 45 E7 A6 93 5C FB 7A C1 57 36 95 7E 11 5E
##$RELAX= 
##$RELAX= 
##$RELAX= 
##$RELAX= 
##$RELAX= 
##$RELAX= 
$$ Bruker specific parameters
$$ --------------------------
##$DU= <F:/spectra>
##$EXPNO= 1
##$NAME= <H-F>
##$PROCNO= 1
##$TYPE= <nmr>
##$USER= <she>
##$AMP= (0..31)
100 100 100 100 100 100 100 100 100 100 100 100 100 100 100 100 100 100 
100 100 100 100 100 100 100 100 100 100 100 100 100 100 
##$AQSEQ= 0
##$AQ_mod= 1
##$AUNM= <au_zg>
##$AUTOPOS= <>
##$BF1= 200.13
##$BF2= 200.13
##$BF3= 200.13
##$BF4= 200.13
##$BF5= 200.13
##$BF6= 200.13
##$BF7= 200.13
##$BF8= 200.13
##$BYTORDA= 1
##$CFDGTYP= 0
##$CFRGTYP= 5
##$CHEMSTR= <none>
##$CNST= (0..31)
1 1 145 1 1 1 1 1 1 1 1 1 1 1 1 1 1 1 1 1 1 1 1 1 1 1 1 1 1 1 1 1 
##$CPDPRG= <>
##$CPDPRG1= <>
##$CPDPRG2= <>
##$CPDPRG3= <>
##$CPDPRG4= <mlev>
##$CPDPRG5= <mlev>
##$CPDPRG6= <mlev>
##$CPDPRG7= <mlev>
##$CPDPRG8= <mlev>
##$CPDPRGB= <>
##$CPDPRGT= <>
##$D= (0..31)
0 1.2 0 0 0 0 0 0 0 0 0 0.03 0 0 0 0 0 0 0 0 0 0 0 0 0 0 0 0 0 0 0 0 
##$DATE= 1566293987
##$DBL= (0..7)
120 120 120 120 120 120 120 120 
##$DBP= (0..7)
150 150 150 150 150 150 150 150 
##$DBP07= 0
##$DBPNAM0= <>
##$DBPNAM1= <>
##$DBPNAM2= <>
##$DBPNAM3= <>
##$DBPNAM4= <>
##$DBPNAM5= <>
##$DBPNAM6= <>
##$DBPNAM7= <>
##$DBPOAL= (0..7)
0.5 0.5 0.5 0.5 0.5 0.5 0.5 0.5 
##$DBPOFFS= (0..7)
0 0 0 0 0 0 0 0 
##$DE= 6
##$DECBNUC= <off>
##$DECIM= 24
##$DECNUC= <off>
##$DECSTAT= 4
##$DIGMOD= 1
##$DIGTYP= 9
##$DL= (0..7)
0 120 120 120 120 120 120 120 
##$DP= (0..7)
150 150 150 150 150 150 150 150 
##$DP07= 0
##$DPNAME0= <>
##$DPNAME1= <>
##$DPNAME2= <>
##$DPNAME3= <>
##$DPNAME4= <>
##$DPNAME5= <>
##$DPNAME6= <>
##$DPNAME7= <>
##$DPOAL= (0..7)
0.5 0.5 0.5 0.5 0.5 0.5 0.5 0.5 
##$DPOFFS= (0..7)
0 0 0 0 0 0 0 0 
##$DQDMODE= 0
##$DR= 18
##$DS= 0
##$DSLIST= <SSSSSSSSSSSSSSS>
##$DSPFIRM= 0
$$ [...]
##$SUBNAM2= <"">
##$SUBNAM3= <"">
##$SUBNAM4= <"">
##$SUBNAM5= <"">
##$SUBNAM6= <"">
##$SUBNAM7= <"">
##$SUBNAM8= <"">
##$SUBNAM9= <"">
##$SW= 24.9336996594482
##$SWIBOX= (0..15)
0 0 2 0 0 0 0 0 0 0 0 0 0 0 0 0 
##$SW_h= 4990.01996007984
##$TD= 16384
##$TD0= 1
##$TE= 0
##$TE2= 300
##$TE3= 300
##$TEG= 300
##$TL= (0..7)
0 120 120 120 120 120 120 120 
##$TP= (0..7)
150 150 150 150 150 150 150 150 
##$TP07= 0
##$TPNAME0= <>
##$TPNAME1= <>
##$TPNAME2= <>
##$TPNAME3= <>
##$TPNAME4= <>
##$TPNAME5= <>
##$TPNAME6= <>
##$TPNAME7= <>
##$TPOAL= (0..7)
0.5 0.5 0.5 0.5 0.5 0.5 0.5 0.5 
##$TPOFFS= (0..7)
0 0 0 0 0 0 0 0 
##$TUNHIN= 0
##$TUNHOUT= 0
##$TUNXOUT= 0
##$USERA1= <user>
##$USERA2= <user>
##$USERA3= <user>
##$USERA4= <user>
##$USERA5= <user>
##$V9= 5
##$VALIST= <valist>
##$VCLIST= <CCCCCCCCCCCCCCC>
##$VD= 0
##$VDLIST= <DDDDDDDDDDDDDDD>
##$VPLIST= <PPPPPPPPPPPPPPP>
##$VTLIST= <TTTTTTTTTTTTTTT>
##$WBST= 1024
##$WBSW= 4
##$XGAIN= (0..3)
0 0 0 0 
##$XL= 0
##$YL= 0
##$YMAX_a= 687529
##$YMIN_a= -535421
##$ZGOPTNS= <>
##$ZL1= 120
##$ZL2= 120
##$ZL3= 120
##$ZL4= 120
##$ABSF1= 10
##$ABSF2= 0
##$ABSG= 5
##$ABSL= 3
##$ALPHA= 0
##$AQORDER= 0
##$ASSFAC= 0
##$ASSFACI= 0
##$ASSFACX= 0
##$ASSWID= 0
##$AUNMP= <proc_1d>
##$AZFE= 0.1
##$AZFW= 0.1
##$BCFW= 1
##$BC_mod= 2
##$BYTORDP= 1
##$COROFFS= 0
##$CY= 11.3945322036743
##$DATMOD= 1
##$DC= 2
##$DFILT= <>
##$DTYPP= 0
##$F1P= 20.1720416913024
##$F2P= 0.152960286110954
##$FCOR= 0.5
##$FTSIZE= 0
##$FT_mod= 4
##$GAMMA= 1
##$GB= 0.15
##$INTBC= 1
##$INTSCL= 1
##$ISEN= 128
##$LB= 0.24
##$LEV0= 0
##$LPBIN= 0
##$MAXI= 10000
##$MC2= 0
##$MEAN= 0
##$ME_mod= 0
##$MI= 1.114404
##$NCOEF= 0
##$NC_proc= 0
##$NLEV= 6
##$NOISF1= 3.799351
##$NOISF2= 2.8
##$NSP= 1
##$NTH_PI= 0
##$NZP= 0
##$OFFSET= 15.70392
##$PC= 1
##$PHC0= -9211.665
##$PHC1= 13.40096
##$PH_mod= 1
##$PKNL= yes
##$PPARMOD= 0
##$PSCAL= 0
##$PSIGN= 0
##$REVERSE= no
##$SF= 200.130013532006
##$SI= 16384
##$SIGF1= 3
##$SIGF2= 2
##$SINO= 400
##$SIOLD= 16384
##$SREGLST= <1H.CDCl3>
##$SSB= 0
##$STSI= 0
##$STSR= 0
##$SW_p= 3612.71676300578
##$SYMM= 0
##$S_DEV= 0
##$TDeff= 0
##$TDoff= 0
##$TI= <>
##$TILT= no
##$TM1= 0
##$TM2= 0
##$TOPLEV= 0
##$USERP1= <user>
##$USERP2= <user>
##$USERP3= <user>
##$USERP4= <user>
##$USERP5= <user>
##$WDW= 1
##$XDIM= 8192
##$YMAX_p= 0
##$YMIN_p= 0
$$ End of Bruker specific parameters
$$ ---------------------------------
##NTUPLES= NMR FID
##VAR_NAME=  TIME,          FID/REAL,        FID/IMAG
##SYMBOL=    X,             R,               I
##VAR_TYPE=  INDEPENDENT,   DEPENDENT,       DEPENDENT
##VAR_FORM=  AFFN,          ASDF,            ASDF
##VAR_DIM=   8192,          8192,            8192
##UNITS=     SECONDS,       ARBITRARY UNITS, ARBITRARY UNITS
##FACTOR=    0.0002004,     1,               1
##FIRST=     0,             0,               0
##LAST=      1.6414764,     0,               0
##MIN=       0,             -535421,         0
##MAX=       1.6414764,     687529,          0
$$ Real data points
##PAGE= N=1
##DATA TABLE= (X++(R..R)), XYDATA
0@%%%qJ6j6K4l2M0m8O4q0R6j21J46j81K20k64L13l67M31n05N87o81P82q95J024
27E45j167J322j495J690j903K136k391K669k976L316l687M092m538N028n567O165
43C239o826P558q380R306j0354J1553j2937J4561j6495J8844k1771K5540l0601
56a6763L7807m8976O8844j15073M17545L44145l50229N0462K671P1401J5396L3891
68E11121j11431j33811j79497o9039L5388P2594l9597m8252q8457j51591j37004
79c39576J6448N1311K6785k482n3231j23277o4878l563P653M6847R3999J1644
91c32320o8135n9940k7014K6689J22725J07467L022k1500j165k6538K0559J22564
103a33586J08320K2761k699j3323j1477M7010P5448M7863N3689L5902n1883n2947
$$ y = [0, 0, 0, 0, -8, 8, -8, 16, -16, 24, -24, 40, -40, 56, -65, 81, -100, 120, -144, 169, -198, 233, -272, 315, -366, 416, -479, 545, -622, 700, -795, 895, -1008, 1128, -1263, 1406, -1570, 1746, -1941, 2151, -2387, 2641, -2926, 3239, -3587, 3971, -4409, 4897, -5457, 6096, -6841, 7720, -8775, 10069, -11702, 13838, -16763, 21044, -27932, 40912, -74161, 343384, 687529, 337300, 387762, 390433, 461834, 477230, 511121, 399690, 265879, 86382, 17343, 52731, 125325, 85728, 37476, -50981, -202572, -339576, -323128, -271817, -245032, -247514, -300745, -424022, -488900, -492463, -484810, -437963, -343964, -332320, -400455, -460395, -487409, -460720, -337995, -230528, -227506, -249006, -250171, -276709, -256150, -133586, -25266, -2505, -5204, -18527, -30004, 17006, 92454, 140317, 194006, 229908, 178025, 125078]
115A25078M6467O6060K6000K8984k172o2483k9238K0597m183r65L5392p200n7574
128A84763m0471l9323l9054K2763M3093j9525m7211m8206p0625k9275M8466K3889
140a0716k7037r677k2832o3700k2689K6882J1872K2798L9791k1239n7305p737
152a41589J4976J6532N9134M7900k4820k5028J1798L21J4358N5084K5108p025
164D6749J8949M965l4137K893M1557J4392Q005J3225k8618k9137K2194Q642k5769
177F3910M291J0524k4101p149N155l8542l0152K4742P308k9201j0111r895k5525
190e8746L650Q212l0206j3129K0539q685j8997R782p511k0138K2017J6206l1056
203a08062m578L3423N100m726J2608j4035j7038L6394L4403o496J446M845j5047
$$ y = [125078, 171545, 237605, 263605, 292589, 290417, 227934, 198696, 219293, 215110, 214145, 249537, 242337, 184763, 144292, 104969, 65915, 88678, 131771, 112246, 65035, 16829, -53796, -83071, -34605, -10716, -37753, -47430, -70262, -133962, -156651, -129769, -117897, -95099, -55308, -76547, -133852, -141589, -126613, -110081, -50947, -3047, -27867, -52895, -41097, -40776, -26418, 28666, 53774, 46749, 65698, 70663, 36526, 39419, 80976, 95368, 103373, 116598, 87980, 58843, 81037, 89679, 63910, 68201, 78725, 54624, 47475, 52630, 14088, -16064, 8678, 15986, -13215, -23326, -33221, -58746, -55096, -46884, -77090, -90219, -69680, -78365, -97362, -87580, -95091, -115229, -93212, -77006, -108062, -112640, -79217, -74117, -78843, -66235, -80270, -97308, -60914, -26511, -33007, -31561, -26716, -41763]
216d1763J4663L9035j766q766K9453J0628j7077J2355J5175j1068J5128L0455
228H6452r694j1515J4811n773j1177K0614L721j9204J4269J4205l1041j8137J1947
241E9478q518m811K2557j0689m1263n216P222j2904L296P326k4590j4099J1488
254a0723j5053j8219J6783K262k0460P370P538k3898N81K5594p831j5648J5265
267c6439L684o152J8601L720k2542P764K5597m009j388J3113j1901o487K8594
280A2155N387k4405N672J6005q135M379J3460j8734j1942J9287Q38j2804J2743
293A3906L222j9097M140P344k1845r0K8696k933j8796L864q989j5821K1915K1372
307A6888j5746q015N423j4414j830K2243j694r532J6795Q75k4915L567J5513p010
$$ y = [-41763, -27100, 11935, 10169, 1403, 30856, 41484, 24407, 36762, 51937, 40869, 55997, 86452, 76758, 65243, 80054, 74281, 63104, 83718, 87439, 68235, 82504, 96709, 65668, 47531, 59478, 50960, 46149, 68706, 58017, 16754, 11538, 18760, 5856, 9152, 16478, -8112, -22211, -10723, -25776, -43995, -27212, -24950, -45410, -38040, -30502, -54400, -53819, -28225, -36056, -51704, -36439, -32755, -38907, -20306, -16586, -39128, -31364, -5767, -9776, -11164, 1949, -9952, -16439, 12155, 17542, -6863, -1191, 14814, 6679, 11058, 24518, 5784, -6158, 13129, 13967, 1163, 13906, 17128, -1969, 2171, 9515, -12330, -12420, 16276, 13343, -5453, -1589, -10578, -26399, -4484, 16888, 1142, -6873, -1450, -15864, -17694, 4549, 2855, -6677, 10118, 10993, -13922, -10355, 5158, -1852]
321a852Q843K1152j5856k1973J2740O034o620J5392Q866j6440R19P737j9326m843
335e227K6150O262q622N418j4326k7388J4520K6596o655n355M778j8698j4699
348a7246J3892K371n971J7757L456k6900j0001O091p146J0812K5837j1023k5484
361b3555K653J34r346J6822J6973j2881l531P246j6099r303J8873Q650p08J5197
375A1125o043k9324J327K1702R55O427J5869j4231j8792J0610M134p764J7205
388A3200J5653j2845o579J151j5457K322K8260M150j4774L144m960j7784J0438
401E919J6889j0236j495J4066j1331j8401O142K039l884J6355M584k4006o806
414a0165Q709q643L90J6438o491j5222Q795q00j8984N370J4687o860j137P213
$$ y = [-1852, 6991, 28143, 12287, -9686, 3054, 9088, 2468, 17860, 26726, 10286, 11205, 18942, -384, -5227, 20923, 27185, 18563, 23981, 9655, -17733, -3213, 23383, 16728, 11373, 16151, -2547, -17246, -3354, -983, -6954, 10803, 14259, -12641, -22642, -16551, -23697, -12885, 12952, 1929, -23555, -20902, -20768, -30114, -13292, 3681, -9200, -12731, -5485, -21584, -30887, -12014, -3364, -4072, 11125, 5082, -24242, -22915, -1213, -258, 6169, 22038, 7807, -10985, -375, 3759, -4005, 13200, 28853, 16008, 9429, 10580, -4877, -2555, 25705, 29855, 15081, 18225, 13265, -4519, 5919, 22808, 12572, 11077, 25143, 13812, -4589, 1553, 3592, -292, 16063, 20647, -3359, -10165, -1456, -10099, -9709, 6729, 238, -14984, -6189, -6989, -25973, -20603, -5916, -12776, -13913, -6700]
428f700j4686j0522J5112M297q080Q888K427j5219M842J2362j1958k743J8688
441c292q28r917J0041L29j1874J1205J3387r386O74J1570o738l269J4720j676
455A4946r551J3952Q677j2576L388Q838j0604N98J6916m613j1157R942J576j1860
469A8472M910L880j1968L804J0914j4328j2421Q185m429j0221J0239k84j9687
482a2934j025O684j4127n441R898o670q883P463n854j5925P304Q294r316L651
496c6881Q671j2935m659J5343q4o490J4873P259j0175N065R472o528O703J9662
510I296j021m528J1078j385o721J6703J2334q569L284R376r506k706J4753j279
524D1109o956J1657Q78j4975P60N178p403L717R387j3296j1845P978l943j2259
$$ y = [-6700, -21386, -31908, -16796, -12499, -20579, -11691, -9264, -24483, -19641, -7279, -19237, -21980, -3292, -4120, -14037, -3996, -3667, -15541, -4336, 9051, -335, 339, 11909, 5171, 1902, 16622, 14946, 5395, 19347, 28024, 15448, 18836, 27674, 17070, 17668, 34584, 29971, 18814, 28756, 30332, 18472, 23382, 27262, 15294, 19098, 30012, 15684, 3263, 11448, 7019, -3202, 7037, 6753, -12934, -13959, -7275, -21402, -26843, -16945, -23615, -32498, -25035, -30889, -46814, -39510, -31216, -40532, -36881, -28210, -41145, -45804, -30461, -30545, -37035, -22162, -14903, -25078, -20013, -10541, -17069, -10366, 9296, 8275, 3747, 14825, 13440, 6719, 23422, 35756, 27187, 30471, 39847, 30341, 27635, 42388, 41109, 34153, 45810, 46688, 31713, 32473, 37651, 30248, 33965, 43352, 30056, 18211, 26189, 22246, 9987]
538I987P443L146j3880m97L201j6667p314J2053k659q917L044p493j5152O052
552b7653O937j0959J7P639j1470q140R512k283o888J3179N009j3696J30R521m941
567c4086M366J4888l271n326J1247J465p053J2917J2092o288M723J0254q540l294
581D094J5238L252m663J0006J087j4151K964Q763n618J106Q576r972j0731O047
595A5998m179j0177R680N169j4401n386K608j1484l213J2687k123r996L329l359
609a4847j1860N327J0352n350K243Q555r678o981J1991L601k945J3086O353j0442
623e95L42R283l680L851J6399K1o545O231j214q113J1195J1424o872J252O491
638C9470j1111q254J0835K131n061P938k013j7193k626N452p433p79P626r456
$$ y = [9987, 17430, 20576, 6696, 6199, 9400, -7267, -14581, -2528, -5187, -14104, -11060, -18553, -33705, -27653, -20716, -31675, -31658, -24019, -35489, -43629, -34117, -36400, -43288, -30109, -25100, -38796, -38666, -29145, -34086, -29720, -14832, -18103, -23429, -12182, -10717, -17770, -4853, 7239, 951, 5674, 15928, 7388, 4094, 19332, 22584, 17921, 27927, 29014, 14863, 17827, 26590, 20972, 22078, 30654, 20682, 9951, 15998, 11819, 1642, 11322, 16491, 2090, -3296, -688, -12172, -15385, -2698, -4821, -14817, -11488, -14847, -26707, -21380, -11028, -16378, -14135, -5580, -15258, -22239, -10248, -6647, -9592, 3494, 9847, -595, -253, 9030, 5350, 9201, 25600, 25621, 19076, 25307, 24093, 15980, 27175, 38599, 31727, 32979, 39470, 28359, 20105, 30940, 33071, 28010, 35948, 33935, 16742, 14116, 19568, 12135, 11356, 18982, 9526]
652I526j2759J091o408j2237P586N190j4256o337J768j2482p742Q135k181p906
666d9012N404j661j4356OO176n063M446J2223n891p766Q279J833k739J4647J2540
681b0934m529L317Q912m564L113J9175P727L40R845J484p284R485J2877r19O674
696D4719J1833p926p564P954K221m520R848M597j0884k430J053j2239l708J0195
710D3149j213o939J693r083j8398Q89O645m462J699L679j6898j5184L705L88k717
725a3047J0154J696j4929o451r72p981N192J6142k094r872R25n629r879R439J1732
740a5574l206K534M834j1884q227Q962M083J447J2611K359j3255k988K501m076
754a9879Q387J7348j815q983J37o707p778J3755J5268k617k704k318j4131k855
$$ y = [9526, -3233, -2142, -8550, -20787, -13201, -8011, -22267, -28604, -26836, -39318, -47060, -38925, -41106, -49012, -43608, -45269, -59625, -59619, -53443, -58506, -54060, -41837, -47728, -55494, -47215, -45382, -48121, -33474, -20934, -25463, -22146, -13234, -17798, -14685, 4490, 12217, 12557, 22402, 23886, 16602, 26087, 38964, 38045, 44719, 56552, 48626, 41062, 49016, 51237, 46717, 56565, 61162, 50278, 47848, 48901, 36662, 32954, 43149, 41936, 34997, 36690, 27607, 9209, 10098, 16743, 12281, 13980, 17659, 761, -14423, -10718, -10330, -13047, -2893, -1197, -16126, -22577, -23549, -31530, -26338, -10196, -12290, -22162, -21237, -26866, -36745, -27306, -15574, -18780, -16246, -11412, -23296, -31523, -22561, -18478, -17031, -4420, -2061, -15316, -18304, -15803, -19879, -11492, 5856, 4041, -4942, -4805, -11512, -19290, -5535, 9733, 7116, 4412, 2094, -12037, -14892]
768a4892J4287O115j071N232n628j4711J133Q208j503N521R545q448j1022L532
782c702m97l118J2932P948q174k510J550p593J943J4104J734k277N904l560j2611
797B073M502J1292K39N621N748j2160j0816N867L651J336J0209k89j5591n193
811F489K469m546M473J1042o138j1731q63n401p774Q896Q475p714m110j96j0162
826a6791m513R501J738l326N479j487j1995Q0N699l398M788J1128m455r503K430
841a4625m65k805J1170Q154o219r81K666p669q28J2161L798j664M276l898j1136
856h065N485J0909k193J334M594p515n869P357K101l857O027K277q615O26L980
871H576o433l83Q455j969o513L521k012p813N250N765p064r67M809o653n589O674
$$ y = [-14892, -605, 5510, 4439, 9671, 4043, -10668, -9535, -1327, -2830, 2691, 12236, 3788, -7234, -3702, -4199, -7317, 5615, 13563, 5389, 2879, 4429, -3164, -1221, 12883, 14617, 12340, 18244, 14684, 2073, 6575, 17867, 18106, 23727, 29475, 17315, 6499, 12366, 16017, 17353, 27562, 27273, 11682, 6489, 8958, 4412, 8885, 19927, 13789, 2058, 1195, -4206, -11980, -3084, 5391, -2323, -6433, -6629, -16791, -21304, -11803, -10065, -13391, -7912, -9399, -21394, -21314, -15615, -19013, -14225, -3097, -7552, -17055, -14625, -15090, -17895, -6725, 1429, -4790, -5771, -3105, -10774, -11602, 559, 4357, 2693, 6969, 3071, -8065, -2580, 8329, 6136, 7470, 12064, 4549, -1320, 6037, 8138, 4281, 10308, 12585, 3970, 4596, 8576, 2143, 1760, 10215, 8246, 1733, 5254, 3242, -4571, 679, 6444, -620, -1587, 3222, -3431, -9020, -2346]
887b346J14l857O169K40j0354R8N832k560K364P680o376q194N716K179k641O876
903I40M507p204r72M166n493P75J0837Q14o214K136p58n956N599P268n417o31
919D397O071n507o375N124J131l343O859K526r119l169L032m319J939R517l308
934E456p555K704j753o692N581P100l887p67K693p718n389Q363L899k425L993
949C603k092j0126J139P460j433M72N605m995o315M525L47m577N797N494o248
964a344k562K957n112q18Q982J8n360L116O2p730K443O880l295O44O011n587p061
981g756N433K675j788N842K149q888j837N408j727J146Q179l276p197L530P25
996B618m747N416O773n824l300L183m968j921Q770J503o564L63J55n421K864N440
$$ y = [-2346, -2232, -6089, 80, 320, -10034, -9936, -4104, -6664, -4300, 3380, -2996, -11190, -5474, -3295, -5936, 940, 5447, -1757, -2729, 1437, -4056, -3281, 7556, 8370, 2156, 4292, 3534, -2422, 3177, 10445, 5028, 4397, 10468, 4961, -1414, 3710, 4841, 1498, 8357, 10883, 1764, -1405, 1627, -2692, -753, 8764, 5456, -2099, 605, -1148, -7840, -2259, 4841, 954, 187, 2880, -4838, -10227, -1864, 2035, -390, 3603, 1511, -8615, -7476, -16, -1449, -977, 4628, -367, -6682, -2157, -1810, -6387, -590, 4904, -1344, -3906, -949, -6061, -6879, 2103, 2121, -3239, -123, -61, -7791, -5348, 1532, -1763, -1119, 4892, -695, -7756, -2323, 352, -1436, 4406, 6555, -2333, -4170, 1238, -489, 657, 8836, 5560, -1637, 1893, 2618, -2129, 3287, 10060, 4236, 936, 4119, -849, -2770, 6000, 7503, 939, 1302, 1457, -3964, -1100, 4340]
1012D340n397k368N249k702o067L327J055m108M520L406q193l053N155r73j107
1027f916O262j679o156L277J498m704M301P089l322k190L152l869k466R912M722
1042H911m542N42J89n748L566Q996r03k287L502l526n325N398L791k965L658K871
1058A6128q658m118M979l00j381N870k322q504L76O68m887J670N462m600m318
1073c935J244o049n625O416M502m571l37j707r147p65Q066J80j756L528l868p211
1089b1035K610M113p25N043N489n908m600M487J13J974R620K958n714L75K536
1104A336k175M517Q561k11j478M156k471m910N645N801o61K833J222q289k996
1119A0880O114K62j458M406k261q181o91M91m680J693N311n070o303o23m712m266
$$ y = [4340, -1057, -3425, 1824, -878, -6945, -3618, -2563, -6671, -2151, 1255, -6938, -9991, -4836, -5809, -6916, -654, -2333, -8489, -5212, -3714, -8418, -4117, 2972, -350, -2540, 612, -3257, -5723, 4189, 8911, 4369, 4911, 5100, -648, 2918, 11914, 11011, 8724, 12226, 8700, 3375, 8773, 12564, 9599, 13257, 16128, 7470, 3352, 8331, 8031, 6650, 12520, 10198, 1694, 2070, 2738, -2149, -479, 4983, 383, -3935, -2691, -8740, -14365, -7949, -3447, -8018, -8355, -10062, -19209, -19974, -11908, -11728, -13484, -9956, -13824, -21035, -18425, -14312, -15037, -9994, -4505, -10413, -15013, -10526, -10413, -8439, 1181, 4139, -1575, -1200, 1336, -839, 3678, 12239, 12028, 10550, 14706, 12235, 7325, 12970, 18771, 18110, 20943, 22165, 13876, 10880, 16994, 17256, 15798, 20204, 17943, 9762, 9071, 9562, 4882, 6575, 11886, 6816, 513, -110, -4822, -9088]
1135i088O464K178o919j966m15o201q19N875j556k826L723k055o313K417L456
1150a4045j616L692M980n521l366N418J442k15O460J580m562K572M226l122J341
1165g36P266N0j127L802k030l610N880M556l232O97K480l999q86M552j441l169
1181I053M101J91o017o5J372m076L04L792m927m133K433k064m468L287Q7n811
1197f941L62K763m768j918L808j757k276M343p67m681K573L734k547J417L789
1212b866l206m63N771m0k832M479K541k828K331L046l146L03N551j270k501L130
1228H000r38k728L226J850n132l99L553l706k747K741k173l046L448p31o104K56
1244d630K410l883P6L025k942k908L375j589l649L703K232l322J480L316m262
$$ y = [-9088, -2624, -446, -7365, -9331, -9746, -15947, -16766, -10891, -12447, -15273, -11550, -13605, -19918, -17501, -14045, -15661, -11969, -6989, -12510, -15876, -10458, -9016, -9231, -2771, -1191, -5753, -3181, 1045, -2077, -736, 6530, 6580, 5453, 9255, 7225, 3615, 9495, 14051, 10819, 11516, 13996, 9997, 9111, 13663, 12222, 9053, 13154, 13345, 7328, 7263, 8635, 4559, 4863, 8655, 3728, -405, 2028, -36, -4504, -1217, -1130, -6941, -6579, -3816, -8584, -10502, -6694, -8451, -10727, -6384, -7151, -11832, -9259, -5525, -8072, -6655, -2866, -6072, -6535, -764, -804, -3636, 843, 3384, 556, 2887, 5933, 2787, 3090, 8641, 7371, 4870, 8000, 7062, 4334, 7560, 9410, 4278, 3879, 7432, 3726, 979, 3720, 1547, -1499, 1949, 1218, -4886, -4630, -2220, -6103, -6027, -3002, -5944, -8852, -5477, -7066, -10715, -7012, -4780, -8102, -6622, -3306, -7568]
1259g568j395N385M44p90L409L85l464L005L127k559J270M993j478j426L040j090
1275E288k697M834K619l417M82J971l177n27M027k269k272L661k49m656M66P56
1291D840l374J130L359l655l567K082j252l022K334L50m375J399K089m426j107
1306g195L037j253j960L624n81l662K377K012l018J277L714j985q75M200p99l088
1322d175L580J624j784K739K086l805K2L969j435j675L699p6l319K175J89m019
1338b05J172L440k866j809J607k584k617K747N24l910R83J188l886o02K502j928
1354f244r78M120p83m438J311J598j151K658L621k841j390L336n80r49M797K218
1370D305j867J683J149l302J206N589L45k6K518k669l992L236L281j224J683J365
$$ y = [-7568, -8963, -3578, -3134, -3924, -515, -130, -3594, -589, 2538, -21, 1249, 6242, 4764, 3338, 6378, 5288, 2591, 7425, 10044, 6627, 7109, 9080, 5903, 5376, 9403, 7134, 4862, 8523, 8274, 3618, 4084, 4840, 1466, 2596, 5955, 2300, -1267, 815, -437, -3459, -1125, -775, -5150, -3751, -1662, -6088, -7195, -4158, -5411, -7371, -3747, -4328, -7990, -5613, -3601, -6619, -5342, -1628, -3613, -4488, -288, -1087, -4175, -595, 1029, -755, 1984, 4070, 265, 287, 4256, 2821, 1146, 4845, 4769, 1450, 3625, 3814, -205, 967, 4407, 1541, -268, 1339, -1245, -3862, -1115, -591, -4501, -3518, -2330, -6216, -6818, -4316, -6244, -7222, -3102, -3885, -8323, -7012, -5414, -6565, -3907, -286, -3127, -4517, -1181, -1761, -2710, 2087, 4305, 2438, 4121, 5270, 1968, 3174, 8763, 9108, 9082, 11600, 8931, 4939, 8175, 11456, 10232, 11915, 13280]
1386A3280m473k350J781j158q06M484k89n031j779j227l421K377L702k481l492
1401h83j86l778l874K723J692j908J047n86o320k470K772O50N68L788k088o031
1417a4884N81J461p30L187M489j822j885J468j524j299O045M504o25J196k98l718
1433c854J999N862J929N95L302j688l539K505K747j058L624K882l183l239R02
1448I786p90j90M135j45m041o97p50l749j77K850j586k085J183l823n175J272
1464c982J485j433O94J30m746l035K344p41l32L384o55l989K73J028j675K223
1480i027L937r37j446J898n99j517M694K930j034J584J601k298Q91M097nJ39M190
1497I098M2k641J104J430j250K087L545k236k202J112j388j448K764P57l064j18
$$ y = [13280, 8807, 6457, 8238, 7080, 6274, 10758, 10469, 5438, 3659, 2432, -989, 1388, 5090, 2609, -883, -1069, -4847, -8721, -5998, -4306, -6214, -5167, -5753, -12073, -14543, -11771, -11121, -10553, -6765, -8853, -14884, -14303, -12842, -13572, -10385, -5896, -7718, -9603, -8135, -9659, -10958, -4913, -409, -1034, 162, -136, -3854, -1855, 4007, 5936, 6531, 9833, 8145, 4606, 7111, 9858, 8800, 12424, 15306, 12123, 8884, 9786, 8996, 8806, 12941, 12796, 8755, 8058, 7308, 3559, 3382, 6232, 4646, 2561, 3744, -79, -5254, -3982, -2497, -3930, -3236, -3106, -7852, -10887, -8543, -9284, -9616, -6232, -6887, -10876, -10603, -9575, -11250, -9027, -5090, -6027, -7473, -5575, -6174, -7691, -2997, -67, -1101, 483, 2084, -214, 677, 4774, 4769, 4908, 9098, 9140, 6499, 7603, 9033, 7783, 9870, 13415, 11179, 8977, 10089, 8701, 7253, 10017, 10774, 7710, 7592]
1513G592l65m044j212K647j352j853O08k939m131P22J281k441m99N34l686r79
1529a0117J546j659j826K264L47k348M83J029k546J643L239q80p42K576K69j328
1545h050L124J774j145K142K798j303j58K774Q92M04L733j0k869J485K438m78
1561G551J030K257k099r61J974p46k106K644O88l117k24M69k693n29K501k103
1577D536j916J051j777l015J125L41k311J88J110k906j629J341j230q20K089L5
1593c788k438r9J355j963K90L044m07r81J608n38k107K432K140o07J132J869k532
1610a590o67K860O72m03J945L11k045J088J595j984Q22K672r17j272J276r95k308
1627A060J968J092j787L51M04k513r28J737r25j246J786k60l052J93M94j914J081
$$ y = [7592, 7227, 3183, 1971, 4618, 3266, 1413, 2021, -918, -5049, -4327, -3046, -5487, -5986, -5452, -9138, -10117, -8571, -10230, -12056, -9792, -9445, -11793, -11310, -10281, -12827, -11184, -7945, -8825, -9567, -6991, -6722, -8050, -4926, -3152, -4297, -2155, 643, -660, -818, 1956, 2848, 3252, 6985, 6975, 4106, 5591, 8029, 7551, 8581, 10838, 8739, 7778, 9752, 9006, 6900, 9544, 10232, 7115, 6891, 7360, 4667, 4138, 6639, 4536, 2620, 3671, 1894, -1121, 4, 345, -1966, -1778, -668, -3574, -5203, -3862, -5092, -5912, -3823, -3788, -6226, -6325, -4970, -6933, -6643, -3599, -4006, -4987, -3379, -3917, -6024, -3592, -1452, -2059, -927, 942, -1590, -2257, 603, 1275, 872, 2817, 3128, 1083, 2171, 3766, 1782, 2604, 5276, 4359, 3087, 4363, 3368, 1060, 3028, 4120, 2333, 2684, 3088, 575, -353, 1384, 459, -787, 999, 739, -2313, -2120, -1626, -3540, -2459]
1644b459K158k161k368Q94j77j185K373M34k073P50P90j795J67K844m24j173J900
1661a505l35j494J753J696j298J051K279j819m24J951J36j076K503J239j688R4
1677C063Q62k017J038L090r63j516J315q63k572J878J902j269j33M02k724r99
1693D94K181m20q26J535j073k792K49J116j057K07J434k067j966J917j23j918
1709c109J487L64j190M28Q16k272l70K231j36j266J339k6k032J156J291j317P82
1726a824J720j832j156J829m87n02J829M55k407K58J357q95O04J674j482j439
1742b298J624M72j605K094R21k095j60J279j036K60K941j212j896J521Q6r63J097
1759A030J758j055j085J284q33o38K094N32j386J035N47k133M39J533p93P11J583
$$ y = [-2459, -301, -2462, -4830, -3936, -4113, -5298, -2925, -2491, -4564, -3814, -3024, -4819, -4652, -1808, -2232, -3405, -1505, -1840, -3334, -1581, 115, -1183, -132, 2147, 328, -96, 1855, 1991, 915, 3418, 4657, 2969, 3063, 3925, 1908, 2946, 6036, 5073, 3557, 4872, 4009, 1437, 3315, 5217, 3948, 3815, 4217, 1493, 494, 2675, 2255, 1429, 2964, 1891, -901, -652, 464, -593, -386, 1048, -1019, -2985, -1068, -1191, -3109, -1622, -1258, -2448, -2020, -1204, -3476, -3846, -1615, -1751, -3017, -1678, -1704, -3736, -2580, -1289, -2606, -1824, -104, -1936, -3092, -1263, -1750, -2252, -423, 32, -2375, -2117, -760, -1655, -1051, 623, -859, -2298, -674, -202, -1807, 287, 1208, -887, -1047, 232, -804, -544, 2397, 1185, -711, 810, 896, -67, 1030, 2788, 1733, 648, 1932, 1099, 461, 2555, 3087, 1701, 2736, 3283, 1150, 1589, 3122, 2329, 3040, 4623]
1776D623j263k048R62L14j263J505J267j860r06L2j405m27K885L97k240Lp20k092
1794b236K20K343n13m02K57k256j999J721Q94q77J027J66k963l13J497n15K55
1811c694J848j84j853P17oj247J689K233o04j230R02p29l24J983J073n28R44L99
1829A389k144j27K030K55K49J729j088k161Q94J149q32J460J263j722r85L89n64
1846A184l29K178M65j858j53J12j621N70J683p55n64O76p91j868J230K67m71R38
1864H93M62k173r52J281p43K4J589q7j735O23L1j630J387J639l54j018O87r82
1882a058q87J654Q04p21J084m1j666j16J560l0k50J643o36j504Q06L18r96J126
1900A090R30j248p73J187j138n57J343J52j179J15K48j988M3J722p91m63N62j011
$$ y = [4623, 3360, 1312, 2274, 2588, 1325, 2830, 4097, 2237, 1331, 1363, -42, -469, 2416, 2813, 573, 576, -144, -2236, -2016, 327, -186, -588, -331, -2587, -4586, -2865, -1971, -2848, -1821, -1655, -4618, -4931, -3434, -3949, -3694, -1846, -2030, -3883, -3166, -3172, -4419, -2730, -497, -1101, -2331, -1429, -2158, -2482, -499, 574, 46, 990, 1389, -755, -882, 1148, 1403, 1652, 3381, 2293, 132, 1026, 2175, 1343, 2803, 4066, 2344, 1359, 1748, 1184, 855, 3033, 3498, 1640, 1487, 1599, -22, 548, 2231, 1476, 912, 1588, 797, -1071, 159, 426, -45, 893, 1355, -818, -1770, -489, -1232, -1208, 381, 294, -1441, -818, -787, -2417, -1030, 609, 255, -763, -76, -1058, -1945, -291, 513, -208, 876, 835, -831, -947, 613, 583, 333, 1976, 1340, -164, 642, 960, -36, 1090, 2020, 772, -1, 1186, 48, -509, 834, 986, -193, -78, 170, -1818, -1775, -53, -844, -1307, -745, -1756]
1918a756j586J103O28p85O46Q07j802q87J025m38K71J654J50j547N0M6r5J216
1936a300J844r37m19O83o46p41J632J458J7N49P8j582k53K239j31O39J072r2j809
1955B301q7O18k59J688J349j201j590J93o89j59J423O13j073l94r32k013M93J452
1973A733j20o63J46j453j765L45N33m55O30K92j922j201N26r8J81J434m47j549
1991c853p8L04j129P17J599J57n07P51r47r40J719J539k77K02j5r55N9J455K32
2010C3N5J538j93j672K52Q82j47J022Q82q15j142P88n12j94J461J92q72n30Kj030
2030@K86J300m27m34M85o27j360N24P90k44K35L48r97j172J599k30m43J049p9
2049F03r62J53O78j068L28J305o60n14P21J37o11Q38L16n25l10J045m15m30Q31
$$ y = [-1756, -3342, -2239, -1611, -2396, -1750, -943, -2745, -3632, -2607, -3045, -2774, -1120, -970, -2517, -2467, -2421, -2516, -1300, 544, -393, -812, -129, -775, -1516, 116, 1574, 1591, 2140, 2218, 636, 383, 2622, 2491, 3130, 4202, 4110, 2301, 2214, 2832, 2573, 4261, 5610, 4409, 2819, 3012, 2323, 2164, 3587, 4200, 3127, 2733, 1801, -212, 281, 1733, 1613, 950, 1096, -357, -2122, -1777, -1244, -1699, -1069, -777, -2699, -3900, -3374, -3472, -3291, -1857, -2304, -3853, -3931, -3627, -4756, -4039, -2440, -2283, -2790, -2039, -2986, -3926, -2207, -668, -945, -743, -758, -1713, -1654, -199, 33, 88, 1626, 1433, -239, 13, 895, 748, 1770, 2652, 1837, 695, 1483, 971, 777, 2238, 2430, 1558, 1028, 1030, 0, 286, 1586, 1159, 725, 1210, 583, -777, -253, 537, 293, 528, 876, -121, -1293, 306, 76, -367, 682, 603, -359, -206, 472, -596, -268, 1037, 377, -137, 584, 721, 110, 948, 1264, 739, 429, 1474, 1059, 629, 1460]
2068A460q50k42O10M26o30K06N80j557l27N13l72J32Q36l18j139L6m66o28L61
2087a369J635q18r16k18o30n13N35O74r2K87K37j500n44O28M58R25J280q14j590
2106b345K03O22PP76J517r67k74K12r94K35J162J763k76k28o81j178O20J276M28
2125A878j41N45r17p93k9N44n7J569J15j322j359N57Q3l0J392J7j029o09n18n67
2145f71J038J198j63p94pp35o70P11J007J03K09o02j356k62J032L75L97O73p69
2164G14j113j11K85j71P47J377q33j103p7m95K62R04O49n97n12p0j610L77J123
2183b54K19j25k11q04r91N5M93K87N26o2j437o97N14n3K08R26J11p51j3o4l98
2204b521L93J111J49l3m2j20m54O36R08N39K18J6o33J7J275K96m95R17M49n09
$$ y = [1460, 610, 368, 978, 1404, 774, 980, 1560, 3, -324, 189, -183, -51, 785, 467, -672, -636, -1102, -1730, -1369, 266, -552, -1468, -1686, -2316, -2829, -2294, -1620, -1712, -1425, -1188, -2688, -3232, -2604, -2146, -1221, 59, -755, -2345, -2142, -1520, -1513, -737, 780, -187, -461, -249, -1243, -1008, 154, 1917, 1641, 1413, 732, -446, 174, 1450, 1878, 1737, 2282, 1365, 572, 543, 1087, 1030, 2599, 2714, 1392, 33, 590, 673, 643, 2035, 2052, 1023, 414, -104, -671, 367, 1565, 1402, 608, 601, -134, -804, -93, 914, 1017, 1226, 624, -732, -994, 38, 413, 810, 1483, 714, -399, -510, -225, -396, 351, 1728, 895, -208, -285, -780, -518, 386, 1035, 438, -74, -144, -1754, -1377, -254, -35, -160, -371, -1175, -2166, -2111, -1618, -1331, -805, -867, -2304, -3001, -2487, -2540, -2332, -1406, -1295, -2046, -2059, -2123, -2521, -2128, -1017, -868, -901, -943, -1063, -1517, -881, 27, 566, 784, 800, 167, 184, 1459, 1755, 1260, 2177, 2626, 2117]
2224B117k43L77R7P17P20p14n67k91N86k17L76K19p84r2K00j211k49N90l20m51
2244H60K46o36j483O30K56n70R1k21p38q39L65j3o64J076L17j037j42p2p40L31
2264b983J312k5k10k11m5m11P41J085M1K7K10p2l2M5N14L86Q92o5r16j22O48K61
2286A070K49O72m06m63K74n31l65M47J188n99m21l95j015K6N96J76j49P8n07r80
2306a055j74K80q4N98M5m04r73L15Q0k30Q34N96p48k77J36k21J29J281K16n64
2326b20L07N2m64O23J069k82L85K86l40o09O25K18O29L49J53q77k51L34j15j61
2346A711O52n1q39K52p74l79K55O97p51o69m91l10l92N04N7q71j42J49j032nK57
2367b172l42J37O1Q5p44j27j19K65M54M53r47J09R33r6m97J067O55l62L35J19
$$ y = [2117, 1874, 2251, 2348, 3065, 3785, 3071, 2504, 2213, 2799, 2582, 2958, 3177, 2393, 2301, 2501, 1290, 1041, 1631, 1311, 860, 1106, 470, -1013, -383, -127, -697, -606, -827, -1565, -2404, -2039, -2052, -2716, -1640, -1323, -2360, -2502, -2574, -3314, -2983, -1671, -1696, -1906, -2117, -2162, -2573, -1832, -747, -706, -679, -469, -541, -573, -528, -14, 372, 1264, 1199, 283, 161, 809, 1070, 1319, 1991, 1585, 1122, 1396, 865, 500, 947, 2135, 1536, 1115, 720, -295, -269, 327, 503, 354, 432, -75, -1055, -1229, -949, -1033, -435, -390, -794, -1767, -1452, -1372, -1602, -768, -172, -920, -1197, -1061, -1282, -1153, 128, 344, -220, 87, 139, -325, 298, 1367, 1085, 1470, 1756, 1416, 807, 1432, 1650, 2279, 2628, 2781, 1904, 1653, 1987, 1872, 1711, 2363, 2312, 1473, 1725, 951, 572, 827, 1524, 773, 104, -387, -697, -1089, -585, -528, -1399, -1541, -1392, -2424, -2429, -2172, -2514, -2377, -2316, -2231, -2975, -3102, -3221, -2956, -2502, -2049, -2996, -2887, -1954, -2050, -2547, -1480, -825, -1187, -852, -733]
2387g33J57K54O46L16j28N76m4k39O40N99k90J63O34p5JJ08k65n8O69l85q36N8
2409A768M18n9K75p34k62o48Q22k03n80k37L70j205r2M94o43j53M08l71p62lK20
2430a177n15P75k58l13K4K22n13J32Q15o2k14M56R8m67K8N98Q2K08N07k7n73N64
2452C90j26n9O66P74r37m72M41n89N27O05k53m98J93j93q07M96O51q68M3J24r28
2473h20J81K28Q4n79J35J34n65k0r4k39K06P13j98n68J92J11k56L19O72l82M08
2494c38pj53m72J005K44j6O04j74r25R6J290j84M63K51n57n86R36M13n08o8N66
2515A880m66j18K72n28j94P92J25r74L6J74p11K16J36k90j78N10o16o57K92j42
2535d41l61P98j16j164MO29m99j40Q15Kp53M74K69p70L54O74j45n28N42l24j10
$$ y = [-733, -576, -322, 324, 640, 512, 1088, 1044, 805, 1445, 2044, 1754, 1917, 2551, 2476, 2477, 2585, 2320, 2262, 2931, 2546, 1710, 1768, 2186, 2127, 2402, 1668, 1406, 758, 1580, 1377, 797, 560, 930, -275, -367, 127, -516, -669, -261, -632, -1394, -1397, -1177, -1692, -917, -1175, -1488, -1464, -1242, -1755, -1623, -808, -870, -1084, -628, -530, -997, -969, -371, -289, -81, 426, 399, -174, 390, 264, 205, 871, 1645, 708, 236, 677, 88, 615, 1220, 967, 469, 662, 469, -338, 158, 809, -59, -16, 108, -820, -639, -411, -327, -906, -771, -637, -1202, -1222, -1316, -1555, -1349, -636, -834, -1402, -1210, -1099, -1355, -1036, -364, -746, -338, -345, -498, -970, 35, 279, 263, 867, 693, -232, -136, 1154, 970, 1433, 1684, 1127, 541, 1477, 1890, 1382, 1314, 1880, 1414, 1296, 1568, 1040, 846, 1638, 1763, 789, 825, 999, 288, 504, 640, 350, 172, 682, 66, -591, -299, -441, -802, -4, -120, -1284, -1280, -651, -1150, -1290, -475, -473, -1226, -752, -483, -1253, -899, -225, -370, -898, -356, -680, -790]
2556g90P13M19n24L32L31o62J29O00o62J98Q65n03m01J85J44r03Q34L45o01j03
2576e4N9l55l39L41K29p44L34J14n18J00K33n23L5Q14o48m78L69O4l03O03M26
2597b41m58k58L35J20K41L60K35m20N78L9l80M30N02l0j75L61p1j34N07K21m17
2618A345N22K37o03j91M27k26MN38j17p23j15l68j04K53K66o59m35N25q63k20
2638e07L38J38p06Q7L4r80j44N26k80k42M32K0q41L41jn65J017J18j86n7J62n49
2660a845L63P70N15m90L09L00m02L70N71k28J41R24m03n61L89N19K5Q6J63m23
2680A093k76M57k49l11O54N0q53K08k14m67J64O29o71j74Ml28p74N65J84k19Q6
2701d42K7p84J39K86j77k83Q48M6q94O12j60j82L85Q69j60m53M51l45j65J149
$$ y = [-790, -77, 342, -182, 150, 481, -181, -52, 548, -114, 84, 949, 446, 45, 230, 374, -529, 305, 650, 49, -54, 5, -350, -689, -348, -119, -863, -529, -415, -933, -833, -600, -1123, -1088, -274, -922, -1400, -1031, -967, -1270, -667, -241, -699, -957, -622, -502, -261, 99, 334, -86, 492, 531, 151, 581, 1083, 1053, 878, 1239, 1168, 1034, 1541, 1762, 1345, 1867, 2104, 1501, 1310, 1737, 1511, 1515, 2053, 1936, 1213, 1098, 730, 626, 879, 1145, 486, 51, 576, -287, -507, -169, -31, -737, -650, -616, -1596, -1740, -1214, -1494, -1736, -1304, -1284, -2125, -1784, -1785, -2350, -1333, -1215, -1401, -1458, -1296, -1845, -1482, -712, -197, -687, -378, -78, -480, -110, 461, 233, 374, 1298, 895, 334, 723, 1242, 1267, 1353, 1516, 1093, 817, 1274, 1025, 714, 1368, 1418, 565, 773, 559, 92, 256, 885, 214, 40, 44, -284, -1058, -493, -309, -528, -442, -415, -1199, -1060, -774, -951, -1234, -386, -340, -1234, -622, -782, -964, -579, 290, 130, -323, 128, -217, -382, 767]
2721G67L93n07Q0N85l41l5K56N1M5M15k89k58K70K08k98o3J76m86l55L20m3n34
2743C57K51J48l84j89M9r60k80N48m99j87J86k58q49L22j98k77N08K60o27J06
2763a973k4p0l62R07J07o94N98J85L9L42L38L1K7P73j29q3J56M96P0N81M36k35
2785A516j45M17J12m87O75j99j69M74J52n84p7L36m92K0K45m75r68Q81l86n03
2805C43L40n2o75k4j69l03o05M82M7p32K74K35o39j08K73P8m62M74K7p21O12M16
2827h89k60L11N52p95k2O16l10K8R48K37q31O85M3k68K75P15l92K68rj09l66J26
2849E53K96j72M69j4p32j95L80l03j94P54k76j207N49q5l32J38M47m66o84N40
2869e34j73n39O68l0k33K94J66o99qJ103m81k12N29ml36N53K50L1Q6O98l01k30
$$ y = [767, 1160, 653, 733, 1318, 977, 942, 1198, 1249, 1294, 1709, 1420, 1162, 1432, 1640, 1342, 1279, 1455, 969, 614, 934, 891, 357, 608, 756, 372, 183, 232, -728, -1008, -460, -959, -1146, -960, -1218, -2067, -1745, -1943, -2220, -1712, -1452, -2079, -1973, -1997, -2067, -2429, -1522, -1415, -2109, -1511, -1326, -1287, -945, -607, -576, -549, 224, 95, 12, 168, 664, 734, 1315, 1751, 1516, 1371, 1788, 1900, 1413, 2088, 1889, 1720, 2194, 2346, 1762, 1685, 2021, 1529, 1549, 1794, 1319, 351, 1232, 846, 343, 683, 631, -44, -68, -237, -540, -1145, -663, -616, -1348, -1074, -839, -1478, -1586, -1313, -1235, -1697, -1223, -1196, -1917, -1305, -889, -1149, -838, -286, -1081, -1103, -487, -797, -769, 179, 416, -415, 270, 313, 45, 320, 1035, 643, 911, 902, 793, 427, 553, 849, 677, 1146, 1132, 400, 205, 585, 282, 88, 842, 566, -641, -92, -177, -509, -371, 76, -390, -1074, -534, -707, -1246, -578, -608, -841, -547, -381, -1080, -1088, 15, -466, -678, -149, -153, -489, 64, 314, 345, 431, 1129, 828, 598]
2891E98O40k98r4Q45j31m50L14J42l34M8M84m87l65M76l15l80J64K88r30K33L21
2912G69q83j30J22n74l52M97l39m88pK11o72K3L62m53l60O09m04m19O46L19l73
2933a896L06K95m73K37M14n9J2O60J19m87L97P67q4M2N10J79q6O63n62P6P17M45
2955B192q02K48M60r78M26M87m30OL09l28p69M97k28QQ3l4m88n52M39n76k38M85
2977B17J30q71Rj57j27k18N00m05l6O34n75q99P83M36n14K57J93l20L7N96m49
2998g79L56Q28j60o65M46K97k45M96K10j72l71K86m8l51P56J18o11J33L39q03
3018F0j30M46N8o44P42r44l88P1J19n75M54L68p49n17M46l04k90N89L35p52r4
3039a699M71n95M31Q64k71JK47l8m60N61N16k16L17R04n68J20M95ml2Q88L15q17
$$ y = [598, 1238, 940, 846, 1691, 1560, 1110, 1424, 1566, 1232, 1280, 1764, 1277, 912, 1388, 1073, 693, 857, 1145, 215, 448, 769, -114, -244, -122, -696, -1048, -551, -890, -1378, -1385, -1174, -1846, -1823, -1461, -1914, -2274, -1665, -2069, -2488, -1842, -1523, -1896, -1590, -1295, -1768, -1531, -1117, -1176, -1164, -504, -385, -872, -475, 292, 208, 250, 760, 939, 853, 1516, 954, 1030, 1747, 2192, 1390, 1638, 2098, 1120, 1546, 2033, 1603, 1609, 1918, 1590, 821, 1318, 1090, 1098, 1181, 1147, 659, 107, 546, -30, -268, 217, 347, -524, -515, -672, -799, -1017, -517, -922, -958, -324, -899, -1798, -1015, -579, -1093, -836, -643, -963, -926, -330, -779, -423, 405, 245, -420, 26, 323, 78, 574, 784, 612, 241, 527, 479, 128, 884, 1002, 391, 524, 863, 60, -70, 376, 434, -210, 532, -412, -800, -729, -610, -1185, -731, -363, -1112, -1629, -1183, -1487, -1777, -1188, -853, -1605, -1699, -1228, -1823, -1392, -528, -799, -798, -551, -589, -1049, -488, 28, -188, 129, 1033, 465, 585, 1080, 1076, 1044, 1932, 2247, 1430]
3061A430M05P02o30m8P48k55n89O08oo09O10J1q36q7P24j155l84N64p40n44N41
3082D60r7j012K19J92q36l17O29m98r74O20k22l65J18N53q52m6O90o48o7R52k53
3103a754l91N05L18k54O26L48n19L80J016l27p8O35n7l67Q44M16j036R77O90k93
3123A679l62L58j52k96K86O97p98M24m9q58L8O20o50j12K01k65q19J69l8n59O
3144d80L0m59j46N36r28l35N08K66n72K46pp52M78N04k32J38L82n4m02N58L85
3165c36j93L49O68o77K0P57R5k65R14O1r32R51J43n09O9J004o66J60J25m30r3
3186A215L22J61p51N15K1r53r2P07p31k51K40k09q77K95M8n59M54k50m92m9N13
3207g23r41p7N80r2k05L7J1o66N35M09m6l71Q60Pm51M36M13l44P03M00o72J77
$$ y = [1430, 1835, 2537, 1907, 1859, 2607, 2352, 1763, 2371, 2365, 1756, 2366, 2377, 1541, 1454, 2178, 1023, 639, 1203, 463, -81, 460, 363, -649, -430, -238, -1074, -1391, -762, -1260, -2234, -1614, -1836, -2201, -2083, -1530, -2382, -2428, -1738, -2386, -2453, -1501, -1754, -2145, -1640, -1322, -1576, -950, -602, -1121, -741, 275, -52, -130, 505, 448, 81, 925, 1341, 305, 1282, 1972, 1679, 1317, 1675, 1523, 1227, 1513, 2210, 1412, 1836, 1787, 929, 967, 1587, 937, 825, 1026, 761, -58, 111, 73, -486, -480, -450, -909, -1055, -519, -1447, -1782, -1274, -1008, -1580, -1334, -1341, -2093, -1615, -1111, -1343, -1205, -823, -877, -1279, -721, -336, -529, -180, 488, -189, -169, 588, 683, 418, 1332, 1393, 461, 1412, 1555, 1046, 1115, 2119, 1453, 1613, 1738, 1308, 1215, 1537, 1698, 947, 1462, 1483, 530, 438, 1145, 414, 163, 403, 194, -683, -388, -340, -899, -445, -695, -1187, -1236, -723, -1664, -1741, -1161, -1253, -1458, -1421, -1410, -2076, -1541, -1132, -1178, -1549, -689, -682, -1133, -697, -284, -628, 75, 475, -197, -20]
3229b0O91m33K76M02L90n94N32J04m68K85L34r0o51P40n4n48J26K5l72J08J9o99
3251A03J6M04o49k62P56p78k90k8L18q66J42P80r57j59O45k66l78K82K79m19L21
3272a006K47o07K07O65l99L4J018o71l6O57k6m03O91L47n36O5O74k96j72O55L65
3293A473o93M17J43k81m3O81n29l04O31o80m07N80J97o05j02L31p06q8O18o35
3313bl36N89j13p65K98L8o69L86L24o11l62N45o85j58J014j95m43M41j92m02K06
3334a092J091m34m11R28m38p25M62N87m34L15Q72p90k35N33K46m70L42N31q02
3353G6K86K02p57L4P84l26m63N05k44k62M76jp98L24L20m75n4L13m7n66J134l43
3375A18o19L34J83l61J83N55k14m27P59k33l78M97N76p98J57M13q70K06J027l96
$$ y = [-20, 671, 238, 514, 916, 1306, 712, 1244, 1348, 880, 1165, 1499, 1409, 758, 1498, 1444, 896, 1022, 1047, 675, 783, 802, 103, 119, 523, -126, -388, 368, -410, -700, -728, -410, -1276, -1134, -354, -1311, -1470, -825, -1091, -1469, -1187, -908, -1327, -1006, -759, -1366, -1159, -494, -893, -859, 159, -512, -548, 109, 83, -320, 371, 718, 182, 247, 921, 625, 453, 1108, 1473, 780, 1197, 1340, 1059, 1016, 1697, 1168, 864, 1495, 815, 408, 988, 1185, 580, 478, 809, 103, 15, 633, -2, -338, 251, 138, -627, -329, -291, -960, -574, -250, -861, -1223, -678, -1363, -1521, -507, -702, -1145, -704, -896, -1298, -1092, -1, -435, -846, 82, -356, -1081, -619, -32, -466, -151, 721, -69, -304, 229, 475, 5, 347, 878, 76, 362, 564, -193, -159, 625, 299, -164, 341, 97, -165, 311, 310, -488, -164, 156, -319, -373, -60, -107, -673, 461, 118, -501, -167, 16, -345, -162, 393, 179, -248, 511, 278, -100, 397, 973, 175, 332, 745, -125, 81, 1108, 712]
3395G12j45K45J43o67N96j64j86J02J07k44m29N55l23l70N37K32p52l41K86j84
3415b90oL15n32k92O92k02q64K50M11p44J28N49n37k19O69n55j23P91l37q3M18
3436e61J86m11K37O77n09j35O56L59q50N71M13l25K12M81l33J02M86k0n74P72
3456A434no64L90L10m71p0M87m01m09P58n71l12M4j8o28J64K18k83j55J53m12
3477d41l18K92k31m41L05o6n50K06K18n0m62M28j55m63N96J17m18M59O39p32K67
3498h00N43m68J85N80J8k03L63L94o89K80O05k26l17P15j11r4K83j25k92M22K58
3519A321k88n26Q61n22o33O94k20m67M94l11m18K33N92n54l52K67m35n24N03K25
3539f0q97N93P4p40J60K69p5j12M41k33l09J90K37n09L43P97k28l31K91n7k8L72
$$ y = [712, 567, 812, 955, 288, 884, 720, 534, 636, 743, 499, 70, 625, 302, -68, 469, 701, -51, -392, -106, -290, -296, 19, -513, -805, -113, -315, -1179, -929, -518, -1262, -1134, -585, -1122, -1341, -672, -1227, -1350, -559, -896, -979, -561, -375, -786, -549, 128, -381, -516, 140, 499, -351, 220, 633, 308, 520, 1001, 668, 770, 1256, 1236, 662, 1434, 1429, 765, 1155, 1465, 994, 924, 1411, 1010, 601, 1359, 788, 476, 520, 502, -126, 38, 256, -27, -182, -29, -441, -759, -467, -698, -1139, -834, -900, -1450, -1244, -1026, -1076, -1538, -1110, -1265, -1728, -1132, -1015, -1433, -974, -335, -1067, -800, -257, -725, -540, 40, 58, -145, 218, 612, -77, 203, 808, 582, 265, 980, 869, 775, 1058, 933, 641, 1063, 1321, 1033, 507, 1368, 846, 213, 907, 687, 220, 714, 403, -15, 218, 810, 256, -96, 171, -264, -788, -285, -60, -957, -364, -290, -1030, -870, -601, -676, -788, -347, -580, -889, -699, -462, -971, -628, 169, -59, -390, -99, -156, -184, 188]
3561A88J09k71K43K54n18K33L96l35k78O22p3o10N62j43l46M24m5l00j66L42m51
3582a63j35J21j55l21L90j01m89K27K43k33m47N67l69k95M01j01l19O70M1n62
3602a030K60J36n7k46M93K20n52P16l7l08L37P54o82J79N82k45r3L24L15n29Q29
3623A366j8m75K04L87j63j08N71k61r21N83K88l65J55Kl87l79P31n51m19K84m77
3644D7JN2l3o51J82L73m43m64r0M89o60M48k4m50K72Q9n59N5L38m52L5L05O09
3667e31o25J07M08m95J89O01l17j95O45l9n92N77J27k79N94K6l77J80L56q1r8
3688A81L08j39k13L50J13o34O95M84m74k47M34m75o0O48k94k89K30oq03L79L92
3709E80k11o1L77J32n42J81N70n66J20R0l12m07R36m56m03M35K69n33J6M89r61
$$ y = [188, 297, 26, 269, 523, 5, 238, 634, 299, 21, 643, 570, -40, 522, 379, 33, 457, 412, 112, -54, 288, -163, -298, -177, -332, -653, -263, -364, -853, -626, -383, -616, -1063, -496, -865, -1160, -759, -860, -1179, -509, -468, -1030, -770, -634, -691, -937, -444, -224, -776, -60, -97, -405, -68, 686, 4, 183, 765, 520, 427, 751, 1066, 537, 1366, 1348, 873, 1077, 1464, 1301, 1193, 1764, 1503, 582, 1165, 1453, 1088, 1243, 1245, 858, 479, 1210, 659, 240, 524, 47, 48, 100, 67, -584, -402, -29, -472, -936, -1026, -537, -1197, -749, -773, -1223, -951, -862, -1421, -1366, -1028, -1480, -1445, -1140, -531, -1156, -1049, -641, -1136, -947, -346, -663, -858, -213, -252, -844, -267, -140, -419, 175, 201, -176, 4, 360, 279, 181, 489, 350, 137, 487, 600, -34, 661, 1145, 671, 424, 858, 383, 323, 971, 677, 388, 618, 612, -191, 188, 580, 369, 308, 685, 817, 275, 456, 1026, 460, 580, 670, 358, -49, 887, 431, 28, 463, 732, 199, 215, 704, -257]
3730b57M47N21q46j19M34j96l88P88k52m03O1M09o58k57N93m75l6L27k14j85K17
3751d89j68m38K28P22n72k60O67l97n64P50ln57K21Q99n30j23J55R7Q4M91k97
3772h4k02J07N56k25J72M24n12K25K05j8n74O84o9n08O24R6m09K63L17l59j92
3793E21N75m10l50J70p8o15O26L56o84l29N22j70m77L45j43p67M52N7k36l42P08
3814b69m16l36N02k1p60O28J91m67J85M10l02K3L26J58k19L33J14k40L07K04j40
3835B11m9M65l45j61P99k68k51M93j68K9j41M81o96q6L60k44QJ59Q4n02L18J13
3857F09o44k04L26j71k67K97p0n67J64N9o57M50K67m85J65P0l58p1L32L8k52L88
3879e81J81m53K05R3Q9Q9J31J71k62N24P5j67L92L64l63j54O64j29l74P34m58
$$ y = [-257, 190, 711, -135, -254, 180, -16, -404, 384, 132, -271, -210, 199, -459, -716, -123, -598, -634, -307, -521, -706, -489, -657, -1095, -867, -145, -717, -977, -310, -707, -1271, -521, -524, -1081, -860, 39, -491, -614, -459, -362, -278, 213, -84, -286, -179, 377, 152, 324, 748, 236, 461, 666, 648, 74, 758, 689, 181, 805, 901, 492, 755, 1072, 713, 521, 1096, 686, 336, 506, 428, -187, 439, 795, 111, -218, 304, 134, -343, 2, -141, -908, -456, -399, -635, -977, -269, -685, -1021, -519, -540, -1300, -672, -481, -948, -763, -353, -655, -632, -306, -148, -367, -34, 80, -160, 147, 351, 211, 162, 627, 282, 121, 920, 652, 401, 894, 726, 755, 614, 1095, 399, 313, 673, 429, 437, 596, 680, 178, 496, 609, -35, -239, 87, -84, -351, -54, -124, -691, -527, -468, -1125, -675, -408, -893, -728, -658, -1016, -1087, -755, -717, -969, -581, -400, -853, -648, -555, -466, -377, -246, -75, -337, 187, 262, 95, 487, 851, 488, 334, 998, 869, 495, 1229, 771]
3900G71n3J87M01r10J68M62k26m15O09l80n02M38M7n99K31K06o93l32M18l45l33
3921h50M31k64n70O26j93n03K91J39n50rN39l60M8P46m48l73N91K69j22p2J92
3942d42j2R8L33pK08J93J69j24L50L12k67K58O77n08k51O05R3n67K28N30q89J30
3964A117M96l04m11O75o72l98L42j72o83J65L39q16j07L83n58l55P82m30n48l2
3984a187K4m83K02O29p05p5M56l09l41N80N17q67L28J10m7Q2P56n91O8M51J29
4005b73j68L95J34p7K69K84j28J69L89l14rK49l3k59R1M41k36k16O77n19o52J137
4027A351n31l82J75K42m80K27J81q64k79P41l87n18K58J59k48k52L06n42P2N61
4047b10m59k45M22l09j28L67k5l79R12j91m87J87K91J05j42P83k17m82K63N36
$$ y = [771, 718, 905, 1306, 396, 564, 1026, 800, 385, 994, 614, 112, 550, 597, -2, 229, 435, -258, -590, -172, -517, -850, -419, -683, -1253, -627, -820, -1323, -1032, -893, -1443, -1452, -913, -1273, -1225, -479, -927, -1300, -709, -440, -562, -634, -442, -454, -356, -23, -30, 178, 371, 540, 416, 766, 1078, 811, 1069, 1746, 1238, 987, 1592, 1685, 1118, 1346, 1876, 987, 1117, 1613, 1309, 898, 1573, 901, 503, 845, 673, -10, 155, 494, -322, -429, -46, -604, -959, -177, -607, -1155, -1187, -1163, -1646, -1444, -815, -1520, -1595, -1139, -1448, -1789, -1209, -692, -1559, -1231, -1121, -1168, -1086, -330, -921, -853, -402, -273, -441, -46, 88, 11, 280, 564, 436, 605, 994, 680, 671, 920, 887, 628, 719, 1160, 924, 708, 1385, 866, 214, 1351, 820, 438, 613, 855, 375, 602, 783, -81, -360, 381, -6, -524, -266, -107, -355, -607, -301, -843, -771, -210, -669, -914, -492, -801, -929, -562, -587, -966, -54, -245, -732, -545, -254, -149, -291, 492, 275, -207, 56, 592]
4067E92n13L29K01o3l57O83l48r8K22k14J41k24L22o19K0N65n25n1L61pp70L76
4089B3J96k47k94L40k52o24P75m42l91N04R8o44M02L09q39N71J56l05L21J19j31
4110c55k29J15M45k50M05L30m10j1L76Kj91L22j62j38L87o1j47k36O66l67O3J49
4132G03j02m74J73L39n91N72l49o03J57M43l90j15J51nn69O04l99N1n8j78k53
4153h93J52K21l52O1M74Q8l61j75P78m31l02N93m82K90K75J4l60N74J90n66K50
4174C8Q57p24j30O30m47N7M11J81l37M91k0o45J89J14q8l84P06k09p30N37K47
4195G44n84j13L77p50K71M39m44k51K21k4m24J14K73n93L56L18n45RL18m28m81
4216a197O66J07k89M85N9n30K46K41O4l95P3O02m38L20M46m87J12K01l45L4L17
$$ y = [592, 79, 408, 609, 546, 189, 872, 524, 426, 648, 434, 575, 351, 673, 54, 74, 639, 114, 63, 424, 417, -353, 23, 219, -28, -322, 18, -234, -858, -83, -525, -916, -412, -314, -958, -556, -247, -1086, -515, -359, -664, -343, -224, -355, -584, -469, -24, -274, 131, 461, 51, 40, 416, 418, 227, 549, 387, 249, 636, 575, 428, 192, 858, 491, 554, 703, 601, 127, 300, 639, 48, 620, 271, -332, -175, 268, -122, -237, -86, -91, -660, -56, -455, -404, -462, -640, -893, -741, -520, -872, -811, -337, -249, -610, -785, -7, -438, -740, -147, -629, -339, -64, -50, -410, 164, 354, -212, 38, 895, 171, 41, 671, 224, 281, 692, 873, 536, 1027, 1007, 362, 551, 665, 577, 193, 899, 690, -40, 497, 744, 160, 47, 424, -326, -55, 384, -60, -311, -90, -114, -538, -424, -151, -744, -388, -70, -615, -606, -288, -716, -1197, -531, -424, -713, -228, -169, -699, -453, -212, -148, -543, -470, 132, -306, 14, 460, -27, 85, 286, -59, -25, 292]
4237B92J75n68L04L59n99J52L44l51j18L74l05Q9K16j93m65L22L09p16K41L9k0
4258a19k50L12l52k8J28K57l26J7L67j62l51N04J94n91M84j12j86J21J64k02K25
4279I4J54l5J12L73j63k65L37K16m10L24R9k91K51Om91o2M54K43m78J29L81q03
4301A75K58P4j39j93K05j31n15K19P6n21L65j73k76k79N36n44m02P90l03l41L31
4322g88j09l08L65J10m68L52N16m08j30K27K19k78N1M79k08L92K08m8k74O12k81
4343B31R9J07R7l18L09N59n91J81L20k02k73M75j19j16N5J52o51N55K43n53l09
4364B51O57m45j90K55k55k67M3M59p07R4K12m95l17M41k56k74L52J91k29r9K35
4385c44m39j67M91M0k21K31P0q0n4K71l07M07J80k90j36K25J70j42K09J03K1l91
$$ y = [292, 467, -101, 203, 562, -37, 115, 459, 108, -10, 364, 59, 148, 364, 171, -294, 28, 337, -379, -138, -99, -119, -369, -57, -409, -437, -309, -52, -378, -361, 6, -156, -507, -3, 191, -400, 84, -28, -214, -93, 71, -131, 94, 248, 213, 325, 698, 535, 270, 607, 823, 413, 737, 836, 545, 796, 802, 311, 249, 703, 946, 468, 597, 978, 175, 433, 507, 368, 175, 380, 249, -266, -47, 29, -492, -127, -300, -576, -855, -319, -863, -1265, -475, -778, -1119, -788, -897, -1205, -840, -730, -1198, -846, -330, -738, -868, -641, -422, -700, -649, -170, -378, 14, 222, 174, -100, 512, 231, 330, 437, 534, 216, 525, 1084, 493, 674, 994, 792, 519, 994, 875, 759, 814, 966, 315, 870, 1113, 560, 251, 908, 463, 273, 528, 273, 6, 49, 508, -199, -105, 107, -388, -705, -264, -520, -794, -442, -251, -480, -579, -344, -783, -950, -459, -419, -640, -409, -339, -419, -473, -202, -509, -102, 78, -212, -348, -123, 47, -95, 114, 217, 238, -153]
4407a53O56n04L9M02k36j00L30r5n65M94L0O2l52N62l13l28L91l25l58K46N09
4428C92p00K64O7p7j98J98k04K12P1k6m47M13L1m04J48L68j58l71M77j6n61O84
4450A63M2j02j43J38j14Q4L51l27k93N49j49k46J74L12m36l6P07o53k49P24k95
4471B01m60M37k35m10M36K58l96k70L98k89J06K28J13m84M02n4m39M45j16p5l
4492b07O9n4k65N98J07n45K80J80m99J19O00m35k88P61l73l53O30r9n60M58N7
4513A81l44k2N00j21k99M74j83l59L27O8n34N10K29m21j39M32j60l97K75K03n34
4534c14K15J20k24K32P2r2j78L79J06m45K96L22p76K86K40o52M3N67k69k15L36
4555D9J48n79N78q0l64J52J78l63K5M26J07m01O00n09j68L89m4l52J06J84j83
$$ y = [-153, 503, -1, 38, 440, 204, 104, 434, 339, -226, 268, 298, 360, 8, 570, 257, -71, 320, -5, -363, -117, 392, -308, -44, 23, -54, -252, -54, -258, -46, 25, -1, -448, -35, -4, -408, -260, 108, -50, -421, 56, 40, -521, 163, 205, 103, -40, 98, -16, 68, 419, 92, -201, 348, 199, -47, 127, 439, 3, -33, 674, 21, -228, 496, 201, -259, 178, -57, -467, -31, 227, -169, -439, -41, -330, -224, 4, 117, -367, 35, -19, -458, -13, -129, -204, -207, -138, -192, -457, 141, 248, -297, -17, 163, -336, -217, 383, -52, -340, 421, 48, -305, 325, 226, -334, 124, 181, -163, -185, 315, 194, -105, 369, 186, -173, 154, 222, -312, 198, 427, 6, -133, 299, 139, -258, 17, 220, -314, -99, 21, -203, 29, 101, 9, -169, 210, 316, -129, 167, 489, -287, -1, 239, -413, -370, 197, -72, -287, 49, 197, -382, 196, 116, -248, -96, 82, -281, -256, 170, 277, -124, 476, -33, -201, 188, 144, -208, -102, 82, -101]
4576a01k12M45M84o74J31M5k91J3J23K64o95M39j52p1K68n3m7pJ88l3j36L68l19
4599b3k84R3O59q39N86K85m82j31L57p2J74J99j63o49N48K26n94N07p7l67K18
4620A71K37J36n33L84K2n52K60m4k35j7N90k92r6K01J58o13N84k01o30M92j65
4641a43mj7J75k70k88M07l26j28K73K09L5l02J87k45n4K97k34K50n6n7J00J98
4663GN9k50J07K01k63r2K10J65k24J84L15m31J01J66o1k46M60p2k95M60n7m86
4685d2L82R3k58j11J49M20m37O4k7j16o2J26m28K28Lj00O1K56o51O5L97k55j35
4708c78K04K41m00K70K75m73o8M56k27j2j34L31l80M53m6k85k01M28J40n74N47
4729A67k14l34J51M68j72k49N34r1m85N9L00k61J25K92n40K45K89n67N07k22K5
$$ y = [-101, -313, 132, 616, -58, 73, 118, -173, -160, -37, 227, -468, -29, -181, -252, 16, -37, -84, -91, 97, 64, -72, 296, -23, -307, -214, 445, -394, 192, 477, -5, -136, 221, 149, 323, 522, 359, -290, 258, 484, -110, 397, 320, -47, 171, 408, 544, 11, 395, 417, -135, 125, 81, -154, -171, 419, 127, 31, 232, 390, -223, 361, 160, -470, 22, -143, -147, -164, 11, -259, -547, -140, -466, -594, -321, -112, -77, -379, -192, -437, -491, -194, -428, -178, -234, -291, -191, 7, 66, -184, -77, 124, -139, -231, -21, 144, -80, 104, 419, -12, 89, 255, 194, -52, 408, 336, 41, 501, 444, -42, 340, 433, 175, 64, 213, 633, 196, 260, 233, 117, 55, 181, -247, -19, -16, -116, -55, 201, -450, -385, 12, -243, -378, -174, 67, -333, -63, 212, -261, -329, 127, -100, -112, -246, 85, -295, 158, 112, -173, -374, 54, 194, -380, 167, -47, -381, -230, 238, 66, -183, 351, 260, -225, -166, 134, -127, -2, 290, -250, -5, 284, -283, 224, 2, 27]
4750B7l14O57j57k01O7P6l54k5M50l80j0K56q6k96N02k63j40k7M02l71O0K93k71
4773a05j43L95p6k97O83m2o21M02J01Kj82K46l2l17J51R2l48M13k8n48K59L92
4795C97l78k30O68m46q9L52k03j25P0K14k97k94K00L05l49L20j65k30j32P55q13
4816d70o4O42l95k49M24J19l88M91p4j64J03p1k23k54N13J68l11L38n5n12O63
4837B31j01mj49M88k13l93N03j02k34M09q4l45P26l03m12J83J03k2j72J51O2n74
4859b52L86K07m02Q1J17n24K28N61k41n49N08j79p26N09L03l59J02M66o91P6M92
4880A13m28l20N71J39j62k81O32m44j70N45k26l40M94k0n62M40K11K3l52K67j3
4901A17pK52k9m48K60O06o42O3J88l44M0L65m51j58K50J40n11L87P4l12m0M99
$$ y = [27, -287, 370, 213, 12, 79, 155, -199, -224, 226, -154, -164, 92, 6, -290, 212, -51, -191, -218, 184, -187, -127, 166, -105, -248, 147, 71, -226, 457, 415, -206, 196, 297, 299, 117, 363, 331, 14, 165, 257, -91, 322, 294, -254, 5, 397, 19, -211, 457, 11, -78, 274, 71, -54, 16, 230, -67, -361, -161, 144, -205, 115, -50, -280, -412, 343, -470, -534, 108, -287, -536, -112, 7, -381, 110, 36, -128, -25, -96, -319, -573, -60, 108, -203, 135, 80, -432, 231, 130, 126, -23, 465, 252, -141, 362, 260, 26, 435, 351, 6, 732, 429, 17, 200, 303, 281, 109, 260, 322, -252, 134, 341, -61, 20, 137, -387, -159, 402, 161, -388, 120, -59, -785, -276, 27, -332, -230, 236, -455, -379, 113, -315, -635, -64, 75, -87, -368, 264, -180, -350, 195, -31, -371, 123, 103, -459, -19, 192, 215, -137, 130, 117, 110, 362, 333, -115, 145, 751, 109, 172, 360, 16, 56, 421, -30, -188, 62, 202, -309, 78, 152, -160, -200, 299]
4923B99m87mJ86k91j60M46j51l96M12K0m27J16M86l60n0K35L71l74l2K63j84k11
4945b93N48m91J37L30j10m14M02L40n63J64L18j35j32O00l66j61Q6Q0k95N02J48
4966F95o94M77j65j76l4K53m36j8L44j8m11l0K59m76L23K22k75l30K15J67n55
4987f63L96p2l73K76O4k09Q3J81L20j88j91K94j36K04J53m42L35J00J19k27P8
5008A02j38K1L55J84m46J73K61k36l31O18k24l69O83l66nL52k32k22K09J36k60
5029B65k97K45km03N85l8o55L3O31p44P3L29k97j60Q7J04k42m7L60n58k6O59m69
5052e67J93L89m10j98M76J9l39L79L16o06L41q1M9NL20k6j68k1M90l98K06M7k14
5075B02K46l9j07o9M25k8n57N23l13P8p9L86m63j88Q5Pl61M32M1o50M94j27n69
$$ y = [299, -188, -192, -6, -297, -457, -11, -162, -558, -146, -126, -553, -437, 49, -311, -361, -126, 245, -129, -161, 102, -82, -293, 255, -236, -99, 231, 121, -293, 109, 449, -114, 50, 368, 233, 101, 701, 335, 174, 260, 340, 45, 547, 695, 1, 478, 313, 137, 103, 356, -80, -98, 246, 228, -183, -213, 46, -430, -107, 115, -160, -490, -275, -108, -663, -267, -339, -712, -436, -372, -581, -498, -317, 3, -185, -376, -82, -218, -14, 139, -303, 32, 132, 251, 24, 102, -36, -15, 340, 524, 78, 251, 512, 276, -55, 563, 339, -30, 653, 287, 282, 634, 402, 180, 389, 525, 265, -32, 213, 211, -192, 393, 355, -300, -267, 364, -380, -307, 22, -275, -435, -348, -244, -486, -533, -173, -731, -757, -98, -567, -374, 15, -395, -593, -117, -98, -437, -58, 258, -348, -7, -88, -39, -34, 286, 260, 92, 71, 561, 163, 369, 416, 202, 448, 409, 302, 233, 658, 630, 73, 596, 283, 361, 282, 668, 205, 17, 102, 109, -252, 180, 221, -429, 65, -62, -631]
5098f31L3N04k60l12O97l75k99K01k2qO3J94q5k22M49l62j97O02o8l60K5M23j17
5121a27J3M23k08J8L24k78o05P93L06k32j96L85n00J85L73l95M7p5K96p01K26
5142G2K78k36j48K81k67k43O32r3p11J57L91k48j4J17k77k17K71R4m16M73O7o49
5164f86M72o8K40m01M69k58j45N85j37k77J31K50l24J0L66l23L1O09k10l41N07
5185E00j32o67N54L94m67L29N27q04j35K59j07k57K82L9l49N0L24m80J67L84q12
5206d01j32O15k52m21M40m0m2l03O72n82j01M54l04L5N48k57m00J14N06n64K06
5227b09L91o16P0L19o1n9M4L61n01K35J88N1l67L41K48m05O98k75m10K02K86j93
5249C38l02N86l01l38M34J42o38J45P0m90L29J95j34R5k84L44n13K21L72n19k50
$$ y = [-631, -598, -94, -354, -666, 31, -344, -643, -442, -464, -472, -409, -215, -300, -522, -73, -435, -632, -30, -98, -458, -433, -10, -127, -114, 309, 101, 119, 443, 165, -440, 353, 659, 427, 231, 616, 116, 301, 674, 279, 326, 251, 547, -154, 72, 350, 114, -34, 247, -20, -263, 369, 276, -435, -278, 113, -135, -149, -32, -309, -526, -255, -161, -577, -104, -37, -686, -214, -282, -42, -443, 26, -232, -377, 208, 71, -206, -75, 175, -149, -139, 227, -96, -65, 544, 334, -7, 500, 368, -299, 255, 649, 182, 511, 1038, 234, 99, 358, 251, -6, 276, 315, -34, 16, 340, -140, 27, 411, -401, -533, 82, -170, -591, -151, -191, -233, -536, 136, -446, -547, -93, -397, -362, 186, -71, -471, -357, 149, -415, -209, 182, -434, -364, -45, -106, -165, -121, 240, -261, -26, 162, 213, -154, 187, 435, 30, 728, 453, 43, 245, 531, 338, 36, 622, 321, -17, 417, 559, -79, 66, 136, -354, -25, 170, 36, 131, -153, 191, -322, -101, 271, -248, -498]
5270d98M45o04J05M91k00j34L28r3m39J69P06q83O49K20k10j54N02l42l03L41
5290I6N83p48LN40o78K22M19m35J39O55n52k24J47Q3m31L20J39k90K7J63J63o37
5312b96M53j96j59L25J20p29K48J95l50J34M21n61P0N18n83o6M53o6k99k50Q01
5333A83m06j97N96m86O6P8J07k68Q8M07q9j29K07k32k9L18k1l25K09M53n30Q6
5355H6K56k43q2L43j4k90M27L77j071K43K55l39L0M32k16j91N00k97l22N6J29
5376F9n49J70M76m70O0M1r4J28l5J88n28M61J3k57r3L85j61j82L82j78Pm0M13
5399B06j156N21P01l64O5L57k96j68L65J62n53L81M07o44k05N26pm45P27j45n39
5420a04N15n2m86R6O90q39J35L55k17l29N48m1l25J53Q6k86k97O74n10l50O95
$$ y = [-498, -53, -657, -552, -61, -261, -395, -67, -160, -599, -430, 276, -607, 42, 262, 52, -102, 400, 58, -245, 96, 679, -69, -66, 474, -204, 18, 437, 2, 141, 796, 244, 20, 167, 250, -181, 139, 278, -12, 15, 178, 341, -296, 157, -39, -198, 127, 247, -482, -234, -39, -389, -255, 166, -395, -325, 193, -390, -456, -3, -69, -368, -618, 183, -223, -420, 176, -310, -244, -166, -59, -327, -239, 168, 79, -50, 157, -75, -104, 214, 193, -132, 77, 530, 0, 86, 342, 99, 17, 360, 346, 56, 483, 860, -211, 32, 287, -52, -22, 410, 194, 3, 503, 206, -116, -60, 69, -480, -310, 166, -304, -244, -203, -297, -169, -204, -16, -544, -83, -70, -327, -420, -35, -196, -378, 4, -174, -167, -207, 206, -950, -429, 272, -92, -27, 330, 34, -134, 231, 393, -160, 221, 628, -16, -221, 305, 298, -147, 580, 435, -104, 411, 359, -127, -31, 659, -180, -45, 310, 93, -236, 312, 271, -54, 99, 185, -101, -398, 276, -234, -584, 111]
5441A11q3m18L12J76n96J03N07j54l02O88n82K4K40M7l79O21M5p66M63J16j49
5462B4LM91q25M17j62N51m91k1N70o29k20O04l30j5K48k25J66O0L84n94k40L82
5484A48j59k66K61jj77L05mj81j73N07l34l01O08O5n69M14k99j19O4K77k37k67
5506d38P72n95j9L25j51k87N28j24p39P34R7m3M8L03p32J93P33n46m15O66J6J88
5528E14l0k00j58k18K41R5k72K2K32o1n9R1l96J83O83o52r1K39k64j44L17J76
5550B48m79j30O18n65L01L19o53o4O86k82k82J74J48n35L13L32n82k60R76j99
5570H4o66L70M00n91J89N12o64J09K07j09J06L40k42l08M46o3m26K81J6ro1M08
5592C29l06r3K62j05k14L12K61o21K93K55m79j12L71k28k29J78N08p29L75M61
$$ y = [111, 28, -390, -78, 98, -498, -395, 112, -42, -344, 344, -238, -214, 26, 73, -306, 315, 360, -406, 57, 173, 24, 27, 518, -307, 110, -52, 499, 8, -13, 557, -72, -292, 312, -18, -33, 215, -10, 156, 216, 600, 6, -234, 148, -11, -277, -16, -17, -194, 111, 107, -74, -247, 260, -74, -375, 233, 298, -271, 143, -156, -275, -211, 66, -171, -438, 334, -261, -280, 45, -106, -393, 135, 11, -728, 6, 103, 60, 108, 411, -321, -128, 605, 59, -356, 310, 326, 514, 484, 284, 126, -92, 149, 244, -28, -6, 226, 165, 106, 197, -199, -16, 667, 15, -76, 163, -101, -245, 72, 248, -231, -361, 257, -308, -7, 312, -341, -405, 281, -1, -283, -109, 39, -496, -183, 149, -433, -693, 283, 84, -582, -212, 188, -403, -214, 298, -366, -257, -50, -159, -53, 287, 45, -263, 183, 120, -306, -25, -9, -18, -79, 329, 23, -70, 192, 87, -127, 185, 446, -175, 118, 373, -106, -218, 153, -75, -304, -126, 382, -347, 28, 489]
5612D89p96J78K91k66m22O28N7m70j9M77j41l44N88n75o3L62m5M6J74R2m07j13
5634b79N19l51J81J83l51k0M74J03q80N72J51l97J62M55n88j86L72j61k57K94
5654dJ73k23J9O6N2k35M07n61L1M23j19m09L94Q6m16L48N0l19j07M86k11m36P72
5677B67j36o63O88L44o81J10J14L3n26O01l61P7L63J59k80j4J81n75M3M99p7k52
5699h6o0J01j78P7O75q08K02L06k57j04M15n70J82K5J72j42J3L65m87m0J99Q3
5721H3l12K84Jl46Q4K6k11L00M89n44p3M20k51l85P64j45l36J85P1l08K73n3k15
5744a99J96R4k4k74M19J30n30J44N90r29L69K92j90l50J71J14k53K50ok88L21
5765D7K40m38k17N61k37j51O2J78k06j73K42%k51O01j72l49L36K60n66Q7K86m86
$$ y = [489, -307, -129, 162, -104, -526, 102, 159, -311, -330, 147, 6, -338, 250, -325, -388, -26, -71, -25, 149, 241, -166, -279, 240, -111, 70, 253, -98, -118, 356, 459, -421, 151, 302, -95, 67, 522, -66, -252, 120, -41, -298, -4, 169, -54, -35, 31, 83, -152, 255, -306, -275, 148, 29, -380, 14, 100, -316, 32, 82, -237, -344, 142, -69, -505, 267, 131, -532, 156, 500, -181, -71, 43, 76, -450, 151, -210, -133, 230, 389, 109, 95, 276, -299, -256, 243, 166, -86, -146, -45, -223, -146, 529, -279, -77, 229, -28, -132, 283, -287, -105, -80, 92, -50, -37, 328, -159, -199, 0, 83, -229, 55, 56, -290, -206, -180, -391, -91, 398, -146, -219, 201, -50, -435, 329, 184, -152, 33, 104, -204, 69, 16, -199, -3, 91, 67, -207, 212, 342, -188, -44, 546, -383, -14, 278, 88, -262, -91, 23, -230, 20, 14, -274, 47, 287, -151, -368, 193, -44, -195, -133, 45, -161, -334, -92, -92, -343, 258, 86, -263, 73, 333, -233, -146, 140, -346]
5787c46R7O63o18n2N00l52k68L20P5j26K2K09r2l89P10k76Rj58J94l37L71K61
5809D17n89K48M3N7j40L05j53n63J80N28m44L62j06o3j12K21k78k5K7L35m19L50
5831A81j2p53N85J92o0k88N65m66k86L87J26k14k52N98n53K69J48q9r4J01p1k61
5853b47K63P2j89N6M76n71j01L10J7n59O10j7l56L29k38J10R9K76j94l61K41J52
5875A78l41L11O2n72L61N11q07J42M82l17l04L50J64o19L77J7l16J1N96k90l68
5896c72M67j07k84K59L2m98M47J55r6l2L45l26j09L18k7j21n4L23l78J93K47l48
5918C4k95J044l89l79K19m0k47j41N82p16L09J28K9n05L99j1n1J04K43o23M98
5939A92J7m11k79N80l92J10L9J58j59j89Q33p36J28K50k90J7L96m62r0L71J14
$$ y = [-346, -249, 414, -204, -256, 244, -108, -376, -56, 19, -107, -85, 124, 32, -357, 353, 77, 86, -72, 122, -215, 156, 417, -172, 76, 119, 176, 36, 341, 188, -375, -195, 333, -111, 251, 145, 82, -30, 191, -87, -112, -85, 250, -169, 181, 169, -584, 1, 193, 133, -155, 410, -56, -342, 45, 171, -43, -295, 303, -250, 19, 167, 78, -16, 85, 14, -247, 16, 88, -101, -45, 431, -140, -241, 69, 86, -473, 137, 120, -236, 93, -145, -35, 64, 340, 146, -215, 26, 178, -163, 148, 210, -362, -1, 510, -297, -155, 327, 10, -294, 56, 220, -399, -22, -5, -321, -310, 286, -4, -372, 95, -12, -296, -37, -5, -503, -56, 99, 3, -29, 316, -10, -119, 199, 172, 51, -3, 320, -58, 135, 382, 34, -261, 783, 394, 15, 234, 194, -53, -194, 388, -328, -19, 109, 138, -367, 32, 21, -30, 74, 317, -306, 192, 209, -202, -481, 99, -293, -183, -144, 14, -145, -334, 499, -237, -109, 141, -149, -132, 264, -198, -288, 83, 197]
5960A97r13R44j0m54l7L36k80R0N41n30o6j29O28l09J61J71k45n72N99K96n25
5981a07K39K88n30J77K62m55j42M28J57n08J50J1o8r8K51k64Q2K72l33j03M66
6002A75l20l3K73O3k97J51J5k76J57M87o53l1K57Rk92N93k20l33J29M31k02j26
6024d3N48m30j24J86r8J8J01K24o81K42M32n90N6M44j21l74L81J26n71M57l2k23
6046g2J39Q1k18l32P58l18n07O56J07o34Q2N13n71j4N55O5p07M94k63j72O24k59
6068Gl41K54K66l30K05J02Q1m02M24j63k61j57M44J6j59K37j54k47N17r0l25K78
6090B02P7q6l25J96J37l43L77l75j14K63K21l14J27o0j91K19n0K2o0J94k4l23
6112b30J50J67j24j10M53n25r1M32m8m16L38K5k92L43q7Q7j50K14k35j94K74j42
$$ y = [197, -716, 228, 218, -236, -273, 63, -217, -127, 414, -116, -182, -311, 317, 8, 169, 340, 95, -477, 122, 418, -107, 132, 420, -110, 67, 329, -126, -268, 160, 317, -191, -41, -30, -98, -196, 55, -209, -127, 145, -188, -291, 175, -145, -178, 95, 158, -139, 12, 27, -249, -92, 395, -258, -289, -32, -23, -315, 278, 58, -275, -146, 285, 83, -43, 505, 75, -49, 137, 39, 57, 158, 382, -299, -57, 375, -215, -159, 285, 164, -210, 171, 297, -274, 183, 151, -72, 67, 148, -70, -402, 356, 38, -469, 187, 294, -340, -258, 255, -316, -330, 225, 290, -417, 77, -186, -358, 266, 7, -334, -80, 186, -144, 61, 163, 244, -158, 266, 103, -158, -315, 129, 145, -14, 223, 69, -178, 339, 249, -76, 202, 279, 193, -132, 64, 201, -142, 235, -140, -254, 9, 230, -84, 43, -17, -208, 11, -39, -17, -77, 117, 93, -230, -80, 87, -37, -147, 306, -219, -310, 122, 74, -342, -4, 21, -271, 72, -15, 72, -78, 136, -99, -293, -19, -161]
6134a61l58M65M86q72M57L63o44J87N05m24l37M10r3k41K53L38m76ON49n90l9
6155b16J68J96o35L92N8j91K12K33n50J7N9K42J24k86J98K3O2K8n6n25N76n56
6177d27K81J26J58k70K15qm73K70L68k64j50K17r8m3N13l71n22O32m4k05J37L69
6199D11k86k80M45k06j2j53K98n95M37N7m71M97J03l89L7M65k04n08N91p3k89
6220a25J24J78l89J34L38k73j42K70j67m37O29K74p22L0N96l55oK62j24n76N02
6241B1M65p31PL51j96j73O59l89j43L18n6l03M65N1p16L75L55n46J87M0j75J17
6263a7J75l20QQ3p2R5o7J90j44k28K16q2m92N57O04o39j71L34J8k70L32j93j31
6286b14nL19j03R6K43l96R4L57k66k98N22k0o15K77J84k12J61J08P1l52K01j26
$$ y = [-161, -519, -54, 432, -440, 17, 380, -264, -77, 428, 4, -333, 77, -16, -257, -4, 334, -142, -136, 413, -177, -216, -48, 148, -487, -95, -37, -228, -16, 217, -333, -316, -257, -15, 109, -177, 21, 44, 106, 134, 78, -447, 129, -427, -146, -20, 138, -132, 83, 75, -398, -128, 240, -24, -174, 43, -55, -98, 415, 44, -478, 154, 110, -95, 42, 411, 125, -155, 290, 84, 72, -81, 217, -378, 59, 116, -355, 142, 245, -144, -107, 358, 154, -354, 237, 164, -125, -1, 177, -212, -78, 260, -13, -155, 115, -52, -489, 140, 414, -308, -278, 318, -37, -43, 219, 95, -481, 21, 486, -245, -238, 113, -83, -256, 403, 14, -129, 189, 133, -170, 295, 346, -370, 5, 360, -186, 1, 41, -134, -17, 158, -162, -154, -71, -143, -48, -115, 75, -69, -297, -81, -163, -655, -98, 506, -133, -304, 30, 48, -222, 110, -83, -214, -219, 100, -3, 93, 336, -60, 34, 391, 125, -173, 349, 329, -286, -9, 175, -37, 124, 232, 303, -49, 152, 26]
6308B6j8J18K32m42q8N08l84L43q8j46r2J96j36l04N05K00n43J84J41l16K3K16
6330A35l58M6L46j74l46L01L81n48j03L92j89l00N43j45m56N83%r2m1K21l56K08
6352D8L25j37k38J56l26j8K27K85m18J89Lk35j53N80k48j07L26j60k80L39K99
6373D57m66k80N77m67j46L84J80k77N32k42l96j38L90j96k11O55k79n26M46O8
6393F5l07K88o7k24k3N92o41QM62r6j80L26j41l09r0O42n37O9N89l59k60L08J8
6416A33o03M06O55r33K56L37r6j75N61l21k75K35J62m04K12J61m69m4K53K06m23
6437a66K29n8l36M8M33k03P2O2m17r4M56qn20O20j88l25J47L34k76kN41n42R5
6460i8J48j07o7K30j01l83M22J30m06M7N33k39j09J25K51o65K46L10m85M1N05
$$ y = [26, 8, 126, 358, -84, -172, 336, -48, 295, 207, 61, -31, 165, 29, -275, 230, 430, -113, 71, 212, -104, -81, 135, -223, -177, 169, -5, -351, -50, 331, -217, -320, 72, -117, -417, 126, -19, -475, 108, 108, 16, -25, 196, -160, 48, 373, 236, -2, 154, -172, -190, 37, 322, -96, 93, 96, -139, -292, 288, 40, -67, 259, 99, -181, 158, 457, -9, -289, 288, -179, -325, 59, 239, -38, 494, 252, -144, -282, 108, -88, -299, 356, 77, -449, -3, 65, -242, 46, -21, -245, -268, 324, -317, -309, 153, 57, -123, 203, 62, -247, -337, 305, -232, -163, 426, 67, -193, 115, 133, -470, -64, 591, -342, -86, 251, 155, -20, 541, 220, -55, 180, 342, -62, 150, 311, -158, -202, 51, 257, -166, 63, 5, -331, -283, 150, -53, 19, 81, -336, -430, 26, 18, -502, 118, -70, -395, -248, 86, -190, -192, 349, -193, -98, 50, -57, -124, 106, 5, -378, 44, 174, -232, -185, 348, 109, 0, 125, 376, -289, -43, 267, -218, -177, 328]
6481C28l30RJ45m4m95P14j36k76L33K00o71L8M43k15l74N48O8o86L50K07m08L39
6503H7J83n83J37J19M3L5O7J89n89K39k2l4L61j11q7l18N27l62k62M44R9k13m26
6526d77P68l25k8K89o3k50M00j58m30M45o7k06R1L68l29J4K54j44n93M53J36k33
6548h5P4J52k89j67M40k76m00P58p2k72j4L96o30L16L89l90PK2o5L3N6M0k79J43
6572a13L80m03j30L88j67j32L49J7n50L69O18m63k84M46l62J67Q6k03k63O5M94
6593C09l03M63j60k16l41N54j43k35J59r6o1K87r5k35K31j0n22M2M40j74j73J40
6615a39K35n50M13J69m62J10L60j26n07O66m63k1K28L7j93L08J15k50q3M64l75
6636f4l6K25Q7m29M13Q9p12M92N5R3l95N23j85j41M9J32k32j23M85n00l4M06k54
$$ y = [328, -2, 7, 152, 108, -387, 327, 191, -85, 248, 448, -223, -185, 258, 43, -331, 217, 285, -401, -51, 156, -252, 87, 270, -313, -176, -57, -14, 21, 88, 277, -312, -73, -95, -129, 232, 121, 34, -284, 243, -119, -381, 63, 162, -51, -477, 291, -34, -62, 227, 164, -86, 314, 156, -274, 171, 104, -102, -11, 357, 28, 42, 296, 152, -441, 12, 148, -85, -11, 141, -148, -315, 125, -151, -551, 207, 135, -137, -151, 245, -385, -69, 320, -70, -63, -41, -106, -73, -17, 23, -256, -113, 267, -136, -266, 122, -45, -177, 172, 189, -361, 8, 626, 163, -121, 325, -37, 130, 216, 13, -250, -185, 309, 6, 469, 309, 93, -248, 306, 163, -72, 87, -9, -70, 217, 122, -113, 118, 108, -414, -372, 68, -106, -279, -139, 96, -454, -41, 128, -334, -224, 136, 10, -497, 169, -294, -315, -87, -50, -243, 65, 180, -70, -153, 311, -64, -100, 125, 212, -217, 196, 285, -427, 65, 120, 213, -182, 341, 156, 15, 64, 196, -36, -159, 326, -174, -208, 198, -56]
6659e6m22M98J2N8M0K29m94kP2l47J29L69j46j85K49m24K21J42pqM8J83o90N30
6683aJ1R1j66J24L48n22J77K22j88k86N30k09k15K61M30j042N75K4k90R9K84j91
6705F6j09OJ93l15K32J03j41o3O0k60M38j66q8j94L95j27l00N39l69l20J08N94
6727B82n53K52k50nJ57l18M27k59J68L11m88J2K90Q8m14O16j06n52P28q4m50M54
6749C06k10Qq2J91k15K3K3J90k46qM70n64M80o6m00K22m8P9k30J19J27k88J2K39
6773A32P0m09M15l06l2M02k01k44L19R8j91k47N07k88l18L81k1m37K12K5k44L55
6795b2J43o4l26K94L9l55M91q5k86J10K64j35j83M53k47k39L94j15l66N28m2j76
6817G5j90J65r5K03L67m69k03M68j05m55K46K3k56K12l3J93o0r9R9m14M28j98
$$ y = [-56, -478, 20, 32, 90, 130, 359, -135, -137, -65, -412, -283, 86, -60, -245, 4, -420, -199, -57, -64, -72, -24, 159, -531, -1, 10, 101, -65, 59, 407, -115, 62, 284, 96, -190, 340, 131, -84, 177, 607, -435, 140, 164, -126, -27, 257, 66, -43, -37, 156, -159, 73, 176, 35, -28, 32, -228, 210, 44, -44, -238, 157, 30, -270, 269, -100, -420, -312, 282, -271, -19, -269, -274, -117, -435, -8, -267, -99, 212, -276, -264, 26, 114, -300, 316, 210, -342, 386, 302, -148, 306, 96, 104, 22, 213, -2, 21, 44, 234, -12, -20, 450, -114, 366, 300, -100, 122, 74, 153, -77, 42, 169, -119, -107, 132, 202, -207, 208, -98, -130, 272, 71, -173, 146, 244, 53, -194, 313, 25, -293, 88, 67, -370, -158, -133, -377, -22, 121, 57, -269, 25, 64, -291, 200, 115, -171, -61, 203, 68, -115, 338, 91, -148, 246, 131, -235, 293, 251, 75, -115, 50, -45, 158, 525, 56, -147, 321, 216, -239, 7, 30, -226, -14, -47, 146, 86, -13, 86, -328, 100, -98]
6839i8k44L16R0l07J32Q4m5k27K78P0l12M00M1n56J67L13l34J32J25J66l31K24
6861H4j54k86O43k79k30K64K62j74j02L64J55p15J14K66m8J30Q5j12p01Q40j83
6882B23J2j01K28m06L77Q8l41M9n1l45P4N72k74m96M40L7k45K75p2j8k32J29k20
6905b97q3L82K22n89Q67n03l40K23K33j10p4K16j46m3K62k54j32K20q6k0j06K99
6927A41l95L36K62l15k2J25K25l28K59j96j3r2J97J48k99m6M50m64j98K31n38
6948e32L65J53K82l22K60k91l29N38J28n44L80l63J17L50j19j77N7N7K1k42K87
6969G6Mj76K96O3l80rK49J88n12K26Q5k88M16J07n41Q5O92p00P9J6j02j37N49
6992B86%o41M15J22m21M4L16k78j10L93m8j30j14L72n58L47L6j76N41j90k78l92
$$ y = [-98, -342, -26, 64, -243, -111, -27, -72, -299, -21, 49, -263, 137, 178, -378, -211, 102, -232, -100, 25, 191, -140, 84, -70, -356, 287, 8, -222, 42, 304, 130, 28, 392, 547, -168, -54, 212, 164, 294, 379, 267, -434, 406, 223, 235, 134, 362, -44, 333, 421, 80, 129, 78, -267, -193, 379, 105, -391, 49, 86, -159, 116, 44, 26, -206, -77, -297, -380, 2, 224, -365, 502, -1, -341, -118, 115, 5, -69, 147, 1, -42, 220, -34, -166, 54, -32, -52, -158, 141, -254, 82, 344, 29, 7, 132, 357, 29, 288, 92, 79, -13, 184, 332, 33, -13, 437, -27, -225, 6, -532, -167, -14, 268, -54, 206, -85, -414, 124, 252, -292, 88, -275, -158, 192, 73, -104, -47, 10, 31, -211, 76, 80, -96, 200, 263, -117, -126, 123, 311, -201, 25, 110, -178, 238, 345, -196, -111, 581, -119, -40, -24, -126, -263, 286, 286, -355, 60, 182, -239, -195, 121, -157, -267, 126, 78, -52, -166, 206, -352, -5, 31, -145, 396, 206, -72, -464]
7014d64N45M4l33n6M79l60J47p9K00r0l2L10m31J81P1j09j55L47l50J38P5R2k65
7037i5J86k47J34j56L95l33lL38n60j3N96J93o63N14j52k57j98K20r2j44M61j63
7059c9k60L08Ll95N08j64M5Q0m2k06j28M05l82J69K23K1k83J01K27l38p1O0L67
7082B09l59J80j21J2L78j16k01P5R6k58j52L36L38m71J13L4j58ML17m12N7k7l1
7105a57%M40l50J32l8ll6k41N00m79n7J91rk70K46M5M1o6L12m98L0M29m23J99
7129f2O4j18M3j83K84o13O71J75k53l00N45L9m81K70m9Qj68K11l4L24o8p3l34
7152a02M42j81r3L11k53j37O5K83m90M14Q3n09M3M53j73n50L89j8j49j26L12k74
7174b60pM20o15K48%L68j90k9J1l30R9L51k34J83k1J63l27J26J67k78j6L10j03
$$ y = [-464, 81, 125, -208, -264, 215, -145, 2, -77, 123, 33, 1, 311, -120, 61, 132, 23, -132, 215, -135, 3, 78, 170, -95, 91, -156, -22, -178, 217, -116, -119, 219, -341, -354, 242, 435, -228, 286, 134, -123, -321, -101, -193, -337, 124, -39, -299, 9, 12, -383, 125, -39, 6, 86, 44, -162, -290, 115, -267, -98, 125, 146, -137, -36, 191, -147, -218, -158, 209, -150, 30, -91, -79, 299, 183, -18, 57, 153, -105, -257, 79, 417, -54, 59, 93, -65, -61, 256, -156, -99, -126, -157, -157, 283, -67, 65, 27, 24, -12, -253, 247, -232, -289, -98, -107, -377, -131, -86, -45, -111, 201, -297, -267, 162, -261, -62, 2, -116, -73, -256, 28, -585, 86, 261, 8, -292, 253, 292, -189, 81, 32, 40, -128, 83, 49, 373, 305, 232, -102, 340, 159, 66, 377, 124, -13, 52, 335, -155, 259, 342, -167, -124, 329, 156, -394, -5, -23, -172, -298, 14, -260, -267, 153, -462, -214, -214, 154, -36, -65, -54, -384, -285, 66, -168, 15, -6, 157, -170, -44, 123, -155, -171, 139, 36]
7197C6l88P09l75k69M71N1m96M42J11l23K4K10l10j24N53m59k6M15k0l37O0L51
7219C06m40K33K28n0m10M66l10J12K49m18j02K8K47l01kM55m05n20L47M81k77
7240h3j66N23n10L75j83j29O1K12M8k69K83k74k43R8L72l97L77j13J45k30Q4L87
7262C68k29p2K58l94Q9N2j53k55N56l53J68R6J27k30k47L01j55p7J16m4j66K65
7284B1Pk19K66K75p61N44k39l2o8M7J41l05K06K14l56J33K58j78l5M03k14l04
7306a96M92k18P9m9k38L2K37M7j66l14M96j61j61J20J91l96K48lK05j19K34k27
7328A33k62J60L07n83J61N32p15M71J45k61l41j27M23m6m2L3k13P8j6R9P3L29
7350C38l45l76L95L07n51J52K77m71K21N27m27m07O42j68k71K59jl78K84J8m0
$$ y = [36, -352, 357, -18, -287, 184, 235, -261, 181, 292, -31, -7, 203, -107, -231, 322, -137, -163, 252, 232, -105, -45, 306, -134, 99, 327, 277, -133, 333, 23, 135, 384, -34, -136, -108, 139, -162, -164, 291, -114, -634, -287, 194, -83, -249, 274, -236, 139, -44, -173, -112, 100, 148, -121, 162, -112, -355, -257, 115, -282, 95, -18, 127, -103, -19, 368, 139, 67, 325, -69, 20, 72, -81, -336, 220, -133, 35, 131, 258, 28, -219, 82, -73, -150, -34, -78, -244, 21, 28, -191, 75, 350, -411, 133, -106, -138, -206, -159, -18, -323, -117, 97, -259, -126, 132, -46, -81, 322, 108, -196, 296, 78, 157, 108, -130, -98, 139, 186, 20, -294, 202, 41, -120, 0, 191, -205, 43, 40, 245, 126, 360, 133, -129, 31, 338, -245, -84, 448, -267, 204, 349, 88, -253, -380, 43, -3, -45, -12, -225, -147, -163, -64, 9, 338, -7, -383, 12, 319, -232, -80, 197, -274, -53, 474, 47, -360, 282, 114, -157, 102, 101, -277, 7, 25, -15]
7371a5o0K29j74L2K26k18J0%J85l30O8J63j54l4L11j65k06L32k78j3J73N9m61
7394c20J71J74j80O3O4K50j85L65o18K92n0L75p54K27R0p9K13J61j53l33N4J16
7416e7N8J2n0J13k24K25j02Q0J45M3k96J01O8J04j99K74o8k33J97j99N0J66q9
7439A19m56L39L6K98o46M14O9m73L82l3l80N43l80L1Q4J64k74k21L64K59l03J72
7461A08j17j15J27r6O0j91J83j17j80K31J84n9J25Q9j43j6J66n01R9N80m54L3
7483dR9K91k64q4K77n0j85K70m29J02J7j15L75l02o5q3j4L77Ln02L29J01n47L58
7507d5k2j79L68Nl05j93M62j72m9K97m55j20K51M20q17M34N7R0j07K54o6l37L28
7530I9Kj41Q6K15j13j46K19M6k37K86J8l45K18L4j41k31K23j56J53J47j98k18
$$ y = [-15, -75, 154, -20, 12, 238, 20, 30, 30, 215, -115, -47, 116, -38, -72, 239, 74, -132, 200, -78, -91, 82, 141, -320, -149, 25, -155, -92, -28, 222, 37, 402, -216, 76, 26, 401, -353, -126, -36, -115, 98, 259, 106, -227, -173, -57, 1, 13, -37, 76, -148, 77, -25, 55, 200, 243, -53, 48, 116, 220, 21, 295, 227, -6, 191, -8, 42, 208, 119, -337, 2, 38, 336, -310, 104, 173, -300, 82, 49, -331, 212, -168, -137, -53, 111, -163, -384, -20, 239, -64, 108, -9, -124, 3, -93, -33, -224, -41, -158, -338, -107, 77, 18, 143, 232, 89, 73, 239, -262, -163, 417, -37, -4, 95, 386, 122, 38, 315, 265, 80, 350, -79, 23, 40, -75, 300, -2, -67, -150, -164, 213, 216, -286, 43, 144, -403, -45, -67, -246, 122, 127, -178, -371, 91, -81, -130, 167, -288, -408, -157, 263, -554, -120, -63, 27, -80, 174, 108, -229, 99, 101, -40, 46, 261, 148, 2, 221, 267, 30, 316, 334, -11, 207, 241, 100, -131, 92, -64, 89, 236, 38, -180]
7552a80J77J41J65k44L92o49O2P0J3k2L57q6m72L13R8n11K28L13l55q2M05l24
7574a91l1K39r4j60K04l3q6J46N28o21j36M02rk53R8r4r2M04j82j76J77K9k30
7597a61L28o6K1k63J05O4r2J83K39o17L83L9j26l20L67J5K09Nl10k0k0L87j02
7620B48j34K34m97k9K85p4l52O90m39J27n3N4Rm44K93j59J06L69o9l36J55K80
7642B64o12K06M74j77j09j56K39m12K95L3j67J2M27n37L9L48j59j25Q8K46j70
7663D7j55K35j72K71k32k93L21pK09m43l7M04k98K79J59j66q9K03k03j07k11L24
7685C9k36K53M52q94P6L35k08O1J97k31K7L05j26j96R0J26j84j26K70J35j54j88
7707a77L60J9j09J33j78j71J8l2j11M2L34m80K76O4j13L20Nj13p2K12j66q4j31
$$ y = [-180, -3, 138, 303, 59, 451, -198, -136, -66, -53, -75, 282, 196, -276, 37, 135, -376, -148, 165, -190, -272, 133, -191, -222, 17, -77, -237, -33, -66, -152, -6, 522, -99, -235, 167, 158, -95, 3, -91, -183, 221, 39, -137, 40, 69, -161, 167, 101, 122, -141, -36, 28, -64, 119, 358, -259, 124, 163, 37, -283, 84, 99, 308, 313, 3, -17, -37, 350, 248, 114, 348, -149, -178, 107, 33, -319, 371, -68, 59, 6, 60, 69, -375, -82, -241, -135, 234, 165, -171, -16, 264, -348, -142, 332, 155, 46, -110, 129, -283, 12, 45, -122, -110, 317, -220, -181, 167, 8, -117, -29, 217, 47, -108, 127, -45, 226, -6, -299, 22, 15, 224, -219, -256, 148, -150, 129, 288, 122, 33, 236, 33, -74, -285, 39, -197, 56, 508, -386, -310, 25, -183, -122, 75, -156, -129, 176, 50, -146, -56, 70, -114, -240, 30, 165, 11, -177, 183, 202, 93, 226, 48, -123, -105, -137, -248, -206, 128, -352, -76, -12, -125, 195, 200, 87, 15, 227, 61, -23, -154]
7730a54L64k61J99J12o19N21N2k56k93L03L48m02J28Q4l27J20L45m65K31k25K46
7751E1k95K06K55m42%K85l28K31J43rj62J71Jm71K44K17l23N31j88m11L32k65
7773b27L06k0J1k51JN0J38j38nM5n8J73j79j4M5L52l7k08K40j77m46P6L80N7k66
7798a52L00j82j29K54J3Q3k40J16j45M1J85m14J02K35Nk61L28p3j34k5J90M0l11
7821a74K83J63j55j71K08l13J69M7l14J26O2K22n5l0j4k18J19K94m06r6J68pj31
7844b23K41pj15J04q0n5K27k8Ml19N41l41n5J24l36M19k51J06k10O4K88k49mJ41
7868a4j67j18K83J81k72K44Qk64M3J32N9k99M72o5l77J32J56j67P5J45k5k61k1
7891a20O8n1K29j76J38m20O79l20J17l72J48l8J54o4k47K09mk15J81J41m20n9
$$ y = [-154, 210, -51, 148, 260, -359, 162, 214, -42, -335, -32, 316, -86, 42, 126, -201, -81, 264, -201, 30, -195, 51, -244, -38, 217, -225, -225, 60, -268, -37, 106, 97, -65, 106, 107, -364, -120, 97, -226, 305, 117, -294, 38, -227, 79, 59, 70, -181, -180, -130, 8, -130, -135, -90, -148, 25, -154, -168, -123, 229, 192, -16, 224, 47, -399, -323, 57, 114, -152, 148, -34, -163, 91, 104, 187, -53, 63, -82, -41, 144, -270, -168, 67, 72, -189, 139, 66, -68, -93, 97, 137, -174, 109, 272, 117, -54, 154, -159, 10, 57, -257, -131, -69, 153, 98, 68, 54, -164, -45, 249, -157, -253, -85, -92, -223, 18, 11, -104, 0, -80, -135, 92, 64, 68, -251, 290, -51, -106, 18, -318, 101, -150, -44, -254, -190, 98, -151, -155, -14, -181, -299, -16, 165, -107, 137, 145, -119, -76, 56, 115, -184, 288, 223, -154, -22, 134, -33, 42, 187, 162, -99, -120, -52, -103, 126, -50, 88, -332, 347, 27, 144, -228, -80, -118, 36, -28, -275, -66, -70, -285, -104, 37, -383, -442]
7913d42O40l85J4j90J3M13q7j38L27k35m7Q9j70M81P9m86K13J38Qk64J24P7m55
7936b83N54k19p4J12K40k78M3J86j84Mj38R6j50K28j29O2j30L43m04J16J15j99
7958h9QN10k27j99k59J67K18k00K31k80J07J46m46K75J42R3l39J0N47q75O59L
7980B02m85L32K89n27n8J91N21n98J98J51j95J84k64K34k34J02j5k55K51n2m81
8001e09N38o8k28K61L11j60k48L00p0Pj59N8k06J72J99n12L66k98N8Q7L09k83
8023g5q0J50J42j77k71K13k24L93N9J20k84M7j42nO9J9k10L07L62n82P5N68m08
8046F6k85L11j08l0j25M86m61j26L09Q7j54qJ82m00L76J1M9l49M32n19L25jOk19
8070a45K43j22j94K48O1n87K60L62k53p8J38R4j46O1J70m15L39j05k49J07M38
$$ y = [-442, 198, -187, -173, -363, -350, 63, -24, -162, 165, -70, -117, -28, -198, 283, 362, -124, 89, 227, 235, -29, 95, 172, -283, 271, 52, -22, 90, 330, 52, 95, 281, 97, 101, -37, 59, -91, 137, 8, 70, -60, 283, -121, -5, 110, -89, -81, 429, 202, 3, -256, -89, 129, -71, 160, -120, -13, 133, -313, -38, 104, 197, -142, -132, 415, -460, 199, 202, -283, 49, 338, -189, -247, -56, 465, -133, 65, 216, 21, 205, -59, 175, -59, 43, 28, -227, 24, -28, -509, 29, -39, -267, -6, 305, 145, -103, 197, 127, 134, -25, 33, -173, -1, 198, -314, 52, -246, -188, -101, 208, -75, -155, -5, 137, -40, -311, -98, -322, 71, 130, 250, -34, 13, -129, -134, -65, -46, -256, 51, 413, -169, -94, 474, 66, -219, 92, -16, -46, -171, 315, -146, -272, 37, 124, -30, -38, 144, -256, 120, 131, 180, -169, 263, -256, 69, 68, 74, -145, 98, -24, -218, 30, 91, -496, -236, 126, -127, -205, -67, 27, -119, -58, 112, -303, 36, -69, -318, -211, 227]
8091B27j95l13N50j82n7O5J3j19O3L2j85O3K4R1j56Q4M0J68J79m95L27k52L70
8114C42k87k99M25j95n1j24L30k22K46j85j6l08J39O33q00N07k34j1L17K05n60
8135a48K79m7K02o25L42j48k75K54K6K33m30N33n72M07mLK35r0ql24K61J09o7
8158A46j26j97J06L1K55q6K5p7J51k50j56K56N1J3q4%k67K74J8j3l58L58j44k75
8182c49M88o5k50K77j23l2J19m5M0
$$ y = [227, 32, -281, 269, 87, 30, 95, 108, -11, 52, 84, -101, -38, -14, 77, -79, 5, 45, 213, 392, -103, 224, -28, 342, 55, -244, 181, -14, -65, -189, 141, -81, 165, -20, -36, -344, -205, 428, -372, 135, -99, -110, 207, 412, -148, 131, 84, 286, -339, 3, -145, -420, -166, -140, 93, -337, 196, -376, 31, 27, 30, 265, 175, 167, -157, 104, 213, 146, 20, -177, -71, -40, 215, 129, 154, 77, 228, -22, -178, 78, 129, 142, 58, 58, -209, 65, 83, 70, -288, 70, -74, -349, 139, 74, -176, 101, -22, -54, 65, 20, 60]
8191F0
$$ Imaginary data points
##PAGE= N=2
##DATA TABLE= (X++(I..I)), XYDATA
0@%%%%%%qJ6j6J6k4L2m0M8n7P3q8J04j24J45j70K01k33K67l08L55m04M57n18N88
30C12o63P45q35R36j046J162j291J436j594J769j959K169k401K657k946L268l629
47a910M041m514N062n708O478p419Q604j0144J2239j5269K0072k8900N0471j97326
61a64223l71198J31740J28195O2291j0751j9960j11369r8617m7416N9668J36804
72c04836J12925k6092n5927l2113m1863j925J34400J41287M4316p891k8488n5982
84a22189J6236R5583Q0670O1841P0171j1730q4168l4174L6863O6917J00515N3112
96C29647o7448q3231j7028r578J4695Q1323M0625p0621q2904m4718k4197K0459
108H7024L9890j1483l2961l3336q0567o5399M1386N6341j8371l2149l1802o4367
$$ y = [0, 0, 0, 0, 0, 0, 0, -8, 8, -8, 8, -16, 16, -24, 24, -33, 40, -48, 56, -68, 77, -93, 108, -125, 142, -166, 189, -215, 242, -276, 312, -351, 394, -441, 495, -551, 611, -680, 756, -838, 931, -1028, 1141, -1260, 1397, -1549, 1719, -1910, 2131, -2383, 2679, -3029, 3449, -3970, 4634, -5510, 6729, -8540, 11532, -17368, 33103, -164223, -535421, -403681, -275486, -213195, -223946, -243906, -355275, -453892, -501308, -441640, -304836, -191911, -218003, -273930, -306043, -347906, -349831, -215431, -74144, -29828, -37719, -66207, -122189, -105953, -10370, 70300, 132141, 202312, 190582, 106414, 72240, 109103, 176020, 276535, 329647, 262199, 178968, 161940, 152362, 167057, 248380, 289005, 218384, 135480, 90762, 66565, 87024, 126914, 115431, 82470, 49134, -31433, -96832, -55446, 895, -17476, -49625, -81427, -145794]
120a45794k3958M3003J8848n765K3361m579n1707j5875J9924J7616N3409O1438
132a0079j0699m0377o089K339L2913Q8972N1089k3671q404R209j9078J5289O6839
145A48253L5625Q703J7714k6948n6050O567M0875J5956K2374P259o0670n8281
157A01377J399q84j0869J5443j2199n6553k9775j9799n1858j9590K2903j2202
169g2607l7258k1149m0104m0169J3951J0490l2725p726J4952j8873j1183J6914
181b25487j1695j0652M5070L2102j5324N174K5179Q723K6480L9082L547J0340
193f7461M8296K3377q06L0038K5994L419L3356L6115j2460M332M6252J4523j2070
206A72905J0083n00j0417L0397K7993k5599k3033j253j6257k312K1452j8524l7956
$$ y = [-145794, -169752, -126749, -107901, -113666, -90305, -94884, -146591, -162466, -142542, -124926, -71517, -10079, -20778, -61155, -67244, -64905, -31992, 56980, 108069, 84398, 75994, 85203, 66125, 81414, 148253, 183878, 192581, 210295, 183347, 127297, 133864, 174739, 190695, 213069, 220328, 159658, 101377, 102776, 101892, 91023, 106466, 94267, 37714, 7939, -11860, -63718, -83308, -60405, -72607, -109865, -131014, -171118, -211287, -197336, -186846, -219571, -227297, -212345, -231218, -242401, -225487, -237182, -247834, -202764, -170662, -185986, -180812, -155633, -146910, -120430, -81348, -77801, -67461, -19165, 4212, 3406, 33444, 59438, 62857, 96213, 132328, 119868, 124200, 170452, 184975, 172905, 182988, 182488, 172071, 202468, 230461, 204862, 181829, 180576, 164319, 162007, 183459, 164935, 126979]
219A26979K302n313m0480j4448K415k7390j4794N724k9918l9470l628j2010k6842
232g6873J943k678l2180n076P675l2633k2709J9062M423r156J6753l830l2908
245a68187O538L2785M253P344K0298o442j654L0101J1600k482L0301K4197p855
258a9203J4047K6195n389O856L6897M427j3270J9987J5896o552J1173P642k0278
271G8428K303K5706p825j7497N057j0568j5508J5382j80l4872p589J4270j5310
284C1797j3912L278k0943k1122J3536O98k2957K71K983k2968l941J1266j5450
297e7464m447K5626k883k6013K651O848o754K0214K3481j7121j3279J4020K24
310c4897K252K5777O104j2673J3136Q855j8517O202K7068j01m38J7198j2235k1460
$$ y = [126979, 129281, 123968, 83488, 69040, 71455, 44065, 29271, 34995, 5077, -34393, -38021, -50031, -76873, -74930, -77608, -109788, -114864, -107189, -139822, -162531, -143469, -139046, -148202, -131449, -135279, -168187, -161649, -128864, -124611, -117267, -96969, -103411, -105065, -74964, -63364, -65846, -35545, -11348, -19203, -5156, 21039, 15650, 22506, 59403, 63830, 50560, 70547, 86443, 79891, 91064, 98706, 78428, 80731, 106437, 98612, 81115, 86172, 75604, 60096, 75478, 75298, 40426, 32837, 47107, 31797, 17885, 21163, 220, -20902, -7366, -6668, -29625, -29354, -26371, -49339, -53280, -42014, -57464, -61911, -36285, -39168, -65181, -62530, -55682, -62436, -42222, -18741, -35862, -49141, -35121, -34897, -32645, -6868, -764, -13437, -301, 8554, -9963, -3761, 23307, 23206, 22768, 39966, 27731, 6271]
324F271J6985J7585p549P152P887j8389o789J0803j1039o607K4047M267k2052
337B2572n203p602j9512J4365K7750j3089k0906J187j1666j2568J6433R332j1104
350a0011O468J729k6826r443J8515M031M243J7758j2747k9104O906J5372l318
363a6427J2010J6630j5616j1437J0427n413o273K2743J2275r244K961l855k3637
376a4856M951K9866K236o643O647j3214k0526J3162J3098q198Q203J1426j9061
389G091j4882O068n133J219K4161L31k5290l673K717j1705R026J9111j0998j0682
403a2639J0656p435j8214J0133J2229m195Q342L722k2578o470J8277J013k200
416i359J4508k999j6949Q676Q500j2981N440J9841m964p478P390p017q338J7224
$$ y = [6271, 23256, 40841, 33292, 40444, 48331, 29942, 23153, 33956, 22917, 16310, 40357, 44624, 22572, 17369, 9767, -9745, 4620, 32370, 19281, -1625, -438, -12104, -24672, -8239, 1093, -10011, -3543, -1814, -28640, -38083, -19568, -15537, -11294, 6464, -6283, -35387, -28481, -13109, -16427, -4417, 12213, -3403, -14840, -4413, -9826, -16099, 6644, 18919, 9675, 12636, 8781, -14856, -9905, 19961, 22197, 15554, 22201, 8987, -11539, 1623, 14721, 6523, 14726, 26152, 7091, -7791, -1723, -6856, -5637, 18524, 18855, -6435, -10108, -7391, -19096, -10070, 9041, -1957, -12639, -1983, -9418, -27632, -17499, -5270, -9465, -1123, 2599, -19979, -26449, -8172, -7159, -9359, 5149, 2150, -14799, -6123, 2377, -10604, -5164, 14677, 9713, 2235, 9625, 2608, -5730, 11494]
430A1494R837j1464K719M988j2871R58J4612q845p422J5560L22j6012L753M364
444A1993j1613M550J2499j1922q327R152n127r411J0543r3j3891P953Q131j5435
458a0998m460J0679p956m843J4203k828j5629O880O273j2133K320Q870q257j95
472a8074J2604j0005j2450J2874N769q340Q987O327j5229O41J5401n239m033J5171
486D404J079q603Q820K900j0312Q926J5551p222j364J0156q028o249J5861L892
500B9811j1113Q329O315j3869k690R531o646k278J2148n606j5355L323q61j0860
514A79P831Q159j5195p833O735r193p571J1568k07j2621N703K137j5211k79J1086
529a4712l821j7R484q742j1513J2310O009q905P823R569j0269j255J0235o946
$$ y = [11494, 21331, 9867, 12586, 17574, 4703, 5661, 20273, 11428, 4006, 19566, 19888, 3876, 7629, 11993, 380, 4930, 17429, 5507, -2820, 6332, 1205, -8206, 2337, 2244, -11647, -3694, 4437, -10998, -15458, -4779, -12735, -17578, -3375, -6203, -21832, -14952, -8679, -20812, -18492, -9622, -17879, -18074, -5470, -15475, -27925, -15051, -9282, -17622, -8635, -2308, -17537, -16896, -1495, -6734, -10767, 4404, 5483, -3120, 5700, 8600, -1712, 7214, 22765, 15543, 14179, 24335, 16307, 10058, 25919, 29811, 18698, 27027, 33342, 19473, 16783, 26314, 19668, 17390, 29538, 23932, 8577, 11900, 11039, 179, 8010, 16169, 974, -6859, -124, -9317, -16888, -5320, -5527, -18148, -12445, -10308, -25519, -25798, -14712, -18533, -18550, -9066, -17808, -29321, -17011, -11002, -19907, -12084, -2515, -12784, -14039, -3804, -10750]
543a0750l606J7016L932r967L205J518r089Q509J2708p994l603R546o840q507
557c922J1073L883q719P570N113j5166l559J1319l140k990R548m960j2414O042
571c22K041j0090O051Q846j1143n497P348p951p837J2588L641j1256K923K338
585h320j3178J850J3185k978k966Q885n320q832J0329N870n348J0455J0596j0587
599C641l525J1857K22Q87J6445L389r526M365N669o408P373J3982m515m029O913
614D6740p049r294J1025M423r467K832J768j7359p720P054o597o122O110p086
628I258j8248k472k597j1699K413O446j3723j0397K302j0525j1007R664M048r445
642e5982N76k12j4163m79J3396q67j189J0180k928r414Q293P671k250J2324J3879
$$ y = [-10750, -14356, 2660, 6592, -3375, -170, 1348, -7741, 768, 13476, 5482, 1879, 11425, 4585, -3922, 7151, 11034, 2315, 9885, 14998, -168, -3727, 7592, 4452, 1462, 11010, 6050, -6364, -322, 1719, -8371, -2320, 6526, -4617, -10114, -2766, -10717, -18554, -5966, -2325, -13581, -10658, -8320, -21498, -19648, -6463, -9441, -12407, -3522, -8842, -17674, -7345, -1475, -6823, 3632, 14228, 3641, 116, 11973, 12195, 13082, 29527, 32916, 23390, 27755, 33424, 27016, 34389, 48371, 43856, 39827, 46740, 39691, 30397, 41422, 45845, 36378, 39210, 40978, 23619, 15899, 22953, 16356, 10234, 16344, 9258, -8990, -11462, -14059, -25758, -23345, -16899, -30622, -41019, -38717, -49242, -60249, -50585, -46537, -55982, -55406, -55618, -69781, -70260, -56864, -57731, -58920, -48740, -51668, -61082, -52789, -45118, -47368, -35044, -21165]
657b1165o630k006J3034K316P08J7251R130l218R492P809o406O292J6264K239
671D5110M142J2015l317q465R714P525l851P896P957j1412o937M428o361n125
685E3319J0319q88j4947n088n338j4741r54O181j0781r172k96j3973j6701L408
699a9652J008j0380K98N35j5067p256M136o304k996J2747J672r014J207k14q469
714e7749Q371J8338J570R30O647p372o433J5638J3947K261R636N162j1419k120
728b593J0652L218P957J5344k300j3882J007J973m472Q998J2386p523o873J107
742B4999j1229q934R760N206n852J530l691j8459o911N930k181K300R053q473
756f952j8418k434n60m589J1551J3035r610j1209j551o361J412J8469P854o501
$$ y = [-21165, -27795, -29801, -16767, -14451, -13743, 3508, 12638, 9420, 18912, 26721, 20315, 26607, 42871, 45110, 49252, 61267, 57950, 49485, 59199, 66724, 62873, 70769, 78726, 67314, 60377, 64805, 58444, 53319, 63638, 62750, 47803, 42715, 37377, 22636, 21682, 27863, 17082, 7910, 7614, -6359, -23060, -19652, -18644, -29024, -28726, -28191, -43258, -50514, -46378, -52682, -55678, -42931, -41259, -50273, -49066, -49280, -57749, -49378, -31040, -29470, -28540, -21893, -29265, -35698, -20060, -6113, -3852, 5784, 10946, -473, -2593, 8059, 11277, 19234, 34578, 32278, 18396, 19403, 21376, 16904, 25902, 38288, 30765, 23892, 24999, 13770, 4836, 14596, 19802, 13950, 15480, 11789, -6670, -13581, -7651, -9832, -7532, 1521, -6952, -25370, -27804, -28364, -32953, -21402, -8367, -17977, -29186, -30737, -37098, -35686, -17217, -9363, -15864]
770a5864N95j225r334O956J7231L401K477Q508n176q152R686R276J989J1574Q633
785D0575r141m731O792j92K719J3937J457r433J111k257j1570L880J1879l470
799D1556n936j517j4202j2900O498M578n744o72o257j9557q291N865k229j753
813b0561M597r461j6724r80R98m417P325Q030j0131p754K938k796r98J2948N822
828c1164m535L992K237p328M520J3468K088L747J1361k075q462P058Q450J648
842E005J0284Q978o897l248O614r94L78J3787M611o632M84j845q209N844J2444
857D0604l831o420J961o995p615O775K582p943l09O93j0414m095L682n865m877
872b067N572l291j1219M57j31p631K138N358p621m834M460l935n889P010L106
$$ y = [-15864, -15269, -16494, -25828, -18872, -1641, 1760, 4237, 12745, 7569, -583, 9103, 18379, 20368, 31942, 40575, 31434, 26703, 33495, 33303, 36022, 49959, 51416, 41983, 43094, 40837, 29267, 33147, 45026, 41556, 35620, 34103, 19901, 7001, 13499, 18077, 12333, 11661, 5404, -14153, -22444, -16579, -18808, -20561, -15964, -25425, -42149, -43129, -42131, -46548, -39223, -31193, -41324, -49078, -46140, -48936, -49934, -36986, -31164, -35699, -31707, -29470, -36798, -32278, -18810, -16722, -12975, -1614, -3689, -12151, -5093, 3357, 5005, 15289, 24267, 17370, 14122, 20736, 19742, 20120, 33907, 38518, 31886, 32370, 30525, 22316, 28160, 40604, 36773, 30353, 32314, 25319, 17704, 24479, 27061, 19118, 18809, 19502, 9088, 4993, 8675, 2810, -2067, 3505, 214, -11005, -10548, -10679, -18310, -16172, -10814, -18435, -23269, -18809, -22744, -28633, -21623, -18517]
887a8517n118L351K474q180Q49J0717K68K23O943l662o857Q350Q229k612M302
902G60O124o604j740P780k76K33J0300J097q913J640L404l854M393P889n795m125
918A2313M764l398o990N359L610m699J893K247j0160m677N441j109p46N722l376
933F194j1190J065K392n719L572O839n949o056K564m833m590R046M757n997p73
948h678o43q061J819R755m34l494M034l360o643N778M371l731L778O317o717l838
964i747N078J8n24Q726J214p243K004L178m985K857Q139k106k580M642l395o500
980a224O459O001l080J719J700q726k356P733L30j656M877l372q697K679M034
995F421l876K293N058o652o079L440j547k359O811J532r321r56K688l526J552
$$ y = [-18517, -23635, -20284, -17810, -25990, -25141, -14424, -14156, -13933, -6990, -10652, -17509, -9159, -930, -3542, 760, 6884, 280, -1460, 6320, 6044, 6277, 16577, 17674, 8761, 10401, 13805, 9951, 14344, 22233, 16438, 12313, 17077, 13679, 6689, 12048, 15658, 10959, 12852, 15099, 4939, 262, 5703, 4594, 3848, 9570, 6194, -4996, -3931, -1539, -7258, -3686, 3153, -2796, -8852, -6288, -11121, -15711, -6665, -1908, -7905, -8678, -9321, -17382, -15563, -5808, -6242, -9736, -5702, -9062, -15705, -9927, -5556, -9287, -5509, 808, -5909, -9747, -4669, -4651, -5175, 3551, 4765, -2478, -474, 2704, -2281, 576, 8715, 6609, 4029, 8671, 5276, -1224, 5235, 11236, 8156, 9875, 11575, 2849, 493, 8226, 8556, 6900, 11777, 8405, -292, 2387, 6421, 2545, 4838, 9896, 3244, -2835, 605, -942, -3301, 3510, 5042, -4279, -5235, -2547, -6073, -4521]
1010d521N683m454m788N382m67n969L525L544l503K911L490o782k995P472J463
1025ij951M385m20o653L111M561l341J895P242m192n242L289j51k197P793L933
1041A2053q115k562J817l492K464Q028k536o886J566j199n355M674M639m453r33
1056b90K118p555m211O934J873l094K766j305q609L88N178k314J190N547m110
1071e494n503K961j077l088P791O092n556k594J328m439J691J0323K013m788J885
1086A545q57n614M539P397n77J639L499o165n466N966L692l25N661Q24r413j881
1102D464M594j161J542N793l186o485J123j562n219L870N824m458k769j77p402
1117e209l286P331K052m376P26j764p580K84M446j640Q22N218l947p020K845J023
$$ y = [-4521, 1162, -3292, -8080, -2698, -3165, -9134, -5609, -2065, -5568, -2657, 833, -5949, -8944, -1472, -9, -1960, 2425, 2005, -4648, -1537, 3024, -317, 1578, 8820, 4628, -614, 2675, 2524, 327, 8120, 12053, 3938, 1376, 3193, -299, 2165, 10193, 7657, 771, 2337, 1138, -4217, 457, 5096, 643, -290, 1828, -5727, -9938, -3004, -1131, -4225, -1459, -2764, -11373, -10985, -5807, -8121, -6931, -1384, -5494, -10997, -8036, -9113, -12201, -4410, 1682, -3874, -6468, -5140, -9579, -7888, 2435, 4448, -340, 1545, 688, -4926, -387, 7010, 6433, 8072, 11571, 5406, -60, 5906, 9598, 9273, 14934, 15758, 6345, 4464, 9058, 7897, 9439, 15232, 12046, 5561, 6684, 5122, -97, 3773, 9597, 5139, 2370, 2193, -5209, -8495, -1164, 888, -3488, -2762, -4526, -12106, -11822, -7376, -9016, -8194, -2976, -6923, -13943, -11098, -10075]
1133a0075j222P243L853o446k200L583j673Q55P852M67l810L178M95m767L086
1148D19O269j449P92L282n171m261O073K529k780K951Q19o199l64L930l185j045
1164B610M844j402n279R67j027m584L940M505n370k957K188l102k058M405k17
1179b537m383K800J562n624O9M223j909L26L982k141l768M233J595k863L931L211
1195B707l751Q18M676j676j402N097N86k517L525J156m396J745N064k432j409
1210G791K606k217l130L887j41n362J168K025m969j189J809m440k745L771j846
1225b982n668L96M46m333J345J851n588j032L796k280k923L486M47k127L469K481
1241i216m177J269N762p48Q30M952j46j139M796K457k241M037M994j641O56M125
$$ y = [-10075, -11297, -4054, -201, -6647, -8847, -5264, -6937, -6082, 1770, 2237, -1573, 1605, 2100, -2667, 419, 6688, 5239, 6031, 9313, 4142, -119, 5954, 8483, 5703, 8654, 9473, 3274, 2910, 6840, 3655, 2610, 7454, 6052, 773, 1740, 713, -3871, 69, 4574, -796, -3753, -1565, -4667, -6725, -2320, -2537, -6920, -4120, -2558, -8182, -8113, -3890, -5799, -5473, -1491, -3632, -7400, -3167, -1572, -4435, -504, 2707, -1044, -226, 4450, 2774, 1372, 6469, 7055, 4538, 8063, 9219, 4823, 6568, 11632, 9200, 7791, 10397, 8180, 5050, 8937, 8796, 3434, 4602, 6627, 1658, 469, 2278, -2162, -4907, -1136, -2982, -8650, -8254, -7808, -12141, -10796, -8945, -14533, -15565, -11769, -14049, -16972, -13486, -13039, -15166, -11697, -9216, -13393, -12124, -6362, -7110, -6280, -1328, -1474, -2613, 2183, 4640, 2399, 6436, 11430, 9789, 10445, 14570]
1257A4570j751j231N580K003l210J983O97m187J237K863l140j519K806k802m652
1272I247R19j331m391J923J283o089l269J016l306k846K567k060n184J683k16
1287a0054n495k35K218k637k02L407k971m000L353J655k087K636K858k845J632
1302a2767M210j201j76M939J652p45M293J804k493L271M351j578R32N002p25j245
1318I524L971j3k949K705K509k855L09J849m035j741L063r12m110J862p32m934
1334C511n60O39m299p73K866l076m447J118j212l278K243J316m249r8J978k679
1350a1000j183M236R1j807L602N51l866K324L903l39K165L469k686j549M145J607
1366C663n99L880K084l352N02K337k513Q59N738k5l369N15j581l715L378L680
$$ y = [14570, 12819, 11588, 17168, 19171, 15961, 17944, 18641, 14454, 15691, 18554, 15414, 13895, 16701, 13899, 9247, 10166, 8835, 4444, 6367, 7650, 1561, -1708, -692, -3998, -6844, -4277, -6337, -11521, -9838, -10054, -15549, -15784, -13566, -16203, -16405, -12998, -15969, -19969, -16616, -14961, -17048, -14412, -11554, -14399, -12767, -8557, -9758, -9934, -4995, -3343, -4088, 205, 2009, -484, 2787, 7138, 5560, 6492, 11494, 10769, 9524, 13495, 13482, 10533, 13238, 15747, 12892, 13201, 15050, 11015, 9274, 12337, 11425, 7315, 9177, 8445, 3511, 2951, 3590, -709, -1482, 1384, -1692, -6139, -5021, -6233, -9511, -7268, -5952, -10201, -10299, -8321, -11000, -12183, -7947, -7856, -9663, -6061, -5510, -9376, -7052, -3149, -3488, -1323, 2146, -540, -2089, 2056, 3663, 3064, 6944, 9028, 5676, 6178, 8515, 6002, 6861, 12599, 12574, 9205, 9720, 8139, 4424, 7802, 11482]
1382A1482k858j705N10m617k418K874l70j648K105j035o828j813J108j407J365
1397e255L272l648n186L00j027j914L722K643k753o92M24m373j122N878K205r7
1413g623K178j243m558J941M815J264K270L413j684k796K235J270K29N604M093
1428A1408k731j437M76k346J983O589P2k601Q78j892l368J429L213j355L45Q68
1444A1531m774m263J534Q89j173J774q17n615j681Q41k390j94L091q87l430M9
1460e515j609l280K233L716j127p48L42l021j387M166J287k50K701q8l807O93
1476e694L570J09J370L576j309k636K143P67q48L391L028k582q88J498j800j16
1492C579L230K21j918J653k10l960k8J997j600N32J849l226l574O37P11k241K020
$$ y = [11482, 8624, 6919, 7429, 2812, 394, 3268, 2898, 1250, 3355, 2320, -4508, -6321, -5213, -6620, -5255, -1983, -5631, -10817, -10517, -11544, -13458, -9736, -7093, -9846, -10538, -10114, -14487, -15609, -9731, -7526, -7623, -5445, -6688, -11246, -9305, -4490, -3226, -956, 2457, 773, -2023, 212, 1482, 1711, 7315, 11408, 8677, 7240, 7716, 5370, 7353, 13942, 14014, 11413, 12291, 10399, 7031, 8460, 11673, 10318, 10663, 11531, 6757, 2494, 4028, 4917, 3744, 5518, 4701, -914, -2595, -1754, -4144, -4338, -1247, -2134, -5564, -5515, -7124, -10404, -8171, -4455, -5582, -6330, -5988, -9009, -10396, -6230, -4943, -5193, -2492, -2580, -6387, -5694, -2124, -2015, -645, 2931, 1622, -1014, 1129, 1896, 1048, 4439, 7467, 4885, 3997, 5495, 3695, 3579, 6809, 7030, 5112, 6765, 6555, 2595, 2567, 4564, 2964, 3496, 5345, 2119, -1455, -818, -107, -2348, -328]
1509c28R90m487o76P18k694p36L333j13k430M08q36k324J639L393j386p79J932
1526d376j435j005L483M50j118K669J801k156N00K874r63O42L631l37k085K368
1542D943O64j477J773J977j762j54J885j606j753K199J63j177J227p39m090K95
1558B368K573j721r71O41k169k224J417n8k388J531P51l250r58J341j725J8K674
1575b150r09k378Q02R74k180J453K498j721K25K121j057j438K393R05o20K104
1591A022J182k756J14K486r68L99K604k34k048O75L25j778J939K302k092o76O52
1608C148j957j406K387K26k031Q68m84k474oJ291j491j034K290j244k647O02J78
1625c784j735J448J448j928j62R92j715q14K718M90j066J676K16j854O81K543
$$ y = [-328, 662, -3825, -4501, -3783, -6477, -7213, -3880, -3993, -6423, -6015, -6851, -9175, -7536, -4143, -5529, -6308, -4376, -5811, -6816, -3333, -2883, -4001, -1332, 469, -1687, -1187, 1687, 724, 1366, 4997, 4660, 2575, 4943, 5607, 4130, 5903, 7880, 6118, 5964, 7849, 6243, 4490, 6689, 6852, 5675, 6902, 6163, 2073, 2368, 4941, 3220, 2249, 2890, 721, -1503, -86, -144, -2532, -1001, -250, -3500, -4458, -3117, -4842, -4824, -2150, -3059, -5437, -4635, -3661, -5841, -4388, -1890, -3611, -3386, -1265, -2322, -3760, -1367, -462, -1082, 1022, 2204, -552, -438, 2048, 1080, 1479, 4083, 3849, 1801, 2476, 2801, 1023, 2962, 5264, 3172, 2496, 3148, 1191, -215, 2172, 2398, 367, 1235, 751, -1723, -1729, -438, -1929, -2963, -673, -1917, -4564, -3962, -3784, -5519, -4071, -2623, -4551, -4713, -3721, -5436, -6250, -3532, -3042, -4108, -2432, -2216, -4070, -3389, -846]
1641h46o66J167K327j221j870J979J644n00K359R28k118K83J782n11j22K653k16
1658G052k340J379N92j983Q96J660j915l31J146j957j570J343k34j905J212M27
1674C472l354j111J318k028n40K246j220k843O9j94j794J408J637j766j246Q25
1690e121j376j162L115N14j435R48L54k364O86K772L4k2J624q69j446K668J302
1707B22j369J227J728j198jJ557j101k23K892P9j593R21O09j936O12K099j430
1724C095l60J581j767j587J213M98j487J055L29k706n28J704q64m00J141r97j916
1741a996J165R44j446M68J157j911j165K007k31n39J740m83k326J209J383o58
1757f82M65J697j365r96J485k36m19J795J238k133N10J269j921J38J854o2m61
$$ y = [-846, -1512, -345, 1982, 761, -1109, 870, 2514, 2014, 4373, 5301, 3183, 3466, 5248, 4737, 4615, 7268, 7052, 4712, 6091, 6683, 4700, 5596, 7256, 5341, 5010, 6156, 4199, 2629, 3972, 3738, 1833, 3045, 3472, 118, -993, 325, -1703, -2243, 3, -1217, -4060, -3991, -4185, -5979, -4571, -2934, -4700, -5946, -5121, -6497, -7659, -4544, -4030, -5465, -4517, -4163, -6527, -5841, -3069, -3035, -3057, -1433, -2302, -3748, -1080, 222, -1147, 80, 1808, 610, 609, 2166, 1065, 842, 3734, 3813, 2220, 3141, 3750, 1814, 2426, 4525, 3095, 2735, 4316, 2549, 962, 2175, 2673, 1186, 2241, 2570, -136, -664, 1040, 176, -224, 917, -80, -1996, -831, 113, -1333, -865, 292, -1619, -2784, -777, -1008, -1547, 193, -290, -2616, -1407, -24, -682, -217, 1480, 115, -881, 604, 368, -51, 1744, 2982, 849, 1359, 2628, 707, 845, 2699, 2637, 2176]
1774B176R03q13k345R88J377j171R06J015k281j955J030n43j18J970j58l002l78
1791b399Q8j187Q07K211j059j508L03j254j572K309J167p59J10k1j732j52K613
1808b035J47o14J463P2j992Q06R56k2Q93K628j296j745J370k35o8K032J062j159
1826B263K11K36j566k4K383P36q49R63j273k020J210J284n34M04P11j736j105
1843A294N58o7k74J749l88k632rno05N41J596q23j506M68o79j281O51R97m64j38
1863a017K42j980n47J569P2m59J317r1k125%J004p65J215J798j171j454Q48q6
1881a630o29J476J134q09o6O40j091m84K060l0q18R89m82j040L84Q87o50M69R86
1900A296j554o45P94o9p00J002N36j326P5M76j292L61J677l48j227Q46j99j192
$$ y = [2176, 3079, 2266, -79, 909, 2286, 1115, 2021, 3036, 755, -1200, -170, -713, -831, 1139, 981, -2021, -2399, -2311, -3498, -2691, -480, -1539, -3047, -2744, -3998, -5570, -3261, -2094, -2853, -2743, -2764, -4496, -4648, -2035, -1888, -2502, -1039, -967, -2959, -2153, -1197, -1219, -326, 2302, 1006, -739, 631, 396, 328, 2360, 3422, 2263, 2474, 2710, 1144, 1120, 3503, 4239, 3390, 4353, 3080, 1060, 2270, 3554, 3020, 3424, 4135, 2399, 1294, 1852, 1785, 1511, 3260, 2872, 240, 231, 226, -379, 162, 1758, 935, -571, -103, -782, -2063, -1412, -415, -879, -1017, -775, -2755, -3302, -1733, -1661, -2120, -803, -894, -3019, -3019, -2015, -2780, -1565, 233, -938, -2392, -1544, -1630, -2259, -783, 351, -458, -524, 116, -975, -1459, 601, 571, -247, 742, 260, -780, -396, 491, -159, 310, 1296, -258, -903, -109, -178, -878, 124, 660, -666, -591, -115, -1407, -1046, 631, 283, -944, -98, -297, -1489]
1918a489J301Q18n88K84N77q62o61J316M04j80J297j57k225M75J342j20M77J388
1936C397q95j209O52k43p52J681J080r98m32k37j365O5J714k0o62K96r98j669
1954e95J44Q09l23O83M86j824j748N93j65k02J402K04j545j340j0n65N89J749
1972a658j64j419L06n86j274J474J680l31n6P40j452o94J289J408k21J421p8j730
1990a345M88J168j75P96J391k51j018N50n37k13J619J045o99n86J6q63j81J415
2008B620J82r60N13o94j610L74R53n02Q6J39j105j271R14O0j37M95Q9j310p03
2027a867J127o02PJ302j43o55K18K4j093R33J317n65J88L63m73k05J023N05o29
2046G75Q80J23n45k55O22o1j25R65m12r78M02j30m67N34L55j019l53O65m39j020
$$ y = [-1489, -188, 630, 42, 326, 903, 41, -620, 696, 1100, 920, 2217, 2060, -165, 310, 1652, 1532, 2009, 3397, 2502, 1293, 1945, 1702, 950, 2631, 3711, 2713, 2281, 2044, 679, 744, 2458, 2438, 1776, 2072, 1074, -595, -451, 358, 35, 718, 1204, -620, -2368, -1775, -1940, -2142, -740, -536, -2081, -3421, -3431, -3996, -3407, -1658, -1822, -3241, -2935, -3521, -4795, -3321, -1641, -1972, -2028, -1288, -2740, -3434, -2145, -737, -958, 463, 385, -1345, -857, 311, 136, 932, 2323, 2072, 1054, 1604, 1067, 854, 2473, 3518, 2819, 2233, 2249, 1386, 1205, 2620, 2802, 1842, 2355, 1661, 51, 425, 1378, 876, 962, 1101, -4, -1275, -361, -301, -438, 57, 146, -1164, -1867, -740, -1342, -1335, -33, -176, -831, -613, -589, -1682, -749, 568, 3, 191, 554, 81, -124, 899, 1404, 775, 1655, 1778, 1233, 978, 1600, 1539, 1414, 2379, 1967, 989, 1391, 1261, 794, 1328, 1683, 664, 311, 976, 537, -483]
$$ [...]
8191a46
##END NTUPLES=NMR FID
##END=
