##TITLE=1H_TG-2249-1
 CDCl3, 8 sc, 
 19.8.2019
##JCAMPDX= 6.0         $$ Bruker NMR JCAMP-DX V2.0
##DATA TYPE= NMR FID
##DATA CLASS= NTUPLES
##ORIGIN= UXNMR, Bruker Analytische Messtechnik GmbH
##OWNER= root
$$ XWIN-NMR		Version 3.5
$$ Mon Aug 19 14:08:38 2019 Russian Standard Time (UT+4h)  she@DPX200
##.OBSERVE FREQUENCY= 200.13155
##.OBSERVE NUCLEUS= ^1H
##.DELAY= (6, 6)
##.ACQUISITION MODE= SIMULTANEOUS
##.ACQUISITION SCHEME= undefined
##.AVERAGES= 8
##.DIGITISER RES= 18
##SPECTROMETER/DATA SYSTEM= spect
##.PULSE SEQUENCE= zg30
##.SOLVENT NAME= D2O
##.SHIFT REFERENCE= (INTERNAL, D2O, 0, 15.7039)
##AUDIT TRAIL= $$ (NUMBER, WHEN, WHO, WHERE, WHAT)
$$ ##TITLE= Audit trail, XWIN-NMR		Version 3.5
$$ ##JCAMPDX= 5.01
$$ ##ORIGIN= Bruker BioSpin GmbH
$$ ##OWNER= she
$$ F:/spectra/data/she/nmr/H-F/1/audita.txt
$$ ##AUDIT TRAIL=  $$ (NUMBER, WHEN, WHO, WHERE, WHAT)
(   1,<2019-08-19 14:07:11.67 +0400>,<she>,<DPX200>,
      <created by zg, POWCHK disabled, PULCHK disabled
       configuration hash MD5:
       00 E9 B6 7A A2 85 ED C7 34 08 36 98 17 FE 4E 26
       data hash MD5: 16K
       95 6E EF 21 91 43 B8 CB 59 FE D7 80 BF 85 E1 AE>)
$$ ##END=
$$ 
$$ hash MD5
$$ B5 1F 79 41 62 C2 B4 61 1E 41 7E 49 73 3C 35 B6
##$RELAX= 
##$RELAX= 
##$RELAX= 
##$RELAX= 
##$RELAX= 
##$RELAX= 
$$ Bruker specific parameters
$$ --------------------------
##$DU= <F:/spectra>
##$EXPNO= 1
##$NAME= <H-F>
##$PROCNO= 1
##$TYPE= <nmr>
##$USER= <she>
##$AMP= (0..31)
100 100 100 100 100 100 100 100 100 100 100 100 100 100 100 100 100 100 
100 100 100 100 100 100 100 100 100 100 100 100 100 100 
##$AQSEQ= 0
##$AQ_mod= 1
##$AUNM= <au_zg>
##$AUTOPOS= <>
##$BF1= 200.13
##$BF2= 200.13
##$BF3= 200.13
##$BF4= 200.13
##$BF5= 200.13
##$BF6= 200.13
##$BF7= 200.13
##$BF8= 200.13
##$BYTORDA= 1
##$CFDGTYP= 0
##$CFRGTYP= 5
##$CHEMSTR= <none>
##$CNST= (0..31)
1 1 145 1 1 1 1 1 1 1 1 1 1 1 1 1 1 1 1 1 1 1 1 1 1 1 1 1 1 1 1 1 
##$CPDPRG= <>
##$CPDPRG1= <>
##$CPDPRG2= <>
##$CPDPRG3= <>
##$CPDPRG4= <mlev>
##$CPDPRG5= <mlev>
##$CPDPRG6= <mlev>
##$CPDPRG7= <mlev>
##$CPDPRG8= <mlev>
##$CPDPRGB= <>
##$CPDPRGT= <>
##$D= (0..31)
0 1.2 0 0 0 0 0 0 0 0 0 0.03 0 0 0 0 0 0 0 0 0 0 0 0 0 0 0 0 0 0 0 0 
##$DATE= 1566209230
##$DBL= (0..7)
120 120 120 120 120 120 120 120 
##$DBP= (0..7)
150 150 150 150 150 150 150 150 
##$DBP07= 0
##$DBPNAM0= <>
##$DBPNAM1= <>
##$DBPNAM2= <>
##$DBPNAM3= <>
##$DBPNAM4= <>
##$DBPNAM5= <>
##$DBPNAM6= <>
##$DBPNAM7= <>
##$DBPOAL= (0..7)
0.5 0.5 0.5 0.5 0.5 0.5 0.5 0.5 
##$DBPOFFS= (0..7)
0 0 0 0 0 0 0 0 
##$DE= 6
##$DECBNUC= <off>
##$DECIM= 24
##$DECNUC= <off>
##$DECSTAT= 4
##$DIGMOD= 1
##$DIGTYP= 9
##$DL= (0..7)
0 120 120 120 120 120 120 120 
##$DP= (0..7)
150 150 150 150 150 150 150 150 
##$DP07= 0
##$DPNAME0= <>
##$DPNAME1= <>
##$DPNAME2= <>
##$DPNAME3= <>
##$DPNAME4= <>
##$DPNAME5= <>
##$DPNAME6= <>
##$DPNAME7= <>
##$DPOAL= (0..7)
0.5 0.5 0.5 0.5 0.5 0.5 0.5 0.5 
##$DPOFFS= (0..7)
0 0 0 0 0 0 0 0 
##$DQDMODE= 0
##$DR= 18
##$DS= 0
##$DSLIST= <SSSSSSSSSSSSSSS>
##$DSPFIRM= 0
$$ [...]
##$SUBNAM2= <"">
##$SUBNAM3= <"">
##$SUBNAM4= <"">
##$SUBNAM5= <"">
##$SUBNAM6= <"">
##$SUBNAM7= <"">
##$SUBNAM8= <"">
##$SUBNAM9= <"">
##$SW= 24.9336996594482
##$SWIBOX= (0..15)
0 0 2 0 0 0 0 0 0 0 0 0 0 0 0 0 
##$SW_h= 4990.01996007984
##$TD= 16384
##$TD0= 1
##$TE= 0
##$TE2= 300
##$TE3= 300
##$TEG= 300
##$TL= (0..7)
0 120 120 120 120 120 120 120 
##$TP= (0..7)
150 150 150 150 150 150 150 150 
##$TP07= 0
##$TPNAME0= <>
##$TPNAME1= <>
##$TPNAME2= <>
##$TPNAME3= <>
##$TPNAME4= <>
##$TPNAME5= <>
##$TPNAME6= <>
##$TPNAME7= <>
##$TPOAL= (0..7)
0.5 0.5 0.5 0.5 0.5 0.5 0.5 0.5 
##$TPOFFS= (0..7)
0 0 0 0 0 0 0 0 
##$TUNHIN= 0
##$TUNHOUT= 0
##$TUNXOUT= 0
##$USERA1= <user>
##$USERA2= <user>
##$USERA3= <user>
##$USERA4= <user>
##$USERA5= <user>
##$V9= 5
##$VALIST= <valist>
##$VCLIST= <CCCCCCCCCCCCCCC>
##$VD= 0
##$VDLIST= <DDDDDDDDDDDDDDD>
##$VPLIST= <PPPPPPPPPPPPPPP>
##$VTLIST= <TTTTTTTTTTTTTTT>
##$WBST= 1024
##$WBSW= 4
##$XGAIN= (0..3)
0 0 0 0 
##$XL= 0
##$YL= 0
##$YMAX_a= 401749
##$YMIN_a= -554065
##$ZGOPTNS= <>
##$ZL1= 120
##$ZL2= 120
##$ZL3= 120
##$ZL4= 120
##$ABSF1= 10
##$ABSF2= 0
##$ABSG= 5
##$ABSL= 3
##$ALPHA= 0
##$AQORDER= 0
##$ASSFAC= 0
##$ASSFACI= 0
##$ASSFACX= 0
##$ASSWID= 0
##$AUNMP= <proc_1d>
##$AZFE= 0.1
##$AZFW= 0.1
##$BCFW= 1
##$BC_mod= 2
##$BYTORDP= 1
##$COROFFS= 0
##$CY= 11.3945322036743
##$DATMOD= 1
##$DC= 2
##$DFILT= <>
##$DTYPP= 0
##$F1P= 20.1720416913024
##$F2P= 0.152960286110954
##$FCOR= 0.5
##$FTSIZE= 0
##$FT_mod= 4
##$GAMMA= 1
##$GB= 0.15
##$INTBC= 1
##$INTSCL= 1
##$ISEN= 128
##$LB= 0.24
##$LEV0= 0
##$LPBIN= 0
##$MAXI= 10000
##$MC2= 0
##$MEAN= 0
##$ME_mod= 0
##$MI= 1.114404
##$NCOEF= 0
##$NC_proc= 0
##$NLEV= 6
##$NOISF1= 3.799351
##$NOISF2= 2.8
##$NSP= 1
##$NTH_PI= 0
##$NZP= 0
##$OFFSET= 15.70392
##$PC= 1
##$PHC0= -9212.981
##$PHC1= 11.00097
##$PH_mod= 1
##$PKNL= yes
##$PPARMOD= 0
##$PSCAL= 0
##$PSIGN= 0
##$REVERSE= no
##$SF= 200.130013532006
##$SI= 16384
##$SIGF1= 3
##$SIGF2= 2
##$SINO= 400
##$SIOLD= 16384
##$SREGLST= <1H.CDCl3>
##$SSB= 0
##$STSI= 0
##$STSR= 0
##$SW_p= 3612.71676300578
##$SYMM= 0
##$S_DEV= 0
##$TDeff= 0
##$TDoff= 0
##$TI= <>
##$TILT= no
##$TM1= 0
##$TM2= 0
##$TOPLEV= 0
##$USERP1= <user>
##$USERP2= <user>
##$USERP3= <user>
##$USERP4= <user>
##$USERP5= <user>
##$WDW= 1
##$XDIM= 8192
##$YMAX_p= 0
##$YMIN_p= 0
$$ End of Bruker specific parameters
$$ ---------------------------------
##NTUPLES= NMR FID
##VAR_NAME=  TIME,          FID/REAL,        FID/IMAG
##SYMBOL=    X,             R,               I
##VAR_TYPE=  INDEPENDENT,   DEPENDENT,       DEPENDENT
##VAR_FORM=  AFFN,          ASDF,            ASDF
##VAR_DIM=   8192,          8192,            8192
##UNITS=     SECONDS,       ARBITRARY UNITS, ARBITRARY UNITS
##FACTOR=    0.0002004,     1,               1
##FIRST=     0,             0,               0
##LAST=      1.6414764,     0,               0
##MIN=       0,             -554065,         0
##MAX=       1.6414764,     401749,          0
$$ Real data points
##PAGE= N=1
##DATA TABLE= (X++(R..R)), XYDATA
$$ [...]
2353C77k548J738K257j304o37j8j045J042J958j545k457J338J030l19O30j002
2369e05j767J416J946j141j513J398r20RJ863r41j905J479J254j026M79K41j539
2386a172P22K020j461n48O38J9l44J500l73k125R33K047j154m75O08j428K52K245
2404A904m30k160O59O51m15J099l42k294J82K395m13j401O37q25j81K158k86k710
2422a772K69J786l34L72l28j981L80K752k39k597K06P14Q20J499r85l146Q28L337
2440A581j28j765J66j325J194K569o88l429R15J930j17N83j114j895Q34L718j284
2457A745k675k36J164J147J680j691l585J149L722l82j852j317p55K216K686k295
2473G21l796J189K644O26l08k171j915K224L340j912l267L43J728J376Q92k519
$$ plain form
2353 377 -2171 -433 1824 520 -117 -135 -1180 -138 1820 275 -2182 -844 186 -133 497 -505
2369 -505 -2272 -856 1090 -51 -1564 -166 -1086 -1077 786 -155 -2060 -581 673 -353 126 367 -1172
2386 -1172 -450 1570 109 -439 199 218 -126 1374 1001 -1124 -191 1856 702 227 835 -593 -341 1904
2404 1904 1474 -686 -27 624 209 1308 966 -1328 -1146 1249 836 -565 72 -753 -934 1224 938 -1772
2422 -1772 -1503 283 -51 321 -7 -1988 -1608 1144 905 -1692 -1486 -772 48 1547 562 -2584 -1756 1581
2440 1581 1453 -312 -146 -1471 -277 2292 1604 -1825 -910 1020 903 1486 372 -1523 -689 3029 1745
2457 1745 -930 -1166 -2 1145 2825 1134 -2451 -1302 2420 2038 186 -1131 -1886 330 3016 721
2473 721 -3075 -1886 758 1384 1076 -1095 -3010 -786 2554 642 -2625 -2282 -554 822 1714 -805
2489h05k919K356L363l63k491r31l45K927K135k299l973J535L663P70j519k280
2505a176j809L707L726k933l784P56K641J340p5l425k205L638L324k087k955j09
2521a426N15K880J180l452l356K848L239m37j987k101n09L888K402l725l712J714
2537b039K709J259o99l889j017M155L224l140l056Q0J996K689K54m326k286M221
2553A35K483q89k533j557Q66L853J086m047k882K612K945N01j802l019r5M322
2569A979J975l712k653R57K153K442o27m663j270M448K756k529k712j036J703
2584g89L634j08m818j635L197K949j031k075k609R57M632O42m192k105K043K201
2600H93J457j522l767Q2M635J465l316k018l70K486L135j074m637m42L915J839
$$ plain form
2489 -805 -3724 -1368 1995 1632 -859 -1790 -2135 792 2927 628 -3345 -1810 1853 2623 1104 -1176
2505 -1176 -2985 722 4448 1515 -2269 -1513 1128 2468 2393 -1032 -3237 401 3725 1638 -1317 -1426
2521 -1426 -911 1969 3149 -303 -3659 -811 2428 1991 4 -2097 -2606 1282 3684 -41 -3753 -2039
2537 -2039 670 1929 1230 -2659 -3676 479 3703 563 -2493 -2413 -417 2272 2526 -1800 -4086 135
2553 135 2618 1729 -804 -2361 -1495 2358 3444 -603 -3485 -873 2072 2573 771 -2248 -2343 1979
2569 1979 3954 242 -2411 -1454 699 3141 2514 -2149 -3419 1029 3785 1256 -1456 -2492 -789
2584 -789 2845 2737 -2081 -3716 -519 2430 1399 -676 -3285 -2328 2304 2946 -1246 -3351 -1308 893
2600 893 2350 828 -2939 -2857 1778 3243 -73 -2091 -2461 25 3160 2086 -2551 -2993 922 2761
2616B761j228k143j639J444L905O2m582r25K344J963N98k040l186Q30M397L75
2632B936l464j231K82J900K538j654l946K58L738O99j967j347j128J613L301j243
2648A285l744JK613Q23M32j906k727J808L580n73k834q28J218J260J521j582l140
2665b793J365L263M0j700j442l59K064K195j546k836O62K112M77k39j157k116
2681b010J695K823j048k500N42L53O70J311j765k060J303K371p84j306k76j020
2697a701J282K299j676k157R25J589m06M4p88j412J367K381j660j777R56L11M55
2714C2J048r41k036J239J611p57m69J52m61N84J476j020j591J139Q70p29O54l89
2732D12j376J012J464r26j269J074l45J42J083o47j385O01R43o58k40L17q16J92
$$ plain form
2616 2761 1533 -610 -2249 -805 3100 3162 -1420 -2345 -1 1962 2560 520 -2666 -1836 2561 2936
2632 2936 -528 -1759 -1477 423 2961 1307 -2639 -2381 1357 2056 89 -1258 -2386 -773 2528 1285
2648 1285 -2459 -2458 155 978 1410 -496 -3223 -1415 2165 1592 -1242 -2070 -852 408 1929 347 -2793
2665 -2793 -1428 1835 1875 175 -1267 -1626 438 2633 1087 -1749 -1087 1025 1502 1263 106 -2010
2681 -2010 -315 2508 1460 -1040 -498 -145 525 1836 71 -1989 -686 1685 901 -405 -681 -1701
2697 -1701 -419 1880 204 -1953 -1028 561 155 199 -589 -2001 -634 1747 87 -1690 -734 -423 32
2714 32 1080 139 -1897 -658 953 196 -273 -121 -582 2 1478 458 -1133 6 876 147 801 412
2732 412 -964 48 1512 586 -683 391 46 188 1271 624 -761 -160 783 125 -115 202 -614 -422
2750d22J703j103j046L22O28o28Q89O6k039Q48J330o17l27K79o06n25J922l34
2768C40j824O84Q78q3M00p1j465R6J989K4j503L95k96L31J508m94j987P45J424
2787A091l86J5m33q42N08J561l61j786L60N24J30R16n18j847K84K404o52j135
2805a67k49l24O72J350q21k356P01J980k67m14p24q95J032J733m74k321J55J103
2823b86Q11M64j296j838J203K637p92j752j16P6J064J776j515k574J114K157L01
2840A434o42j372j149K044K147j052k912L49J685P80L77j992j848J992K780j604
2856A017j716l68K93K142P47j989k475J810K001j63j287j409l05K039K312k837
2872a88k233J230J469R75o67j992j528K618K714k067k052j10J481J708N25k642
$$ plain form
2750 -422 1281 178 -868 -546 82 -546 343 409 -1630 -782 548 -69 -396 -117 -723 -1248 674 340
2768 340 -1484 -800 78 -5 395 324 -1141 -1045 944 968 -535 -140 -436 -105 1403 909 -1078 -333 1091
2787 1091 705 720 287 -555 -47 1514 1153 -633 -273 251 381 1297 779 -1068 -784 1620 968 -167
2805 -167 -416 -740 -68 1282 461 -1895 -1194 786 519 105 -619 -1514 -482 1251 777 -1544 -1389 -286
2823 -286 525 989 -307 -2145 -942 1695 903 -849 -965 -889 175 1951 436 -2138 -1024 1133 1434
2840 1434 792 -580 -1729 315 2462 1410 -1502 -1153 532 1312 1689 -303 -2151 -159 2621 1017
2856 1017 -699 -1067 -774 1368 2115 126 -2349 -539 1462 1299 12 -1397 -1702 337 2649 -188
2872 -188 -2421 -1191 278 1253 586 -1406 -2934 -316 2398 331 -1721 -1831 -350 1358 1883 -759
2888g59k072K526K552p86j841j075K64K751J482k970k415J816K097L87j227k201
2904a471o51L325J773k458k468R33J209J821k6l176j693L492J872j654j830j021
2920b023J169K596L44l226j548K315J769k29j303j752o1L208J277l164j903J159
2936a372J846J145o79l034k19L356J162k010j748q5J166K398k83k975q49K678
2952D97J503o31j611j533J197K732L60l179j013J574J396P67j402k549J60L412
2968A680N10k374j190M37J121J895o88l091n50K964J108j168j550j100J254K464
2984A722l33l234k83K018J242J6j138k461J227K782j27k106r72R62Q44J457j238
3001C78k625Q94K490P11j745o31o04J173K022o56k750J00J866O87k28j338j293
$$ plain form
2888 -759 -2831 -305 2247 1461 -380 -1455 -1191 1560 3042 72 -2343 -527 1570 1957 730 -1471
2904 -1471 -2122 1203 2976 518 -1950 -1017 192 2013 1987 -1189 -2882 610 2482 828 -1002 -2023
2920 -2023 -854 1742 2086 -1140 -2688 -373 1396 1167 -136 -1888 -1949 1259 2536 -628 -2531 -1372
2936 -1372 474 1619 940 -2094 -2313 1043 2205 195 -1553 -1638 -472 1926 1643 -1332 -2181 497
2952 497 2000 1369 -242 -1775 -578 2154 2514 -665 -1678 -104 1292 2059 657 -1892 -1732 1680
2968 1680 2190 -184 -1374 -937 184 2079 1391 -1700 -2250 714 1822 654 -896 -1996 -742 1722
2984 1722 1389 -1845 -2128 -110 1132 1148 10 -2451 -1224 1558 1431 -675 -1647 -685 159 1616 378
3001 378 -2247 -1353 1137 1848 103 -528 -1132 41 2063 1407 -1343 -1243 623 1310 1082 -256 -1549
3018a549J579J539j88j758m16J068L33Q05r33j799N91K259l44j567m39k02R51
3035g0J425r73k142O72J453L85m89o03j064R35K053j182j915M51P27P41M95r32
3053c3j497P73K003o51j154J18J4P70R44j392j156J054J176k09p1o60n71N10J458
3072A426j010o93K65K39J58Q10p93j266P52J278j069m26M59m82J48J152p57j130
3090i39O13N90m55K02k58p93N87J079m28p44J85j7O7Q38n48j315J139O79n68l21
3110d07M34m90K93J041o03q58N18M02o35P59K95j176N73P15l62n35K99k35J01
3129A29O54l56r04O33J44p7J83m0j154M18J180k60r15J19J12P8O29j42j629K51
3149i47J427k23l56M0j106R57J105q15j063M22O68r3L63m90j075N20J716m59j403
$$ plain form
3018 -1549 30 1569 1381 -377 -793 275 608 1413 480 -1319 -728 1531 1187 -380 -819 -1021 -70
3035 -70 1355 382 -1760 -1088 365 750 261 -342 -1406 -471 1582 400 -1515 -1064 -337 404 899 -33
3053 -33 -1530 -757 1246 595 -559 -441 -427 343 1287 -105 -1261 -207 969 760 689 29 -542 -32 1426
3072 1426 416 -277 -12 227 385 1195 402 -864 -112 1166 97 -329 130 -352 -204 948 191 -939
3090 -939 -326 264 -191 11 -247 -1040 -453 626 198 -546 -361 -378 -311 527 -21 -1336 -197 482 -86 -407
3110 -407 27 -463 -170 871 268 -590 -72 330 -305 454 749 -427 146 861 499 -36 263 28 129
3129 129 783 427 -477 156 300 223 406 366 -788 -370 810 550 -365 -246 -134 -56 573 431 -1198 -947
3149 -947 480 257 -99 -59 -1165 -208 897 82 -981 -559 109 16 379 -111 -1186 -666 1050 591 -812
3168h12L33J74M47J053p72j402L85J636J60q97n67l59O54J518o99j561K49R12
3186D52K94J35q22j439R93J901n62j489k78N21R83N69r38j975N98J831K33j011
3204dr98l52J378J443j397j639L38J324N87k13j115j117J447J875r64j869j25
3221a401J057J039M87j364j439J094J947p28j084n62L09J572J074j716j794Q39
3237f70J488P26q53j521q04K093J664j649j699M65J005J278k67j930r70J584J870
3254A810j092j447o56P45J457O29k072j187J351J428j50r46j180r0J833J180j614
3271aj531N14J242P72j67k176m11K192J064r08j638k7P06J880P0k145j093J785
3289A28J251k17j306j216O18K144N84k147j097J021J114P71j084j930K91J855
$$ plain form
3168 -812 -479 -305 142 1195 423 -979 -594 1042 1202 305 -262 -621 33 1551 852 -709 -460 452
3186 452 746 881 59 -1380 -387 1514 952 -537 -815 -294 689 1258 320 -1655 -1057 774 1007 -4
3204 -4 -1002 -1354 24 1467 70 -1569 -1231 93 680 467 -648 -1765 -318 1557 593 -1276 -1401
3221 -1401 -344 695 1182 -182 -1621 -527 1420 692 -392 -954 -645 927 2001 285 -1509 -670
3237 -670 818 1544 691 -830 -1634 459 2123 474 -1225 -760 245 1523 1256 -674 -1644 -60 1810
3254 1810 718 -729 -1385 -640 817 1446 -626 -1813 -462 966 816 -130 -1310 -1400 433 1613 -1
3271 -1 -1532 -1018 224 996 829 -1347 -1758 434 1498 590 -1048 -1075 -369 1511 1581 -564 -1657 128
3289 128 1379 1162 -144 -1360 -742 1402 1986 -161 -1258 -237 877 1648 564 -1366 -1075 780
3305G80J455k037j220P5R75J544j24k809l36K151R24p92j356o43P33J827j92k051
3323a096p02J321J221M62j219j803O11K548k21j474r79P50J207N92p50j656j75
3340a363K170L14o57j473j14R49J710l12k206p6J478P05j44j100q60P02J680l87
3358A016j583l26O75P11N86j022j117O4K170k07j274m27j05R82Q72o68j470L8
3376a085J315O24n33r89n05M54J697m80j375J07K49R22L60r12r45P25J204n8j256
3395d81j14r8J052P25r66j151O43J041L41r98m6m71Q81J449j242j223L82O36J9
3414C79L35p81r00R68J284r60p49j59M78L39J95l81j281R96O10m0p59J17l48O18
3434c9N87m07r81L73M76K31L96p52n65M55P44m09o13J22J05L94O77m38p66L94
$$ plain form
3305 780 2235 198 -1022 -947 28 1572 1448 -1361 -1697 454 1378 586 -770 -1413 -680 1147 955 -1096
3323 -1096 -1798 -477 744 1206 -13 -1816 -1205 1343 1122 -352 -1331 -581 626 1218 468 -1188 -1363
3340 -1363 807 1121 464 -1009 -1123 -174 1536 1224 -982 -1058 420 1125 981 -119 -979 -277 1403 1016
3358 1016 -567 -893 -218 493 1079 57 -1060 -996 1174 967 -307 -734 -839 143 1015 347 -1123 -1085
3376 -1085 230 854 321 -668 -1173 -719 978 498 -877 -770 -521 401 761 -151 -1096 -371 833 775 -481
3395 -481 -595 -693 359 1084 118 -1033 -390 651 992 -6 -52 -523 358 1807 565 -658 -276 360 379
3414 379 714 -67 -967 1 1285 325 -424 -583 -105 234 429 48 -1233 -237 373 333 -426 -309 -657 -39
3434 -39 548 141 -840 -467 9 240 636 -116 -681 -226 518 109 -504 -382 -277 117 794 356 -410 -16
3454a6M79j41p3l31L8M11L76o83k02M67J92p29O98k47m99L66J94ko0J93n24o6
3476a59O60l59n42L02J09L01l95P0o81N84J56J46o96J38J90p3M33l89l86K2L38
3497b31K13K53m57L9J0P87n1j254N42J19J54N24l51j120N78Q29k3n95l5l48N65
3518A48O69l28q75J67N07L05k62l58m87K91J122l67j040K46J48M10L16o14j081
3537a083N76R72R4p53l32j72R21M54q75q18K28J017L37m18l79j090J397R81q17
3556B40j197j9Q00Q20j38p31j062J017J352m87p76p17L75J014J044j344q68M21
3574b56R78P0k54q53o49J296R18o60j360p3Q87R75j51j432m53J044R51m28j156
3593f06n83Q05O64Q00j032j303L89J529k1q50o95j7J097Q89p82j430M53J009M58
$$ plain form
3454 -16 463 322 249 -82 -44 367 743 60 -142 325 517 -212 486 239 -260 106 300 298 238 431 -93 -159
3476 -159 501 142 -400 -98 11 312 -83 -13 -694 -110 46 192 -504 -366 -176 -249 184 -205 -591 -569 -231
3497 -231 -18 235 -222 -183 -173 614 563 -691 -149 -30 124 648 297 -823 -245 584 561 -34 -69 -417 148
3518 148 817 489 -386 -219 288 593 331 -27 -514 -223 899 532 -508 -262 -114 296 612 -2 -1083
3537 -1083 -507 465 559 -194 -526 -698 223 677 -198 -1016 -788 229 566 148 -231 -1321 76 1057 240
3556 240 -957 -976 -176 644 506 -225 -1287 -270 1082 595 -181 -898 -523 491 1535 191 -677 -256
3574 -256 722 792 538 -315 -964 332 1250 590 -770 -843 44 1019 868 -564 -1017 27 978 550 -606
3593 -606 -1189 -384 280 1080 48 -1255 -866 663 642 -208 -903 -920 177 1066 284 -1146 -693 316 774
3612G74m36q79q02J299J388p48j301r0P51R28N35j800r17J386J008j38j229l78
3630f49M25J074M60j176j339Q45Q09O18p60j093n4J334J102j210j131j55Q45Q34
3648G79n4j458p83J407J327r37q37o87P65J071L70j457j095J357J186k17j228
3665d91p15L13J656L16j144q10M14Q94O83p23j088J20J226L27o45j007m5Q17J044
3684A142n21j224m35J029J072l17j050n12N53R80M03j396p06O44R70L70r47p81
3702g26k7J341K97j087m38j4P16R97r15j132K91Q80N62n41o21m86O67P78J66j474
3722g66J4O70N77l4p76j08k19J580r2j087l80K69P31N04p94j091M92J040Qj79
3742C59q73K07M71R43l90j224K72M45M00k37o43k40K90J034j25q70l67M98J91
$$ plain form
3612 774 338 -541 -1343 -44 1344 596 -705 -795 -44 884 1419 -381 -1298 88 1096 958 -271 -649
3630 -649 -224 850 1310 134 -1205 -360 449 1067 307 -786 -840 494 1596 386 -745 -900 -55 779
3648 779 725 -733 -1516 -109 1218 281 -556 -1243 -478 593 963 -494 -1589 -232 954 737 -491
3665 -491 -1206 -893 763 1079 -65 -875 -461 433 1116 393 -695 -575 651 978 333 -674 -719 98 1142
3684 1142 621 -603 -1038 -9 1063 746 -304 -816 -263 717 1120 -276 -982 -338 632 1002 55 -726
3702 -726 -753 588 885 -202 -640 -654 62 1059 144 -988 -697 183 745 204 -417 -903 -236 542 708 -766
3722 -766 -752 -82 495 461 -315 -423 -642 938 846 -241 -621 -352 379 883 89 -1002 -510 530 538 359
3742 359 -514 -307 164 1107 717 -507 -235 210 610 373 -270 -510 -220 814 689 -181 -548 -50 141
3761A41M32p09p15N51O32J6l05o38m0P26N13m51p45L05K83L03k35l72m34O86O58
3782F02l42m31k78J50O46K39n27l57J63O77j87l96j94J59M55J85l23p98L31M11
3802A85J83J6m55M8L10J00L2m80m13K59L23O5j64n75L35J19K46j18n49M17LM04
3824B91J7p38RJ26N7K91l39J21K01o4K22n52Q9K29K4K11k61k2l21O24R7l43Q4
3847E3o72N85M29k61k7m39M69RJ70J37p71k64Q48J22m2k80l90K26N39k32l09M8
3869e2J47M17j78n32m36K03P33k24n6m38L7L61O00m57n67m6K71M85o62K18k84
3890d60P53J45J34j090j4N85m8N01o82m83K98O15J32n44r4n0Q09N70q37n79j31
3911d70R96J36k75q07P3P30M72m38r62K03L81M18j09r46J85M08N99k96n38o92
$$ plain form
3761 141 573 -136 -851 -300 332 348 43 -595 -635 91 604 153 -592 -287 -4 299 64 -308 -742 -56 602
3782 602 260 -171 -449 -299 347 586 59 -298 -135 542 355 -41 -235 -76 379 564 241 -557 -226 185
3802 185 368 384 -71 -23 287 387 419 -61 -474 -215 108 173 9 -566 -231 -112 134 16 -533 -116 -113 291
3824 291 308 -430 -421 -295 -238 53 -286 -165 36 -28 194 -358 -269 -40 -16 195 -66 -88 -409 215 312 -31 53
3847 53 -619 -34 395 134 107 -332 137 146 316 453 -318 -582 266 388 346 66 -324 -98 441 209 -100 -52
3869 -52 95 512 334 -198 -634 -431 302 78 22 -416 -379 -18 582 125 -442 -488 -217 268 -394 -176 -460
3890 -460 293 438 572 -518 -532 53 5 506 -176 -659 -361 254 386 -158 -252 -302 507 1077 240 -339 -470
3911 -470 526 662 387 -420 -347 383 855 417 -545 -342 39 457 348 -598 -413 -5 594 298 -240 -932
3931i32M71Q57J33p24p56O58O36L7n35m66o1Q60P04p34j008L08N55K93k87m98
3951d89k06Q53O73m42j167J36M74M95P1m83p63O11J046k81o50j59J20Q23K63q62
3971F3o63L60O93Q2m44n74r4O56O12l00p80N6N74O24o02q09k43O60P20l80q49
3992f38j19K65Q87K32o40q49M07R83m13j23o81J65P74N89j007n33K8R53M30p15
4012el24n93R69P66m18p79J02J77R10k13r58m65O90R61n7q74l93K31R12J19p62
4033do34M30P94J16n95r43J61R81M78p09p76K24M27P56k68j040L2N97O54n56m19
4054b94k33M54O97m3r13m42O65L60J75m74p80K10J228Q7o02p17J07P40M52n14
4074A63o88K33N30L78j00r77J30N89L80m3r33j69O74P11m43p79k83L32O47K86
$$ plain form
3931 -932 -461 396 529 -195 -951 -293 343 380 -155 -621 -682 178 882 148 -860 -552 3 296 9 -489
3951 -489 -695 158 831 389 -778 -642 -168 327 398 -85 -848 -237 809 528 -122 -281 -161 662 925 63
3971 63 -600 -240 453 535 91 -483 -577 79 691 391 -389 -333 241 865 263 -546 -789 -129 591 211 -638
3992 -638 -757 -492 395 627 -13 -862 -455 528 115 -8 -689 -524 250 839 -168 -701 -673 280 710 -5
4012 -5 -329 -922 47 813 395 -384 -282 -105 805 592 -366 -831 -141 820 763 -111 -504 -273 639 758 -4
4033 -4 -638 -208 586 702 107 -836 -675 306 784 75 -701 -477 -50 706 438 -602 -570 27 681 125 -294
4054 -294 -527 -73 624 581 -332 -774 -109 251 426 -48 -828 -618 610 697 95 -622 -515 225 677 163
4074 163 -525 -292 238 616 516 -461 -331 258 638 595 -338 -507 167 878 435 -344 -627 -295 352 638
4094F38q39l09J43N24K19j98p52L99O60J1p12k79o0R46Q1n30n96k3N06O24l54
4115I9l84k33L06Q81n02m96n3L35L23K0l45m75N37J97L4j18l63K47L18L26n53
4136A01l11J82K08M45p92l7J2K01K81J02o17J8K2O02k37l12l40R0O84j70o42K28
4158b82K88l4L50j28l31m32L53J98n8Pk55M07L16l96k35k76N07m0K15J22m29j65
4180b98M03j4j79k9o7K00J78r1m89M42K28k26K27k95n6J77J29O8l34m0kK06k74
4203a36M65m97j33M75k28N6j41N2r3K66Q9l41J5J56L6J74l98Jj17L58Q2J61n97
4226b95J65J46kO6Q9o48O13N01o80n2J54k59K15J95l47j51L05L79M6m59k32K12
4248c9N62l0l27k21j79J07K55J46o28J4L14L27j57l92l66L83O76k98m5m64L51
$$ plain form
4094 638 -201 -510 -367 157 376 178 -574 -175 485 496 -216 -495 -555 391 472 -58 -654 -677 -171 453 99
4115 99 -285 -518 -212 669 167 -329 -382 -47 276 296 -49 -524 13 210 244 126 -237 10 328 654 101
4136 101 -210 -28 180 625 -167 -204 -192 9 290 392 -225 -207 -185 417 180 -132 -472 -382 302 132 -510 -282
4158 -282 6 -28 322 194 -137 -569 -216 -18 -76 -69 -324 83 399 3 -232 -508 -1 -41 174 296 -133 -298
4180 -298 105 91 -88 -117 -184 16 194 103 -386 56 284 58 285 -10 -66 111 240 308 -26 -66 -68 138 -136
4203 -136 329 -168 -301 174 -54 2 -139 -87 -180 86 175 -166 -151 5 41 215 -183 -182 -299 59 141 302 -295
4226 -295 -130 16 14 80 169 -479 134 635 -45 -97 57 -202 13 208 -139 -290 15 394 440 -19 -251 -39
4248 -39 523 493 166 -55 -234 -127 128 274 -354 -340 -26 301 144 -248 -614 -231 445 147 102 -362 -11
4269a1K23j70o3m56J00M00L29l31m54J2K22J35j09l84K0O11K48m18k85J84N2M31
4291B86J43p99K6L89K76n9l44l74M51O31j67m47m55L94K59K29j37o78N5O18J54
4312D51o28k42J64L52N12j38j229K55N85L62n12r8n36P23N29m77k61k21K90J78
4332E9K36m76j99r7Q61R8q46%L23mM19j53p91L93M45K92m60o43J98L08N40j87
4354C16q25q2P30N02l24p64q5L61O46n1q17j43O47L28k35m29l11K61N08L83l38
4375B78q15J94K44Q64p97o50L06L88L89k41n05m96N79Q18k28p90k11L61M31M71
4395E90r81k86M53L97L62o85l24L96J76P04r88j45o7Q66N5n58n55K82M81O05r12
4416a34k23J11L28M40n01J56m17l1R12m75r1m91J96N18K27j030M0K61O84l43k41
$$ plain form
4269 -11 212 42 -21 -477 -377 23 352 21 -433 -421 -199 -64 -173 -557 -537 74 322 -96 -381 -197 -145 286
4291 286 429 -370 -344 45 321 262 -82 -456 -5 626 459 12 -443 -49 210 439 302 -376 -321 297 451
4312 451 -177 -419 -255 97 609 471 -758 -503 82 444 -68 -166 -702 21 550 73 -188 -409 -119 59
4332 59 295 -181 -380 -477 384 482 -364 -364 -41 -45 374 221 -570 -177 268 560 100 -543 -345 -37 503 316
4354 316 -509 -591 139 641 317 -447 -532 -171 475 424 -393 -536 111 439 204 -225 -536 -275 233 616 278
4375 278 -537 -343 -99 765 -32 -682 -376 12 401 160 -345 -841 -262 556 328 -462 -673 -312 119 590
4395 590 -391 -677 -224 173 535 -150 -474 -78 98 802 -186 -331 -398 468 523 -35 -590 -308 173 778 -134
4416 -134 -357 -246 82 522 21 177 -240 -271 641 166 75 -416 -220 298 525 -505 -465 -204 480 137 -104
4437a04n2k35O08P6m36k50L62L01p0P7n93JK92M06l24k21j48J43O83k25o61J86
4459a84j98N58K58k74o99M73L09M01n65n97K23L06L38J9l92m29O52J32k71N8l04
4480a86L82M42l94n43R5K28M92l44l85j05Q4L39L23o28k99L50K44j44j5j11j14
4501b89K51K78m49p7Q5M88q4k16k23J9L37M7o4j64J55m67O72k61J15m88J98L21
4523A84j58K6K02j91k36N39m51l0l7j8N50j25l29L11j58L01k69J19k20p2j10N60
4545C88m52k19J76K02j64K00k06l31M85l3k20l97O04l40K51L08n39n5K26Q8L86
4566C58n77R7j43N37q2j00j9j9J11j50J71K5m13K83L17n68P1j54j12L55J89n8
4588A19j57P2K96%k32m09K18Q3K87m97K46L0k22J35K63j90k99P8M12k01o0J0J08
$$ plain form
4437 -104 -156 -391 217 293 -143 -393 -31 270 200 277 -316 -315 -23 383 59 -162 -310 -167 516 291 -370 -184
4459 -184 -382 176 434 160 -539 -66 243 644 79 -518 -295 11 349 368 -24 -453 199 331 60 118 -186
4480 -186 196 638 244 -299 -204 24 516 172 -213 -318 -234 105 428 -200 -499 -149 95 -49 -64 -175 -289
4501 -289 -38 240 -209 -286 -201 287 203 -13 -236 -217 120 167 103 -61 94 -373 299 38 153 -335 -137 184
4523 184 26 52 254 63 -173 366 -85 -115 -152 -170 380 255 -74 237 79 380 111 230 10 -62 -172 388
4545 388 -64 -283 -107 95 -69 131 -75 -406 79 46 -174 -571 33 -307 -56 252 -287 -342 -116 -28 358
4566 358 -219 -122 -265 272 190 90 71 52 163 13 184 209 -204 79 396 -172 -101 -255 -367 -12 177 119
4588 119 -38 34 330 330 98 -311 -93 -10 277 -220 26 56 -166 -31 232 42 -257 -179 233 32 -28 -18 90
4611I0oK16o14j84L57J67K79m50M1k47N31J57j08o37L79OJ40K6j64r7K09P8p8
4634I1l11p7K79R0K76l61l01J85L16Q3q4k15L0K64j80k88l13q7O20L66j63k64
4656d4m01N32L65k37l46j57M72J50k70l08j24L75J39k23j33m74L30K66N25n76
4676a39j61Q4K93Q6O1o53K56L93K44l03m25L72J26j08J51m86j33L60J81p3m51
4697c25J56j08O14J13l87m1L14l08M17k68o38L73K1N05o20j50J58N6N90k16p42
4718d86J83J03K99J22l53m7P0M41J90j082J35L10M36m2j65m06J15M29m0n41j15
4739d44L59P8N91o80k99k7N19K81m89j35J6J22J77K88o99M0L31K56k73P2n21L47
4761i0N39k81l13J00J07m0m1j73j96jO25j10j22l07K1M56qq0m75K78P0P7J32j85
$$ plain form
4611 90 84 300 -314 -498 -141 26 305 -145 -104 -351 180 337 229 -408 -29 -23 117 143 -21 -118 91 169 91
4634 91 -220 -297 -18 72 348 -13 -314 -129 187 270 186 -29 1 265 85 -203 -516 -603 17 383 220 -44
4656 -44 -445 87 452 215 -131 -288 184 334 64 -244 -368 7 146 -77 -210 -684 -354 -88 437 -139
4676 -139 -300 -216 77 163 224 -429 -173 220 464 161 -264 108 234 126 277 -209 -342 18 199 126 -325
4697 -325 -169 -277 337 450 63 22 336 28 445 177 -461 -88 -67 438 -182 -332 -174 -118 472 256 -486
4718 -486 -303 -200 99 221 -132 -179 -109 332 522 -560 -425 -115 321 279 114 -292 -177 252 212 -329 -444
4739 -444 -85 -7 584 -96 -395 -422 97 378 -111 -246 -230 -108 69 357 -342 -302 29 285 12 84 -437 -90
4761 -90 449 168 -145 -45 62 22 -19 -192 -388 -389 236 126 4 -303 -282 174 166 86 -389 -111 -41 36 168 -17
4785a7K5LN51m00k79r5K84J23K25m07l81L40N28k04l25j8K7K50N3l36l22K99K81
4808B05K05l15o2j99K03K79q8p01L67J91N8j26q3l9j19N75l18o6P7q8J04M9k19
4831a10j93o0N48k05M8q5k18J87K84p3n26L07J83j81L20r8l13L1L81k08k25L34
4853A28k78N12J7n95k11N38P0k24L27k49k24J51O01m70l32N93l01j19J35r7m7
4874g5M62l16k19R7K27k49M0K84m00J19J29P1j95k62J35q4O5M06n88K15K66j50
4896b2j9J87j61l13K38L96l8j98Jj70j31M26p2m04M81k66O1L89m37J30j50L59
4918B87k84o5J81p3l4K44p8m69M07l8j25P9p7L8N5J68k53j7M2J4j49L44r8l5j81
4943a17p2P2R9j7J71j22J79l61k22K31L92m87L73k41l04M47L09m17l91O65j32
$$ plain form
4785 -17 8 11 562 162 -117 -212 72 195 420 13 -368 -28 500 296 -29 -47 -20 230 283 -53 -375 -76 205
4808 205 410 95 33 -166 37 316 228 -473 -106 85 143 17 -66 -105 -224 351 33 -33 44 -44 60 109 -110
4831 -110 -303 -363 185 -20 28 -57 -275 -88 196 123 -403 -96 87 -94 226 128 -185 -154 227 19 -206 128
4853 128 -150 362 379 -216 -427 111 181 -43 284 35 -189 -38 563 93 -239 354 53 -66 69 -28 -75
4874 -75 387 71 -148 -51 176 -73 -33 251 -149 -30 99 170 -25 -287 -152 -236 -171 235 -353 -138 128 -22
4896 -22 -41 146 -15 -328 -90 306 268 70 71 -99 -230 196 124 -280 201 -65 -4 385 -52 78 -72 287
4918 287 3 -62 119 46 12 256 178 -291 116 78 -47 32 -45 -7 48 216 -37 -54 -12 2 -147 197 99 64 -117
4943 -117 -189 -117 -18 -35 136 14 193 -168 -390 -159 233 -254 119 -122 -426 21 330 -87 -478 187 55
4964E5L8L34o28J00M00ol95J99m09K27j25L63m1m46L16L09l56O4k16J71J73J46
4986B73k27m46M22k6m3O04n16l38J82M08k19Q4l18nK58Ql08k5L43R5k45k38k3
5009c00l4M93K42n15n2jJ96L10k10J14l98K85m7L2l82N87k53L75J41o41j77K68
5031C3P1j34J43m32N40K35j79k40k62L63j91M6O1n29M55L2L89m17j10j46L7P5
5053a60N08m83m58R03k78J97k94k22J61K40K18q15L31J82k00L51%m02P4M08K0
5074B81m77K27N1J06L41j06o41K03K38J81k63j97J11P0p0k4l16L6P41m17k8m9
5096bj64m3N30k44l10K96%J01K44m6p26K03K95R2l53m1J61K8K55r3o93Q7M41R4
5120A12l17J93l37L23M47r9l09k23J61m2J03r3J9j68N81k52k07k24K19m7L59j74
$$ plain form
4964 55 93 427 -201 -101 299 293 -102 97 -312 -85 -210 153 112 -334 -18 291 -65 -1 -217 -46 127 273
4986 273 46 -400 22 -4 -47 557 41 -297 -115 293 74 158 -160 -165 93 101 -207 -232 111 206 -39 -277 -300
5009 -300 -334 159 401 -114 -166 -167 29 339 129 243 -155 130 83 115 -267 320 67 442 583 -58 -235 33
5031 33 104 -30 113 -319 221 456 277 37 -225 138 -53 -7 54 -475 -20 12 401 -16 -126 -272 -235 -160
5053 -160 348 -135 -593 310 32 229 -65 -287 -126 114 332 -483 -152 30 -170 181 181 -221 -147 261 281
5074 281 -196 31 82 188 529 423 -218 -15 223 404 141 -56 55 125 55 31 -285 -249 492 75 47 -2
5096 -2 -166 -209 321 77 -233 63 63 164 408 362 -364 -161 134 226 -127 -168 -7 21 276 183 -510 -423 18 112
5120 112 -205 -12 -349 -26 421 322 13 -210 -49 -91 12 -81 -62 -230 351 99 -108 -332 -113 -160 199 25
5142B5m38M14J26p2L7l9k28L07J37k09m15M94K3j09L20l24m20K25M01l97j74K46
5164g0J26K76j38q6p17N33J38L33l80O1l21K03L1j01k93M11O7Q0l15l58K57K18
5186d5K10k12l36M20j49J75J95j82l87L14K86m17K36j67l06J95M58l54k41L72
5206F5rj31J49m16J8P67l59k03L57k70m2Q4M57p53O0M07J22m69K71P8l11J63K31
5229B66n67Q2K04O5k69L08O2k80L34j75L6o7J49k21j25L47r3l14K78J47l20J97
5251D4L31r29L43K36J79n2P5m58J45K91j71m09L12K08k23j74J83q0J02L98l26
5272B5q7J11j04N3K03J85m59J17J11m03pN40n19R1K81j06n86P72n2q4j55J1q9
5295a51K09J97j99l1q7J45m28M77j15j5j69J84L6q1lk17L22N1l31J3Q7J48L0r0
$$ plain form
5142 25 -413 1 127 55 92 53 -175 132 269 60 -355 139 162 53 373 49 -371 -146 255 -142 -316 -70
5164 -70 56 332 194 108 -609 -76 62 395 15 76 -245 -42 -11 -112 -405 6 73 153 -162 -520 -263 -45
5186 -45 165 -47 -383 37 -112 63 258 76 -311 3 289 -128 108 -59 -365 -170 288 -66 -307 65
5206 65 56 -75 74 -342 -324 443 84 -119 238 -32 -74 10 467 -286 -226 181 303 -166 105 183 -128 35 266
5229 266 -301 -219 -15 50 -219 89 151 -129 205 30 66 -1 148 -73 -198 149 56 -258 20 167 -153 44
5251 44 375 -554 -211 25 204 152 227 -231 -86 205 34 -375 -63 145 -78 -252 -69 -149 -47 351 25
5272 25 -62 49 -55 -2 201 386 -73 44 155 -248 -255 285 -234 -143 138 32 -554 218 166 82 -73 -62 -151
5295 -151 58 255 56 25 -62 83 -345 132 17 2 -167 17 53 -28 -31 -248 74 125 -206 -193 -106 42 72 -18
5319a8m1J83M6P1Pp1j31O4k50K84k48K0J06M38m68p3N4K9j03K41j73n43O16L3
5343G3k35J01j08J66O9M80o15p7k16M04l1L72n39j61N38p1j21j07M01l50l2N19
5365D60l84m42M12J71l52M59j31j59m3K29k0n67Q41k12n44N35m5n06O00k62j01
5386f1j16L23L2k60K61l35j66J24J80K6L7J00k70N2K37l97J04J26Q3j42J64r7
5408En28O64Km21K04J74J9K4K09l08l40K60M30n68K16N7O1j90L16k78l08L33j81
5431a48l7J35j17J8K47l3k30m9L62J13j07N6k81l8L23po52N43K7l35L14p1j93
5454a60K97j41j6j37J95n84N73l1k59P9M5kq8N33j99m68K10M39k0n85M73M1l74
5477a79O18l13m34q0P72l77q5J51j33j76M33j96j78k0M63l67j40K85k75K84J62
$$ plain form
5319 -18 -59 124 170 241 248 177 46 110 -140 144 -104 -84 22 460 -8 -81 -27 2 -101 140 -33 -576 40 73
5343 73 -162 -61 -169 -3 66 546 -69 -146 -362 42 11 383 -156 -317 221 150 29 -78 323 -27 -59 460
5365 460 76 -366 46 217 -135 324 193 34 -9 220 200 -367 474 262 -282 253 208 -298 302 40 -61
5386 -61 -177 146 178 -82 179 -156 -322 -198 -18 8 45 145 -125 -73 164 -233 -129 -3 80 -62 102 5
5408 5 -523 141 143 -278 -74 100 119 143 352 44 -296 -36 394 -174 42 99 160 -30 286 8 -300 33 -148
5431 -148 -185 -50 -167 -149 98 65 -165 -214 148 261 154 210 -71 -109 214 207 -445 98 125 -210 104 33 -160
5454 -160 137 -4 -20 -157 38 -546 27 -4 -263 -184 -139 -141 -229 304 105 -363 -153 286 266 -319 154 195 -179
5477 -179 439 126 -308 -388 384 7 -78 73 -60 -236 197 1 -177 -197 266 -101 -241 44 -231 53 215
5498B15k00m96M38J14K8J14j05k4j84j0L09j4l55k42M94L53k26l51L29j41k45
5519a99K07K6l70M19K59l83l08K95P0k41N41n06j17M41K45m21k90M13j13J98J62
5540C28j31k86K72m84J45L81j81j64J80J74n08L62R5j41m5K91J0n26M73k93j34
5561a82m9K58j5K00q3k36k40K92J22k13OJ26j77K5M50k23l21K11K00l12M53j83
5583A09n18M70J70k98n1K70K9m46J43J19m6K50j78o8K40k76j37L44K53l10j78
5604a09M4J44j13L02j50j97R8J89k41n0M16n94R8L32j78J17J02l32p5J37P3%J00
5627A13q1P2l25L28k81K56L99n77J88j16J3K9O5k05j35P04j04m42j42K17p2j92
5649b88Q93o45p5K56k62J68k20K25r0P7K57k02P7J47l36j65M10k43L3O8p3j10
$$ plain form
5498 215 15 -481 -43 71 99 213 108 84 -100 -110 199 185 -170 -412 82 435 209 -142 187 46 -199
5519 -199 8 34 -336 83 342 -41 -349 -54 16 -225 316 -190 -307 134 379 -42 -332 81 -32 166 328
5540 328 197 -89 183 -301 -156 225 44 -120 60 234 -274 88 183 42 -3 288 298 -228 245 -48 -182
5561 -182 -231 27 12 212 129 -107 -347 -55 67 -146 -140 -14 -191 -166 284 61 -260 -49 151 -161 292 109
5583 109 -409 61 231 -67 -118 152 181 -265 -122 -3 -49 201 23 -45 195 -81 -218 126 379 69 -109
5604 -109 -65 79 -34 268 118 -79 19 208 -33 -83 333 -261 -163 169 -9 108 210 -122 -197 -60 13 13 113
5627 113 32 104 -221 107 -174 82 481 -96 92 -24 -11 18 83 -122 -257 447 343 -99 -241 -24 -96 -288
5649 -288 605 -40 -115 141 -121 47 -173 52 -38 39 296 94 171 318 -18 -183 227 -16 17 85 12 -98
5671i8l79L73Rl9L48l03j94M11J31k46j87K96m46L88j1m58K56K98l42J25j87K95
5693D0n17M79K12l61K70j9l44J78P0rk18J11J89l93M84%l95J36M04k85l85L71
5715A8M8M4j48m8K79j88J79l67k4O25k42o9P5K5n48N67j8n50M44j88K0M9N41o92
5739a68Q6J34m1O9P7k9m75O20j25o56L58L53j26L1J94m80R3K97k45J84k46O1k36
5762b70O17L3m21k20M58j38j77J01Kl07L53j06k07m8N63l28N08j04p40J91N39
5783B99l18l61M35j8l24M31Q2o38J06K89K19l42M00o2m30L97M0m10J37K71j83
5804B0J74j69k30K48K2k04J04q2Q3j16L59j04k80n4Q31l91l18N77m71j70M80m66
5826a57J17K1K19m41L90j2m56L08J76q2k98L85k28nK39q7l88K01M56j25j44l28
$$ plain form
5671 -98 -477 -104 -95 -134 214 -89 -283 128 259 13 -174 122 -324 64 53 -405 -149 149 -193 -68 -255 40
5693 40 -477 2 214 -147 123 104 -240 -62 8 -1 -219 -108 81 -312 172 172 -223 -87 317 32 -353 18
5715 18 66 110 -38 -86 193 5 184 -183 -207 418 176 107 182 207 -341 226 208 -342 102 -86 -66 -17 524 -168
5739 -168 -82 52 11 80 157 128 -347 273 148 -508 -150 203 77 108 302 -178 -85 212 -33 151 -95 -34 -270
5762 -270 347 380 -41 -261 197 59 -118 -17 -15 -322 31 -75 -282 -330 233 -95 413 309 -431 -240 299
5783 299 -19 -380 55 37 -287 144 226 -412 -306 -17 202 -140 260 198 -232 165 205 -205 -68 203 20
5804 20 194 25 -205 43 65 -139 -35 -117 -34 -150 209 105 -175 -229 602 211 -107 470 -1 -171 309 -157
5826 -157 -40 -19 200 -241 149 137 -319 -11 165 83 -215 170 -58 -63 176 89 -299 -98 358 233 89 -239
5848b39J00J63M19j32q51O18r6K07k21N9k93K40M13o56K01j10J15j2j34J47q4
5869a46J09P0j12Q9K46m45J09K37j55l14J30K41L3L9O0k37K41N6j54J3lo6K11
5892B52j29k12j17j0M67l20R0L56o99R0O29p05O5K40J58l72L56p1j00K03K49l74
5914D6k43M88j60k20K63k11J03M9J14j18L08k78k19J51M49o29j74L04k1o8Q8J70
5936A92m43L28J83n05K54j10J68l30K73k40NK04K66p44M2O1L17J48o0K5l39M92
5958A87j38L1j02K09m77J87K76m15O8L05j15j6L17l07m9M9Kj26j85K14O4j0L28
5981B97l67j56J55K38m3K28j58j84n8J56l53M35k57j23P9K67J36o59N78j54j53
6002i6K43p8k4j55J10k91O0K03j1j01M19k15l13J29L4m%K56m09P4L42p8J26M5
$$ plain form
5848 -239 -139 24 443 311 -540 78 -18 189 -32 27 -266 -26 387 -269 -68 -178 -63 -75 -209 -62 -146
5869 -146 -37 33 -79 10 256 -189 -80 157 2 -312 -182 59 92 131 191 -46 195 251 97 110 107 41 252
5892 252 123 -89 -206 -216 251 -69 21 377 -322 -232 397 -308 -243 -3 155 -217 139 68 -32 171 420 46
5914 46 -197 291 131 -89 174 -37 66 115 229 111 419 141 -78 73 522 -107 -281 23 2 -66 22 192
5936 192 -251 77 260 -245 9 -101 67 -263 10 -230 -225 -21 245 -499 -457 -396 -79 69 9 34 -305 187
5958 187 49 80 -22 187 -290 -103 173 -242 -174 131 16 0 317 10 -39 10 12 -114 -299 -85 -21 -31 297
5981 297 -70 -226 -71 167 124 352 194 10 -48 108 -245 190 -67 -190 -111 156 292 -367 211 57 -96
6002 -96 147 69 45 -110 0 -291 -231 -28 -39 -140 279 64 -249 -120 -86 -90 -90 166 -243 -169 173 95 221 266
6026B66l01q6L71k33l06J83N10n37k2L17J04l41M30l96j21L38m13K20J08J00l23
6047a32R0J41k47L4K02m7j11n0J33k81L47J33n5j51J18j73j0J51P0j98L58k52
6069G0j08m1J16n8M5J07l12J50K24j37l69M21m1k92L97j5k40k0K07l33L47J09
6091B27j90K3j47L02m30J26J48l86L86Q3l57L07K40m12N6J81M5n97M18P9l98M46
6113A50j09q3L0K41j56l56M52K29n13K23j12m23N22R9m28O0L84m5l86L38m6k56
6135a85L27j22j06j1L2o4K74j82N5n31N37j4j49N5ql3M50m93k10J46L44Jj30Q4
6159F7O0n90N47J63m08M85p5k73j2K7l8Q1l7j44K10K18n2j63J1o3k96M4K37J04
6183A03l4j36L7q2J16Rp2PJ35k60l8L50n60K9M65N7l00L31J3l75J92J89l53J72
$$ plain form
6026 266 -35 -121 250 17 -289 -106 404 -133 -155 162 266 -75 355 -41 -162 176 -237 -17 91 191 -132
6047 -132 -42 99 -148 -114 88 41 -70 -120 13 -268 79 212 157 6 124 -49 -59 92 162 -36 322 70
6069 70 -38 -79 37 -21 24 131 -181 -31 193 56 -313 108 67 -225 172 157 -83 -103 104 -229 118 227
6091 227 37 60 -87 215 -215 -89 59 -327 59 142 -215 92 332 -80 -24 157 202 -395 23 102 -296 150
6113 150 41 -42 -12 229 73 -283 169 398 -115 108 -4 -427 95 194 -234 -174 210 165 -221 117 71 -185
6135 -185 142 20 -86 -97 -65 -129 145 -37 18 -513 24 10 -139 -84 -92 -125 325 -168 -378 -232 112 113 -17 67
6159 67 127 -463 84 247 -161 324 249 -24 -36 -9 -47 34 -3 -147 63 281 229 66 77 14 -282 -238 -1 103
6183 103 69 -67 -30 -112 4 13 -59 -52 83 -177 -215 135 -425 -396 69 126 -174 157 170 -205 -13 176 -177 -5
6207eL96j83j89l1j91J02N48m66k68N94l08O2k66N13n78M21J06m77l26Q78l76
6228d4r6M16j44j40p2J09k94L15k46K34O5k73K37k62J65j22Q9P3q4J35J28j46
6250D3J88o0j4m78K89N70m79m99M65R4k22K71n3l18Q9K48J82n26K46j17J55L57
6272D31n94J03O1L9J8l19L17n3k30M78q3m79K32J46j92J62j3j23j16M66j86j20
6294e5QJ60k37K96k77R6M4j11K61m42L69j42P1Q7j74j07K62M8l46J37P1j84M73
6317C08p3k82L23m7J75o59J36M24o47K16K17j45J64L7o20O78o7j77m32M67J53
6338A49j49N9K6k59lN85o66J1K03P1j63L25k40k39K47K58n02M35l52K46r4K74
6360B22pm09M19j19q3l10M93l80KK22k79j03M30j65m70M21J7j19K53P8j24J33
$$ plain form
6207 -5 391 208 19 -12 -203 -101 447 -19 -287 307 -1 61 -205 308 -270 151 257 -220 -546 332 -44
6228 -44 -140 276 132 -8 -80 29 -265 50 -196 38 103 -170 67 -195 -30 -152 -63 10 -74 61 189 43
6250 43 231 171 157 -321 -32 538 59 -440 25 119 -103 168 115 -203 -114 134 316 -210 36 -81 74 431
6272 431 -163 -60 1 40 58 -261 56 3 -227 251 168 -311 -79 67 -125 37 24 -99 -215 251 65 -55
6294 -55 -47 113 -124 172 -105 -9 35 -76 185 -257 112 -30 41 128 -46 -153 109 157 -189 -52 19 -165 308
6317 308 235 -47 276 229 404 -255 -119 305 -342 -126 91 -54 110 147 -473 205 138 -39 -471 -4 149
6338 149 0 59 85 -174 -177 408 -258 -247 -44 27 -136 189 -51 -290 -43 215 -287 148 -204 42 -52 222
6360 222 215 -194 225 106 23 -287 206 -174 -172 50 -229 -332 98 -67 -537 -116 -99 -218 35 113 -11 122
6382A22j42r4n7L03Ko12M07L73n72K30O8k22L48L01l68r8O6J9J12p6p0r1q9L05
6406A65k14K38j60k80K10N6m19o2K90K12M4M36o71J58K67k19m08J18J69l3j46
6427b49Q2o6M11k82K89k26nNR2l30M44j52l36L44j23M4M24j32k51L9J04r7j25
6450i6K12R4j84K47K3l24J81J22m65J84K42j58l1L6j40j94L97k65k23J41O8K97
6472A64j05k5k99K67M1k10L50j01j70k13L42K44m36K54J59k22Q6l15j37R4N50
6493C18l42L6K85l68J17k53M35n30O18m50L56q8J33l39k24O51k96l56M94j02k25
6514a30P8K88j37l57L55r3O9L30J1n66L46j46k34M25M2J98l61M3j18q6L50k05
6536A02R8k8k8l93K61L08m32p4K50Qk16K15j45j58L25k2k19J1J87j15J63P3j89
$$ plain form
6382 122 -20 -114 -171 132 134 -478 -71 302 -270 -40 28 -194 154 455 87 -11 55 74 186 110 40 -51 -140 165
6406 165 -49 189 29 -251 -41 15 -404 -466 -176 36 80 516 -155 3 270 51 -357 -239 -70 -103 -249
6427 -249 -167 -233 178 -104 185 -41 -46 -41 51 -279 165 13 -323 21 -102 -58 366 234 -17 22 126 29 -96
6450 -96 116 210 26 273 296 -28 153 275 -190 -6 236 78 47 83 -57 -251 146 -119 -342 -201 -133 164
6472 164 59 34 -265 2 43 -167 183 82 -88 -301 41 285 -151 103 262 40 126 -189 -326 -232 318
6493 318 -24 12 297 -71 46 -207 228 -302 316 -134 222 134 267 -72 -296 355 59 -297 197 95 -130
6514 -130 -52 236 99 -258 97 4 73 403 414 -152 194 48 -186 239 281 479 118 161 43 -43 307 102
6536 102 200 172 144 -249 12 320 -112 -186 64 72 -144 71 -74 -232 93 71 -148 -137 50 -65 98 171 -18
6559a8m2R6P9l95K94j7P7L8Q1m15MJ80j28J91J77m55J72M46l29k58K50M0k08L86
6583B46q8j32J72k66J49k07J88q6p0M9j0N4p2K01l66K96L70n92K17L83q8m10K41
6606A79m16K02N6r1j85K36j30j35J27J76N6j76K80l78r0R8J21L1k02O15m64j1
6628a01K88l27J11m1J64Q8l32K23l79K91L04l38K54l55P5J8K00l44p3J92J06j50
6650a26J63J78m35Q2K65k26P1J22l20M61j52K2J32k20K41l24p6M23l35o4M84l22
6672D4j22l4l3o7M32j53q0J5J89j79j08L5j41K6K30k62J34Q2M9j97j27L62l6j45
6696h6O1J06j28J72l66J30r4J54j59L01l21Q8J30j04K46l99L04k04l9M5J53k14
6718b24J68M45j24o05K06R5J76j13l7K32r3RM2j21R6k30p2J13o1K99l16J87j66
$$ plain form
6559 -18 -60 36 115 -280 14 -3 74 112 193 -222 -218 -38 -166 25 202 -253 -81 365 36 -222 28 68 -140 246
6583 246 158 26 198 -68 81 -126 62 -24 -94 -45 -55 -1 -73 128 -238 58 428 -164 53 436 348 -62 179
6606 179 -237 -35 21 -70 -255 -19 -149 -284 -157 19 75 -101 179 -199 -289 -191 -70 -39 -241 374 -90 -101
6628 -101 187 -140 -29 -70 94 182 -150 73 -306 -15 289 -49 205 -150 -75 -57 143 -201 -274 -82 24 -126
6650 -126 37 215 -220 -138 127 -99 -28 94 -226 235 83 105 237 17 258 -66 -142 281 -54 -118 366 44
6672 44 -78 -112 -145 -212 220 67 -13 2 191 12 -96 -61 -202 -176 54 -208 -74 8 57 -140 -267 95 59 -86
6696 -86 -25 81 -47 125 -241 -111 -205 -51 -210 91 -230 -142 -12 -116 130 -269 35 -169 -208 -163 -10 -224
6718 -224 -56 389 265 -340 -134 -39 137 24 -13 219 126 135 177 56 152 -78 -150 -37 -98 201 -115 72 -94
6741i4M92l30J52k50O4q1j71J60n6p0K55j67J97k34J97j58Q9j5J08q2J54j45j85
6764a70L91j37m3m4K75n30J53l8k08L96j9m8J67l70M53j26j4K40q83P74k90k80
6786c51L12J17k26K99j83l9P8j7R2k88K60M7l40M03j76K52k72N9r0j2L39l08j12
6809a56K41j73j25K87k09Q0l98L97KPJ38J04l95J29K30l57l9N36j70m84M87r8
6831C4lJ15l26q0O70m01r5m08O12m54M3J83J87k73O0M38l82M5L05k82L70%n94
6854b36J86K74m88O65l94J37n66O37r5k29j1J62J6n8p9k33K65J55k21J86j51k9
6876a07m0J19J88j96j9O9K19m10J97k46M63K57m95J90q2K7k03L4K79l71j41M54
6898A86l42J78m4J43k44J51j7j67J55L8L06l28j21k8j51J89M56k84j7K52k79k6
$$ plain form
6741 -94 398 68 220 -30 34 -47 -218 -58 -114 -184 71 -96 101 -133 64 -94 -5 -20 88 6 160 15 -170
6764 -170 221 84 41 -3 272 -258 -105 -143 -351 45 26 -22 145 -225 228 102 88 328 -555 219 -71 -351
6786 -351 -39 78 -148 151 -32 -71 7 -10 82 -206 54 101 -239 164 -12 240 -32 27 -63 -75 264 -44 -156
6809 -156 85 -88 -213 74 -135 -55 -453 -56 -54 -47 91 195 -200 -71 159 -198 -237 299 129 -355 132 34
6831 34 31 146 -180 -260 410 9 -86 -494 118 -336 -293 -110 77 -196 -136 302 -80 -35 270 -12 358 358 -236
6854 -236 -50 224 -264 401 7 144 -422 215 120 -109 -120 42 58 0 -79 -312 -47 108 -113 73 -78 -107
6876 -107 -147 -28 160 -36 -55 14 233 -177 20 -226 237 494 -1 189 107 134 -69 -35 244 -127 -268 186
6898 186 -156 22 -22 121 -123 28 11 -156 -1 37 343 15 -106 -134 -285 -96 360 76 59 311 32 6
6920FP2m41L65j56L00l85M68j59j28L32l04l93K26L48j15j90M7J82m34N55r8j07
6942iO9m6j96M39j43l31jL23K0m3R5k52o4J93m4j86K38j05J15l36M62k5l93L97
6966A77k04j92j7M09l97L37ok68K04J64j69k31M69l02K5J16M0l80K39J54l26J46
6988a2K0N8J00mM7o58P15l8l64N1J88l09K68L55o24K64k43M2l04M57J98j41K03
7011B69l40j48L6L23m97M09j8o7j38K55j2p5Q7k24L28k27J60l53K25pJ66j21q1
7034e0M1j19LK77m28N23K3m44L25j95Q8j00K65k72k11J48K61j3K12m49J58j20
7056g7K9J91k71K69L3n05N34l44l46N73k70Q8o0L60k86j44O22n26n2K63N0m48
7078c17M14O0l28J73L1n5l5p7L71m15N28j22m75M26k96Q3K59m46K67R7K13n96
$$ plain form
6920 6 78 -363 2 -154 146 -239 229 70 -58 274 -30 -423 -197 151 36 -154 -107 75 -359 196 98 -9
6942 -9 60 14 -182 257 114 -217 -218 105 125 82 177 -75 -139 54 10 -176 62 -43 72 -264 198 173 -220 177
6966 177 -27 -219 -236 173 -224 113 107 -161 43 207 38 -193 276 -26 -1 115 155 -225 14 168 -158 -12
6988 -12 8 66 166 162 209 -449 266 228 -136 -85 103 -206 62 417 -207 57 -186 -144 -448 9 207 66 269
7011 269 -71 -219 -183 140 -357 52 34 -33 -171 84 72 -3 84 -140 188 -39 121 -232 -7 -14 152 31 -50
7034 -50 -9 -128 -125 152 -276 247 270 -174 151 -44 44 -56 209 -63 -274 -126 135 122 334 -115 43 -77
7056 -77 -48 143 -128 141 174 -331 203 -141 -487 86 -184 -96 -156 204 -82 -226 396 -130 -182 81 131 -317
7078 -317 97 157 -171 2 33 -22 -57 -134 237 -178 350 228 -247 179 -117 -34 225 -221 46 143 356 -240
7100b40J36K82l78J49J19J31j24r5N34q32L07L26n69K23N8m6m6K2K40l50K38l3
7122E2l9J74j94j20J22J77k17k26J67J09j69M11j29J3j80P3O8j76j79K47p0J93
7144A07j57J23n5J68j31K9J12n33L82k6j84k24L78o2r7n8K24l05N6M85j70p6K51
7167B37p1k00K85m58p7K39J76j33k06K54j79j19N81l01N8o5J07k4k04J69j8K59
7189C10m81K2K88j90J06K0J75k83j91K34K6n2O7O0k57J64K44n95M30P0n4j06J72
7212A79k77J24q4j09N5K11J3m2k11K47k55k80P45k70RJ90k28l6J17k53k20L98
7234B3K5k57M7M63k51k21j24J42M04j97m2j03j85L54k49j4N68o13J53J61J44k81
7256e3J56J93k87j91L27j92j17K97p1j24p6M17n85N69j78j89J4L8l18K85M09l09
$$ plain form
7100 -240 -104 178 -200 -51 68 199 75 -20 514 -318 -11 315 -254 -31 27 -19 -65 -43 197 -153 85 52
7122 52 13 187 -7 -127 -5 172 -45 -271 -104 5 -164 247 118 131 -49 24 92 -84 -263 -16 -86 107
7144 107 -50 73 18 186 55 84 196 -337 45 19 -165 -389 -11 -73 -170 -228 -4 -309 -253 232 62 -14 237
7167 237 166 -34 251 -207 -284 -45 131 -2 -208 46 -133 -252 329 28 86 21 128 104 -100 69 51 310
7189 310 -171 -149 139 -51 55 75 250 -33 -224 10 36 -16 51 111 -146 18 262 -333 97 167 113 7 179
7212 179 -98 26 -58 -167 -112 99 112 70 -141 106 -149 -429 316 46 55 245 17 -19 98 -155 -375 23
7234 23 48 -209 -162 301 50 -171 -295 -153 251 54 12 -91 -276 78 -171 -185 383 -230 -77 84 228 -53
7256 -53 103 296 9 -182 145 -47 -164 133 62 -62 -138 279 -306 263 85 -104 -90 -52 -370 -85 324 15
7278A5k02K34j04J10K03m00j49P4M11k56j00J89J9N4r7j45M2O4J42Pj20Q2k77
7301b04R6K94k33j18L84Rk90J68p3N0k41L49l25j5K44j18j36M80o7n41L21J39
7323A73k50K3J72j12l74L33L11k72K33o6j98K39k03m42L79m4j47M1K90k53L84
7344B17L48p10K59k6J25l0m34L44m78K59L58l28N2K19K84o32K75l60J3K59r7q8
7366a71J35r0J29Q4M4j92k56K64J90j21k57L24m12J10N14l64j1n3K4J99p8p0l8
7389i6J29J31l30K19l9j05j1K2J19m2J48k22l04N14Q7m02M8K83l5m05K14m7J7
7412a07%J50l62N37k98k33L26j33M1j16K56j34j99N17j50j92j13J46l4K21j70
7433d7j30K16K2Q9k19L31M8l01K61m92J19K41n6q6nq2k5P6j44J47j2K34R6m97
$$ plain form
7278 15 -187 47 -57 53 256 -144 -293 -219 192 -64 -164 25 44 98 1 -144 -102 -38 104 111 -9 73 -204
7301 -204 -108 186 -47 -165 219 228 -62 106 33 83 -158 191 -134 -149 95 -23 -159 321 254 -287 34 173
7323 173 -77 -54 118 6 -368 -35 276 4 237 171 -27 212 9 -433 -54 -98 -245 -204 86 -167 217
7344 217 565 -145 114 88 213 183 -251 93 -385 -126 232 -96 -44 175 459 -173 102 -258 -245 14 -83 -171
7366 -171 -36 -126 3 87 131 -61 -317 -53 137 16 -241 83 -329 -219 295 -69 -80 -133 -109 90 12 -58 -96
7389 -96 33 164 -166 53 14 -91 -102 -80 39 -3 145 -77 -381 133 220 -182 -134 149 114 -291 -77 -124 -107
7412 -107 -107 43 -319 218 -80 -313 13 -120 -79 -195 61 -73 -272 245 95 -97 -210 -64 -98 123 -47
7433 -47 -177 39 61 150 -69 262 310 9 270 -222 -103 138 82 -4 -9 -91 -116 -40 -184 -37 -49 185 281 -216
7457b16J45J37m2Q4j97j8k16M68k26L04k67K6j27M02j56l50L21L35l21k66Q3K52
7479A55m44M29r5r8J17J53o0j78J64J84o41L74M7l46M24n5l9n3j01MO3J48J84
7502C36n79M33Pj4k55L77l13J10j21r5l2K18O2j30J28k05j2J73j49n7J15j73K58
7525H2Q1q2m9J91j47r3j44L40j39l04L74K36l68L1l7j16J02J63k07k7J2Q6k30
7548b45L68l5m0J97r9k22J39L7m1OJ07n73O14o7k88l5L45M4m78R3K57O1j51K7
7572B1lp0J87j66J92J52k11m07M3N59n52P08n20m8J91K72m30k0K65k3p7L6J2m97
7596c86N13Kl27L50J34k20l27O2K69k27K70j77k12K05k12J59j53N23j41j58K74
7617B21j07M1j18J00j85P2m15J95K17N6j16j18K45l70k3L91m0L03n08J92k19J48
$$ plain form
7457 -216 -71 66 24 108 -89 -107 -323 145 -81 223 -44 -18 -145 257 101 -249 72 407 86 -180 -97 155
7479 155 -289 140 45 -53 64 217 157 -21 143 327 -314 60 107 -239 185 130 91 38 -63 -59 4 152 336
7502 336 -243 190 197 183 -72 305 -8 102 -19 -114 -146 72 134 4 132 -73 -85 88 -61 -118 -3 -176 82
7525 82 163 81 32 223 76 -17 -161 179 40 -264 110 346 -22 9 -28 -144 -42 121 -86 -113 -101 -15 -245
7548 -245 123 88 48 245 146 -76 63 100 59 65 172 -401 213 146 -142 -177 168 212 -266 -173 84 145 -6 21
7572 21 18 -52 135 -31 161 313 102 -305 -262 297 -255 453 -67 -115 76 348 -82 -102 163 140 63 99 111 -386
7596 -386 127 129 -198 152 286 66 -261 -199 70 -157 113 -64 -276 -71 -283 -124 -277 246 105 -53 221
7617 221 114 155 37 137 -48 24 -391 -196 21 77 -39 -157 88 -282 -305 86 46 349 -159 33 -186 -38
7639c8K06k7k24J03J36k51J53j62j69L63P8l97R0K33k32J86N0J21l70K06J08j84
7661b1J91l9m55L10j09K08l7O1k14q0MJ99k04K32m7k76K45K11j95l54N11J6k99
7684a42K17o4J30p8J84k13k88L81O2j20j04L3j8oJ6pj9rk9q6K59k22M4P6L1j61
7710a33K40j73%j3k25L54j74L24j44k83J01J55o5n2j29J81K00j35L0j47K42k86
7732a32N6L89l01j27J89K5k53K67J38k91J64l57K38j66K52J27l31K81m2k51Q3
7753d2K50k54J99l22l5J31L61j59l51L90j92k12K67k11L9J72n8N7k88J83J18m01
7775c58M96j04j06n5PK07k38L45q7j27J56n0j50R2j54O1N06k89l53K18J09r7l72
7798c43M77J93l84J8p6N5R8l8j1k12M69R7k52N7m15J27L38ql48L54j68k07L36
$$ plain form
7639 -38 168 141 -83 20 156 -95 58 -104 -273 90 168 -229 -139 94 -138 48 98 219 -151 55 163 -21
7661 -21 170 131 -324 -14 -123 85 48 109 -105 -185 -181 18 -186 46 -1 -277 -32 179 -16 -370 141 157 -142
7684 -142 75 11 141 63 247 34 -254 127 189 69 -35 -2 -20 -26 -10 -17 -36 -45 -74 -160 99 -123 -79 -3 28 -133
7710 -133 107 -66 -66 -79 -304 50 -124 200 56 -227 -126 29 -36 -88 -217 -36 164 29 59 -88 154 -132
7732 -132 -76 313 12 -115 74 99 -154 113 251 -40 124 -233 5 -161 91 218 -113 168 126 -125 -42
7753 -42 208 -46 153 -169 -204 -73 288 129 -222 168 -24 -236 31 -180 -141 31 -27 30 -258 -75 43 -358
7775 -358 138 34 -72 -127 -120 87 -151 194 107 -20 136 86 -64 28 -126 -65 441 152 -201 17 126 29 -343
7798 -343 134 327 -57 -39 -115 -60 38 0 -11 -223 246 343 91 148 -267 -140 198 190 -158 196 28 -179 157
7821A57l06P9l4o7l5M6L54l67L19j30k18L32J02k07l91K42K80k78l1J28Pj16L56
7844B22k93qK66j84j64P2K72k20j52K57Q9j88j6M28j54O3l82J65k6K15m24R0J27
7867E5p1l00L39K8k88J84M3k58K71k7L6j33R0j90o3J15J66j70J88K04l81M81l63
7890d4R1k34M57p4l03K50l48J36j50M39m20K26m6J28j88L18j53j42J81m07K20
7911f3K42j54m15J81Q2j72M82Mk43O0J36l42K93J26m4m29n7M70j20k17M24j85
7933E9j75M55n36M86l40J9k36K89K98m37j85M95n3j21L51n66K5R7L76m73j40L20
7955HK00m03J08l1r5K18k2k1J25r1r8J56l07J17l8J82rQ9r2m24L93r6M26o51L06
7980e0M7N0m9P6j82M6J85J10j99Q0k84K6M61l71k39K83N9o0k46M40m43P3L59J9
$$ plain form
7821 157 -149 -70 -104 -171 -206 -160 194 -173 146 16 -202 130 232 25 -366 -124 156 -122 -153 -25 -18 -134 222
7844 222 -71 -79 187 3 -161 -89 183 -37 -189 68 157 -31 -47 381 227 290 -92 73 47 262 -162 -72 55
7867 55 -16 -316 23 51 -237 -53 -10 -268 3 -24 12 -121 -31 -221 -284 -169 -3 -173 15 219 -162 319 -44
7890 -44 47 -187 270 196 -107 143 -205 -69 -219 220 -200 26 -20 108 -80 238 85 -57 124 -283 -63
7911 -63 179 25 -390 -209 -127 -299 183 187 -56 4 140 -202 91 217 173 -256 -313 157 37 -180 244 59
7933 59 -116 339 -197 289 -51 -32 -268 21 319 -118 -303 192 139 18 369 -197 -172 -75 301 -172 -312 8
7955 8 208 -195 -87 -118 -213 5 -17 -38 87 -4 -102 54 -253 -136 -174 8 -1 88 -4 -428 -35 -131 295 -356 -50
7980 -50 -3 47 -2 74 -108 -62 123 233 34 114 -170 -144 317 -54 -293 -10 49 -11 -257 183 -260 -187 172 191
8004A91l08J86k30L20j19m6j10j3M95n76J49N8q3j77M50l66R3J45L48p28L49R4
8026A22r7j22M15n7o06P39k62k1O6m0q5q8P3p0R6kl1l36M88q4j23J01O2j40j81
8051a83M28l43j32J11K17m30M66k05j52K36j64rN2J20J26n98L40M1K4L5Q6j68
8073a02R1N04m64m3k00J58q2N66m31j50L19o1k94K90L51l17k19L03k13k08J02
8094a00k20K23l7k5M8J19N7Q3j57OM8L2r1K30j67rJ82k77J5J55J83m3n5j79k68
8119b47N45m97K44J72l51k2K23o1jj94M11l71K34J96l44q8Q7p6L5L66l34O8J97
8142A92j09J7k31N96m20j35K01l54K27j12J59j21J53j42J38l26M90n34K99j8R1
8163F1l4k02J10k25M03o3l38M91r1j23j9q3j56J73K74J44n14L16O1l74L43k26
$$ plain form
8004 191 -117 69 -161 159 40 -6 -116 -129 366 -210 -61 -3 -86 -263 187 -179 -86 59 407 -321 28 122
8026 122 25 -97 318 261 -345 394 132 111 177 137 52 -36 37 -33 63 61 30 -306 182 98 -25 76 138 -2 -183
8051 -183 245 -98 -230 -119 98 -332 134 -71 -223 13 -151 -160 -108 12 138 -460 -120 -79 -55 -20 66 -102
8073 -102 -11 493 29 -14 -214 -56 -138 428 -3 -153 166 105 -189 101 452 135 -84 219 6 -202 -100
8094 -100 -320 -97 -134 -159 -111 8 65 148 -9 -3 45 77 -14 216 49 40 222 -55 -40 115 298 255 200 21 -247
8119 -247 298 -199 45 217 -134 -156 67 6 5 -189 222 -149 85 281 -63 -151 -64 -140 -105 261 -73 -5 192
8142 192 83 100 -131 465 45 -90 111 -243 -16 -128 31 -90 63 -79 59 -267 223 -311 -12 -30 61
8163 61 27 -175 -65 -290 113 50 -288 203 112 -11 -30 -113 -269 -96 178 322 -192 124 185 -189 154 -72
8185g2J55p0j22j89l8J48
$$ plain form
8185 -72 83 13 -109 -298 -336 -188
8191a88
$$ Imaginary data points
##PAGE= N=2
##DATA TABLE= (X++(I..I)), XYDATA
0@%%%%%%qJ6j6J6k4L2m0M8n6O8q3J02j19J36j59J87k16K49k85L26l73M26m81N45
30B91o14O86p70Q62r62J073j195J325j469J631j805J997k211K448k713L011l346
47a761L725m163M673n273N992o878P993r445J1432j4332J8974k7599M8985j96137
61a63814l90251K78106L15996K8462k25002j44282M7331J59009q601j27840q667
72b39553J32106N3879k9727n6275m5680M0170J38668N9306n5798n9681j6048M1664
84c6969J18942M2436j05894n4459J06397R3942k6699r6990p2561O5890J65667
95A99702J7336j66556r1259P9603J00070K0161q3471j12089K8247J38509Q289
106A38542j35004o8667M7283P8474M2002o4826j16449O224J02032K0879n5450
$$ plain form
0 0 0 0 0 0 0 0 -8 8 -8 8 -16 16 -24 24 -32 36 -47 55 -64 72 -87 100 -116 133 -152 174 -199 227 -254 291
30 291 -323 363 -407 455 -507 566 -629 696 -773 858 -947 1050 -1161 1287 -1426 1585 -1761
47 -1761 1964 -2199 2474 -2799 3193 -3685 4308 -5137 6295 -8037 10937 -16662 32323 -163814
61 -163814 -554065 -275959 40037 68499 -156503 -300785 -253454 -94445 -103046 -230886 -239553
72 -239553 -107447 -53568 -83295 -139570 -185250 -145080 -6412 52894 -2904 -62585 -78633 -36969
84 -36969 81973 124409 18515 -35944 70453 164395 137696 40706 -31855 34035 199702
95 199702 217038 50482 -40777 38826 138896 159057 75586 -36503 -8256 130253 138542
106 138542 3538 -65129 -17846 60628 102630 37804 -78645 -72421 29611 50490 -4960
117d960m1900k0419L7005Q3644j5241j12273k8690P7037O7627J1309o5770r4941
129a07572L2408J37848K3558j01051m7611M4457O6610K7093o9848q0614O8376
140f346J24667j4495r9468l9864K5053O7910N7601n3228r4254J6049P2527J3696
152F9848k2074l7581m1102L3948O7037l1343p6697l200L2227K0454J1035m4301
164b1749o3553L1348O8153k2082n8209j7263R250L9660L5546n4351o9535L8988
176h3797O8147p833l8068k8066o380N5044M7647m9839n0209L8875M1684l987l493
189b0275j6665j7690L8199L7030k4009j2849J9824j945Q549K8174k5412l5734
201b2803L7630M1903j4662j7211j1035j0793L6440L3826m3574l7283L2676K0582
$$ plain form
117 -4960 -46860 -67279 -30274 53370 38129 -74144 -102834 -25797 41830 53139 -12631 -107572
129 -107572 -75164 62684 86242 -14809 -62420 -17963 48647 75740 5892 -74722 -6346
140 -6346 118321 103826 4358 -35506 -10453 57457 115058 61830 -32424 -16375 56152 69848
152 69848 47774 10193 -30909 3039 70076 38733 -37964 -41164 -8937 11517 22552 -21749
164 -21749 -85302 -53954 14199 -7883 -66092 -83355 -74105 -34445 1101 -53250 -122785 -83797
176 -83797 -15650 -23483 -61551 -89617 -95997 -40953 6694 -43145 -93354 -54479 -12795 -16782 -20275
189 -20275 -36940 -54630 -16431 20599 -3410 -16259 3565 1620 10169 38343 12931 -22803
201 -22803 14827 56730 42068 24857 13822 3029 39469 73295 29721 -7562 25114 45696
213D5696j2394l64j2828j4628L0333J3364m0111p739K8142p036q177J4121j5642
226A2737j5363K8925O249k8867O469J2396j8025N468J7045j9694n490K2137j3283
239A0704j4102K7883J589l2760M607J3212j4057Q855J4894k2648o137K2868j2080
252B828j7903J7059k863j8152K2531J3777k7303n371J3888p294P166J3509l0936
265a9064j4898M0857J2517l3328p202J0866M458J7998p676m7157J612N2743O677
278A8403k9352j1912j1140O764L9416k828n0748k090L7235N514p236r541k6746
291d4261J0464M9427m421m5327l534J9610J2428J9426j2426m5879J1879N8046
303B5432L999l5985j9142l101K8218M9222j8585o6826L549N7773J8638j8805l2907
$$ plain form
213 45696 33302 32938 20110 5482 35815 49179 9068 1329 29471 22435 14258 28379 12737
226 12737 -2626 26299 32548 3681 10150 22546 4521 9989 27034 7340 1850 23987 10704
239 10704 -3398 24485 26074 -6686 -2079 11133 -2924 5931 20825 -1823 -7960 14908 2828
252 2828 -15075 1984 -879 -19031 3500 17277 -10026 -15397 -1509 -8803 -1637 11872 -19064
265 -19064 -33962 6895 19412 -13916 -21118 -10252 -5794 12204 4528 -42629 -41017 11726 18403
278 18403 -10949 -22861 -34001 -27237 12179 9351 -41397 -43487 -6252 -738 -7974 -17515 -44261
291 -44261 -33797 15630 11209 -34118 -37652 -18042 -5614 13812 1386 -44493 -32614 25432
303 25432 29431 -6554 -25696 -28797 -579 48643 30058 -36768 -33219 24554 43192 24387 -8520
316h520k5339L6227N7769k6657o3647O424M4369K1366j837m0322m3836L3186O3695
329E2878j0573m9250j4868J0980L3815L1432l9942o2633K2278O3066Q747l3328
341A2602l8774j5338N1419N6373m0749p1797Q781N3716K5870j3727n2093l1880
353e5597N6734O2992l4000o6136q008L5989M6442J2051o2984n2767M8594O6701
365E0011j1482m8579k9185Q750N7741L3564n8566o1611K9215N8830J7894k3950
377B2632n3144k1124O2415N1966m5585o0763O417M4834L9826p132p1086l6402
389f7146O5985O1291l2015n8814k0423K7877N9979J2686p1340m5934M8693N2903
401C3742p162l8980m1529O922P0481L0735o3614n4233K4218M9693K7077k0222
$$ plain form
316 -8520 -33859 2368 60137 33480 -30167 -23743 20626 41992 40155 -167 -44003 -10817 52878
329 52878 42305 -6945 -21813 -10833 22982 54414 14472 -48161 -25883 37183 45930 12602
341 12602 -26172 -41510 9909 66282 25533 -46264 -37483 16233 42103 28376 -23717 -55597
353 -55597 1137 64129 30129 -36007 -44015 -8026 38416 50467 -12517 -65284 -16690 50011
365 50011 38529 -10050 -39235 -30485 27256 60820 2254 -59357 -30142 28688 46582 22632
377 22632 -30512 -51636 10779 62745 17160 -43603 -37186 7648 47474 40342 -30744 -67146
389 -67146 -1161 60130 28115 -30699 -51122 -23245 36734 49420 -21920 -67854 -19161 33742
401 33742 26580 -12400 -53929 -47007 23474 54209 -9405 -63638 -39420 10273 37350 17128
413A7128o4137j4984P2985M4093m4611n1173k283L8255N1682m802p3625k7407
425e8879O2842M7747k0890m3048k8289K3287O5263Q176p1563l5548M2213M5042
437C6353P371l3608n1534P509O9909J8595n7200l7894J5412L7038L1363k1626
449B1688o4088m120O6132K8000l6347m0633j4221L1131N4747p128o5877j5703
461d6419M7404L0415r232l3550l3166K3016O1882j122n9718k0422K8982L3718
473B1788J5511k9814n1638J3598O2177R014m2810k5441M319L2776L5163k5108
485A9535n7478O731N2649J4666k2582k8810j6598K9973M7032j7217n3153l189
497b8441L3474K0619J368k9743l5415K4495N0559p003m0896j3288J0480K4942
$$ plain form
413 17128 -47009 -61993 10992 55085 10474 -40699 -42982 -4727 46955 42153 -31472 -58879
425 -58879 3963 51710 30820 -12228 -40517 -17230 48033 56209 -15354 -50902 -8689 36353
437 36353 43724 10116 -41418 -33909 36000 54595 -2605 -40499 -25087 11951 43314 21688
449 21688 -42400 -46520 19612 47612 11265 -29368 -43589 -12458 42289 35161 -30716 -46419
461 -46419 985 31400 22168 -11382 -44548 -21532 40350 39228 -20490 -40912 -11930 21788
473 21788 37299 7485 -44153 -30555 31622 40636 -2174 -27615 -23296 9480 44643 19535
485 19535 -37943 -31212 21437 36103 13521 -15289 -31887 -1914 45118 27901 -25252 -28441
497 -28441 5033 25652 27020 -2723 -38138 -13643 36916 29913 -10983 -24271 -13791 11151
509A1151K0566k8548m3362J8638M5974M44k7475k1315o148K9993L2304k5942m1610
522c5330J1739L1318O682p379k1724j7981K7656L3651k0596l1635M777J6527J4466
535A2171R307k5181k8105K3023L1711r302j7718o809k373K0417K0621k5278k9031
548b6547J7737K2752j517p243j5846j3059K4990K3174k3717k3114J1733J1152
560D95M523K585k0576j4905K4494J8192j8286j0279M692k017R541J1212j8105
573h434j3715J8327Q815p964L495l176j1700J4121J4369j5502q830J0784K42J433
587B265J0714j0061j2304J5648Q952j4704m65P121n568M665J0333j3370p240J4306
601A0292j674j0096J0402K852j3307L154O529q560L866Q363j5094n982J7678k64
$$ plain form
509 11151 31717 3169 -40193 -21555 24419 24863 -2612 -23927 -30075 -82 32222 6280 -35330
522 -35330 -23591 7727 14409 7030 -14694 -32675 -5019 28632 8036 -23599 -18822 -2295 12171
535 12171 21478 -3703 -31808 -8785 22926 13624 -4094 -10903 -13276 7141 27762 2484 -26547
548 -26547 -8810 13942 12425 5182 -10664 -23723 1267 24441 724 -22390 -10657 495
560 495 5018 7603 -12973 -27878 -3384 14808 -3478 -13757 -9065 -11082 -1541 9671 -8434
573 -8434 -22149 -3822 4993 -2971 524 -2652 -14352 -231 14138 -1364 -10194 590 832 2265
587 2265 12979 2918 -9386 6262 15214 510 45 7166 1598 6263 16596 3226 -4014 10292
601 10292 8618 -1478 8924 11776 -1531 1623 8152 -408 3458 11821 -3273 -9255 8423 8159
615H159j3915K427J127l516J1417L81k1395K022J8952l610q906J841o721j322
629a3059J8768o87j9177J733J0872j951N179J714j9889j416K5220L870j5041l273
643g137j604L964K0065l082k9805J220K7732N437j0966r295j1576J1079K8258
656B4290p284l2518K19K1321P011M26j2796k2044J1588L1206n898k6518m791O651
670i137J1292J6199j2856l1895N263K9845L332j3771j2392j0497J6131K9578j2477
683H615l6194J170K6262J3791k354k3278k3138K2766L9616j0729l6396m649J8855
696e663K1374R086k6955k9484K1179L7254m132k3769j1993J510K4714K2477k3277
709A2321l4606J1462K9688P770r134k3663j5695K8087L4985j9220l8937k829K2195
$$ plain form
615 8159 -5756 -3329 -2202 -5718 5699 6080 -15315 -13293 5659 2049 -6857 -5016 -11737 -13059
629 -13059 5709 5022 -14155 -12422 -1550 -3501 1678 3392 -16497 -17913 7307 11177 -3864 -7137
643 -7137 -8741 -4777 15288 12206 -17599 -16379 11353 16790 5824 -3471 -15047 -3968 24290
656 24290 17006 -15512 -15293 6028 13039 13465 669 -21375 -9787 21419 15521 -10997 -15788 -9137
670 -9137 2155 18354 5498 -26397 -21134 8711 12043 -1728 -14120 -24617 -8486 21092 8615
683 8615 -27579 -26409 -147 13644 11290 -11988 -35126 -12360 27256 16527 -19869 -24518 -5663
696 -5663 15711 24797 -2158 -31642 -10463 26791 22659 -1110 -13103 -11593 13121 35598 12321
709 12321 -22285 -10823 18865 26635 17501 -6162 -21857 6230 41215 21995 -16942 -19771 2424
722B424K3078L665l4761k8943K9203L7890j2746l2982j3315J0722L0786J3890
734B8911l7021l2661K3514L3507k038k0696k1492j947L4157K1768l0783l0679
746c5460J1837K5035J4285n214l2018j6313L4931L1902j8309k9674o087J5394
758i691L0589Q959l8357k6466L0733L4783o711k6418k0576Q454M1449J3403m1712
771a561k7509K3504K8315M060j8068k9320j70M0111J6933l1915k5939O670J9301
784D412J9954n232l7411j2774L4421K3226j5849k3500j2717J1732L4373M504m1263
797a6124j9345K8552K5361j513k0804k6255P589M1408Q775l6927k0210J6005K3296
810I808J2949j5361l4223J849M0138J1934k5805j8009K43J6409K3888o543l5258
$$ plain form
722 2424 25502 29167 -5594 -34537 -5334 32556 19810 -13172 -26487 -15765 15021 28911
734 28911 -8110 -40771 -17257 16250 14212 -6484 -27976 -29923 4234 26002 -4781 -35460
746 -35460 -23623 1412 15697 10483 -21535 -37848 -2917 28985 10676 -18998 -25085 -9691
758 -9691 20898 29857 -8500 -34966 -4233 30550 23839 -2579 -23155 -14701 26748 40151 -1561
771 -1561 -29070 -5566 22749 26809 8741 -20579 -20749 19362 36295 4380 -21559 -14889 4412
784 4412 24366 19134 -18277 -31051 3370 26596 10747 -12753 -25470 -13738 20635 25139 -16124
797 -16124 -35469 -6917 18444 16931 -3873 -30128 -22539 18869 27644 -9283 -29493 -13488 9808
810 9808 22757 7396 -26827 -24978 15160 27094 1289 -16720 -16477 -68 23820 17277 -17981
823a7981l997K9578J3628r568j7147j5846J1328L4087m55l5020j1297J8619J8068
836A3997O669j7807k9478P894L8197M184k8929j4954O392J9287J7038j5910l3084
849b6504O505L2006N473j6104j3803n830J5575K4504j0936l0290J387K1717R086
862A2786j567j4693j8308J3191K8881n142k3452m671P529J2980J1836j4213k5264
875b0107R789K6552q7j4865r127l436J4960J8447j4057k5312P759J9352K741n526
889G083j2004j0637J5179K0227j2846j9648M777Q844M385N309j1361j5541J1045
902e188J6200o603q760r79l289Q501J2852j1682j6462Q658J1917k404j360n301
916c900q716J2032J4164j2532j2811P598N601J082M348q358j0318J2268J0204
$$ plain form
823 -17981 -21978 7600 21228 11660 -5487 -21333 -10005 24082 23627 -11393 -22690 -4071 13997
836 13997 20666 2859 -26619 -18725 19472 23656 -5273 -20227 -13835 5452 22490 6580 -26504
849 -26504 -19999 12007 17480 1376 -12427 -18257 -2682 21822 10886 -19404 -18017 3700 12786
862 12786 11219 -3474 -21782 -8591 20290 15148 -8304 -12975 -5446 7534 19370 5157 -20107
875 -20107 -10318 16234 16147 1282 -7845 -11281 3679 22126 8069 -17243 -9484 9868 12609 7083
889 7083 -4921 -15558 -379 19848 7002 -12646 -7869 975 5360 10669 -692 -16233 -5188
902 -5188 11012 4409 -4351 -5330 -8619 -118 12734 1052 -15410 -6752 5165 2761 1401 -3900
916 -3900 -12616 -584 13580 1048 -11763 -4165 1436 2518 6866 -1492 -11810 458 10662
929A0662r721m252L699l531L516Q470p960q368R181L018o403L693J051q183M049
944a079P894p553l406N918l518k102Q929l548r449O345N076p068J423L639p572
959f071P76R562m694n587O856j803o317Q381L477r566J207N018l319L279N155
974F354j0647m177J3705K903r715O78J232j453Q857J865j4536q75J3510o2m903
989B736J85n318Q7J3335j89j5576L66Q485p5K271j09j2941j210J6438J041j1787
1005b261k551M72J868J1367k095j9133k9J6747K245o936m787p320N603J7849l289
1020G750k0732q11J3582N062m7o712j3311O983J9491k912j6230j002M927O141
1034B179R470p443j8012N337J8801J14j0143m960m132R511J7059q228k1635K208
$$ plain form
929 10662 941 -3311 388 -3143 373 8843 883 -7485 1696 4714 -1689 2004 3055 -5128 -1079
944 -1079 6815 -738 -4144 1774 -1744 -3846 5083 1535 -7914 -1569 3507 -3561 -2138 1501 -6071
959 -6071 -5295 4267 -427 -6014 842 -961 -7278 1103 4580 -4986 -3779 1239 -2080 1199 6354
974 6354 -4293 -8470 5235 8138 -1577 -899 333 -1120 7737 9602 -4934 -5809 7701 7639 2736
989 2736 2921 -2397 -2310 11025 10836 -4740 -4374 4111 4036 6307 6198 -6743 -7953 8485 9526 -2261
1005 -2261 -4812 -4340 -2472 8895 6800 -12333 -12362 4385 6630 -306 -5093 -12413 -6810 11039 7750
1020 7750 -12982 -13793 -211 4851 4804 -1908 -15219 -8236 11255 8343 -7887 -8889 -3962 2179
1034 2179 11649 4206 -13806 -8469 10332 10446 303 -4657 -8789 722 17781 9553 -12082 -9874
1048i874J5689N621k152j1975j2605J2771K1694q489k0901q19J0088R528M368
1061A2944j4686j7798J2743K1306n345j5314n645J553J3982J2135j5840k0375
1073b0340J0280J7801Q90p306j1651o529J7523J7733j3897k0456L939J3573R031
1086A0591O19j7814j2841J9041K0107j0456j7249l223P248J6085P031k1084j6435
1099a8380J6660J9272m922j2298j0143K76J9931J1435k0375j7648J0699J4123
1111H630M676n682j8256o533K1941J4991j6240j6412J604R436J3165O09k2627
1124a0698j1275K0920J6214r327j4030p351N282K0904N139k4022j3231J6733J4909
1137A0167n53r437j5821R73K4826Q856k1121j3541P641J2919R742n243k1747l593
$$ plain form
1048 -9874 5815 11436 9284 -2691 -15296 -2525 19169 10680 -10221 -11040 -952 8576 12944
1061 12944 -1742 -19540 -6797 14509 9164 -6150 -11795 -10242 3740 15875 35 -20340
1073 -20340 -10060 7741 8631 1325 -10326 -16855 668 18401 4504 -15952 -12013 1560 10591
1086 10591 11210 -6604 -19445 -404 19703 9247 -8002 -11225 -3977 12108 19139 -1945 -18380
1099 -18380 -1720 17552 12630 332 -9811 -9535 10396 21831 1456 -16192 -5493 8630
1111 8630 13306 7624 -10632 -17165 4776 19767 3527 -12885 -11281 -1845 11320 11929 -10698
1124 -10698 -21973 -1053 15161 5834 -8196 -15547 -10265 10639 15778 -8244 -21475 -4742 10167
1137 10167 9614 177 -15644 -14671 10155 19011 -2110 -15651 -8010 4909 14651 9408 -12339 -15932
1151a5932K4251J0712j4256j2254k316Q894J7274j017k4528o925J9631J1390n119
1164I805j1069j2530N488K2628K210k3411q480J1550J1114M896r836j9068K199
1177a4504K3964M219j7307q996K660R642J2656o328k1842N7J9797O545q539r260
1191g236o756Q806J8791l645k1131k735J4125P849N86q686j3933O860K0848n67
1205A3176j7387m691N420R656Q707q311j8926M845J8793J696j0084o913l047R134
1219B068J4374q017j8712K393J3710L299k915p808r464Q662J5253o358j4372K78
1233g609N368N032N270q562j3423P001J4409l240q624k828j149P080J0395q310
1247H10j3877N811J0540k96k340m973n886Q930J1485p781j0590L924N215J813
$$ plain form
1151 -15932 8319 19031 4775 -7479 -9795 -901 16373 15356 -9172 -16097 3534 14924 9805
1164 9805 -1264 -13794 -8306 14322 16532 -6879 -15359 -3809 7305 12201 2365 -16703 -14504
1177 -14504 9460 13679 -3628 -12624 -9964 -322 12334 6006 -15836 -15779 4018 10563 2024 -7236
1191 -7236 -13992 -5186 13605 9960 -11171 -13906 219 8068 8654 -32 -13965 -7105 13743 13176
1205 13176 -4211 -8902 -3482 6174 14881 6570 -12356 -7511 11282 12978 2894 -4019 -7066 2068
1219 2068 16442 8425 -10287 -7894 5816 9115 6200 -1608 -11072 -2410 12843 6485 -7887 -7609
1233 -7609 -2241 2791 8061 -501 -13924 -6923 7486 4246 -4378 -7206 -8355 -1275 9120 810
1247 810 -13067 -7256 3284 2988 648 -4325 -10211 -1281 10204 2423 -8167 -4243 972 2785
1261B785L536o103q850Q532R839o085n556J938r63L771O375p035q083O986N321
1276F408l565k85j108n525N547P167p070o373M754J349o23L143l778p087O558
1291d88N633o811k288L044k643R81N405n147m880O536J267m834K556J632n398
1306e435K600N591m960j373M913k663k088O078j169n647M106L190m511K508L164
1321D304n708m72P077k479l625L991j388k986N823J133p458J254M901l102k51
1336A014L077n305k453P838p5o525J332J497k929N058J162q920j020Q674o6m583
1352b224M51k832p5R044j291j0391J063O795k73j8J67o618Q55J0077n24q654R65
1369c483K651M40N077j267r968J685J1307j269n336j448k084L173R484l279j2076
$$ plain form
1261 2785 6321 218 -8632 -100 9739 3654 -1902 36 -927 2844 9219 2184 -5899 1087 6408
1276 6408 2843 2558 1450 -4075 1472 8639 1569 -4804 -50 1299 676 3819 41 -7046 -488
1291 -488 5145 -1666 -3954 -910 -3553 -2572 2833 -2314 -7194 -658 609 -4225 -1669 -37 -5435
1306 -5435 -2835 2756 -2204 -3577 1336 -1327 -3415 2663 1494 -4153 -47 3143 -1368 1140 4304
1321 4304 -1404 -1876 5201 2722 -903 3088 1700 -1286 4537 5670 -1788 -534 4367 1265 1014
1336 1014 4091 -1214 -3667 4171 4096 -2429 -1097 400 -2529 2529 3691 -5229 -6249 2425 2359 -2224
1352 -2224 -1773 -4605 -4680 4364 3073 -7318 -6255 540 267 249 416 -6202 -5347 4730 4206 -4448 -3483
1369 -3483 -832 -392 4685 3418 -6550 -4865 6442 5173 -163 -1611 -3695 -522 8962 5683 -6393
1384f393J558R252P61j323l591p188M514J1652l043j1328k41N064L279L760n885
1399H48j0856N368J2230k788q429j916O34N868P517p067j2322N116J0658j38l606
1414A117m916m873P594J1619o396j2378K100P210M331J582q270r848R693J3366
1428A1931n556j0430j629L637P873N579j1225j1482Q770J1840j960p076o182j306
1442g216J0797R209j1216j2124N237Q788K967k337j0005o278J2134J1227q519
1455B664j1123P86N127P576K972j2865r214J1212J1624m328q259m752P84J2612
1469D816P120j4357j0851Q970J0915J264n496j0137j866J5069Q082j2174j0102
1482h747M894O616N927o91j3005n380J3949Q945p682q153k266K893J1884K634
$$ plain form
1384 -6393 -4835 4417 5178 3855 264 -6924 -2410 9242 6199 -5129 -5370 -306 2973 6733 848
1399 848 -10008 -4640 7590 4802 -3627 -5543 -4909 959 8476 1409 -10913 -5797 4861 4723 1117
1414 1117 -3799 -8672 -1078 10541 4145 -8233 -6133 1077 5408 6990 -1280 -11128 -1435 11931
1428 11931 6375 -4055 -5684 -2047 5826 11405 180 -11302 -2532 9308 7348 272 -5910 -7216
1442 -7216 3581 12790 1574 -10550 -5313 3475 6442 4105 -5900 -12178 -44 11183 2664
1455 2664 -8459 -7673 -2546 5030 8002 -4863 -14077 -2865 8759 4431 -3828 -8580 -7796 4816
1469 4816 11936 -2421 -13272 -4302 6613 7877 2381 -7756 -9622 5447 13529 1355 -8747
1482 -8747 -3853 2763 8690 7999 -5006 -10386 3563 12508 4826 -3327 -5593 -2700 9184 11818
1496A1818j5415p721J1040R285j800o636q933Q36J4828M935j4772q058O032P631
1510C070L955l832j2981j304J4939N697j0348p377M77N875R192j425j5106k867
1524a2035J3176N958m195o187n583L549J3121Q93j3308m589P827N947K376l801
1538C149j0947Q45J4479L016j0855n102K377N610P495l684j4018N34J3644K912
1552I455o946n799k187N111J0108l224j2559n73Q742K678m55m173q019L306J1646
1567G111j141j0409j848L109L956N162m546j0892L186J1064j92o816k671j004
1581e931M888Q316m718j0741K231Q555J115j467l789n514M875R984l431q543R80
1596c190M043J955K304l723p012M247Q400l301m775N22q45K395N830l874p924
$$ plain form
1496 11818 -3597 -11318 -278 9007 7207 571 -8362 -7526 7302 12237 -2535 -10593 -4561 3070
1510 3070 7025 3193 -9788 -11092 3847 9544 -804 -8181 -7704 -1829 7363 5938 -9168 -12035
1524 -12035 1141 7099 2904 -3283 -8866 -5317 7804 8697 -4611 -9200 -1373 4574 6950 3149
1538 3149 -7798 -6953 7526 10542 -313 -5415 -3038 2572 10067 6383 -7635 -7101 6543 9455
1552 9455 2509 -3290 -5477 -366 9742 6518 -6041 -6614 2128 4806 4351 178 -7841 -4535 7111
1567 7111 5970 -4439 -6287 -3178 778 5940 1394 -9498 -6312 4752 4560 -2256 -4927 -5931
1581 -5931 -1043 7273 2555 -8186 -5955 2600 3715 2248 -1541 -7055 -2180 7804 4373 -4170 -3190
1596 -3190 853 2808 5112 1389 -5623 -1376 7024 3723 -1052 -530 -1375 1020 6850 2976 -4948
1611d948L507N437r69j275k166l926L794P062m480p162K807L110j14K052l771
1626a042n250N081N352m539l277K169n61O26L636l253m354M260L298k987J37j68
1642h72k972L085M745m312l544M255O81j262K745j861l697L630L325l694m51K078
1658A879k031J25M058k551l749L800J551l493J628J121l772J816L021l711j468
1673a776L737j664k409L514j08m072J875J613k791J812J999m535n26M978j343
1688C04l664K601q7j733L472P38n199J104L742j878m21K101k878p65N496m43m592
1705b102R49J997j130K643R53n963L96O101l33l785J129j554J19N249o20o818
1721b769O27N001k80o50q37m234J137P122j324o954O47L006Q9J880k124n856K136
$$ plain form
1611 -4948 -1441 3996 3027 1752 -414 -4340 -546 6516 2036 -5126 -2319 791 677 2729 -1042
1626 -1042 -6292 -1211 4141 -398 -3675 -1506 -2067 -1441 2195 -1058 -5412 -1152 2146 -841 -704 -872
1642 -872 -3844 -759 3986 -326 -3870 385 1066 -196 2549 688 -3009 621 3946 252 -199 1879
1658 1879 -152 -27 4031 1480 -2269 1531 3082 -411 1217 2338 -1434 382 3403 -308 -1776
1673 -1776 1961 297 -2112 1402 1294 -2778 -903 710 -2081 -269 1730 -2805 -3331 1647 304
1688 304 -3360 -759 -846 -2579 893 1631 -3568 -2464 1278 -600 -1021 1080 -1798 -2563 2933 2490 -2102
1705 -2102 -1153 844 -286 2357 3310 -2653 -2257 3844 3511 -274 855 -699 -580 4669 4049 -2769
1721 -2769 -2142 2859 2579 1929 1092 -3142 -2005 5117 3793 -3161 -2514 492 581 2461 337 -5519 -3383
1738c383P050j420m900L16j183J813N745k537p580J784O471l33j483k021l732
1753e393L239P793k955p686J029M201J878J621l786o477M939Q357k910n918n32
1768b600J333L452M737m898q146M200P217q85k939l224k650N557O886n246q033
1783e239K139N406J493l9n367n495O006Q067m207o956p80K785M947K909p224p295
1799h850N960Q475k588m908k875j346P866N272p543p474M679N735J328j790n520
1814c579l405Q012O849o443o233J375L777M294J333p818n784Q064P325l670n408
1829a311k457J072P292L723q789o853O394O264r18k792n791j465R134M442q082
1844a37n932K989M135L268p64q511l034R353N164n924n270m89K551O813J068r479
$$ plain form
1738 -3383 3667 2247 -2653 -2337 -3520 -1707 4038 1501 -6079 -4295 2176 1843 360 -1661 -5393
1753 -5393 -2154 5639 2684 -5002 -3973 228 2106 3727 -59 -6536 -1597 6760 3850 -2068 -2600
1768 -2600 -1267 2185 6922 2024 -6122 -1922 5295 4410 1471 -1753 -4403 1154 8040 2794 -5239
1783 -5239 -3100 2306 3799 3760 -1607 -7102 -1096 6971 2764 -4192 -4972 -2187 2760 5669 -1555 -8850
1799 -8850 -2890 5585 2997 -1911 -4786 -6132 1734 7006 -537 -8011 -3332 2403 3731 1941 -3579
1814 -3579 -6984 1028 7877 1434 -4799 -3424 353 4647 5980 -1838 -7622 442 7767 4097 -1311
1829 -1311 -3768 -2696 4596 8319 -470 -7323 -929 5335 4417 1625 -4166 -5631 3503 7945 -137
1844 -137 -6069 -3080 1055 4323 3559 -4952 -7986 1367 6531 607 -4663 -5152 -2601 4212 5280 -4199
1860d199l665P270N146j958l716m636Q32R596K396r143m600N157M210K048k366
1875B372p508m99J0070L180p335m581J499L452O078j494r408j524Q711K784l662
1890B135l384l027K231P794j07q940k246N527L251J36k831o036R95R024L12p241
1906b407k339K138K768M100k416p965N92Q379J019m289k602j456L338O271k149
1921B982p957J94O238J513p58k683m396K753P760j724o691j09K983J819K511k764
1937A671o208K420O843o67m108j452o06K739N105l209o701J450N412P6j492k143
1953h70l320L280N544k486n967Q58K901J065J048k657m754L311N531k257l717
1968b490L22M0J823L713l349m924K655M504j510q82q10j972K671M079k753l745
$$ plain form
1860 -4199 -7864 -594 4552 2594 -1122 -5758 -4926 4670 7066 -2077 -6677 -1520 2690 4738 2372
1875 2372 -5136 -5635 4435 7615 280 -4301 -2802 650 6728 5234 -4174 -5698 3013 5797 2135
1890 2135 -1249 -4276 -2045 5749 5642 -3298 -5544 -17 3234 3370 539 -5497 -4502 4522 4834 -2407
1906 -2407 -4746 -2608 160 4260 1844 -6121 -5529 2850 3869 -420 -3022 -4478 -1140 5131 2982
1921 2982 -4975 -4781 1457 2970 2212 -471 -4867 -2114 5646 3922 -2769 -2878 105 1924 4435 1671
1937 1671 -4537 -2117 4726 4059 -49 -1501 -2107 632 5737 2528 -4173 -2723 2689 2765 1273 -870
1953 -870 -4190 -910 4634 2148 -3819 -2961 -60 1005 2053 -604 -5358 -2047 3484 1227 -2490
1968 -2490 -2168 -2128 -305 3408 59 -4865 -2210 2294 784 -98 -908 -2880 -209 3870 1117 -2628
1984b628J909J788P3R85j443l736L319L994l018k096J212m82J111K507k452l705
2000b662L252K289j937n05L21k405J784L171l382k289K515K65o48J457j114l281
2016c169K057K603k417l84R27j191j2K904j905k371K186J013j486J305L92l053
2032b601J470K993j788j550K109q03o97K970p59k966J596J853j721Q95P51k747
2048i95L22L475j152k273J391J02j115K376L11m000N57K950r65j099O33j861l8
2065a381L680o83l950R56J733p96R33J59l966Q63M340n65l289L79k11N50L125
2082A877r93m553P94L888Kn72j314k164J572M970j464m740M24L055O85J122j450
2099A139m631K077N617j095l972l07O81J952L200k711n251J924M472l0k070j600
$$ plain form
1984 -2628 -719 1069 1142 2127 684 -3052 267 4261 1243 -853 359 -123 988 3495 1043 -2662
2000 -2662 590 2879 942 437 758 -1647 137 3308 -74 -2363 152 417 -231 1226 112 -3169
2016 -3169 -1112 1491 -926 -1310 -383 -1574 -1586 1318 -587 -2958 -772 241 -1245 60 452 -2601
2032 -2601 -1131 1862 74 -1476 633 -170 -867 2103 1344 -1622 -26 1827 106 1001 1752 -995
2048 -995 -673 2802 1650 -623 768 870 -245 2131 2442 -1558 -1001 1949 984 -115 518 -1343 -1381
2065 -1381 2299 1616 -2334 -1378 355 -441 492 651 -3315 -2452 1888 1323 -1966 -1587 -1798 -1248 1877
2082 1877 884 -3669 -2875 1013 1015 443 -871 -3035 -1463 3507 2043 -2697 -2273 782 1467 2589 1139
2099 1139 -3492 -1415 4202 3107 -865 -1172 -491 1461 4661 1950 -3301 -1377 3095 3065 995 -605
2115f05k295L104M751k756n390Q19L274J074J75k925m222L310N608j878m517o60
2131c133J084K638L378m381n491L015N630n62k748k464q44M431M532m616n043
2146d574K057M033R47o78l623k976N058N187l052n341N18K197L653J180m803m700
2162d917M556N389j477l856k267N50M561L463n631n222L082M979K76k224m075
2177b813j478N853L958m895n126J455L223K766j82n920k906O075M571l457l746
2192b622j099J363M829J765o232l900M580M344o17k270l863r7O165K977n322m452
2208d451K645L508K396j728n645j213P147L150m500m054J34K994M033j05o541
2223b230k384N678L525k205k978k604J003N858J035o395k819L877K908O61k133
$$ plain form
2115 -605 -2900 204 4955 2199 -3191 -2372 902 1976 2151 -774 -4996 -1686 3922 2044 -2473 -3133
2131 -3133 -2049 589 3967 -414 -5905 -2890 2740 2178 -570 -3034 -3878 553 5085 469 -4574
2146 -4574 -2517 1516 2463 1785 -1838 -4814 244 5431 2379 -2962 -2444 -247 3406 4586 -217 -4917
2162 -4917 -361 5028 3551 -305 -2572 -2022 2539 6002 371 -4851 -1769 3210 3486 1262 -2813
2177 -2813 -4291 1562 5520 625 -4501 -3046 177 2943 2761 -3159 -6065 10 4581 1124 -2622
2192 -2622 -3721 -2358 2471 4236 -1996 -5896 -1316 3028 2411 141 -3722 -3819 2346 5323 1 -4451
2208 -4451 -1806 1702 4098 2370 -3275 -4488 2659 5809 1309 -2745 -2611 383 4416 4311 -2230
2223 -2230 -4614 1064 4589 2384 -594 -3198 -2195 3663 4698 -1697 -4516 -639 2269 2930 797
2238G97n078M02O372J521n047l047J675K345L532j348o648l08O116K440l099k725
2254b100j735K606N074o80o203j289M926K179m04k621l265K043N198N07n360j599
2270b723K267J976K372k204n488J142N898M91l283k217j81K396L922j965n884
2285c481M40M510J045j210k317k524K254M839j461n114J67K462J569Q05k232m036
2301d284J985N004n06l642q91J81K274K788k373m197J748L384M3j028j275j836
2317b625K267L869j979l669N52K194R01Q82k090l241K586L833j734k639L2L87
2333d74J391K052k143l525K294K574p66j079q63j151J344L314k649k406J101J328
2349C42M2M65j348k289K032K632j719j671N13l90J127J677j891k452K109J919
$$ plain form
2238 797 -4281 -3879 2493 4014 -1033 -4080 -2405 -60 3472 2124 -4524 -4832 1284 3724 625 -2100
2254 -2100 -3835 -1229 3845 3165 -3038 -4327 599 2778 2374 -247 -3512 -1469 3729 4236 -1124 -2723
2270 -2723 -456 1520 3892 1688 -3800 -2658 3240 3731 448 -1769 -1950 446 4368 2403 -3481
2285 -3481 -3041 1469 2514 1304 -1013 -3537 -1283 3556 2095 -3019 -2852 -390 1179 1984 -248 -4284
2301 -4284 -2299 2705 2199 -1443 -2334 -2153 121 2909 536 -3661 -1913 1471 1514 486 -789 -2625
2317 -2625 -358 3511 1532 -2137 -1585 609 1510 2392 302 -2939 -353 3480 1746 -893 -861 -474
2333 -474 917 2969 826 -2699 -405 2169 1403 324 -539 -1690 -346 2968 319 -2087 -986 342
2349 342 384 849 -499 -2788 -756 1876 157 -1514 -1001 -1391 -264 1413 -478 -2930 -821 1098
2365A098j112j41k24j422J530K239j776j734J598J26m5J238j005j616J144J904
2381A802j169n93Q86r78k65K298j109j446R93M63o35O57K48k451J118J748o19
2398I48j797Q07m5n50J840m37k521P57J212m41L03J57j887O6K960o50k314P07
2416h85M54q58J787J28k577L02K494k67q41J39j406L96L052n01k583j7J677M65
2434I59Q04j066k531P26L494l46k558j58N74Q08J834j235k910N99K869k29r53
2451F81j141j139J235L038j070l942O00J984J017L91k051k828J858L742q84l231
2467a740k77O90J527J887k077l236J485L729m74j995r58q23K320L149k310l825
2483b928J013L302M61k59j933k376K651L652j897l169j27J608J748J483k843l433
$$ plain form
2365 1098 -14 -155 -379 -1801 -271 1968 192 -1542 56 182 137 1375 370 -1246 -102 1802
2381 1802 633 40 926 -52 -317 1981 872 -574 419 882 247 904 1152 -1299 -181 1567 948
2398 948 -849 -42 -87 -637 1203 766 -1755 -998 214 -227 76 233 -1654 -1588 1372 722 -1592 -885
2416 -885 -431 -1289 498 626 -1951 -1649 845 578 -263 -124 -1530 -1134 1918 1417 -1166 -1183 494 959
2434 959 1763 697 -1834 -1108 2386 2040 -518 -676 -102 706 2540 1305 -1605 -1006 1863 1634 681
2451 681 -460 -1599 -364 2674 1604 -2338 -1738 246 1263 1654 -397 -3225 -1367 2375 1491 -1740
2467 -1740 -2017 -1327 200 2087 10 -3226 -1741 1988 1514 -481 -1439 -2262 58 3207 897 -2928
2483 -2928 -1915 1387 1848 1589 -344 -2720 -69 3583 1686 -1483 -1610 -2 1746 3229 386 -3047
2499c047K531L910j201k506j248k75L097K526l351l781J806L317L84j007l038
2514a883j219L748L231l424l606J053K131J916k14l174k689L655L310j582l050
2529a797q94J164L185J409l920l238K862L459k61j578k480n03L977K626l532l508
2545c029J588K646J605j052l792j092M471K997l018l175K78J504L210q7m415j986
2561c347L925K457j162k349k071Q24M009R89m474k370K419K793M54j375l673l70
2577c321M734J894l968k156N59K013K683q02m376j067M851K087k518k338p10J045
2593a390M168l2m989q78L193K149j49j989k709P45M673P92m199j806J846J974
2609A399J899j597m194J98M315J414k599k370k88J948K987q77m829k53L506J409
$$ plain form
2499 -3047 -516 3394 2193 -313 -1561 -1836 1261 3787 436 -3345 -1539 1778 2162 1155 -1883
2514 -1883 -3102 646 3877 453 -3153 -2100 31 1947 1733 -1441 -4130 -475 2835 1253 -1797
2529 -1797 -2691 -1527 1658 3067 -853 -4091 -1229 2230 1969 391 -2089 -2592 1385 4011 479 -3029
2545 -3029 -1441 1205 2810 1758 -2034 -3126 1345 4342 1324 -1851 -1573 -69 3141 3054 -1361 -3347
2561 -3347 578 3035 1873 -476 -2547 -1723 2286 3275 -1199 -3569 -1150 1643 2097 722 -2951 -3321
2577 -3321 1413 3307 -661 -2817 -2258 -245 2438 1636 -2740 -3807 1044 3131 613 -1725 -2435 -1390
2593 -1390 2778 2746 -2243 -3121 72 2221 2072 83 -2626 -1881 2792 3584 -615 -2421 -575 1399
2609 1399 3298 1701 -2493 -2295 2020 3434 835 -1535 -1823 125 3112 2235 -2594 -2847 659 2068
2625B068j017j882k015J461M125o01m189o83K120J650P25j764l318Q94M283K59
2641B116k647j560L79J527K450j034l722q4L535J044j182j556j526J614L651r40
2657B065l960K33J844J424K81j498k515J350L641r33k596j85K42J437J460j353
2673I37k852R89K996o81j188p59q38J295K366j391k961L10K265J47K83j161k282
2690b525J795K346j128k120M31L93P24J562j248k411J250K034q34m23j36j195
2706a485J444J830j453j784Q53J361j88K26o08j450J181J873j439p86P26l54L75
2723C22J086r14j843J319J360j105K5k28o64M64J426q19j782J280K08j99O03m47
2741I2j387J167Q25j071j2P12r88J65J199k69j870J126M32p90R44k48j224M97
$$ plain form
2625 2068 1051 -831 -2846 -1385 2740 2139 -2050 -2733 -613 1037 1762 -2 -3320 -2426 1857 2116
2641 2116 -531 -2091 -1712 -185 2265 1231 -2491 -2575 960 2004 822 -734 -2260 -646 3005 2065
2657 2065 -1895 -1662 182 1606 1887 389 -2126 -776 2865 1932 -664 -849 -607 830 2290 937
2673 937 -1915 -926 2070 1389 201 -558 -1396 -101 2265 874 -2087 -1777 488 635 918 -243 -2525
2690 -2525 -730 1616 488 -1632 -1201 -808 -84 1478 230 -2181 -931 1103 269 -154 -290 -1485
2706 -1485 -41 1789 336 -1448 -595 766 578 804 196 -1254 -73 1800 361 -425 301 -53 322
2723 322 1408 494 -1349 -30 1330 225 250 22 -642 -178 1248 429 -1353 -73 135 -64 539 92
2741 92 -1295 -128 697 -374 -386 326 -662 -497 702 433 -1437 -311 121 -669 275 27 -1197 -700
2759g00J799q44j126Q51j36j58J186k25j794L22J629n16k1P2r47K13J835n42j329
2778d31K40M68l6Q41r1j967O42J457l23r31J29o05J46J923p26k194N12J032K87
2797C73K87m74j701L96K337m51k156K82O12N19Q80q68k123P29K287k68j112n22
2815i73k81J069J920j271k049M89K207l50R2o79j410J096K372r98k145K12P12
2832A3J020M60r61k262J289K665j014j420n20j04J259J691j553k555J023J910
2848I41K16n48j332j230J731K398j687k379K69J648P42K04j556k161K120K315
2864A691j002k060rL63J584J437k433k283J684K471k3j311j649o01K919K053k236
2881E95k932J265J991R36k96k557j152K694K491k080k134O1Q08K175L91l100j747
$$ plain form
2759 -700 1099 255 -871 -20 -156 -314 872 647 -1147 -825 804 288 267 339 -608 -395 1440 898 -431
2778 -431 -191 277 241 1082 991 -976 -334 1123 800 -131 -2 -607 -461 1462 736 -1458 -946 86 373
2797 373 660 186 -1515 -1119 1218 767 -1389 -1107 -495 24 904 36 -2087 -1358 929 661 -451 -973
2815 -973 -1254 -185 1735 464 -1585 -1096 1111 761 853 174 -1236 -140 2232 1234 -911 -699 13
2832 13 1033 1493 532 -1730 -441 2224 1210 -210 -730 -834 425 2116 563 -1992 -969 941
2848 941 1157 609 -723 -1953 -222 2176 489 -1890 -1621 27 769 973 -583 -2744 -624 1691
2864 1691 689 -1371 -1380 -1017 567 2004 -429 -2712 -1028 1443 1420 109 -1540 -2141 778 2831 595
2881 595 -2337 -1072 919 1855 1559 -998 -2150 544 3035 955 -1179 -1118 -310 1865 2256 -844 -2591
2898b591K651K127o29j960j495K1K905J461l198k040J568K251O16r34k756p21
2914b724L623J878k926j788L08J323J853K76l615j013K917J978j160k023p74Q37
2930a030K671O32l411j099K105J772j58j073k155J44L306J166k817j669P64J738
2946H86J203n52l266l15L241J594k047j968l83J571K402l94l234j229K550J577
2962A636l40j724j818O45L613l19l015q44J271J172J072j171k412J69L222O89
2978A846j942j436j47J161K626j000k836k46K584J055q90j375j214J126K784l59
2994A737l058j49J700J340k69j122k269J249K628J29k238q25O03J028J643j237
3010H90k492M98K317K32r46j135o83R40K143r26k355kJ778N74m31p26j464P97
$$ plain form
2898 -2591 60 2187 1558 -402 -1897 -1876 1029 2490 -708 -2748 -1180 1071 1687 753 -2003 -2724
2914 -2724 899 2777 -149 -1937 -1629 -306 1547 1823 -1792 -2805 112 2090 930 -1093 -1867 -1030
2930 -1030 1641 2273 -1138 -2237 -132 1640 1482 409 -1746 -1602 1704 2870 53 -1616 -852 886
2946 886 2089 1537 -1729 -2044 1197 2791 744 -1224 -1607 -36 2366 1972 -1262 -2491 59 1636
2962 1636 1296 -428 -2246 -1601 2012 1693 -1322 -2166 -895 277 1349 178 -2234 -2065 1157 1846
2978 1846 -96 -1532 -1679 -518 2108 1108 -1728 -1974 610 1665 775 -600 -1814 -688 2096 1737
2994 1737 -1321 -1470 230 1570 1301 179 -2090 -841 1787 1916 -322 -1147 -544 484 2127 890
3010 890 -1602 -1104 1213 1445 499 -636 -1319 -379 1764 838 -1517 -1519 259 833 402 -324 -1788 -991
3028i91K609p35j931o5N42R39Q41j001k074J291J639l90o59p34k43J148J293r54
3046E25j696O55J461r4n1m56j410Q83K082j240j219K64P47J34O82r40j550J140
3064h3J488m58r63j2o18O59J352j336r93O96O60j84J46n15o58M52J276j308m83
3083h82O61j24m3P92n69j104J128N83o98j25P02q41N52N24o38q54J051J15l92
3102a62N79q5q88L74J141o62k41L39m85J79R75o30q60M30Q13o69M27k80l97k48
3122c50R53nq61k1J94m00J081l62j080J55J151m51j39q0m89J50J371l28j172K2
3142f61N19l24Q56k63j420Q37J245m41q20P8J49K3J122k42j663O60R54r8j67m49
3162a05p20O34J612m34j514P9O63M50L44l86j603Q78J358j81j670K60o6P39R34
$$ plain form
3028 -991 1618 883 -1048 -1113 -571 368 1209 208 -1866 -575 1064 674 15 -719 -962 186 1479 525
3046 525 -1171 -516 945 851 800 344 -1066 -183 1899 659 -560 -296 451 585 1267 327 -1223 -83
3064 -83 1405 947 -16 -28 -646 13 1365 29 -964 -268 392 208 354 -161 -819 -367 909 -399 -882
3083 -882 -221 -345 -388 404 -165 -1269 -141 442 -256 -381 321 -520 32 556 -82 -936 115 230 -162
3102 -162 417 332 -556 -182 959 297 56 395 -90 89 1064 434 -426 4 817 148 575 295 -102 -350
3122 -350 603 598 -263 -284 -90 -490 591 229 -851 -696 455 4 -135 -215 -704 -554 817 489 -683 -661
3142 -661 -142 -466 390 127 -1293 -456 789 348 -472 -394 -245 -222 900 658 -1005 -345 609 511 344 -105
3162 -105 -825 -191 1421 987 -527 -448 215 665 1009 623 -980 -102 1256 1075 -595 -335 -401 338 1272
3181A272j092j345J46J419M76o95q99q14J276J774j127j537M70M37Q00L76j207
3198b70j287J074J832o33j533j66N06P42J307j661j532P30K092l59r29o84l14
3215a085J535J379j309j706M78J290N06k90j328q62J410J645n90k070K30P03J055
3232I91L74j556j631J358J655k67p20j430j03K069J124k067j571J351J208K26
3248A011n14j852l46J800J767j564j844mJ405J203K73k325j280J946K209j062
3264H23j515o03N88J643Q28j759k018J516J724J04j129j609l20K647R91j615j626
3281a330P88R73J136k25k501m26J945J230r33j488l89R55J721K05k379j098J476
3298c40J848n56j318j198L55K027O34j992j128P85J259Q52p40j995j85K037J594
$$ plain form
3181 1272 180 -1165 -1019 400 876 181 -718 -1532 -256 1518 391 -1146 -676 -239 561 937 -270
3198 -270 -1557 -483 1349 716 -817 -983 -477 265 1572 -89 -1621 -891 1201 842 -87 -771 -1085
3215 -1085 450 1829 520 -1186 -708 582 1088 798 -530 -1392 18 1663 1073 -997 -767 -64 991
3232 991 1365 -191 -1822 -464 1191 924 204 -1226 -1329 740 1864 -203 -1774 -423 785 1011
3248 1011 497 -1355 -1701 99 1866 302 -1542 -1546 -141 1062 1335 -990 -2270 -324 1885 823
3264 823 -692 -1295 -707 936 1764 5 -2013 -497 1227 1331 202 -1407 -1727 920 1911 296 -1330
3281 -1330 -542 431 1567 1342 -1159 -1585 360 1590 657 -831 -1220 -265 1456 1661 -718 -1816 -340
3298 -340 1508 952 -366 -1564 -1209 818 1452 -540 -1668 -883 376 1228 488 -1507 -1692 345 1939
3315A939j856j186j95J154J501l66k240j81J769R96p17q96j121J150K001j0k038
3332b96r18J103J318J19j065j242nK043M08j544r67M63R14R86q29j866J80J922
3350G24Q22j276o17r51Q97J667o05j744k00R82J211Lj146j051O21J912o17j190
3368e58m14P36O10N75p43j535N01J445N43j161j117O7J248J065o63j587K62J089
3386C63N20l34q57p54J047J224m76j406K99L13P23L55p84j009O33J223o16m07
3404E7o65L31O23Q54r93j170O29Q12k51k39k73o49R06P61o41q47K68P71j56J39
3424B67m48p25N37J181o17l66j89n5O23N50r86n81P71L47J62n39Q8q18Q59P16
3444G77m08o08R7M71k86L67j41p45O36L11l71k19J38k80L50P95r20m13L98J44
$$ plain form
3315 1939 83 -1103 -1298 -144 1357 991 -1249 -1430 339 1335 618 -278 -1399 -249 1752 1742 -296
3332 -296 -1214 -111 1207 1326 261 -981 -986 1057 1465 -79 -1046 -583 331 1317 488 -1378 -1198 724
3350 724 1546 270 -347 -1298 -401 1266 661 -1083 -1283 -301 910 913 -233 -1284 -663 1249 632 -558
3368 -558 -972 -236 374 949 206 -1329 -828 617 1160 -1 -1118 -1051 197 1262 599 -988 -726 363
3386 363 883 549 -308 -1062 -15 1209 733 -673 -374 -61 662 1017 233 -776 -143 1080 464 57
3404 57 -608 -277 346 1200 207 -963 -334 478 227 -12 -285 -934 -28 733 92 -755 -487 284 128 267
3424 267 -181 -906 -369 812 195 -171 -360 -415 208 758 -228 -809 -38 309 471 -68 20 -798 61 777
3444 777 369 -239 -142 329 43 410 269 -476 160 471 100 -119 19 -261 89 884 -36 -449 -51 93
3464I3j59J64p9q50O66O99o36l77n2K72Q1M51r2p90J45R87o49O9m13j87M42O23
3486D08l30l44P6j2J06M47J30o76j55Q85k18j77o1l79M01N51m10o54K20L93K97
3507D98j19k48o44M40J042n25o39N1N5L70L37l34j105J66Q30K55k49m61l52O21
3527a1P48n42j043L83Q15K6p4o54p61P02J058l5j278k57L97P12N28o98p89K66
3547e07J093R5o90p27J51J037O48r82q51L43J026K73j97r43n53P84J298o96r10
3566c08k67N28Q43M35j112j250O22J552l67p69q84L62R35Q13r88j367L95R75M38
3585E86o60p52l89J107J338j331q32K73M12Q63j93o78j060J149J378q33p65n54
3603i41M87J148J85q90j191R98J149k26n06r64k42J451P65j046r87K34P54J094
$$ plain form
3464 93 -66 98 19 -831 -165 534 -102 -479 -531 -259 -178 273 181 -609 -464 523 -126 -57 -470 -657 -215 408
3486 408 78 -266 -190 -202 -96 351 481 -195 -350 535 317 140 79 -300 101 652 242 -412 -192 201 498
3507 498 379 131 -513 -73 969 444 -195 -144 -89 281 618 284 -821 -655 175 430 181 -280 -632 -11
3527 -11 737 195 -848 -465 350 376 302 -352 -1113 -411 647 612 -666 -923 -526 186 714 16 -773 -507
3547 -507 586 681 -9 -736 -585 452 1100 118 -733 -390 636 909 712 -231 -784 0 1298 602 -308
3566 -308 -575 -47 796 1231 119 -1131 -509 1043 676 -93 -977 -615 320 1133 145 -1222 -827 148 586
3585 586 -74 -826 -1215 -108 1230 -101 -933 -660 -248 615 422 -256 -1316 -167 1211 378 -387 -941
3603 -941 -454 694 879 -11 -1202 -204 945 719 213 -751 -993 458 1223 177 -810 -576 178 1272
3621A272m25j382o25J452J028q88j256J17M89Q74J23j399m23R13J009m75m16j149
3639a161K94J375J15j222o46O64P95R05q18j513K77J351O14p65j201o6R41J129
3657A068l13j665k17J358J066m77j424m21J051J395Nj886l56N60J336r7p08j038
3675g63M6J363K37p73r30L03R02O26q28r25l18J452M13n88n87o39O30J352l25
3694F48j445m06J287Q01l00q49p84M33J586m64r90j94K11Q82N71j166q76N03J062
3713E10K13n62j088M54R07M49o89q28J17O42O57j91r78m02P53Q76j57q80o38Q76
3733D1O21o0q81m61J64J366l34n51o60L71N53M09n90j019L29J016R2m76o25J6
3753f79L25Q52j24q73n6P54J40q0m97l82M86N94j15o25l60N19M28L91q91l65J22
$$ plain form
3621 1272 847 -535 -1160 292 1320 432 -824 -707 -218 656 779 -620 -1043 -130 879 404 -12 -1161
3639 -1161 -867 508 623 -599 -1245 -581 214 1119 301 -1212 -935 416 1030 265 -936 -1002 -61 1068
3657 1068 755 -910 -1127 231 1297 820 -604 -1025 26 1421 1426 -460 -816 -256 1080 983 275 -763
3675 -763 -717 646 883 110 -820 -517 385 1011 183 -742 -1060 392 805 217 -370 -1009 -379 973 648
3694 648 -797 -1203 84 885 585 -264 -1048 -615 971 507 -483 -677 -466 416 987 -179 -1055 -552 510
3713 510 723 161 -927 -473 434 883 194 -634 -517 125 782 591 -387 -789 -36 840 683 -197 -835 41
3733 41 662 602 -279 -740 -576 790 456 -95 -755 -384 169 578 -12 -1031 -702 314 406 -70 -695 -679
3753 -679 -354 498 374 -499 -555 199 339 259 -238 -620 -134 460 345 -280 -640 -121 307 698 -193 -558 -436
3774d36Q87J3l34k06m54M38N48m7o37j97P90J84m59P7o09N51N10l9q95K24l2L88
3796B65J67l76m72O4M74N5j50k50j64L02K11P9p26O3K22J63J80j68o51N18K63
3817F9K19o92O0L89j57M39j92l71j7L10K00o8J0o89K81O10k76l53J19M13l04M30
3839D30j70o77L60K86J80j60J08n68K83K08J86n61l66M59K71j74n9k24m60P29
3859H1p1k7j15l0J04M05m17j92L9K04J34r7k85l07N68J91J74m65m96L16N43n5
3881B02n4l91K27L48K47p83j30k5N20M21m76l55j90P48M10n61k61m43N52O70j20
3902E56q91r5P89k07N30o06p55M54O07L27r99m41M51N51q1k22o72L25P22j22l74
3923a53k38p0L07O54l31q39m7Q56N08m06o09n14R00K71J88j018j39P19M46K41
$$ plain form
3774 -436 451 464 130 -76 -530 -92 456 409 -228 -425 365 549 90 167 -442 109 619 580 -315 -91 -123 265
3796 265 432 56 -416 -352 122 177 27 -223 -387 -85 126 205 -521 -458 -236 -73 107 -61 -712 -194 69
3817 69 288 -404 -344 45 -112 327 135 -236 -253 57 257 189 199 -490 -209 401 125 -228 -109 304 0 430
3839 430 260 -417 -57 229 409 249 357 -211 72 280 466 -95 -461 -2 269 95 36 -188 -648 81
3859 81 10 -17 -132 -162 -58 347 -70 -262 -223 -19 115 18 -267 -574 -6 185 359 -106 -602 -286 257 202
3881 202 148 -243 -16 332 579 -204 -334 -359 161 582 106 -249 -439 309 719 158 -103 -546 6 676 556
3902 556 -335 -430 359 152 682 76 -679 -225 382 709 -290 -731 -280 271 190 -32 -704 -379 343 221 -153
3923 -153 -391 -461 -154 500 169 -670 -717 139 647 241 -368 -882 18 289 477 -541 -680 39 485 726
3943G26o64r91Q02M05M62m15n70j53Q15O05q66n99K94N04M52o11l80o49O00J041
3963H08n63q29kO64L97K8r31m30P74Q17l26p95m63M67Q19M13j089p88L17R07J62
3984C57k43p52l41J101M60n05n11j18M94P17p8r79m43P33Q39k40q20k69O25J037
4004A064l69q70m42K94Q20K53o62n19l3R84K26o15o33L10N59L82l88q75q3P62
4024A65O75o80o50K0N94K72M2j178j88Q97K86r2m51l65O03K66L44n80r82N41O70
4045B09L99o39q45M5J113K93l60q16J76M90O03j38p68m14O25O96K2j055l47Q49
4065A38L18J86r40n60O62P20L27n52r07L48Q58L01r51m66J10O57J48k79p28R1
4085e19Q38O04q87n86R6O48M23l71p94j55P52L19l4p13K12J32N83J46r89k32O27
$$ plain form
3943 726 62 -929 -127 278 740 325 -245 -398 417 1022 156 -443 -149 355 807 196 -184 -833 -233 808
3963 808 245 -584 -586 78 475 503 -428 -858 -84 733 407 -388 -851 -384 435 848 -241 -1029 -712 195 357
3984 357 114 -638 -979 122 582 77 -434 -552 -58 659 581 -398 -841 -108 731 491 -329 -598 27 1064
4004 1064 695 -175 -617 -323 497 750 88 -431 -464 520 746 131 -502 -192 367 749 361 -514 -597 165
4024 165 840 160 -490 -470 124 396 438 -740 -928 -31 255 163 -288 -653 -50 216 560 -20 -1002 -461 209
4045 209 608 -31 -876 -831 282 575 215 -601 -425 65 668 530 -238 -652 -27 669 691 -364 -711 138
4065 138 456 642 -298 -858 -196 524 851 299 -608 -260 598 899 -52 -518 -408 249 397 118 -610 -519
4085 -519 319 923 36 -550 -454 194 617 246 -548 -703 49 368 334 -379 -167 -35 548 694 -295 -527 100
4106A00J80J57n03l50J31N26L57k62p46J64M18L94k74o43K31K72N26o23j64l47
4126d56N82N68l68m70k31K70M87k36k81l56K81O64j41j91n87J2O72K12n70p4j86
4147c99N13L16l22m09R4K89M04m38m8l95M01k9K22j24k72J94j4L88k21j66j14
4168a30K33M93o54j1L6k1M07j79k83N5K05P3K25m40j87M08l4j34p4k8J58N8j82
4191fj60m0J02j22M0M05k00l37K92q4J56j34j94j03J84N70n97R4M2l76O11j00
4213D3K0n32N56K41j33m22Q5Q3r9L55q3k95J47N7J16J20m80j50N29J44l25o2K62
4236A77l32K97r7l54j14K60M59j64k99j85J47L47J07n14l9L37K22J84k50m75J52
4257a34N01k63k18k82J10L79M18l72m60j94N25N10l93m20kK31P25j34n90m29P8
$$ plain form
4106 100 280 437 -66 -416 -285 241 598 336 -410 -246 172 566 292 -351 -120 152 678 55 -109 -456
4126 -456 126 694 326 -144 -375 -105 382 146 -135 -491 -210 454 313 122 -465 -453 219 431 -139 -213 -399
4147 -399 114 430 108 -301 -207 82 486 48 0 -395 6 -23 199 75 -197 -3 -17 371 150 -16 -130
4168 -130 103 596 -58 -69 -33 -54 353 174 -109 -54 151 224 449 9 -178 230 196 62 -12 -40 118 176 -6
4191 -6 -166 -206 -104 -226 -186 219 19 -318 -26 -110 46 -88 -282 -385 -201 369 -228 -134 -92 -468 143 43
4213 43 63 -469 87 328 195 -227 -142 -59 -158 197 114 -181 -34 23 139 259 -221 -371 158 302 -23 -85 177
4236 177 -155 142 45 -309 -423 -163 296 132 -167 -352 -205 142 249 -265 -304 33 255 439 189 -286 -134
4257 -134 367 104 -114 -396 -286 93 511 139 -321 -515 10 520 127 -293 -295 -64 661 527 -63 -492 -414
4278d14P15K48n46m34J26O83K50o35j85p2L62N45l05n32l49Q34K32l37k12r2L34
4299B16NJ42o69J54K81K91J43p79l45J65R16j58l70p56N21M57J1n26k98L75L39
4320A15N08m24r91L94P2Q65k90n05l52Q45no8l03l44N39J46O6m30k32K78K38M79
4342F01n77o45O24L47L19n49j25l98N24M68m80p05K36N42K82k26o47p6M78M33
4362D26P5p93j58N33M68k57o71j47M28J096q42k23o15N28P97k51n96n52L53Q38
4382D37k41o7o83L52L97K53k88n64J72M69P8K02n52j64J4N58m2p76J53O27L30
4403F65j71l04j023P70N53o10m14J29N8N91O80r66l61M88K77p8j32m17j80N01
4423E6L87l79r87O23J65L37Q3m25k89J06O99k21p28J67K09L20K90n51l19J60N56
$$ plain form
4278 -414 301 549 3 -431 -305 378 628 -7 -192 -264 98 643 338 -194 -543 291 523 186 -26 -118 216
4299 216 221 363 -306 -152 129 420 563 -216 -561 -396 520 362 -8 -764 -243 214 225 -301 -599 -224 115
4320 115 623 199 -792 -398 -326 539 249 -256 -608 237 232 164 -139 -483 56 202 268 -162 -394 -116 122 601
4342 601 24 -621 3 350 669 120 -5 -403 121 589 109 -596 -360 182 464 238 -409 -485 -7 426
4362 426 501 -292 -450 83 551 294 -377 -524 -96 1000 158 -65 -680 -152 645 394 -202 -754 -401 437
4382 437 196 129 -554 -202 195 448 160 -404 -232 237 315 517 -35 -199 -185 373 331 -445 -292 335 665
4403 665 494 190 -833 -63 490 -120 -534 -405 -347 244 924 -42 -403 85 362 284 152 -265 -445 56
4423 56 443 64 -923 -300 -135 202 285 -140 -429 -323 376 155 -573 -406 -197 123 413 -138 -457 -297 259
4444B59J11j36p97L15O03j36k57k86K19K63J18j27m44J39K88M88o62j09j92j7
4464c60M82J6m58K2L14J38M7l45j41K07J52K97l45k85K17J99k35K87p15J99J35
4485a72K88k19k99J63J9N02r4J8l09R1J48k3k0l01l6N15J45m44k24Q9O56o13K90
4508A70l49K17J11J36l72m0L22j66M3N4j63k41K78J75k62K5q0L06J30k6k41r3
4530f6O8J99J7j94J73m78O33k3m86J61O2j78m1L08k93p4L86j70r6j36mPK44K24
4554B43l64j24l1L69J09K17p49K45j20M29r8l72K72R9l17P49l61n2j23j32P8k2
4576e5N3k32K02L87l93j43K67j68N9L05k94l2RK76N7r3j63K25j97M47m09j08k37
4599b37M71l49L37l67N4L07J89j54p96O14J06n9j14j94k79M85L48j69n11L04k2
$$ plain form
4444 259 370 234 -563 -248 355 219 -38 -324 -105 158 276 149 -295 -156 132 620 -42 -151 -343 -360
4464 -360 122 138 -320 -298 16 154 201 -144 -285 -78 74 371 26 -259 -42 157 -78 209 -506 -307 -172
4485 -172 116 -103 -402 -239 -220 282 188 206 -103 -12 136 113 93 -208 -244 271 416 -28 -252 -163 493 -120 170
4508 170 -179 38 149 285 -87 -127 195 29 72 126 -37 -278 0 175 -87 -62 -142 164 294 268 27 -66
4530 -66 2 201 218 24 197 -281 352 329 -157 4 66 -112 -153 155 -138 -212 174 4 -92 -228 -232 -225 19 243
4554 243 -121 -245 -276 93 202 419 -330 -85 -205 224 126 -246 26 125 -192 557 196 144 21 -111 -33 -55
4576 -55 -2 -234 -32 355 -38 -181 86 -82 -23 282 -12 -44 -35 241 298 205 42 267 70 517 108 0 -237
4599 -237 234 -115 222 -145 -91 216 405 251 -545 69 175 116 2 -192 -471 14 362 193 -318 -14 -36
4620c6K42r0j01l08J77J76K06j2o46J73L71J75l75J91k65R6K97O9k45m65N11J27
4642B68k76l37J52N4L02J49o17J67P2j35L01j89K31k61M94rj99k29j56K64k8L5
4664E3m40R9M22O54p76k12M3L28K11K7m79J03m0K37ml39Q4j99P35k18m77q5N32
4687B59j77J65k0m76K56K34P5j95j94m46M48K62J88j020M6M68M86l46n5j98K0
4708b20M67n0o5k70K89k83J19M4o47N48K46J87l82k17N9J50L03J20p15J44M21
4729B48j97Rn7k50M15L76l34q34L94J22L33J37k94o21M93M20j07n70m7J73L6O78
$$ plain form
4620 -36 206 116 15 -293 -116 60 266 254 -392 -219 152 327 -48 143 -122 -26 271 340 95 -370 141 268
4642 268 -8 -345 -193 -139 163 312 -305 -138 -66 -201 100 -89 142 -119 375 366 167 -62 -218 46 18 53
4664 53 -387 -288 134 788 12 -200 -157 171 382 409 -70 33 -7 230 226 -113 -29 -228 507 289 -188 -273 259
4687 259 82 247 227 -249 7 241 316 121 -73 -519 -71 191 379 -641 -595 -127 359 13 -42 -240 -220
4708 -220 247 197 132 -138 151 -132 -13 31 -616 -68 178 365 -17 -234 -175 -25 278 398 -317 -173 248
4729 248 51 60 3 -247 168 544 210 -624 -230 -108 225 362 68 -553 -60 360 253 -317 -364 -191 -155 523
$$ [...]
8191a73
##END NTUPLES=NMR FID
##END=
