##TITLE=1H_TG-2248
 CDCl3, 8 sc, 
 2.8.2019
##JCAMPDX= 6.0         $$ Bruker NMR JCAMP-DX V2.0
##DATA TYPE= NMR FID
##DATA CLASS= NTUPLES
##ORIGIN= UXNMR, Bruker Analytische Messtechnik GmbH
##OWNER= root
$$ XWIN-NMR		Version 3.5
$$ Fri Aug  2 14:30:45 2019 Russian Standard Time (UT+4h)  she@DPX200
##.OBSERVE FREQUENCY= 200.13155
##.OBSERVE NUCLEUS= ^1H
##.DELAY= (6, 6)
##.ACQUISITION MODE= SIMULTANEOUS
##.ACQUISITION SCHEME= undefined
##.AVERAGES= 8
##.DIGITISER RES= 18
##SPECTROMETER/DATA SYSTEM= spect
##.PULSE SEQUENCE= zg30
##.SOLVENT NAME= DMSO
##.SHIFT REFERENCE= (INTERNAL, DMSO, 0, 15.7039)
##AUDIT TRAIL= $$ (NUMBER, WHEN, WHO, WHERE, WHAT)
$$ ##TITLE= Audit trail, XWIN-NMR		Version 3.5
$$ ##JCAMPDX= 5.01
$$ ##ORIGIN= Bruker BioSpin GmbH
$$ ##OWNER= she
$$ F:/spectra/data/she/nmr/H-F/1/audita.txt
$$ ##AUDIT TRAIL=  $$ (NUMBER, WHEN, WHO, WHERE, WHAT)
(   1,<2019-08-02 14:29:53.09 +0400>,<she>,<DPX200>,
      <created by zg, POWCHK disabled, PULCHK disabled
       configuration hash MD5:
       00 E9 B6 7A A2 85 ED C7 34 08 36 98 17 FE 4E 26
       data hash MD5: 16K
       52 09 5A E1 4E 0F 33 81 01 B4 D1 99 A3 EE 9A AE>)
$$ ##END=
$$ 
$$ hash MD5
$$ 9F C0 73 AE 02 1B 01 5E AD A9 45 72 CB A4 14 94
##$RELAX= 
##$RELAX= 
##$RELAX= 
##$RELAX= 
##$RELAX= 
##$RELAX= 
$$ Bruker specific parameters
$$ --------------------------
##$DU= <F:/spectra>
##$EXPNO= 1
##$NAME= <H-F>
##$PROCNO= 1
##$TYPE= <nmr>
##$USER= <she>
##$AMP= (0..31)
100 100 100 100 100 100 100 100 100 100 100 100 100 100 100 100 100 100 
100 100 100 100 100 100 100 100 100 100 100 100 100 100 
##$AQSEQ= 0
##$AQ_mod= 1
##$AUNM= <au_zg>
##$AUTOPOS= <>
##$BF1= 200.13
##$BF2= 200.13
##$BF3= 200.13
##$BF4= 200.13
##$BF5= 200.13
##$BF6= 200.13
##$BF7= 200.13
##$BF8= 200.13
##$BYTORDA= 1
##$CFDGTYP= 0
##$CFRGTYP= 5
##$CHEMSTR= <none>
##$CNST= (0..31)
1 1 145 1 1 1 1 1 1 1 1 1 1 1 1 1 1 1 1 1 1 1 1 1 1 1 1 1 1 1 1 1 
##$CPDPRG= <>
##$CPDPRG1= <>
##$CPDPRG2= <>
##$CPDPRG3= <>
##$CPDPRG4= <mlev>
##$CPDPRG5= <mlev>
##$CPDPRG6= <mlev>
##$CPDPRG7= <mlev>
##$CPDPRG8= <mlev>
##$CPDPRGB= <>
##$CPDPRGT= <>
##$D= (0..31)
0 1.2 0 0 0 0 0 0 0 0 0 0.03 0 0 0 0 0 0 0 0 0 0 0 0 0 0 0 0 0 0 0 0 
##$DATE= 1564741792
##$DBL= (0..7)
120 120 120 120 120 120 120 120 
##$DBP= (0..7)
150 150 150 150 150 150 150 150 
##$DBP07= 0
##$DBPNAM0= <>
##$DBPNAM1= <>
##$DBPNAM2= <>
##$DBPNAM3= <>
##$DBPNAM4= <>
##$DBPNAM5= <>
##$DBPNAM6= <>
##$DBPNAM7= <>
##$DBPOAL= (0..7)
0.5 0.5 0.5 0.5 0.5 0.5 0.5 0.5 
##$DBPOFFS= (0..7)
0 0 0 0 0 0 0 0 
##$DE= 6
##$DECBNUC= <off>
##$DECIM= 24
##$DECNUC= <off>
##$DECSTAT= 4
##$DIGMOD= 1
##$DIGTYP= 9
##$DL= (0..7)
0 120 120 120 120 120 120 120 
##$DP= (0..7)
150 150 150 150 150 150 150 150 
##$DP07= 0
##$DPNAME0= <>
##$DPNAME1= <>
##$DPNAME2= <>
##$DPNAME3= <>
##$DPNAME4= <>
##$DPNAME5= <>
##$DPNAME6= <>
##$DPNAME7= <>
##$DPOAL= (0..7)
0.5 0.5 0.5 0.5 0.5 0.5 0.5 0.5 
##$DPOFFS= (0..7)
0 0 0 0 0 0 0 0 
##$DQDMODE= 0
##$DR= 18
##$DS= 0
##$DSLIST= <SSSSSSSSSSSSSSS>
##$DSPFIRM= 0
$$ [...]
##$SUBNAM2= <"">
##$SUBNAM3= <"">
##$SUBNAM4= <"">
##$SUBNAM5= <"">
##$SUBNAM6= <"">
##$SUBNAM7= <"">
##$SUBNAM8= <"">
##$SUBNAM9= <"">
##$SW= 24.9336996594482
##$SWIBOX= (0..15)
0 0 2 0 0 0 0 0 0 0 0 0 0 0 0 0 
##$SW_h= 4990.01996007984
##$TD= 16384
##$TD0= 1
##$TE= 0
##$TE2= 300
##$TE3= 300
##$TEG= 300
##$TL= (0..7)
0 120 120 120 120 120 120 120 
##$TP= (0..7)
150 150 150 150 150 150 150 150 
##$TP07= 0
##$TPNAME0= <>
##$TPNAME1= <>
##$TPNAME2= <>
##$TPNAME3= <>
##$TPNAME4= <>
##$TPNAME5= <>
##$TPNAME6= <>
##$TPNAME7= <>
##$TPOAL= (0..7)
0.5 0.5 0.5 0.5 0.5 0.5 0.5 0.5 
##$TPOFFS= (0..7)
0 0 0 0 0 0 0 0 
##$TUNHIN= 0
##$TUNHOUT= 0
##$TUNXOUT= 0
##$USERA1= <user>
##$USERA2= <user>
##$USERA3= <user>
##$USERA4= <user>
##$USERA5= <user>
##$V9= 5
##$VALIST= <valist>
##$VCLIST= <CCCCCCCCCCCCCCC>
##$VD= 0
##$VDLIST= <DDDDDDDDDDDDDDD>
##$VPLIST= <PPPPPPPPPPPPPPP>
##$VTLIST= <TTTTTTTTTTTTTTT>
##$WBST= 1024
##$WBSW= 4
##$XGAIN= (0..3)
0 0 0 0 
##$XL= 0
##$YL= 0
##$YMAX_a= 281926
##$YMIN_a= -494830
##$ZGOPTNS= <>
##$ZL1= 120
##$ZL2= 120
##$ZL3= 120
##$ZL4= 120
##$ABSF1= 10
##$ABSF2= 0
##$ABSG= 5
##$ABSL= 3
##$ALPHA= 0
##$AQORDER= 0
##$ASSFAC= 0
##$ASSFACI= 0
##$ASSFACX= 0
##$ASSWID= 0
##$AUNMP= <proc_1d>
##$AZFE= 0.1
##$AZFW= 0.1
##$BCFW= 1
##$BC_mod= 2
##$BYTORDP= 1
##$COROFFS= 0
##$CY= 11.3945322036743
##$DATMOD= 1
##$DC= 2
##$DFILT= <>
##$DTYPP= 0
##$F1P= 20.1537800932815
##$F2P= 0.134698688090026
##$FCOR= 0.5
##$FTSIZE= 0
##$FT_mod= 4
##$GAMMA= 1
##$GB= 0.15
##$INTBC= 1
##$INTSCL= 1
##$ISEN= 128
##$LB= 0.24
##$LEV0= 0
##$LPBIN= 0
##$MAXI= 10000
##$MC2= 0
##$MEAN= 0
##$ME_mod= 0
##$MI= 1.114404
##$NCOEF= 0
##$NC_proc= 0
##$NLEV= 6
##$NOISF1= 3.799351
##$NOISF2= 2.8
##$NSP= 1
##$NTH_PI= 0
##$NZP= 0
##$OFFSET= 15.70392
##$PC= 1
##$PHC0= -9219.677
##$PHC1= 10.40097
##$PH_mod= 1
##$PKNL= yes
##$PPARMOD= 0
##$PSCAL= 0
##$PSIGN= 0
##$REVERSE= no
##$SF= 200.130013532006
##$SI= 16384
##$SIGF1= 3
##$SIGF2= 2
##$SINO= 400
##$SIOLD= 16384
##$SREGLST= <1H.CDCl3>
##$SSB= 0
##$STSI= 0
##$STSR= 0
##$SW_p= 3612.71676300578
##$SYMM= 0
##$S_DEV= 0
##$TDeff= 0
##$TDoff= 0
##$TI= <>
##$TILT= no
##$TM1= 0
##$TM2= 0
##$TOPLEV= 0
##$USERP1= <user>
##$USERP2= <user>
##$USERP3= <user>
##$USERP4= <user>
##$USERP5= <user>
##$WDW= 1
##$XDIM= 8192
##$YMAX_p= 0
##$YMIN_p= 0
$$ End of Bruker specific parameters
$$ ---------------------------------
##NTUPLES= NMR FID
##VAR_NAME=  TIME,          FID/REAL,        FID/IMAG
##SYMBOL=    X,             R,               I
##VAR_TYPE=  INDEPENDENT,   DEPENDENT,       DEPENDENT
##VAR_FORM=  AFFN,          ASDF,            ASDF
##VAR_DIM=   8192,          8192,            8192
##UNITS=     SECONDS,       ARBITRARY UNITS, ARBITRARY UNITS
##FACTOR=    0.0002004,     1,               1
##FIRST=     0,             0,               0
##LAST=      1.6414764,     0,               0
##MIN=       0,             -494830,         0
##MAX=       1.6414764,     281926,          0
$$ Real data points
##PAGE= N=1
##DATA TABLE= (X++(R..R)), XYDATA
0@%%%%Qj6J6j6K4l2M0n6P2q8J04j21J46j77K09k47K90l37L90m53N25o01O86p82
$$ 0 0 0 0 0 8 -8 8 -8 16 -16 24 -32 40 -48 56 -65 81 -96 113 -134 156 -181 209 -244 281 -320 366 -416
28d16Q86j002J134j278J434j604J792k003K232k480K754l054L382l746M150m593
$$ -416 470 -532 602 -676 758 -846 946 -1057 1175 -1305 1449 -1605 1777 -1969 2181 -2412
44b412N084n637O260o962P760q682R761j1041J2588j4505J6952k0202K4760l1665
$$ -2412 2672 -2965 3295 -3667 4093 -4589 5172 -5869 6719 -7786 9166 -11036 13724 -17941
58a7941M3480o9055K17448k15740l56207M74934J94565k99502j96487K84104J42489
$$ -17941 25539 -43516 173932 -41808 -398015 76919 271484 -28018 -224505 59599 202088
69B02088k22261k12547J83972K16378j17011k41951Q8101K20824k9105k03564
$$ 202088 -20173 -232720 -48748 167630 50619 -191332 -103231 117593 88488 -115076
79a15076j554K02146J12338j91534k31534J14235K96159l9787k49821K3988J72568
$$ -115076 -116630 85516 197854 6320 -225214 -110979 185180 145393 -104428 -80440 92128
90I2128r6906j77325R8897K09623k4676k07521p0129J87804J40478j60959j64335
$$ 92128 -4778 -182103 -83206 126417 101741 -105780 -175909 11895 152373 -8586 -172921
101a72921J68899J93240j48815k07034J06448K19627j5189j72771k8473J25660
$$ -172921 -4022 189218 40403 -166631 -60183 159444 144255 -28516 -56989 68671
111F8671k641j48730L6235K04356m2906k54159j0845K11500N2461j07402m9888
$$ 68671 66030 -82700 -46465 157891 114985 -139174 -150019 61481 113942 6540 -43348
122d3348J5407K7560J9389l7069k6564P5638N6502o8587o6807K6012L8702m105
$$ -43348 -27941 -381 19008 -18061 -44625 31013 87515 18928 -47879 -21867 16835 12730
134A2730j1416K7850L6819o5662j25564M4225J73419q269j66709k5914J01740
$$ 12730 1314 29164 65983 321 -125243 -81018 92401 84132 -82577 -108491 -6751
145f751L1972j6398J451j4620j2847j686k0672J8704O8373M19m5529K4840K5025
$$ -6751 25221 8823 10274 -4346 -17193 -18879 -39551 -20847 47526 47945 2416 27256 52281
158E2281o0515m1477M0357N4842K8113l2614q7998j8290Q5755M5013m2376m1410
$$ 52281 -8234 -49711 -9354 45488 73601 40987 -47011 -65301 20454 65467 23091 -18319
170a8319j2456J6438M3094L165k5147K1578n855p8321J1550J08648j2089r4607
$$ -18319 -30775 -14337 28757 31922 6775 28353 22498 -55823 -44273 64375 52286 -42321
182d2321L5785Q7092m4916j01492r417P2231N9249k7240p3063p022L9029m291
$$ -42321 -6536 80556 35640 -65852 -75269 -3038 56211 28971 -44092 -51114 -12085 -16376
194a6376L625M2500j8117o4103J88M1303K6058J9084l2493o6649L4085Q8645k9705
$$ -16376 -12751 29749 11632 -52471 -52283 -10980 15078 34162 1669 -64980 -30895 57750 28045
207B8045p7570L4744O3630k2482n3958j7856L0025M8129k090l3274J9371P733
$$ 28045 -49525 -14781 48849 26367 -27591 -45447 -15422 32707 30617 -2657 16714 24447
219B4447p1239p016J12627L6839r7702n9748M7276O5305L641n8698k8473N6421
$$ 24447 -46792 -53808 58819 95658 -2044 -61792 -14516 50789 54430 -4268 -32741 23680
231B3680K2899o2398l301O7270j7059o3655K0586L5017k9706k3665J8267L3574
$$ 23680 46579 -15819 -19120 48150 31091 -32564 -11978 23039 -6667 -30332 -12065 21509
243B1509L0874l2115q6649N24R5123K7466n8792l1974J2480J6427P081r524P489
$$ 21509 52383 20268 -66381 -65857 29266 56732 -2060 -34034 -21554 -5127 1954 -7570 -81
256h1K8122l2972n7835N1917P4197o3537p5181O4869O8458m9113n9189K1576O3163
$$ -81 28041 -4931 -62766 -10849 63348 -189 -75370 -10501 57957 8844 -50345 -28769 34394
269C4394K5339n2258n3684L2042L7258l1450O348O3873k2028q8796j479P3237
$$ 34394 59733 7475 -46209 -14167 23091 -8359 -2011 61862 39834 -48962 -50441 22796
281B2796L4030l0916n3785m682O0824J4490o8151j2129O6224M857n0285r48K6712
$$ 22796 56826 25910 -27875 -32557 28267 42757 -25394 -37523 28701 33558 -16727 -17675 9037
294I037M580m896j0767m0J9038l0658n6800N3769J03816l7271j14750l112P4408
$$ 9037 13617 8721 -2046 -2086 16952 -13706 -70506 -16737 87079 49808 -64942 -68054 6354
307F354J9121l6273k0355K9067K8059m1866m0983O0320M8633o9050m0970P3906
$$ 6354 25475 -10798 -31153 -2086 25973 -15893 -56876 3444 52077 -16973 -57943 15963
319A5963L2781o4251k8581M8395M6382j5046p0626l4054P0245O3667m0078l9485
$$ 15963 48744 -15507 -44088 4307 50689 35643 -34983 -69037 1208 64875 24797 -14688
331a4688K5542j174l7554Q190M2317J8771k3272m8799M91P3845J4954q2899j4599
$$ -14688 10854 9680 -27874 -19684 22633 41404 18132 -30667 -30176 43669 58623 -24276 -38875
344c8875Q4138R959q2430k5178N9779M8228k0420n8794p063M7099j0653n0012
$$ -38875 45263 55222 -27208 -52386 7393 55621 35201 -23593 -30656 16443 5790 -44222
356d4222M3090P0325o0595r2326L9733Q9232j586o3391k8856L8278M0612l5227
$$ -44222 -1132 69193 8598 -83728 -43995 45237 43651 -19740 -48596 -10318 30294 -4933
368d933m6458M9986N8732m7430n7056K7309K8694j8651q717K1938K5016p332n8717
$$ -4933 -51391 -1405 57327 9897 -47159 -19850 8844 -9807 -18524 3414 28430 21098 -37619
381c7619k4442Q0237N5454p4751o7401M8466N3985j6539k4258J1466K2853j0558
$$ -37619 -62061 18176 73630 -1121 -68522 -20056 33929 17390 -6868 4598 27451 16893
393A6893m9529l544O9281J5734o6954k022O6702j6715p5117N112O7261K4556m0433
$$ 16893 -32636 -36180 33101 48835 -18119 -20141 46561 29846 -45271 -40159 27102 51658 11225
406A1225n1118P433N5722N733m1426O822K4342l6981k4864M6622L3890k2780k7299
$$ 11225 -39893 -32460 23262 28995 -12431 -5609 18733 -18248 -43112 3510 37400 14620 -12679
419a2679q916J1065K1115j4094k8318L1096L9201l3406m2872J4462K5118P497
$$ -12679 -21595 -10530 10585 -3509 -31827 -731 38470 5064 -37808 -23346 1772 9269
431I269J296j5431j3354Q458O20J268L5804N926n6744k0325M7027K1277j8843
$$ 9269 10565 -4866 -18220 -9762 -9142 -7874 27930 33856 -22888 -43213 3814 25091 6248
444F248l730L510j343L063j0473j0051K0017J2000j6351Q68N377k3426K078M0250
$$ 6248 2518 6028 4685 7748 -2725 -12776 7241 19241 2890 3758 9135 -14291 -12213 28037
458B8037Q74l4811q990K284n61K5859K0477k2346k5148l407N104J8910Q776k5201
$$ 28037 28911 -5900 -14890 -12606 -13167 12692 33169 10823 -14325 -17732 -12628 6282 15058 -10143
472a0143o645K8978n013l1340J1520K1857j1589o176N112j2368l869J7307Q311
$$ -10143 -16788 12190 7177 -24163 -12643 9214 -2375 -8551 -3439 -15807 -19676 -2369 5942
485E942O634J357l5415k5783L6363L6540j3948j9096k800J43J2582O930j6491
$$ 5942 12576 13933 -21482 -47265 -10902 25638 11690 -7406 -10206 -10063 2519 9449 -7042
498g042J762J9699j6423j9255K6897J5679k3569j365K3214l635k6071j3894J5315
$$ -7042 -5280 14419 -2004 -21259 5638 21317 -2252 -3617 19597 15962 -10109 -24003 -8688
511h688M1310J0214n0939k5733L8163J5563k4524O645J8282k1957k0656J5717
$$ -8688 32622 42836 -8103 -33836 4327 19890 -4634 2011 20293 -1664 -22320 -6603
523f603K1387M369j8481k4393J3082K8857j9571k9132K8569L0889j9822k5850
$$ -6603 14784 19153 672 -23721 -10639 18218 -1353 -30485 -1916 28973 9151 -16699
535a6699l750L180J6176J3419j3108p258N717j6670o393L9360J6387l9553k4641
$$ -16699 -20449 -17269 -1093 12326 -782 -8040 -2323 -18993 -25386 13974 30361 -9192 -33833
548c3833J9153K2085N323j3577j4245J7209J6979k8360j6577L4451J5374k3846
$$ -33833 -14680 7405 12728 -849 -15094 2115 19094 -9266 -25843 8608 23982 136
560A36m59J1590j6800j4483J5564K2448J0804j9092l8422O415M6487L835l2772
$$ 136 -323 11267 -5533 -20016 -4452 17996 28800 9708 -28714 -22299 24188 28023 -4749
573d749l487R607r652L023J4554k400l778j26j0992P08J3796j1394j1876K3494
$$ -4749 -8236 1371 -8281 -5258 9296 6896 3118 2992 -8000 -7292 6504 -4890 -16766 6728
587F728J2462k6994j9959Q007J9382K1234n840l5548p366K4837K327n840J8541
$$ 6728 19190 -7804 -27763 -19756 -374 20860 15020 -20528 -27894 -3057 -730 -6570 11971
600A1971k955l2136q46K8150Q053r193r294k231J4194N465k4521n548L1719Q102
$$ 11971 9016 -23120 -23966 4184 12237 3044 -6250 -8481 5713 11178 -13343 -18891 12828 20930
614B0930k2157n816J645m290J6335K0372j0635j8485q932o896J5989L0094p562
$$ 20930 -1227 -7043 -5398 -9688 6647 27019 16384 -2101 -11033 -17929 -1940 28154 20592
627B0592l0047p38J3820K288J834m120j1673Q927R548j8612q588J8890M627p313
$$ 20592 -9455 -10193 3627 5915 7749 3629 -8044 883 10431 -8181 -16769 2121 6748 -565
641e65P953n105k3212R64K2999J3070k684k2129k6247J4475L5562k764j8025K259
$$ -565 7388 2283 -20929 -19965 3034 16104 13420 -8709 -34956 -20481 15081 12317 -5708 -3449
655c449m229j0679J3960J2012j1840l746R323k712k640J762p135N883K2248k198
$$ -3449 -7678 -18357 -4397 7615 -4225 -7971 1352 -1360 -4000 -2238 -9373 -3490 18758 16560
669A6560k2720o444N321J2008K0266o614l4320n056K3781P961J403P692j4866
$$ 16560 -6160 -12604 -7283 4725 24991 18377 -15943 -20999 2782 10743 12146 19838 4972
682D972k1985P780J4596j960k490j476l04J1154J79k3240j765K5823M757j5775
$$ 4972 -17013 -9233 5363 3403 913 -563 -867 10287 10466 -12774 -14539 11284 16041 266
696B66o559p748k231K2169J3896j6032j6401n947n52J8880J9221j5419k2559M098
$$ 266 -6293 -14041 -16272 5897 19793 3761 -12640 -18587 -19139 -259 18962 3543 -19016 -14918
710a4918O758K416Q556m171r542J4434J1197j9316j0249J3897O902J186M211j1593
$$ -14918 -8160 -5744 2812 -1359 -10901 3533 14730 -4586 -14835 -938 5964 7150 11361 -232
724b32j6514Q137J7830R465l43k2407k2665J7691K8571o924j4634J751n340j916
$$ -232 -16746 -8609 9221 18686 18343 -4064 -26729 -9038 19533 12609 -2025 -274 -5614 -7530
738g530J6543L466j3005K784P968o143l152j933p726Q646J8786p806k1243o105
$$ -7530 9013 12479 -526 2258 10226 4083 931 -1002 -8728 -82 18704 10898 -10345 -16450
752a6450L576J4430J9061j1157l1460k430J8263M474K063K891j3587o994J5740
$$ -16450 -12874 1556 20617 9460 -22000 -24430 -6167 -1693 370 3261 -10326 -17320 -1580
765a580P890m281q22n019l377J1813p55k0928M235K6252M742j3208j0352j1842
$$ -1580 6310 2029 1207 -3812 -7189 4624 3869 -17059 -12824 13428 18170 4962 -5390 -17232
779a7232J783K2899R719j3608j1059m397K371J9120J0929j7481j1682Q312M831
$$ -17232 -15449 7450 17169 3561 -7498 -11895 -9524 9596 20525 3044 -8638 -326 4505
792D505M656O954j1552j1002J5726N626k1026o051J4723O842J923p28j6806j4013
$$ 4505 9161 16115 4563 -6439 9287 14913 -6113 -12164 2559 9401 11324 10596 -6210 -20223
806b0223P769J3181Q112K5j9958j4807K0559K2028q729j1995j025m339M608J1442
$$ -20223 -12454 727 8839 8864 -11094 -25901 -5342 16686 7957 -4038 -5063 -9402 -4794 6648
820F648n473q674P849L687p178P45k393p754J1212J5931j1280j8739k019N641
$$ 6648 1175 -7499 350 4037 -3141 -2396 -4789 -12543 -1331 14600 3320 -15419 -17438 -11797
834a1797J5680J6342j2426k3900M144J6819N293J970l489j3030n49J1263O25k139
$$ -11797 3883 20225 7799 -16101 -11957 4862 10155 12125 8636 -4394 -4943 6320 6945 4806
848D806J700o693L38J3705o862k2506O149K0960j194j1096p215p919P044K0820
$$ 4806 6506 -187 151 13856 6994 -15512 -9363 11597 10403 -693 -7908 -15827 -8783 12037
862A2037M582j4214r670m753L773J7518N362j6607p374M671J698N158K634j1840
$$ 12037 16619 2405 -7265 -12018 -8245 9273 14635 -1972 -9346 -4675 -2977 2181 4815 -7025
876g025k036J5779r10j8413j010R637K267O171K50j5713m867J4392J1354M068
$$ -7025 -9061 6718 5808 -12605 -13615 -3978 -1711 4460 4710 -11003 -15870 -1478 9876 13944
890A3944l551j9339j0553J9613J6053p099p169j521k471N520O193q253m858P393
$$ 13944 10393 -8946 -19499 114 16167 9068 1899 378 -2093 3427 9620 1367 -3491 3902
904C902L30l839J802o549m681J6398R983j4079j1939J556K645J2676J1719j4934
$$ 3902 4232 393 2195 -4354 -9035 7363 17346 3267 -8672 -7116 -4471 8205 19924 4990
918D990k0436M740J3055L655J714n074j0808K005O841k028n44O8n987L386J0399
$$ 4990 -15446 -10706 2349 6004 7718 2644 -8164 -6159 682 -1346 -1890 -1822 -7809 -4423 5976
933E976r892j3567J1896J4789k545n293o593r392Q398J7904p82j2447n265k893
$$ 5976 -3916 -17483 -5587 9202 6657 1364 -5229 -14621 -6223 11681 10899 -1548 -6813 -9706
947i706O161J5778J030j4455l210L866o30M230J869q318J801J1982k804j1563
$$ -9706 -3545 12233 13263 -1192 -4402 -536 -1166 3064 4933 -3385 -1584 10398 7594 -3969
961c969J111M202M686P311o250j7263K65J2841M463L470k274j6700o910J7581
$$ -3969 -2858 1344 6030 13341 7091 -10172 -9907 2934 7397 10867 8593 -8107 -15017 2564
975B564J0094q893o120k092k356O081M456o720j249N836n39j508m1q547o4J5422
$$ 2564 12658 3765 -2355 -4447 -6803 -722 3734 -2986 -4235 1601 1062 -446 -487 -9034 -9098 6324
991F324L714j3799o021J122J508J2722R200j4490j3425O445Q442L115K145o275
$$ 6324 10038 -3761 -9782 -8660 -7152 5570 14770 280 -13145 -6700 1742 4857 7002 727
1005G27q147O061O108l151P83K404m309K869N416r851q237R669R386k211l425
$$ 727 -7420 -1359 4749 1598 2381 4785 476 3345 8761 -1090 -9327 342 9728 7517 4092
1020D092p902o688J1630J3013n445q643l505m610N630J3361k686j2073J230L646
$$ 4092 -3810 -10498 1132 14145 8700 57 -3448 -8058 -2428 10933 8247 -3826 -2596 1050
1034A050j926L178K65p083K042P460n127q131J191L346N665O392q520j3143M558
$$ 1050 -876 2302 2567 -4516 -2474 4986 -141 -8272 -7081 -3735 1930 8322 -198 -13341 -8783
1049h783R421K666L450k693j4768o56J5646M246o692j665k108j158O620J160p013
$$ -8783 638 3304 6754 4061 -10707 -11363 4283 8529 1837 172 -1936 -3094 3526 4686 -2327
1064b327J323N350k631j549p9n964K865J3364L9j0986l240o4K794J0871K721j3066
$$ -2327 -1004 4346 1715 166 87 -5877 -3012 10352 10391 -595 -3835 -3899 -1105 9766 12487 -579
1080e79o504O547M270K858J883q371n874O619J852n516K051J931l485K672K718
$$ -579 -7083 -536 3734 6592 8475 104 -5770 849 2701 -2815 -764 1167 -2318 354 3072
1095C072r419l527J0120N214k191l754p572k262J2291P219o172m368k357l526
$$ 3072 -6347 -9874 246 5460 3269 -485 -8057 -10319 1972 9191 3019 -1349 -3706 -7232
1109g232P341Q982o727q095L604J722j884L679k70m645M767M709o630m601L077
$$ -7232 109 9091 2364 -5731 -2127 -405 -2289 1390 1120 -3525 1242 5951 -679 -5280 -2203
1124b203K893N424M293r154r095O505O724M57K234m050j0130K756J0684j134m761
$$ -2203 690 6114 10407 1253 -7842 -1337 5387 5844 8078 4028 -6102 -3346 7338 6204 1443
1139A443q54l496k33N661j547n162M867L547m671j202o14m246N052R703l869q590
$$ 1443 589 -2907 -3140 2521 974 -4188 679 4226 -445 -1647 -2261 -6507 -1455 8248 4379 -4211
1155d211m86P51L274Q329j903j1540j798N529J662K631P95o881q57O457k154m065
$$ -4211 -4697 -3946 -672 7657 5754 -5786 -7584 -2055 -393 2238 3033 -3848 -4705 1752 -402 -4467
1171d467M604J310k036L486L12p563J431Q413J664k635l340o298J206J1159K517
$$ -4467 137 1447 -589 2897 3209 -4354 -2923 5490 7154 4519 1179 -5119 -3913 7246 9763
1186I763p024k917k008j525O215M569o776k858M224r58j782K941j777k346N434
$$ 9763 2739 -178 -2186 -3711 2504 7073 297 -2561 1663 705 -1077 1864 87 -2259 3175
1201C175J126o760j479L444J250M011M91j0033l993P499L937m85R58n495o216
$$ 3175 4301 -2459 -3938 -494 756 4767 5258 -4775 -8768 -1269 2668 2183 3141 -2354 -8570
1216h570M960O592k854j866J038k310J443L913l589k173O052J003m239L66j018
$$ -8570 -3610 2982 128 -1738 -700 -3010 -1567 2346 -1243 -3416 2636 3639 -600 -234 -1252
1231a252k084O905N089o580o082J310J219M343N800m262q234J216L451O60K537
$$ -1252 -3336 3569 8658 2078 -4004 -2694 -1475 2868 8668 4406 -3828 -2612 839 1499 4036
1246D036q41n093J867M964m147k736M633o1k172J800k490n468M370O457q30k930
$$ 4036 3195 -1898 -31 4933 786 -1950 2683 2622 450 2250 -240 -5708 -1338 5119 4289 1359
1262A359l273n578L432R131j617n731k39r61l57N755J206o008L79L262k421o84
$$ 1359 -1914 -7492 -4060 5071 3454 -2277 -2516 -3477 -3834 1921 3127 -2881 -2502 760 -1661 -2345
1278b345K750j367L48M559k123o163Q97L388K111L550j748q818J44P375J366j272
$$ -2345 405 -962 -614 3945 1822 -4341 -3444 -56 2055 5605 3857 -4961 -4817 2558 3924 2652
1294B652J53m496k674O272L056k810l46j96k850J972J666m498R34O291j101m323
$$ 2652 2805 -1691 -4365 1907 4963 2153 1807 1611 -1239 733 2399 -2099 -1165 5126 4025 -298
1310b98o68j602L31O205J881p071l750J920R44M285L381n975m925L052K070k15
$$ -298 -966 -2568 -2237 3968 5849 -1222 -4972 -3052 -2108 2177 5558 -417 -5342 -2290 -220 -435
1326d35K309k262l643L500K136m695n08N120O3j007R28m328k623N585M462j750
$$ -435 1874 -388 -4031 -531 1605 -3090 -3598 1522 1585 578 1506 -2822 -5445 140 4602 2852
1342B852k135l359k686N693O080k924l896M7j147J104M803j811m244K517K186
$$ 2852 717 -2642 -5328 365 6445 3521 -375 -328 -1475 -371 4432 2621 -1623 894 3080
1357C080l088p81K013r04K019K608m222m903K070K383J594L239l926p321K357
$$ 3080 -8 -789 1224 320 2339 4947 725 -4178 -2108 275 1869 5108 1182 -6139 -3782
1372c782O433l10j116j052m335NM549K44k164J455j76j402K015m71l950K507N040
$$ -3782 2651 2341 1225 173 -4162 -4157 392 636 -1528 -73 -249 -1651 364 -107 -4057 -1550 3490
1389C490k240l429k47j634K335O741l97o828j204K277J249L508N32n358k066L865
$$ 3490 1250 -2179 -2426 -4060 -1725 5016 4619 -2209 -3413 -1136 113 3621 4153 -1205 -3271 594
1405E94O87N82J611k521j781L970l70n715J013M595m49P71j278m967RN681J522
$$ 594 1281 1863 3474 953 -828 3142 2772 -2943 -1930 2665 2216 2987 1709 -3258 -3249 2432 3954
1422C954k350j174l268j687O005M088n016l137L22j4K376K422l029j857L303K
$$ 3954 1604 430 -2838 -4525 1480 5568 552 -2585 -2263 -2277 99 2521 -508 -2365 938 940
1438I40l405l11O49M3L387K162n453k058K184J757J980J991n659m851M802N168
$$ 940 -2465 -2776 -2127 -2084 1303 3465 -1988 -4046 -1862 -105 1875 3866 -1793 -6644 -1842 3326
1454C326o14q32j122k789J607L039j713j487J487m49k02J654j653l200M061L441
$$ 3326 2712 1880 758 -2031 -424 2615 902 -585 902 453 251 1905 252 -2948 1113 4554
1470D554k611l079o71p79M164M389l544n202N24J379J076K985j086m388N48K632
$$ 4554 1943 -1136 -1807 -2586 1578 5967 2423 -2779 -2255 -876 200 3185 2099 -2289 -1741 891
1486H91m42q32l84k609J090L927j716l739K420K952l85l71k431m270K647N821
$$ 891 449 -383 -767 -3376 -2286 1641 -75 -3814 -1394 1558 1173 802 -1629 -5899 -3252 2569
1502B569N88j730j224l276J00N598O38m529m87J263j94J979P91l627o83L709j90
$$ 2569 3157 1427 203 -3073 -2973 2625 3263 -1266 -1753 -490 -684 1295 2086 -1541 -2224 1485 1295
1519A295j838O66l49R77K970j182n201k78K726K107K524K44n975k138L745K101
$$ 1295 -543 123 -226 751 3721 2539 -2662 -2940 -214 1893 4417 4661 -1314 -3452 293 2394
1535B394j708r38j809j288L526J888k890j146J519k83L74M16k420j157M844J422
$$ 2394 686 -252 -2061 -3349 177 2065 -825 -1971 -452 -735 -361 55 -2365 -3522 1322 2744
1551B744k902j226r06m14M558K354m112l308J015J216J804J645k799l302K512
$$ 2744 -158 -1384 -2290 -2704 1854 4208 96 -3212 -2197 -981 823 2468 -331 -3633 -1121
1566a121J979p04L41K02j484J022K733l058k535K133K480M87M02k527k567L199
$$ -1121 858 154 495 697 -787 235 2968 -90 -2625 -492 1988 2475 2877 350 -2217 982
1582I82K999j612k252j590k356K614N062r57l700l93r0l67K256o9l019J646K991
$$ 982 3981 2369 117 -1473 -3829 -1215 3847 2890 -810 -1203 -1293 -1660 596 527 -2492 -846 2145
1599B145j082k269l41m11J828K856k115l041O26J731Q28J050j852m661O39M524
$$ 2145 1063 -1206 -1547 -1958 -130 2726 611 -2430 -1804 -73 755 1805 -47 -4708 -4069 455
1615D55J468r06n69k388l26K972Jk169J098J467j55O15j35k951l5M141R0k478
$$ 455 1923 1017 448 -1940 -2266 706 707 -1462 -364 1103 948 1563 1428 -1523 -1558 2583 2673 195
1633A95j186p48P50L733M15m084j787J774J100J907M73l321j834K405N58m54R33
$$ 195 -991 -1739 -989 2744 3159 -925 -2712 -938 162 2069 2542 -779 -2613 -208 350 -104 829
1650H29m91j615K265J032l366r97J943J262L70j219l149p99L712J628j108p08
$$ 829 338 -1277 988 2020 -1346 -2343 -400 862 1232 13 -3136 -3935 -223 1405 297 -411
1666d11j087j919L127L276l059k125N80P17P64K091j346j803J615J223k205o37
$$ -411 -1498 -3417 -290 2986 -73 -2198 -1618 -901 -137 1954 608 -1195 420 1643 -562 -1199
1682a199L54K08K363J433l016k559J425R48J631J197j894l351J386L085o07r12
$$ -1199 -845 -637 1726 3159 143 -2416 -991 -43 1588 2785 891 -2460 -1074 2011 1404 492
1698D92p00j842J608K801j156j602P08m18p76O85p04j715K099L023r48k362j211
$$ 492 -208 -2050 -442 2359 1203 -399 309 -109 -885 -200 -904 -2619 -520 2503 1555 -807 -2018
1715b018p96J711L185r89k856l80R76O60J994o06k950M16K264j47k72j52j167
$$ -2018 -2814 -1103 2082 1093 -1763 -2143 -1167 -507 1487 881 -2069 -1653 611 464 192 40 -1127
1732a127JK248n23k107Q62J949L32k55j265k630Q60L639M00j045o90k186k27K857
$$ -1127 -1126 1122 599 -1508 -646 1303 1635 1380 115 -2515 -1655 1984 2384 1339 649 -1537 -1764 1093
1750A093J387k394j049J236k56J101J6k017q87K024N84j444N64l6n0K172m76l333
$$ 1093 2480 86 -963 273 17 1118 1134 -883 -1770 254 838 -606 -42 -78 -128 2044 1568 -1765
1768a765j369K130J178J287J52k628k253J990J646m45m47m77q54J643J457j709
$$ -1765 -3134 -1004 174 1461 1613 -1015 -3268 -1278 368 -77 -524 -1001 -1855 -212 1245 -464
1784d64p79J159K64L57N53j445j286K773J064j710j286m00l06K807J587k208k517
$$ -464 -1243 -84 180 537 1090 -355 -1641 1132 2196 486 -800 -1200 -1506 1301 2888 680 -1837
1801a837L05J353O80J522j182k179P55J692j049K34L79r16N92J694j813j865R21
$$ -1837 -1532 -179 501 2023 841 -1338 -583 1109 60 294 673 -243 349 2043 230 -1635 -714
1818g14Q63K96N17j645j766J656K366r63j735k66j187J123K610K76j871o39K97
$$ -714 149 445 962 -683 -2449 -793 1573 610 -1125 -1391 -2578 -1455 1155 1431 -440 -1079 -782
1835g82LQ20R2j100P52K167j213j374j48n22M94K170l29k635N59K060j36J56q12
$$ -782 -779 41 133 -967 -215 1952 739 -635 -783 -1305 -811 1359 1030 -1605 -1046 1014 878 1034 222
1854B22k724k8L268J339n04k9j630q80J985j5j708P23J201l78l12rj827j96K239
$$ 222 -2502 -2530 738 2077 1573 1544 -86 -966 1019 1004 -704 19 1220 842 530 521 -1306 -1502 737
1873G37K26j799l05K5J16K220N44l000o93P56O83J060Q12j248j513J540N47j280
$$ 737 963 -836 -1141 -1116 -1000 1220 1764 -1236 -1929 -1173 -490 570 1382 134 -1379 161 708 -572
1891e72L71p5o98J216L67j849n00J530Q54j52M3k040q40K829J433q46m14p71o18
$$ -572 -201 -276 -974 242 609 -1240 -1740 -210 644 492 535 -1505 -2345 484 1917 1071 657 -114 -732
1910g32J311K169j742j954O96P07J00R34p13j384J113M05j664m91R30k61J606
$$ -732 579 2748 1006 -948 -252 455 555 1489 776 -608 505 910 -754 -1245 -315 -576 1030
1927A030J066k241k092R04J053M46J053o36j954R48J949p87j083l88r45N35K138
$$ 1030 2096 -145 -2237 -1333 -280 166 1219 583 -1371 -423 1526 739 -344 -732 -1677 -1142 996
1944I96p65j413J301L2j044j48Q6q90J456K273o39j562o77l88J177K036n36j855
$$ 996 231 -1182 119 151 -893 -1041 -955 -1845 -389 1884 1245 -317 -994 -1382 -205 1831 1295 -560
1962e60R1R69K11R07k58k277m53K488k76m71M93l79r09J297n49k012O81J875K34
$$ -560 -469 500 711 1618 1360 -917 -1370 1118 842 371 864 485 -424 873 324 -1688 -1007 868 1102
1981A102J95q55k313N12K446N78j429p94j51o53J932P14j607o96O18k41o0Q15
$$ 1102 1297 442 -1871 -1359 1087 1665 236 -558 -709 -1362 570 1284 -323 -1019 -401 -642 -702 113
1999A13j357l7K128m05j531J84L75MJ453M97k409q46J773Q41M93K32k201j470
$$ 113 -1244 -1281 847 442 -1089 -905 -530 -526 927 1424 -985 -1831 -58 783 1276 1508 -693 -2163
2017b163J865J318o34p9J89q67Q45Q23j824j34J199K54j53k8m16r17J342J493
$$ -2163 -298 1020 386 307 496 -371 474 1297 -527 -661 538 792 639 611 195 -722 620 2113
2035B113j628j498R5J78J648J400j657k174L71M46M13Q61j84j741R30J197j152
$$ 2113 485 -1013 -918 -740 908 2308 651 -1523 -1152 -706 -293 568 384 -1357 -427 770 -382
2052c82o50O42l86P10R03j270j535J758J197m38k7r48j639J668K248p22j167o59
$$ -382 -1032 -390 -776 -66 837 -433 -1968 -210 987 549 522 -426 -2065 -397 1851 1129 -38 -697
2070f97m67N06J936J13j741L25J069r80K88Nj053P99J878p60j893N56J30O05J573
$$ -697 -1164 -658 1278 1391 -350 -25 1044 64 352 357 -696 103 1981 1221 -672 -116 14 619 2192
2089B192j231k364L8J708P45k11j62k122m73K552M93j353L2j44p00J022J43j424
$$ 2192 961 -1403 -1365 343 1088 877 715 -1407 -1880 672 1165 -188 -156 -300 -1000 22 165 -1259
2107a259J04J959l80r61J19r09J39K281L49j863r29M62N19J466J060k421j348
$$ -1259 -1155 804 424 -537 -418 -1327 -1188 1093 1442 -421 -1350 -888 -369 1097 2157 -264 -1612
2124a612J415Q67m7P03j171j241J394O20r46j12O59k51Q29J31j763q79K009J197
$$ -1612 -197 670 623 1326 155 -1086 308 928 -18 -130 529 278 1107 1238 -525 -1404 605 1802
2142A802o24m58j750p75K221J948j201j123p8r90Q21J290j239j373J234O43m68
$$ 1802 1178 720 -1030 -1805 416 2364 1163 40 -38 -1028 -207 1083 -156 -1529 -295 348 -120
2159a20L13k77j106R14J525j617j600P88O40J592N65j632k300J129J426J68M79
$$ -120 193 -84 -1190 -276 1249 -368 -1968 -1180 -540 1052 1617 -15 -2315 -1186 240 408 887
2176H87q28j654R22J910p33l89m06m9K17J538o19j448J069J123o17j204l11p28
$$ 887 59 -1595 -673 1237 504 115 -291 -340 -123 1415 796 -652 417 1540 923 -281 -592 -1320
2194a320J363K311m43j689q96l5O51J583k84k383N7J407L21M01l56j209n94J892
$$ -1320 43 2354 1911 222 -674 -709 -58 1525 1241 -1142 -1085 322 643 1044 688 -521 -1115 777
2212G77n30j519K95J440k81R42n74k389j13K165Q45m83o05j606j59K589O48j530
$$ 777 247 -1272 -977 463 182 1124 550 -1839 -1952 213 1058 575 -30 -1636 -1795 794 1442 -88
2230h8p78N2l8J651J255j701q93R52j30m19J15l53l81K189P20k042j126O89N19
$$ -88 -866 -814 -852 799 2054 353 -540 412 282 -137 -22 -375 -756 1433 2153 111 -1015 -326 193
2249A93P44O95k242j082J695J431m4m63j080j486J630J839j278p29Q04r09O8Q67
$$ 193 937 1632 -610 -1692 3 1434 1390 927 -153 -1639 -9 1830 552 -177 627 -282 -214 653
2267F53j655r67J668J806r95m64j115o76J489J613j363j550m70Q25J518K019j410
$$ 653 -1002 -1969 -301 1505 510 46 -1069 -1745 -256 1357 -6 -1556 -2026 -1201 317 2336 926
2284I26k340M53J032J68k36O2j061R73J431q34j220M42M59J74N75p13k242Q75
$$ 926 -1414 -961 71 239 3 65 -996 -23 1408 574 -646 -204 255 429 1004 291 -1951 -1076
2302a076K620M42j126p17j816L93L262J36j641l84j68p2J005j3j951q8J770j06
$$ -1076 1544 1986 860 143 -1673 -1280 1982 2118 477 93 -75 -147 858 845 -1106 -1194 576 470
2320D70k1J5q88o48J971k97k532l0J338R52J716j55k762j470K092O29J79j21j405
$$ 470 449 464 -424 -1072 899 602 -1930 -1960 -622 330 2046 1891 -871 -2341 -249 380 559 438 -967
2339i67n05J833R72j644m04L93l15R39Q15k030k55J827M49j126j54o70o73K669
$$ -967 -1472 361 1333 -311 -715 -322 -637 302 1117 -913 -1168 659 1108 -18 -172 -842 -1515 1154
2357A154K159k224j748O2m1J453J493j912j694J105J050N5k51m51j680J487J112
$$ 1154 3313 1089 -659 -597 -638 815 2308 396 -1298 -193 857 912 661 210 -1470 17 1129
2374A129j541o42O97K45P23N19j498j563J354J696q5o83j255j598J627K420j90
$$ 1129 -412 -1054 -357 -112 611 1130 -368 -1931 -577 1119 1034 351 -904 -2502 -875 1545 1355
2391A355j820n58mP43J171m64j452O71J076p80k79r5q98J458K134p92k342P5N41
$$ 1355 -465 -1023 -1027 -284 887 423 -1029 -358 718 -62 -341 -436 -1334 124 2258 1466 -876 -801 -260
2410b60M81J588q83k523K14K404O83J41j132j760m26K219L24j329J91N09k02R21
$$ -260 221 1809 926 -1597 -1383 1021 1704 1845 713 -1047 -1473 746 1070 -259 -68 441 239 1160
2428A160m92j715j6J953K95q99k23j301p3K192N90j958q28M9Q29J569P04k767
$$ 1160 668 -1047 -1063 890 1185 286 63 -1238 -1311 881 1471 -487 -1315 -1266 -437 1132 1836 -931
2446i31j229J610M97j50N47q79l70J624N16j879o43R34P41R86P5k415j359K181
$$ -931 -2160 -550 -53 -203 344 -535 -905 719 1235 -644 -1287 -353 388 1374 1449 -966 -2325 -144
2464a44J277l09P5j365j186K218J783j572j287m9j3P18J809q82j778P62J040r60
$$ -144 1133 824 899 -466 -1652 566 2349 777 -510 -559 -572 146 1955 1073 -705 57 1097 137
2482A37k46j72j021J644J809j852j820K97O80R10J481j695k141Q64J799L35l56
$$ 137 -109 -281 -1302 342 2151 299 -1521 -1224 -544 366 1847 152 -1989 -1125 674 1009 653
2499F53p17j649O57K184k95j394J06k15J51P61n43j502R41K073n94k37j070r40
$$ 653 -64 -1713 -1056 1128 833 -561 -455 -670 -519 242 -301 -1803 -862 1211 617 380 -690 -1630
2517a630J194K574Jk663m66K80O86J700j78k113l56J724l8k69L56j735J73J611
$$ -1630 -436 2138 2139 -524 -990 -710 -24 1676 1498 -615 -971 753 715 446 802 -933 -760 851
2535H51j52j603N33M07M13R91o76k389j03K405R18l32m94k336m14K095J532j654
$$ 851 699 -904 -371 36 449 1440 764 -1625 -1728 677 1595 1263 769 -1567 -1981 114 1646 -8
2553hq29J92m62J550K10k135n76J733M40k69L64m80n70J466J102k360r29R98R42
$$ -8 -837 -645 -1107 443 653 -1482 -2058 -325 115 -154 210 -270 -840 626 1728 -632 -1561 -563 379
2572C79J096O45j861k002J272J094j91O30p47j620J297J481j527o01N83l26N76
$$ 379 1475 2120 259 -1743 -471 623 432 1062 315 -1305 -8 1473 -54 -655 -72 -398 178
2589A78J146r20j137J355J062j025n01r55n30J891J650j062j694j00k60L47J566
$$ 178 1324 404 -733 622 1684 659 158 -797 -1327 564 2214 1152 -542 -642 -902 -555 1011
2606A011p45j994J71J574n62N47k66j064Q56J257p59j139L59Q68M29O63p74k274
$$ 1011 266 -1728 -1557 17 -545 2 -264 -1328 -472 785 26 -1113 -754 114 543 1206 432 -1842
2624a842Q50K091k90j07q08j326n6K539J19j812p2lK9J511J71j606O45J432l47
$$ -1842 -992 1099 809 702 -106 -1432 -1488 1051 1170 -642 -714 -717 -688 823 994 -612 33 1465 1118
2643A118j181M7l62J25K017N4k012o29Q84K06N81J44k032j003J810Q49n59J55
$$ 1118 -63 -16 -378 -253 1764 1818 -194 -823 61 267 848 992 -1040 -2043 -233 616 57 212
2661B12o43j092J389P43j330M08O06k18N02N0j440p85J940Q21p42m84q96m43J888
$$ 212 -431 -1523 -134 609 -721 -313 293 75 577 627 -813 -1598 342 1163 421 -63 -959 -1402 486
2680D86P35j387j217N59m8R58J388q56j509O72N09k19L04K80q14Q99J068j437
$$ 486 1221 -166 -1383 -824 -872 86 1474 618 -891 -219 290 71 375 655 -159 740 1808 371
2698C71j203P57L79J62R16j557j450J106J531n35n20j32j542Q14K057n59q45m7
$$ 371 -832 -75 304 466 1382 -175 -1625 -519 1012 477 -43 -175 -1717 -903 1154 595 -250 -297
2716b97p5J12R17j21j478R71O67q81k53l6o32O90J596p09k251L64M83O69J580
$$ -297 -372 -260 657 536 -942 29 696 -185 -438 -474 -1106 -416 1180 471 -1780 -1416 -933 -264 1316
2735A316j008j711J9J374K14j76N16j055n30K153j26j374P47m1J5L45P3k002O52
$$ 1316 308 -1403 -1384 -10 204 28 544 -511 -1041 1112 986 -388 359 318 333 678 751 -1251 -599
2754e99K001j51q85l20j059j53J922P06j599k95m8J78J088K88j403p26J259p0
$$ -599 1402 1251 366 46 -1013 -1166 756 1462 -137 -432 -480 -302 786 1074 -329 -1055 204 134
2772A34k8K4k34m54R31L95j832n10J660J45K5K29j725o96J299J126j81n2r06o20
$$ 134 106 130 -104 -558 373 768 -1064 -1574 86 231 256 485 -1240 -1936 -637 489 308 256 -650 -1270
2792a270J066J133q09m05L56k8K0P78p38j234J197P85p37j05m06l95J464J209
$$ -1270 -204 929 120 -285 71 43 63 841 103 -1131 66 851 114 9 -397 -792 672 1881
2810A881j762j139N08M62N83Q57p29j925J022R26l89j64J52j087L14J273n16p95
$$ 1881 119 -1020 -512 -50 533 1390 661 -1264 -242 684 295 131 283 -804 -490 783 267 -528
2828e28L10M83k14M54o03j247M73J484j96o67j49o91M28J600J08j676m4Q3qR59
$$ -528 -218 265 51 505 -98 -1345 -872 612 416 -251 -400 -1091 -663 937 1045 -631 -675 -592 -600 359
2848C59K11j419K21J108k96l47K36n40k10J719j16j785J36J054J83M07K1j526
$$ 359 570 -849 -628 480 184 -163 73 -467 -677 1042 926 -859 -723 331 514 921 942 -584
2866e84o83J983M47r44L5p09m80J352J005j242l79M26j54J74O88j309l43J415
$$ -584 -1267 716 1163 219 254 -455 -935 417 1422 180 -199 227 73 247 935 -374 -717 698
2884F98K94r17n46p2L0P18J304j864r10N89K39P44M05r81j234J006R91l62M4l26
$$ 698 992 75 -471 -543 -513 205 1509 -355 -1265 -676 -437 307 712 -269 -1503 -497 494 132 176 -150
2904a50o43N90P77q55o57Q55O69o6M3q96r25J177J395o47r35j90n57J136J211
$$ -150 -793 -203 574 -281 -938 -83 586 520 563 -333 -1258 -81 1314 667 -268 -458 -1015 121 1332
2923A332l79j434%N32J9R78j62j464N23Q79q13j57J13l86N84Q34o39j223L03O05
$$ 1332 953 -481 -481 51 70 1048 886 -578 -55 824 11 -146 -33 -419 165 999 360 -863 -560 45
2943D5Q1P30p71j765P71J288K89p44k62m33PJ133M90j524J58L64k29L74K57j147
$$ 45 126 856 85 -1680 -909 379 668 -76 -338 -771 -764 369 859 -665 -507 -143 -372 2 259 -888
2963h88N14R54O0q15k00l35K71J411K54j965O8O69M61L70L68j665n69J479K38
$$ -888 -374 580 640 -175 -375 -710 -439 972 1226 -739 -671 -2 459 829 1197 -468 -1037 442 680
2982F80k86j00l08m22Q36N32j052n03Q24K87l36N08j407m51J486R37j102q6l70
$$ 680 394 294 -14 -436 400 932 -120 -623 201 488 152 660 -747 -1198 288 1225 123 37 -333
3001c33n31Q47J377j386q80N77p1M51N08n00q55N27O23k64k30j69l70O08J092
$$ -333 -864 -17 1360 -26 -906 -329 -400 51 559 59 -796 -269 354 90 -140 -309 -679 -71 1021
3020A021j111j126J012O06J93L54j029j141P21J103k81k29j19m99K22J182k22
$$ 1021 -90 -1216 -204 402 595 949 -80 -1221 -500 603 322 93 -26 -525 -303 879 657
3037F57j086K87M55J04J60m55r19O18J229l34p67Pm87M33J224k16j648k9N61K24
$$ 657 -429 -142 313 417 577 122 -797 -179 1050 716 -51 -44 -531 -98 1126 910 -738 -767 -206 18
3057A8K21J47r60n34J470j86j79L6l36k19Q78k5j053J75N61L89k28J49j354J69
$$ 18 239 386 -574 -1108 362 176 -3 33 -303 -522 356 331 -722 -547 14 403 175 324 -1030 -861
3077h61J293M40m33p79j37m63J456J025j579m13M50K75k2M95q94m04O92N68o72
$$ -861 432 872 439 -340 -477 -940 516 1541 -38 -451 -1 274 252 747 -147 -551 141 709 37
3096C7pJ33k61R58L3j098q78R64L41J90M82j169r80R96J093j37n26p40p1L02J079
$$ 37 30 163 -98 860 893 -205 -1083 -119 222 412 894 -275 -1255 -259 834 697 171 -569 -640 -338 741
3117G41o55p52N98Jk65M73k50p89R09P07o57j97l51N4N2J117n43j004N5O25N09
$$ 741 86 -666 -68 -67 -332 141 -109 -898 11 718 61 -136 -487 -433 -381 736 193 -811 -756 -131 378
3138C78K68n41r65N92N84J37k34j81K0k73J083l35j251L95P06J1L74o20r25J50
$$ 378 646 105 -860 -268 316 453 219 38 58 -215 868 533 -718 -323 383 394 768 148 -777 -627
3158f27J452l71k69J4p05K2J195J9r09m61M92Q5L14K76j200j12J211k98o08K01
$$ -627 825 454 185 199 -506 -484 711 730 -179 -640 -148 -63 251 527 -673 -785 426 128 -480 -279
3178b79l37R3R52M49j135m39M86N82qk07p41n96J253L93M3l60m34l32O65Q20q93
$$ -279 -616 -523 429 878 -257 -696 -210 372 364 157 -584 -1180 73 466 509 149 -285 -617 48 868 -25
3199b5n62R60k32j23M43o46l83J040M91n08o04Q7k02N12O80p43o71J87P6L49O76
$$ -25 -587 373 141 18 461 -185 -568 472 963 455 -149 -62 -264 248 928 185 -486 -299 -223 126 802
3220H02m75j012L17R48l88k67r7K9O8P61n80o04M72K75p1n5l02p25M48O05J13
$$ 802 327 -685 -368 580 192 -75 -172 -143 -75 686 106 -498 -26 249 178 123 -179 -904 -456 149 262
3241B62j17n49o7M9R43k08r14K15J26R1M81j1l19k71Q65m00k19P4j45j30R86j03
$$ 262 145 -404 -471 -422 521 313 -601 -386 -260 -169 312 301 -18 -289 576 176 -43 31 -114 -244 742 639
3263F39r43j92Q19K5M41o33m52k17N83O27n46m17K08m13N93K94q06L83K32M0j11
$$ 639 -304 -496 323 348 789 156 -296 -513 70 697 151 -266 -58 -471 122 416 -390 -7 225 265 154
3284A54K82p42k32O79K3m80J13r6J89M15M70j019m53L47J08N02J71m34r01R84
$$ 154 436 -306 -538 141 164 -316 -203 -299 -110 305 775 -244 -697 -350 -242 260 431 -3 -904 80
3304H0L80m50n8j42P4J33P98p02m02J40L26r6M98o85n33P73N17k48k25n58k72
$$ 80 460 10 -48 -190 -116 17 815 113 -289 -149 177 81 579 -106 -639 134 651 403 178 -380 -652
3325f52P69M11k30n57M13K15m32L89k46l95L09P22q41j89P5k76M54M28k67n46
$$ -652 117 528 298 -259 154 369 -63 326 80 -315 -6 716 -125 -314 -239 -515 -61 367 100 -446
3345d46K6M31K81R5l91m93K38M95L9j90M7o64j55R10K15n79p7j29N09r0k2o85
$$ -446 -420 11 292 387 -4 -497 -259 236 275 85 132 -532 -687 223 438 -141 -218 -347 162 72 50 -635
3367f35M37P13q8n18n0m06L04Q64j07p12J03L14N5J81K97r36J52J40J74k32j11
$$ -635 -198 515 427 -91 -141 -547 -243 621 514 -198 -95 219 274 455 752 -184 -32 108 282 50 -61
3388f1N6p56J145o8o62j72O12M7q3K06o99k76Q49K62k37k69M5m32Q42L76p63j24
$$ -61 -5 -761 384 316 -346 -518 94 141 58 264 -435 -711 138 400 163 -106 -61 -493 349 725 -38 -162
3410a62n3L1L43O5k97j59M22J38n51J83j24J26J36M00m71j91J87K05j45N87m23
$$ -162 -215 -184 159 224 -73 -232 190 328 -223 -40 -164 -38 98 498 27 -164 23 228 83 670 247
3431B47m82L11K94k76m2R2k84p5M74l77J25k56J72L0J9r7NJ42L53l01l64K33l08
$$ 247 -235 76 370 94 52 144 -140 -215 259 -118 7 -249 -77 -47 -28 -125 -120 22 375 74 -290 -57 -365
3454c65K97M67L3n09k16O8J11K76J3k72j72M92m44K49j70l17M53O5K9l85L8L06
$$ -365 -68 399 432 -77 -293 -225 -114 162 175 -97 -269 223 -221 28 -142 -459 -6 59 88 -297 -259 47
3476D7Q7J32l80m22N06K13K80l16j30J03k24L37k8m2k47L78kj39J66m74N0N29
$$ 47 134 266 -114 -536 -30 183 463 147 17 120 -104 233 205 163 -84 294 292 153 319 -155 -105 424
3498D24j95k73J2j14j06K52o8k18o8K83L05kLo90L2J005j72m61n6J39j67J60J30
$$ 424 229 -44 -32 -146 -252 0 -68 -286 -354 -71 234 232 235 -455 -423 582 410 -51 -107 32 -135 25 155
3521A55k09k39N23j4j41j05n3j18J30M61l06j94j8M3L60j4l59p8O37m44K11K6
$$ 155 -54 -293 230 216 75 -30 -83 -201 -71 390 84 -110 -128 -85 275 261 -98 -176 461 17 228 254
3543B54j76k06K10Q7n15M07k04J84L83k70j4l01L46r6j83L60l44k01L57K1j85
$$ 254 78 -128 82 169 -346 61 -143 41 424 154 140 -161 185 89 -94 266 -78 -279 78 99 -86
3564h6q1k50K63j10L39j32l45L72j62L39l66N8r6J19K54j74j13J19J22j03K98
$$ -86 -167 -417 -154 -264 75 -57 -402 -30 -192 147 -219 -161 -257 -138 116 -58 -171 -52 70 -33 265
3585B65m66l62K03O26j33j37L45o31N40j94J33n3q2Q2k37L32j87k25J81L07j27
$$ 265 -201 -563 -360 266 133 -4 341 -290 250 56 189 136 54 136 -101 231 44 -181 0 307 180
3606A80j06j43J02q0K67m5l18j94L43N5K69m03j97R4M45l98p8M29l02k18M07o3
$$ 180 74 -69 33 -47 220 175 -143 -337 6 61 330 -73 -270 -176 269 -129 -207 222 -80 -298 109 46
3628D6%j94J85o3m2K10l14l9L39l0j2m2q6k72L43K18l67j54K92j86K18Nl94L73
$$ 46 46 -148 37 -26 -68 142 -172 -211 128 98 86 44 -42 -314 29 247 -120 -274 18 -168 50 55 -339 34
3652C4l1n2P3L30l49Nj13N85l97N4q8N6j7J75k61j14J33k83K41K02l04k89K30
$$ 34 3 -49 24 354 5 10 -103 482 85 139 51 107 90 265 4 -110 23 -260 -19 183 -121 -410 -180
3675a80Q9p5R8m3q5K33k02l8l18N74j37j19p3L06j07L28J81m45j85K68J87j11
$$ -180 -91 -166 -68 -111 -196 37 -165 -203 -521 53 -84 -203 -276 30 -77 251 432 -13 -198 70 257 146
3697A46m4k13m7K07j30k33K90N9j2O5K76k39j71Q9m1J04K10l87L24j76K60j14
$$ 146 102 -111 -158 49 -81 -314 -24 35 23 88 364 125 -46 43 2 106 316 -71 253 77 337 223
3719B23l06n39L18L47K79j17r0j65J67K82l37m2k55r1L56k02K53J49m19K84R2
$$ 223 -83 -622 -304 43 322 205 115 -50 117 399 62 20 -235 -326 30 -172 81 230 -189 95 187
3740A87j09n12K95K11J27p5J79r82M86K11k39J18K13j19j48L29j98m27L41J98
$$ 187 78 -434 -139 72 199 124 303 -679 -193 18 -221 -103 110 -9 -157 172 -26 -453 -112 86
3760H6j16L59l18K37l78L76mk68j9k26J8N88l2l91J27k15O4j09K27j8QJ65k42
$$ 86 -30 329 11 248 -130 246 242 -26 -45 -271 -253 335 303 -88 39 -176 -112 -221 6 -12 -4 161 -81
3783h1n1mJ07Q6j47L83m51R9R9Q2q3j45j94j93O42K1q4k88r3J46M94j11n9k12
$$ -81 -132 -136 -29 57 -90 293 -158 -59 40 122 39 -106 -300 -493 149 170 86 -202 -295 -149 345 234 175 -37
3807c7R2J84j85L01q6o07J40K06k39K88R1j80N9L18k73j61J57J07L7J95l64k88
$$ -37 55 239 54 355 269 -338 -198 8 -231 57 148 -32 27 345 72 -89 68 175 212 407 43 -245
3829b45M05J9Jk15l06l0L39M04m91J58k62J62k55O61o03j64M60O8k0M4k48m13
$$ -245 160 179 180 -35 -341 -371 -32 372 -119 39 -223 -61 -316 345 -258 -422 38 106 86 130 -118 -531
3851e31M45M05l78l1m8M51P0l21j07k96L53J34Mo9J58n16J73L38l98J31k12M55
$$ -531 -86 319 -59 -90 -138 313 383 62 -45 -341 12 146 150 81 239 -277 -104 234 -164 -33 -245 210
3873B10j1J50l74l15L24J00K00m6l38n6Q7L84J86p53J68K3O0p9K94o52J55N22
$$ 210 199 349 -25 -340 -16 84 284 238 -100 -156 -69 315 501 -252 -84 -61 -1 -80 214 -438 -283 239
3895B39k11P4l63k3J40L55K26n48l2J96J01j58J48k68k74M85p5J32k29l03P3K67
$$ 239 28 102 -261 -284 -144 211 437 -111 -143 53 154 -4 144 -124 -398 87 12 144 -85 -388 -315 -48
3917d8K26k35j62L00j12L02l45Q5l53K78K88l04N2j29J99M39K12j139L05J30k42
$$ -48 178 -57 -219 81 -31 271 -74 11 -342 -64 224 -80 -28 -157 42 481 693 -446 -141 -11 -253
3938b53P21p0k47p68N55K38P6m27j1r0K26L58j21m09K58k79M13K08p29j4O01J09
$$ -253 468 398 151 -617 -62 176 252 -175 -186 -276 -50 308 187 -222 36 -243 170 378 -351 -365 236 345
3960C45l89K2j48k87J42P44l41k30Q0J47j14K28j26m11J51N59k36j11K13k91J74
$$ 345 -44 -22 -170 -457 -315 429 88 -142 -62 85 -29 199 73 -338 -187 372 136 25 238 -53 121
3981A21L00l94n03M27R5M25k73j00n34L21M16k92Q6n2O8k80O33k57p39M78J2j61
$$ 121 421 27 -476 -49 46 471 198 98 -436 -115 301 9 95 43 111 -169 464 207 -532 -54 -42 -203
4003b03K79K14p19L80L07j44r3p8j99K05K06N31r10j26L86Q5J07J76p15m6N11
$$ -203 76 290 -429 -49 258 114 21 -57 -256 -51 155 686 -224 -350 36 121 228 404 -311 -357 154
4024A54M21m49n00M61o29N45M08l70q6KL13p3K6p40K33L04K37K1j86j56k50L63
$$ 154 575 126 -374 87 -542 3 411 41 -45 -43 270 197 223 -517 -284 20 257 278 92 -64 -314 49
4046D9L51n14l13K32M22J75k33m98o6L50L82k61p3m7n2M51M8m44k83J23J44K87
$$ 49 400 -114 -427 -195 227 402 169 -329 -395 -45 337 76 3 -44 -96 355 403 -41 -324 -201 -57 230
4068B30J38n64j62J60J59L9p9J48k45K37J75J59m70J65j92J4L32o4l83MO41j49
$$ 230 368 -196 -358 -198 -39 0 -79 69 -176 61 236 395 -75 90 -102 -88 244 180 -203 -199 442 293
4090B93J32j88n99L12K40ok16o38Q92j97M80k14n18L36J56r4l40J67J84l18N26
$$ 293 425 237 -362 -50 190 184 -32 -670 222 25 505 291 -227 109 265 171 -169 -2 182 -136 390
4111C90o1q07K96J72Q8j44J88o75J73O48l25m5j90J12k87N57P9p8p00O75k91Q6
$$ 390 329 -478 -182 -10 78 -66 122 -553 -380 268 -57 -102 -292 -180 -467 90 169 91 -609 66 -225 -139
4133a39M59l29k26L37L63n49J61k74n8J75N69n82m48M29K82J18nm05j45M91N4
$$ -139 320 -9 -235 102 465 -84 77 -197 -255 -80 489 -93 -541 -112 170 288 283 -122 -267 224 278
4154B78J9l46J61m02N47L26k62m68K07J93j40R8l43k29J96L97r8n04K8L0J95L77
$$ 278 297 -49 112 -290 257 583 321 -147 60 253 113 211 -132 -361 -165 232 134 -370 -342 -312 -117 260
4176B60m13m34L04J67K12J49r3o84M15L23J50k54l91j40p3P30n23M9J55K2K48
$$ 260 -153 -587 -283 -116 96 245 152 -532 -117 206 356 102 -289 -429 -502 228 -295 -246 -91 -69 179
4197A79K20n18l25J02P52j11r7j24k83K59M59p7n66j70K67q5M31k01j0k05J82
$$ 179 399 -119 -444 -342 410 299 202 78 -205 54 513 436 -130 -300 -33 -118 313 112 102 -103 79
4218G9k64n2J59oJ47L22l63j78k2R6J5J44M3n38r3M23K49j69J01o8j19K69P8k54
$$ 79 -185 -237 -78 -84 63 385 22 -156 -178 -82 -67 77 120 -418 -511 -88 161 -8 93 25 -94 175 253 -1
4242ar8qK3K53k23mj70N39O4o60j04L39l68N53K4j21j81O9J40O4L00j70m10L06
$$ -1 -99 -107 -84 169 -54 -58 -228 311 375 -285 -389 -50 -418 135 159 38 -143 -74 66 130 430 260 -150 156
4266A56J33l48J21P4j22J39j7J19k32P7J99k20k4k84j00M57J91l26k58J96j12
$$ 156 289 -59 62 136 14 153 136 255 23 100 299 79 55 -229 -329 128 319 -7 -265 -69 -181
4287a81J74L04k89k5q2Q4M2J78m25r9O3K39j12q8L73k51p5M76o6p96N76O7l8J3
$$ -181 -7 297 8 -17 -99 -15 27 205 -220 -319 -256 -17 -129 -217 156 -95 -170 306 240 -556 20 87 49 62
4311F2N4o45K25M75m0K33k55k47K17J42l64m2M5J11K0R8Q5k2k18P8K40l24J36
$$ 62 116 -529 -304 171 131 364 109 -138 79 221 -143 -185 -140 -29 -9 89 174 152 -66 12 252 -72 64
4334F4l3k23N33l1m55k39K65J67J64o0K3k67L12j56k17P4L7m0K81L92p02M9j56
$$ 64 31 -192 341 310 -145 -384 -119 48 212 152 175 -92 220 64 -153 -79 -42 -82 199 591 -111 -62 -218
4357b18M2K58%k30k37M97K59l15J16k05k2k7P43o45j51k6K02J54k67K3P4K32J74
$$ -218 -176 82 82 -148 -385 112 371 56 172 -33 -55 -82 661 16 -135 -161 41 195 -72 -49 25 257 431
4380D31l95l83M08m23K44K03k40J17J77k47K09J99k70m49K61K68j77J76j60n2
$$ 431 36 -347 61 -362 -118 85 -155 -38 139 -108 101 300 30 -419 -158 110 -67 109 -51 -103
4400a03N7O5j63n24N47J71j3k56J46n79L59M26k09J47k41j32M26K63k60q3j93
$$ -103 -46 19 -144 -668 -121 50 37 -219 -73 -652 -293 133 -76 71 -170 -302 124 387 127 44 -149
4421a49K89J12k88L59l44k02M97j55k70J16j29L36L42l44k57j45K02K30M3j0k75
$$ -149 140 252 -36 323 -21 -223 274 119 -151 -35 -164 172 514 170 -87 -232 -30 200 243 233 -42
4442d2l44Q39j59kk36l4r0J90R1l70j91N16j82K43K34m02k93K77k78n7J19k38
$$ -42 -386 453 294 292 56 22 -68 122 213 -157 -348 168 -14 229 463 61 -232 45 -233 -290 -171 -409
4464d09R2O05K42o02Q8kj83J95L27l16l48M42j39k5L83m88k95J83M83k16j89J66
$$ -409 -317 288 530 -72 16 14 -169 26 353 37 -311 131 -8 -33 350 -138 -433 -250 233 17 -172 -6
4486fo0n6P5j5k64N58J85j44j72jk73K32L43m01m59L47K64J3q9l78j87P51p7j33
$$ -6 -66 -122 -47 -62 -326 232 417 273 101 100 -173 59 402 1 -458 -111 153 166 77 -301 -488 263 186 53
4510E3k88P3L0j12M73J28p23L73K60j77J7m49J0m0P01k16j56J94l61K4M26l68
$$ 53 -235 -162 -132 -244 229 357 -366 7 267 90 107 -342 -332 -372 329 113 -43 151 -210 -186 240 -128
4532a28l18M20J95j59k78K95K4m8J14J80r1j60K97o93R08m49j11j11L49J14J41
$$ -128 -446 -26 169 10 -268 27 51 3 117 297 206 46 343 -350 558 109 -2 -113 236 350 491
4553D91l1m77k60O12j64l62M1J30j60L86K6k31k73N73j01j34J6j69q6N04L9n70
$$ 491 460 -17 -277 335 171 -191 -150 -20 -180 206 232 1 -272 301 200 66 82 -87 -173 331 370 -200
4575b00o8k56O18p9J48k76k08K73K49k14q6Q7k35P2M50j28j72J4PL3J65k88n78
$$ -200 -268 -524 94 15 163 -113 -321 -48 201 -13 -99 -12 -247 -175 275 147 -25 -11 -4 29 194 -94 -672
4598f72O04L95r7j56k40n4M34Q7k26j02j65j62L95J80k9m66K62J55k44m5J97m25
$$ -672 -68 327 230 74 -166 -220 214 301 75 -27 -192 -354 41 221 192 -274 -12 143 -101 -146 51 -374
4620c74K87M73j55l40pj4j3N10k93l92O8K13m8K94j05l74Q4L85R6n72J81n9K41
$$ -374 -87 386 231 -109 -116 -130 -143 367 74 -318 -250 -37 -85 209 104 -270 -186 199 295 -277 -96 -155 86
4643H6J92k70k94L2L09L9R0P9n46J82K78J15l65r0K29q0K28n8k58J10O0J31o9
$$ 86 278 8 -286 -254 55 94 184 263 -283 -101 177 292 -73 -163 66 -14 214 156 -102 8 68 199 130
4666A30j23o3k84P72j45m48K90k78j5M50J97p05q2K98R1N4O8q49j6O60L33k42
$$ 130 7 -56 -340 432 287 -161 129 -149 -164 286 483 -222 -304 -6 85 139 207 -642 -658 2 335 93
4688I3l21J80m15M75p4j27j20L5M04k24K32l17k57K01M58k54r5J27p9M57L9m57
$$ 93 -228 -48 -463 12 -62 -189 -309 -274 130 -94 138 -179 -436 -235 223 -31 -126 1 -78 379 418 -39
4710c9k03k3L49J11j82j03k33R4N23l49n2K73n80N67j64j23M9L10P5k31J10k58
$$ -39 -242 -265 84 195 13 -90 -323 -229 294 -55 -107 166 -414 153 -11 -134 -85 225 300 69 179 -79
4732g9l39K00N50n22O5k08L00O7L39l86j14k66K35J99K89l08l24l2O20o5m90L30
$$ -79 -418 -218 332 -190 -125 -333 -33 34 373 -13 -127 -393 -158 41 330 22 -302 -334 286 221 -269 61
4754F1j16k1N19k14k28j3L92k03m5N4l64n7L45K76l43k5l07K12K04J85j31j71
$$ 61 -55 -76 443 229 1 -12 380 177 132 186 -178 -235 110 386 43 18 -289 -77 127 312 181 10
4776A0K57p3k30K98o20K06K65R2j57k86M63k73J28J47k74l72O33k31L1K00K1n43
$$ 10 267 194 -36 262 -358 -152 113 205 48 -238 225 -48 80 227 -47 -419 214 -17 14 214 235 -308
4798c08o1M39k72j09R7J30L30k27L1m30K9M77j8k3m01N1J35N55k23j91m6n2J63
$$ -308 -369 70 -202 -311 -214 -84 246 19 50 -380 -351 126 108 85 -316 -265 -130 425 202 11 -35 -87 76
4821G6M42o43j08K37K51k32j7L85p90K27N06k38O6j07J6j52M96m24m01K62M22
$$ 76 518 -125 -233 4 255 23 6 391 -399 -172 334 96 162 55 71 -81 415 -9 -410 -148 274
4842B74K6k37K21n57Q1M94J2j18k76k66J6M89j11j44k52L03q6K74O3n53j7N41
$$ 274 300 63 284 -273 -192 302 314 196 -80 -346 -330 159 48 -96 -348 -45 -131 143 206 -347 -364 177
4864A77K55l03l63L03j55L46L1n76k35O96P3L7k3n77J75J6J65j61K55k45o7K19
$$ 177 432 129 -234 69 -86 260 291 -285 -520 176 249 286 263 -314 -139 -123 42 -119 136 -109 -176 43
4886D3J32k75k2K55J38K8K13l63n19M21N90o26j10J02j27J50J12j0m77L42o8j80
$$ 43 175 -100 -122 133 271 299 512 149 -370 51 641 15 -95 7 -120 30 142 132 -345 -3 -71 -251
4908b51K97q9n88N75L79l92k34M67k26j74P09n81k10J73K97k05M42k84n39K05
$$ -251 46 -43 -631 -56 323 -69 -303 164 -62 -236 473 -108 -318 -145 152 -53 389 105 -434 -229
4928b29M25p3l31J58j56K34L35l55l57R6N13o6N6k38k05k8K46J70k70k09N38j19
$$ -229 196 123 -208 -50 -206 28 363 8 -349 -253 260 194 250 12 -193 -221 25 195 -75 -284 254 135
4950A35K48Qp62J10m3N38k69J58m26J81K59J07l30j83L6l9M91k08mj89M81j31
$$ 135 383 391 -371 -261 -304 234 -35 123 -303 -122 137 244 -86 -269 -233 -272 219 11 7 -182 299 168
4972A68J43l09q6N6RL02l34j34J76j11M22o7k91j41M1L72Qj25j46k17K79K85m91
$$ 168 311 2 -84 -28 -19 283 -51 -185 -9 -120 302 235 -56 -197 -156 216 224 99 -47 -264 15 300 -191
4995a91J55m6R3J19L49k36o12O19K3N2n40O2l90R99j79l39J39p5j27oL15k23n6
$$ -191 -36 -82 11 130 479 243 -369 250 273 325 -215 -153 -543 456 277 -62 77 2 -125 -131 184 -39 -95
5018i5L18j85R2j73j22j47N16J71l12m13L06j10J54L86j96p49M07L71o3n4l05
$$ -95 223 38 130 -43 -165 -312 204 375 63 -350 -44 -154 0 386 190 -559 -152 219 156 102 -203
5039b03J06j2R9O3l31JM69j29M63m28l93J58J46J07r4J75l83K33J43K56m09j35
$$ -203 -97 -109 -10 53 -278 -277 192 63 526 98 -295 -137 9 116 22 197 -186 47 190 446 37 -98
5061i8j53L35q3K38l25l9M01Rm96K21j56j01M79Q4p35j19N96l46N61k58j04j19
$$ -98 -251 84 1 239 -86 -125 276 285 -211 10 -146 -247 232 316 -419 -538 58 -288 273 15 -89 -208
5083b08K11Q5n1K7m04N3N05K04n33j13N6j2J96J18k07L7L07k72K88Q0o22J09L85
$$ -208 3 88 37 64 -340 -287 218 422 -111 -224 -168 -180 16 134 -73 -36 271 -1 287 367 -255 -146 239
5106B39J61n53j07j4K05LM84k11p39Q08j34m22M08k44k81N27K18j43k56r5q8K35
$$ 239 400 -153 -260 -274 -69 -66 418 207 -532 276 142 -280 128 -116 -397 130 348 205 -51 -146 -234 1
5128AK40j76m06K45K93j11j88n7j3j81O73m14Q7r2J22m9J07k0k86P4K39J47j99
$$ 1 241 65 -341 -96 197 86 -102 -159 -172 -353 320 -94 -7 -99 23 -26 81 61 -225 -151 88 235 36
5151C6n1j93K58J52j65m62M62o9L08l6j90m00K56Q1J05j60J36l65K36M97o45j42
$$ 36 -15 -208 50 202 37 -425 37 -32 276 240 50 -350 -94 -13 92 -68 68 -297 -61 436 -209 -351
5173c51M52j20M2J18K8k32K9J45rP0j03J9l13N37l8k17m44J13m2M13K14o85K21
$$ -351 101 -19 23 141 169 -63 -34 111 102 172 69 88 -225 312 274 57 -387 -274 -316 97 311 -374 -153
5196a53n0K24N4Q1k14l56O17L11o61N3J22rK94p7j34j4k45P39o50K11m86K0K98
$$ -153 -203 21 75 156 -58 -414 203 514 -147 -94 28 19 313 236 102 88 -157 582 -68 143 -343 -323 -25
5219b5L14n30N3J66n5J45K66j76l00K08J03r0J2J3k56K17L28k27j56l2j26J59
$$ -25 289 -241 -188 -22 -77 68 334 158 -142 66 169 79 91 104 -152 65 393 166 10 -22 -148 11
5241A1J11p0l62J65J65r2R0q6k35K04N50K5n03J52j35M1p7J14m19K86M10n2m33
$$ 11 122 52 -310 -145 20 -72 18 -68 -303 -99 451 476 -27 125 -10 31 -46 68 -351 -65 345 293 -140
5264a40K9k10K01J01jl23K62oM06k5j48j94J25K92K4k64j13L4N5j3l9m94L18J03
$$ -140 -111 -321 -120 -19 -20 -343 -81 -87 319 294 146 -48 77 369 393 129 16 50 105 92 53 -441 -123 -20
5288b0J48j27J41m57m7M16j96J21j27j22q5M01J43k56j36J09J69N4J79m17n2L49
$$ -20 128 1 142 -315 -362 54 -142 -21 -148 -270 -355 46 189 -67 -203 -94 75 129 308 -109 -161 188
5310A88k95J21k45k39M0O04p4J7n02M44L4l3M24n47k42K95J80k63K48j73k08P28
$$ 188 -107 14 -231 -470 -430 174 100 117 -385 59 93 60 484 -63 -305 -10 170 -93 155 -18 -226 502
5332E02j91Ol45j13P0M0K19k93j11L18L09n42P4p7j28J13M71j11n33K55k8J13
$$ 502 311 317 -28 -141 -71 -31 188 -105 -216 102 411 -131 -57 -134 -262 -149 322 211 -322 -67 -95 18
5354A8K80l09j26J04L37l45L98n33l19L67L55k40k3J80L6j44J12j76l53K49K59
$$ 18 298 -11 -137 -33 304 -41 357 -176 -495 -128 227 -13 -36 144 180 36 148 -28 -381 -132 127
5375A27L09l06l08p3Q7M82k29m52J99K41R4K99k07o56O3O28m29J15L22l33k51
$$ 127 436 130 -178 -251 -164 318 89 -363 -164 77 171 470 263 -393 -330 298 -131 -16 306 -27 -278
5396b78O36j81o79M87k9J69j5K6l98j65O51j16R2l19l02J48J92l4Ol25kJ49J40
$$ -278 358 177 -502 -15 -44 125 110 136 -262 -427 224 108 200 -119 -421 -273 -81 -115 -109 -434 -436 -287 -147
5419a47L29m68q9L35M1J07j36k67J48K05M74n32k38rP8L70K16o68RL86j59O8m1
$$ -147 182 -286 -375 -40 1 108 -28 -295 -147 58 532 0 -238 -247 -169 201 417 -251 -242 144 -15 53 12
5442A2k71L57m04O76j25l91n6K31r2L00m64j26P75q7k20J50j59n08N07K36m02
$$ 12 -259 98 -306 370 245 -146 -202 29 -63 237 -227 -353 422 335 115 265 106 -402 105 341 -61
5463f1j60J98J87q6K14r4n85K71K14j10pP2m19L67J64l29N8j38J03M1M18l86k86
$$ -61 -221 -23 164 78 292 198 -387 -116 98 -12 -19 53 -366 1 165 -164 -106 -244 -141 -100 318 -68 -354
5486c54K48K98m2J24n54j11K98N09j60m11R0m6j46Q6j54J32K08L41j56K7k36l03
$$ -354 -106 192 150 274 -280 -391 -93 416 256 -155 -65 -111 -257 -171 -325 -193 15 356 200 227 -9 -312
5508c12K30L50J61m71j23P3J75M38m05l64J0J96Q0l26M54m84j3K66K72o21M13
$$ -312 -82 268 429 -42 -165 -92 83 521 116 -248 -238 -42 38 -288 166 -318 -331 -65 207 -414 -1
5529ak36L30J2K89o37n4K85K38j26L6o7n40M69O87p16k7K04j66J38J83On60L09
$$ -1 -237 93 105 394 -243 -297 -12 226 100 136 69 -471 -2 685 -31 -58 146 -20 118 301 307 -253 56
5552E6j1L39l90rj23M52j6r1l40N0Q8j5J40on69J54N81J3k5k39n0L3J77q7l12
$$ 56 45 384 -6 -15 -138 314 298 207 -133 -83 5 -10 130 124 -445 -291 290 303 278 39 -11 22 199 112 -200
5577b00J07O8j21L55k44m74K70M18k12j62l79L63j33O40j51j87n0j29K08J51p4
$$ -200 -93 -25 -146 209 -35 -509 -239 179 -33 -195 -574 -211 -344 296 145 -42 -92 -221 -13 138 64
5598F4j29k10M77j27J58j57o4j92N78mm21k8K11J60j15l7l67J48J61K69k74k78
$$ 64 -65 -275 202 75 233 76 12 -180 398 394 -27 -55 156 316 201 164 -203 -55 106 375 101 -177
5620a77j7J11L8o4L2l24N37N7j15M47n75j94L70k68m3J33J43l40P1K61m25j35
$$ -177 -194 -83 -45 -109 -77 -401 136 193 78 525 -50 -244 126 -142 -185 -52 91 -249 -178 83 -342 -477
5642d77J01J10J87M27k89l71J79J79J08j41j46R1K00R2r1k54N5n7J82Q4k69J8
$$ -477 -376 -266 -79 348 59 -312 -133 46 154 13 -133 -42 158 250 159 -95 -40 -97 85 169 -100 -82
5664h2J3L24k09M4J3k89j9L86q9m44M45K40r7K61n45l49M84L6j19K28l09j77L42
$$ -82 -69 255 46 90 103 -186 -205 181 92 -352 93 333 236 497 -48 -397 87 123 4 232 -77 -254 88
5687H8L21k70k62j43n0K51L83k32k12j56M66J29n64N05l15m4J07N1k41L1J86l70
$$ 88 409 139 -123 -266 -316 -65 318 86 -126 -282 184 313 -251 254 -61 -105 2 53 -188 -157 29 -341
5709c41O22l30k24L24J57j08q1K4k70K6N47q1n51k96P13J70M8j40l62j8J83J82
$$ -341 281 -49 -273 51 208 100 19 43 -227 -201 346 265 -286 -582 131 301 349 209 -153 -171 12 194
5731A94N0k49R9j64L6M74m43j62L08j32J25K71m9p21L36p3j69M00k46j41M41k5
$$ 194 244 -5 94 -70 -34 440 -3 -165 143 11 136 407 358 -363 -27 -100 -269 131 -115 -256 185 160
5753A60r5k31l52N96j01L99m68k37N55j19l15K27j3n42L54N18l33l75L25O3J56
$$ 160 65 -166 -518 78 -23 376 -92 -329 226 107 -208 19 6 -536 -182 336 3 -372 -47 16 172
5774A72M38n46m87N04l4J24q9M7m43K50L16O2p0j02p6j2K21p6l82O0K25R8n6m8
$$ 172 610 64 -423 81 47 171 82 129 -314 -64 252 314 244 142 66 54 275 199 -183 -123 102 200 144 96
5798I6k48k6L76n6l21j10K86J15k98M86o45J5J06L99n8j26j15K1K80r4m74K00
$$ 96 -152 -178 198 142 -179 -289 -3 112 -186 300 -345 -330 -224 175 117 -9 -124 -103 177 83 -391 -191
5820a91K60j98J7J09l63J61M1L95k90j28R2j10K56r1j51N5N0n8M28J45m77p0K38
$$ -191 69 -129 -112 -3 -366 -205 -164 231 -59 -187 -95 -205 51 -40 -191 -136 -86 -144 284 429 -48 -118 120
5843A20J79j53Q4l10j14K53Q5N0l78K43j96O1L89m76k47K98K88k3k25k6P4rM41
$$ 120 299 146 230 -80 -194 59 144 194 -184 59 -137 -76 313 -163 -410 -112 176 153 -72 -98 -24 -33 408
5866D08m09k93K26j77L28k02L9q6J03N41l94l85j35Q1L11L82M7m81pJ63M8q1L
$$ 408 -1 -294 -68 -245 83 -119 -80 -166 -63 478 84 -301 -436 -355 -44 338 385 -96 -103 60 108 27 30
5889C0n56M68K40n7j71J45m90L19K50j88k06J17K48j72J9L7m88K10Q87o20k3m
$$ 30 -526 -58 182 125 -46 99 -391 -72 178 -10 -216 -99 149 -23 -4 33 -455 -245 642 22 -1 -5
5911ej23o0K94j96r8J44k14M43Q3J18q51J5O87r5j05l16J99l53M81K18m75k29
$$ -5 -128 -188 106 -90 -188 -44 -258 185 268 386 -465 -450 237 142 37 -279 -80 -433 48 266 -209 -438
5933d38K60j6Q5J80k2j51J70R1p5J2O6k20M05R3o68K35o8j23M22j52P4m7j79L53
$$ -438 -178 -194 -109 71 49 -102 68 159 84 96 162 -58 347 440 -228 7 -61 -184 238 86 160 113 -66 287
5957B87k84J6j41K31Q3J54k68o21N09R4j83L81k17m49Q6K90k10R2O7Q6P5N4R9
$$ 287 3 19 -122 109 192 346 78 -543 -34 60 -123 258 41 -408 -322 -32 -242 -150 -83 3 78 132 231
5980B31k85j76R0k16N84k94k03L81K06l13j75J21j61L54j04Ok22j57M54j09k19
$$ 231 -54 -230 -140 -356 228 -66 -269 112 318 5 -170 -49 -210 144 40 46 -176 -333 121 12 -207
6001b07Nj38J82L96J61m25l6k77J88K68r6j17O6L58m82R8J86n41L80K78j40j96
$$ -207 -202 -340 -158 238 399 -26 -62 -339 -151 117 21 -96 -30 328 -154 -56 130 -411 -31 247 107 -89
6023h9K73l38p1L14J04l65j82M58l44M07k03k15q2L17K79k64j16O4j34K22K24
$$ -89 184 -154 -225 89 193 -172 -354 104 -240 167 -36 -251 -333 -16 263 -1 -117 -53 -187 35 259
6044B59m97J64j26J80J63j19k56LK42K65l12j28J18k28N99j4m10k42K57N7L02
$$ 259 -238 -74 -200 -20 143 24 -232 -229 13 278 -34 -162 -44 -272 327 313 -97 -339 -82 -25 277
6065B77j13l10l5K60Oq1L40k61q0J20M08l42k11rj6J7K54O2n36J70L52m19q3K06
$$ 277 164 -146 -181 79 85 4 344 83 3 123 531 189 -22 -31 -47 -30 224 286 -250 -80 272 -147 -230 -24
6089b4j93K46J46p0m87K87K36l88M69l58j78J78J98j62k51J07j91M36L5J39k42
$$ -24 -217 29 175 105 -382 -95 141 -247 222 -136 -314 -136 62 -100 -351 -244 -435 1 36 175 -67
6110f7K27L3j53K60k10k81L76L46m27j13R3j27NQ5L55n51J46R6mJ39k66K5j23
$$ -67 160 193 40 300 90 -191 185 531 104 -9 84 -43 -38 47 402 -149 -3 93 89 228 -38 -13 -136
6133a36L15K94o95K70j68J7J72L02m88k5K50l9J65k63j74LM59k85J33k83NM7J52
$$ -136 179 473 -222 48 -120 -103 69 371 -117 -142 108 69 234 -29 -203 -200 259 -26 107 -176 -171 -124 28
6156B8Q6k81P9J3J32M57Oo08l61M12J09k08K53J24l29M1J88k81Q7M0J04k4J0K1
$$ 28 114 -167 -88 -75 57 514 520 -88 -449 -37 72 -136 117 241 -88 -47 141 -140 -53 -13 91 67 77 98
6180I8l83K40P5K31m9l37L4J82J18k13k98J92L07j10k42J28K9k5L52j15l94j14
$$ 98 -285 -45 30 261 212 -125 -91 91 209 -4 -302 -110 197 87 -155 -27 2 -23 329 214 -180 -294
6202b94j23J89N77l17l31K10K47m38O0L53l04k4J84j31lK43l30N47J85l55n30
$$ -294 -417 -228 349 32 -299 -89 158 -280 -220 133 -171 -195 -11 -142 -145 98 -232 315 500 145 -385
6223c85m0M30k61L47j36l84K52K46J03r7j29J08p8K56j35j3j59J48K43l57J97
$$ -385 -425 5 -256 91 -45 -429 -177 69 172 75 -54 54 -24 232 97 84 -75 73 316 -41 156
6244A56l58j28N76J46l56K09j57k61N50m25J5M0P3K60n57L64l47l51M22M75n54
$$ 156 -202 -330 246 392 36 245 88 -173 377 -48 -33 7 80 340 -217 147 -200 -551 -129 346 -208
6265b08J74n5j04J62L77m92n9J41J55Q6J59k17k65k9O18k46l78K37m13O37q9j71
$$ -208 -34 -89 -193 -31 346 -146 -205 -64 91 177 336 119 -146 -175 443 197 -181 56 -357 280 191 20
6287B0k19K76j63M0J86j63J88l68O08k02k26K43n85M81J36q6l00o1J58J17J19
$$ 20 -199 77 -86 -46 140 -23 165 -203 405 203 -23 220 -365 116 252 166 -134 -195 -37 80 199
6308A99k51j52K69J78j36p8l0J34J06Q2p8n27l5L88j33Q9j35k07K03L27J26l60
$$ 199 -52 -204 65 243 107 29 -1 133 239 321 243 -284 -319 69 -64 25 -110 -317 -114 213 339 -21
6330b1nj6q8K07K95k39k60k03K81J28N0l02J3J92m0J51Pk72k16L29K31j05k84
$$ -21 -26 -42 -130 77 372 133 -127 -330 -49 79 129 -173 -160 32 -8 143 150 -122 -338 -9 222 117 -167
6353a67L82j14M9J83m28n7L20p4RL7l58k52L44M54n32K9J47M5O0n3k85J7L06J08
$$ -167 215 101 150 333 -95 -152 168 94 103 140 -218 -470 -126 328 -204 -175 -28 17 77 24 -261 -244 62 170
6377A70k13j84J00K60j46L27k61l83K38J78n1j02K67n75M0N79M7k05rn00K06K19
$$ 170 -43 -227 -127 133 -13 314 53 -330 -92 86 35 -67 200 -375 -335 244 291 86 77 -423 -217 2
6399BJ32p1n4R7Q4l14M55l96k8L99J7k93L2K1j73K31J00n59K52k1J98lk42R6q4
$$ 2 134 63 9 106 190 -124 331 -65 -93 306 323 30 62 83 -90 141 241 -318 -66 -87 111 108 -134 -38 -122
6424a22N17Ml53o9j40m6J50K99J23m56K36l3q0P3m32M08P2j27J23j70L6j25j43
$$ -122 395 399 46 -23 -163 -209 -59 240 363 -93 143 110 30 103 -329 79 151 24 147 -23 13 -112 -255
6447b55J21j8J05J47j54K2J85q7k13K65L94l72p6j16L27l54K69J58k58r1L65k44
$$ -255 -134 -152 -47 100 -54 -32 153 66 -147 118 512 140 64 -52 275 -79 190 348 90 -1 364 120
6469A20N3j80l23M06L15j92l78Q0Qo3L60j74l04K42J0q4M64k05n77L88K60l54
$$ 120 173 -7 -330 76 391 199 -179 -99 -91 -154 206 32 -272 -30 -20 -104 360 155 -422 -34 226 -128
6491a28q2nm2L72m7N4k47j54J83K41J11l06J01k47M20j78J13J7k21P3k85L20j9
$$ -128 -210 -215 -257 115 68 122 -125 -279 -96 145 256 -50 51 -196 224 46 159 176 -45 28 -257 63 44
6514D4J9K6J51j54Q7k06j89K97O3P1l5k02q3L45K4k01O7j18J30M4m9q0n27N14
$$ 44 63 89 240 86 173 -33 -222 75 138 209 174 -28 -111 234 258 57 124 6 136 180 131 51 -476 38
6538C8p5J29k45J64j72L95r4j69l11K81K20k15pK21n40L16L03j77l33p3L49J5
$$ 38 -37 92 -153 11 -161 234 140 -29 -340 -59 161 -54 -61 160 -380 -64 239 62 -271 -344 5 20
6560B0N7j10P0p5J46jK41l82J52l09N24l32J4n5K23k76J13J32j68K72k09J2J17
$$ 20 77 -33 37 -38 108 107 348 -34 118 -191 333 1 15 -40 183 -93 20 152 -16 256 47 59 176
6583A76m14K16m1L40k59q2J09k66k5L50R7j14j90P0J34pk6o14O56J79O1l04j5
$$ 176 -238 -22 -63 277 18 -64 45 -221 -246 104 201 87 -103 -33 101 94 68 -546 110 289 350 46 31
6606C1p2j24K94k23k46M8N7L05O2j64l12L23n5K61k50m4j31L46N7j49j34k8K62
$$ 31 -41 -165 129 -94 -340 -292 -235 70 132 -32 -344 -21 -76 185 -65 -109 -240 106 163 14 -120 -148 114
6629A14J22j89j02kp5L40j27j55K23j84K26j2j08k02j9J7O2L22Q6j04m35J46J24
$$ 114 236 47 -55 -57 -132 208 81 -74 149 -35 191 179 71 -131 -150 -133 -71 251 337 233 -202 -56 68
6652F8L8l76M46k59J57K52k10j39l5N3mo7j25OP6L70k0k71j49l4J49K26l25J2
$$ 68 106 -270 176 -83 74 326 116 -23 -58 -5 -9 -76 -201 -195 -119 251 231 -40 -189 -223 -74 152 -173 -161
6676a61J60j22K76j88P1k01K01j53K44l33M7J68rM9K4k45K59r9j18L09j65k31
$$ -161 -1 -123 153 -35 36 -165 36 -117 127 -206 -159 9 0 49 73 -172 87 -12 -130 179 14 -217
6698b17J68NL95j75k22j6K44j84J83l62J4L61J21o08J44K45j12N0P1k75L59k17
$$ -217 -49 -44 351 176 -46 -62 182 -2 181 -181 -167 194 315 -293 -149 96 -16 34 105 -170 189 -28
6720b8k03K39O4k41J12L75l16J78J22l46JM7K10m08J80J84k69K64l37K25r8N74
$$ -28 -231 8 72 -169 -57 318 2 180 302 -44 -43 4 214 -194 -14 170 -99 165 -172 53 -45 529
6742E29k40m8N3k21j68J46Q6l52M6l28L00L56j2q1k53L03R5k68K45k82j42K36
$$ 529 289 241 294 73 -95 51 137 -215 -169 -497 -197 159 147 66 -187 116 211 -57 188 -94 -236 0
6764@L0n1j08L10l03J16J72p2l57J26K51p2k17K46j31j7K86l14K64l58j3L30r3
$$ 0 30 -21 -129 181 -122 -6 166 94 -263 -137 114 42 -175 71 -60 -77 209 -105 159 -199 -212 118 25
6787B5K54k80J05j45j64M37l33O4N8M5J24m75L90l76M14k9k00l0L89m5k57K26
$$ 25 279 -1 104 -41 -205 232 -101 -37 21 66 190 -285 105 -271 143 114 -86 -116 273 228 -29 197
6809A97k66J88j73l7O1M1k25m0K55K10j41j71J41J07L8r1on88M83K44L31m75r4
$$ 197 -69 119 -54 -91 -30 11 -214 -254 1 211 70 -101 40 147 185 94 88 -500 -17 227 558 83 -11
6832a1J1j40n0L5j57N9K80M0N0K63p54L99o8N8N9O8l18JL63j11K2k16J05K25j36
$$ -11 0 -140 -190 -155 -312 -253 27 67 117 380 -374 25 -43 15 74 142 -176 -175 188 77 99 -117 -12 213 77
6857G7r5k93L33q2K06k84r0K86J83n03K58L5k23L87j44j97K53l05j61L59N82q07
$$ 77 -18 -311 22 -60 146 -138 -228 58 241 -262 -4 31 -192 195 51 -146 107 -198 -359 0 582 -225
6879b25J46M4J8q8K91o8k18j63L42K71l21J22m66M93P6o6m55k4L18%j13L51m30
$$ -225 -79 -35 -17 -105 186 118 -100 -263 79 350 29 151 -315 178 254 188 -267 -291 27 27 -86 265 -165
6902a65K51k27K57K9P5k67p4K67j17J06k43m4K27O6j90J32k08K15k39Q6k9K9J87
$$ -165 86 -141 116 145 220 -47 -121 146 29 135 -108 -152 75 141 -49 83 -125 90 -149 -63 -92 -63 124
6925A24j03K35l81J25j75K92k7j01o0k59Ll6P66l77j25j14p3N32k52k36o0K33
$$ 124 21 256 -125 0 -175 117 90 -11 -71 -330 -327 -363 403 26 -99 -213 -286 246 -6 -242 -302 -69
6947f9L02l23j03%L82J33k05j05j28j00J50L41j45l83P8K4K3K91q2k83K84K1J48
$$ -69 233 -90 -193 -193 189 322 117 12 -116 -216 -66 275 130 -253 -175 -151 -128 163 81 -202 82 103 251
6970B51l95J8k5K26J69l39K38j97k39M83j79j85K00J14j85k05K88J52j45j63K05
$$ 251 -144 -126 -151 75 244 -95 143 -54 -293 190 11 -174 26 140 -45 -250 38 190 45 -118 87
6991H7K31n70L20l9j46M15m87R8l6J16R1Q9n4j35Q0J72k64l53L95o9q2L83k51
$$ 87 318 -252 68 29 -117 298 -189 -91 -127 -11 80 169 115 -20 60 232 -32 -385 10 -59 -141 242 -9
7014iK0k94j9O5P0K48k71J95M1R1l53J43K27K4j05M1l26K11J32j68K22M9n67K02
$$ -9 11 -283 -302 -237 -167 81 -190 5 46 137 -216 -73 154 178 73 114 -212 -1 131 -37 185 234 -333 -131
7038a31K15k9j4N8L1j55J54J94k90N2O2N4j40l69P0N3L88j3k14Q9j58p5K2M15
$$ -131 84 55 41 99 130 -25 129 323 33 85 147 201 61 -308 -238 -185 203 190 -24 65 -93 -168 -146 269
7062B69l25k32L32P2J78k61J3k67J86M90l94k26L28k58J80k1Q7l74K45J12Q7q3
$$ 269 -56 -288 44 116 294 33 46 -221 -35 455 61 -165 163 -95 85 64 151 -223 22 134 221 138
7084A38j29r0K34Q4j23k34LM32l41J68p7r3M9k28K28l27K59r3j58J86K49l81M69
$$ 138 9 -81 153 237 114 -120 -117 315 -26 142 65 -28 21 -207 21 -306 -47 -140 -298 -112 137 -244 225
7107B25q4j80K3p9r6P7k12K12J89l62K37R5q9L0J81j27k14L61j02M1m18N5K56
$$ 225 141 -39 -16 -95 -191 -114 -326 -114 75 -287 -50 45 -44 -14 167 40 -174 187 85 126 -292 -237 19
7130A9L7K64k86k84L11O9j2m6k05l1J60J3P4k42R6L11k42J34k02j08J95r9K43
$$ 19 56 320 34 -250 61 130 118 72 -133 -164 -4 9 83 -159 -63 248 6 140 -62 -170 25 -74 169
7153A69l08k8J54JJ2J54l34Mj5J77J50N5m41K53J38j28j46K57k01n1m4M16j10
$$ 169 -139 -167 -13 -12 0 154 -180 -176 -191 -14 136 191 -250 3 141 13 -133 124 -77 -128 -172 244 134
7176A34j78m25M29P3J63l94N1J93j21q8l2J92j32K36m4q1j33O1R8L50k60k72K57
$$ 134 -44 -469 -40 33 196 -198 -147 46 -75 -163 -195 -3 -135 101 57 -24 -157 -96 2 352 92 -180 77
7199G7p1M45o98JQ9J14R3J29k26j17k3J70K42j71Q3l56J65J42Qo5J14j67K9J70
$$ 77 6 451 -247 -246 -157 -43 50 179 -47 -164 -187 -17 225 54 137 -219 -54 88 96 31 145 -22 7 177
7223A77j39J39l87L63Om15J25M9K34o4j07O0Pj16J4J90j67j48Q4j40K90J16l81
$$ 177 38 177 -210 153 159 -256 -131 -82 152 88 -19 41 48 -68 -54 136 -31 -179 -95 -235 55 171 -210
7246b10K75n3N9K8k36K2j8J17K42p8o9p9k62L78Q0k01l82K72L52j39l31l3M00
$$ -210 65 12 71 99 -137 -115 -133 -16 226 148 79 0 -262 116 196 -5 -387 -115 237 98 -233 -266 134
7269A34j42J13Nl82l1L62j48l1K60m03j65N10P7L6q3j38J96P9k93M1o6kK65r1
$$ 134 -8 105 110 -272 -303 59 -89 -120 140 -263 -428 82 159 195 112 -26 170 249 -44 -3 -69 -71 194 103
7293A03l6J18k96L15j70j98K75j42K20K30m66J22l15J01K30j44J31k09j45J30
$$ 103 67 185 -111 204 34 -164 111 -31 189 419 -47 75 -240 -139 91 -53 78 -131 -276 -146
7313a46K29k9P1J72l73K84J2k06l4k12N57m57J85o7n1J14J4j85Q7l12K52L53l9
$$ -146 83 54 125 297 -76 208 220 14 -20 -232 325 -132 53 -14 -65 49 63 -122 -35 -347 -95 258 219
7336B19j76k63L69j74R8O2q4k90N1N92m19j66M3L32n33M71J02m07J16Mn1p8J79
$$ 219 43 -220 149 -25 73 135 51 -239 -188 404 -15 -181 -138 194 -339 132 234 -173 -57 -53 -104 -182 -3
7359cqP1K77j12l17j39L13J3p4O8k17K50j54P3k08J90k2q8K44Nk73j8J51j71K12
$$ -3 -11 60 337 225 -92 -231 82 95 21 89 -128 122 -32 41 -167 23 1 -87 157 162 -111 -129 22 -149 63
7384F3j06J1J36j90J14l04N18j34k69M43j14r4k95J32j58K36k0O8j95q7L91l03
$$ 63 -43 -32 104 -86 28 -276 242 108 -161 282 168 74 -221 -89 -247 -11 -31 37 -158 -245 146 -157
7406a57J16n6j28R3J13L1l82M90j13P4P0kk62n4J18J58k19K68l22L01J30l76Q4
$$ -157 -41 -97 -225 -132 -19 12 -370 120 7 81 151 149 -113 -167 -49 109 -110 158 -164 137 267 -109 -25
7429b5N7r6J62k62L27M7l77O01n25J75j60r0k9N22j92l15J51j43l7K77J3l13L37
$$ -25 32 -64 98 -164 163 210 -167 434 -91 84 -76 -166 -195 327 135 -180 -29 -172 -209 68 81 -232 105
7452A05j85K63j36qk8J03r1K04l55j26L80k00J80K3l10%J56m2j34nJ92p0J03P0
$$ 105 -80 183 47 39 11 114 23 227 -128 -254 126 -74 106 129 -181 -181 -25 -67 -201 -206 -14 -84 19 89
7476H9m2mr8J08j73L41m04J36J4P4k63J88r2k1k7K62l94M37j65J64K42l38k91
$$ 89 47 43 -55 53 -120 221 -183 -47 -33 41 -222 -34 -126 -147 -174 88 -306 131 -34 130 372 34 -257
7499b57K34QJ76J36m36K1p2nN21o25K02r3j67K53M22o12M2L65k40L82l37K16j66
$$ -257 -23 -15 161 297 -139 -118 -190 -195 326 -299 -97 -190 -357 -104 318 -294 -252 113 -127 255 -82 134 -32
7522c2p7K03N4j21j29L19m0j12r7o5J54J20R7n75K80J60m59L51L8K00p3j04R8
$$ -32 -109 94 148 27 -102 217 177 65 -32 -97 57 177 274 -301 -21 139 -320 31 69 269 196 92 190
7545A90Qk68m8q3J39L41k80J17j71o6K45M2l77m8M22l97K04L90k79m25K93P0N7
$$ 190 198 -70 -118 -201 -62 279 -1 116 -55 -121 124 166 -211 -259 163 -234 -30 360 81 -344 -51 19 76
7568G6k62q7J22K52k09k12O6J03j02K77j52n9j28K17J79N8j31j28J68q1K28J1
$$ 76 -186 -273 -151 101 -108 -320 -254 -151 -253 24 -128 -187 -315 -98 81 139 8 -120 48 -33 195 206
7590B06r4K2L8p0k63J79l58R3N28l77k46L92l4J54J60l84L5o0n8k48L56j05q9
$$ 206 112 134 172 102 -161 18 -340 -247 281 -96 -342 50 16 170 330 -54 -19 -79 -137 -385 -29 -134 -223
7613b23M18Q0m44J88K7K2l3Q6k75q0J53J85j35K06k39j49J15J9R6j82%J60l3L57
$$ -223 195 275 -169 19 46 68 35 121 -154 -234 -81 104 -31 175 -64 -213 -98 -79 17 -165 -165 -5 -38 319
7637C19m53RK44m1l31M08k84r0L82q9J4j72J9J94k43K89j51j37J35J83l44N2k45
$$ 319 -134 -125 119 78 -253 155 -129 -219 163 74 88 -84 -65 129 -114 175 24 -113 22 205 -139 -87 -332
7660c32M66r7J7K6m3M9P6l07N96j81m77K66J8k4K66l5k06o5j25R4k13K28J85m00
$$ -332 134 37 54 80 37 86 162 -145 451 270 -207 59 77 53 319 284 78 13 -112 -18 -231 -3 182 -218
7684b18K85o3q2J16J01k7m8lj61nK7M21l84m8O5K31j75j40J44p6K16p6J51l5n45
$$ -218 67 4 -78 38 139 112 64 61 -100 -105 -78 343 -41 -89 -24 207 32 -108 36 -40 176 100 251 216 -329
7709c29K48L68j83k01J70Kl74J69K54l18J50l2PJ32J44j80m48K86K39j7j36L37
$$ -329 -81 287 104 -97 73 75 -299 -130 124 -194 -44 -76 -69 63 207 27 -421 -135 104 87 -49 288
7731B88m33J26K41m26R0J00r3%J61p4o1J37J00j45k41M58k99M44j46j56k55P1
$$ 288 -145 -19 222 -204 -114 -14 -107 -107 54 -20 -81 56 156 11 -230 228 -71 373 227 71 -184 -113
7753a13L78j59r4n3N8k09P4K43l14J81j34k5K71j54J46J18l60L9J9J52m1j98K11
$$ -113 265 106 12 -41 17 -192 -118 125 -189 -8 -142 -167 104 -50 96 214 -146 -107 -88 64 23 -175 36
7776C6q6L32k60j2N3J60m5j19l8N3j09J83l20L05k35q9L69k51L4o8J34J60l9j28
$$ 36 -50 282 22 10 63 223 178 59 21 74 -35 148 -172 133 -102 -191 178 -73 -39 -107 27 187 148 20
7800B0l26J7K61J67j42O0j57J39j20K98l69J86J35Ok26j23K24p0J61j77N6o4L4
$$ 20 -306 -289 -28 139 -3 57 -100 39 -81 217 -152 34 169 175 -51 -174 50 -20 141 -36 20 -44 -10
7823a0K4M9O1j5m42P6J13M08l19J23r4q5j00K53M88p35J58M7j03J08K36l62P7
$$ -10 14 63 124 109 -333 -257 -144 264 -55 68 -26 -111 -211 42 530 -205 -47 0 -103 5 241 -121 -44
7846d4J75l42J67K90l09QK96m66J28O0J89m0j78j59n5K41K10j5m73l5N4K55NJ20
$$ -44 131 -211 -44 246 -63 -55 241 -225 -97 -37 152 112 -66 -225 -280 -39 171 156 -317 -352 -298 -43 -38 82
7870H2p2L7K31m24J07j94J78J11O8O5m01l0N34m66K46j19j90K84Q3j24p0L67j40
$$ 82 10 47 278 -146 -39 -233 -55 56 124 189 -212 -242 292 -174 72 -47 -237 47 130 6 -64 303 163
7893A63j46N4J69n23L6N1nJ19L02Pl12%K87j79m9J02J08j68J86n41m3K31J43k11
$$ 163 17 71 240 -283 -247 -196 -201 -82 220 227 -85 -85 202 23 -26 76 184 16 202 -339 -382 -151 -8 -219
7917b19M34j18l02K23p9rL68r7m85K87J12p9j36R7j13N38j36n35J75J30k6J38
$$ -219 215 97 -205 18 -61 -70 298 201 -284 3 115 36 -100 -3 -116 422 286 -249 -74 56 30 168
7939A68Q1j64l04L61J8l50L95o2o6J47n1l36j0K16J25r6m4l8O7o6J01M7k56p5
$$ 168 249 85 -219 142 160 -190 205 143 77 224 173 -163 -173 43 168 72 28 -10 57 -9 92 139 -117 -192
7963a92J26p2J95j0k02k0K99jk32m1J49J01J24l1n22J77L07q0q8q2k53J29K86
$$ -192 -66 -138 57 47 -155 -175 124 123 -109 -150 -1 100 224 193 -329 -152 155 75 -13 -95 -348 -219 67
7986F7J23l52L84l48M3M0K30j26l6n5m4K89K6o03K42J48L10m73K05J7l69M37K
$$ 67 190 -162 222 -126 -83 -43 187 61 25 -30 -74 215 241 -362 -120 28 338 -135 70 87 -282 155 157
8009A57o01J97K32L0J73j43q7k71L08n6o8O2K08l04K74r2P1n0q1M3J2K70m71m7
$$ 157 -444 -247 -15 15 188 45 -42 -313 -5 -61 -129 -67 141 -163 111 19 90 40 -41 2 14 284 -187 -234
8033b34J50K9P7K31p0l20N75l30j13k79O5L45m62O00k49Q9p1O7K9j64nj6qJ56
$$ -234 -84 -55 22 253 183 -137 438 108 -5 -284 -219 126 -336 264 15 104 33 100 129 -35 -40 -56 -64 92
8057I2J81J4o29J95J28J7j99J9J68j08L20k48n3J10qQ8j65p6J02j30M13m69m1
$$ 92 273 287 -342 -147 -19 -2 -201 -182 -14 -122 198 -50 -103 7 -1 87 -78 -154 -52 -182 231 -238 -279
8080b79l9J38M54m16R7p1p0K5N01l70k05L46M5j2J00k00q6k32N13k72j27J83j64
$$ -279 -318 -180 274 -142 -45 -116 -186 -161 340 -30 -235 111 156 144 244 44 -42 -274 239 -33 -160 23 -141
8103a41J94K65j51m44L5P0J24J47j98L08k96o8N15j06p4j91m4j72M92l76L63j78
$$ -141 53 318 167 -277 -242 -172 -48 99 -99 209 -87 -155 360 254 180 -11 -55 -227 265 -111 252 74
8125G4l9m5J37k31Q2n0j2J66k67K75k1l22K08j48L3K58m6k8r8K48o5j60m0k71
$$ 74 35 -10 127 -104 -22 -72 -84 82 -185 90 69 -253 -45 -193 -160 98 52 24 -74 174 109 -51 -91 -362
8149c62K28J59k9j47L90k41r4L23l23J71k1L48m04P1L50o73K31j2K2J40k4L9r7
$$ -362 -134 25 -4 -151 239 -2 -96 227 -96 75 54 402 -2 69 419 -254 -23 -35 -13 127 103 142 45
8172D5k77K28R6J3Rk11K0j39K18l74J44J99j89L51k33k7k7J30J05
$$ 45 -232 -4 92 105 114 -97 -77 -216 2 -372 -228 -29 -218 133 -100 -127 -154 -24 81
8191H1
$$ Imaginary data points
##PAGE= N=2
##DATA TABLE= (X++(I..I)), XYDATA
0@%%%%qQqJ6j6J6k4L2m0M8n6P2q8J04j23J47j71J97k29K65l04L47l96M52n10N75
$$ 0 0 0 0 0 -8 0 -8 8 -8 8 -16 16 -24 24 -32 40 -48 56 -67 80 -91 106 -123 142 -162 185 -211 241 -269 306
30C06o50P29q16R13j021J135j259J399j554J722j904K107k335K586k865L179l535
$$ 306 -344 385 -431 482 -539 596 -663 736 -818 904 -1000 1107 -1228 1358 -1507 1672 -1863
47a863L938m401M943n580O346p291Q488j0052J2195j5333K0376k9756N2875k07616
$$ -1863 2075 -2326 2617 -2963 3383 -3908 4580 -5472 6723 -8610 11766 -17990 34885 -172731
61a72731l22099N32473K44283l52112k08872L01635J52099k43499j80636K14474
$$ -172731 -494830 37643 281926 -70186 -279058 22577 174676 -68823 -249459 -34985
71c4985K14325j39995k32075J10139K33393n2059k11771K0748J97472N0785k06732
$$ -34985 179340 39345 -192730 -82591 150802 98743 -113028 -92280 105192 155977 -50755
82e0755j73740J56318K76938p5272k84148J7318K07499n8674j62370J12435J99063
$$ -50755 -224495 -68177 208761 133489 -150659 -133341 74158 15484 -146886 -34451 164612
93A64612o6114k09969k1160K02138J13358j69657j54178J65075J78814j62639
$$ 164612 98498 -111471 -132631 69507 182865 13208 -140970 24105 202919 40280
103D0280k01380J31950K15253o4476k05857k0077J40044J5352j31257K0432J73102
$$ 40280 -161100 -29150 186103 121627 -84230 -104307 35737 51089 -80168 -59736 113366
114A13366m7690k36341K0910K45329L7927j61855n5930N6389L8664R382k5792
$$ 113366 65676 -170665 -149755 95574 133501 -28354 -84284 -27895 10769 20151 -5641
125e641k1145N7563L9976q0741o7310M7593N5041j0670k2264R580J3531n0947
$$ -5641 -26786 30777 70753 -9988 -77298 -29705 25336 14666 -7598 1982 15513 -35434
137c5434p9671O1903J58392k4307j75104q616J42766L6341n4437j6021o245j1406
$$ -35434 -115105 -53202 105190 80883 -94221 -102837 39929 76270 21833 5812 -433 -11839
149a1839J0583K914J5611N0017r398o4612M054K9019m8153l1562N7762N0289j0911
$$ -11839 -1256 1658 17269 67286 57888 -6724 -2670 26349 -21804 -53366 4396 54685 43774
162D3774m9829o4027O428R4104L5960o7461m6171J3906L1010L2927l407l9811
$$ 43774 -6055 -70082 -63654 30450 66410 -1051 -47222 -33316 -2306 30621 27214 -12597
174a2597K440P307n0104J1536R9484j0391j05725K0877Q5971m8116r6514K2887
$$ -12597 -10157 -2850 -52954 -41418 58066 47675 -58050 -37173 48798 682 -95832 -72945
186g2945R2492L8789m9103p1605P611O1457Q255j4118K3500j3951n6682J3479
$$ -72945 19547 58336 9233 -62372 -54761 6696 14951 833 24333 10382 -46300 -32821
198c2821O0222J5043j1555l0235m5485L4156Q2236l1090q6012L1667O9271l2465
$$ -32821 27401 42444 30889 654 -44831 -10675 71561 40471 -45541 -13874 55397 22932
210B2932n9735M630M4854L8010j3062m5594M199J8639m3654k904R6867J9602j12563
$$ 22932 -36803 -32173 12681 50691 37629 -7965 -3766 14873 -28781 -31685 65182 84784 -27779
223b7779n1228P3651O3548k0300o3258k1552N6029K7693n9897j5276O4176r006
$$ -27779 -79007 -5356 58192 37892 -25366 -46918 9111 36804 -23093 -38369 25807 16801
235A6801o8847J8894N0772k4987k5127K9031K7447K608l6718o1365J8884R8302
$$ 16801 -52046 -33152 17620 -7367 -32494 -3463 23984 26592 -10126 -71491 -52607 45695
247D5695J6155q0380l2465L4611K5878K550j0161k406J6467j9714m3019M3722
$$ 45695 61850 -18530 -50995 -16384 9494 12044 1883 -523 15944 -3770 -46789 -3067
259c067O8854n7987p5319O6628P3252n7779o2231L7264O1267Q67o0685m4617M1373
$$ -3067 65787 7800 -67519 -891 72361 14582 -47649 -10385 50882 51749 -8936 -53553 -12180
272a2180N1208k7771j5494M4083k0185q0645J3239Q5635J8017n3973m6349R678
$$ -12180 39028 11257 -4237 39846 19661 -60984 -47745 37890 55907 1934 -44415 -34737
284c4737N8015J2108o5381j4110O9142Q145n9837k474L9214J152j5311q644j941
$$ -34737 23278 35386 -29995 -44105 25037 33182 -26655 -29129 10085 11237 -4074 -12718 -14659
297a4659J3289j2765l3821M6127Q2545n0800j15863J6740R9039J5607n1409j9167
$$ -14659 -1370 -14135 -47956 -1829 80716 29916 -85947 -69207 29832 45439 -5970 -25137
309b5137K9405K4367l3486l3563N2343M7025o4939m5666P3080L6713p0193k9352
$$ -25137 4268 28635 -4851 -38414 13929 60954 -3985 -49651 23429 60142 -10051 -39403
321c9403N7728L4091l4808n9318r285P5557N4340n7033n7775K8572J6904k9921
$$ -39403 18325 52416 17608 -41710 -50995 24562 78902 21869 -35906 -7334 9570 -20351
333b0351R998M2679L133l5272l4544J1099O1729Q597q0710j7709Q3171R973q4843
$$ -20351 -10353 32326 35459 187 -34357 -23258 38471 47068 -33642 -51351 31820 41793 -43050
346d3050j5897P3334L6961m1731n7091J913N3227L256m5075K6817N9231n5294
$$ -43050 -58947 14387 51348 9617 -47474 -45561 7666 10922 -34153 -7336 51895 -3399
358c399q2710N4426R5078k0331p7130j5730M9411L7198l2757m2330M2808N2456
$$ -3399 -86109 -31683 63395 43064 -34066 -49796 -385 36813 4056 -38274 4534 56990
370E6990n1768o1471L8308M5108k0288j4704K1244J3149j7667m1156p352P2516
$$ 56990 5222 -56249 -17941 27167 6879 -7825 13419 26568 8901 -32255 -39607 32909
382C2909M2110q0705o4406O3929O4501l0289l9239J0933J8356j2861l5029M508
$$ 32909 75019 -5686 -70092 -6163 58338 28049 -11190 -257 18099 5238 -29791 -25283
394b5283O2159J1655p0803j2182O4254r757p1828J4151P4193Q717n5930m0297
$$ -25283 36876 48531 -22272 -34454 29800 20043 -51785 -37634 36559 45276 -10654 -50951
406e0951K3036N6523K109n0218k671L1974k1691k2108M6176L0906l8526l3335
$$ -50951 -27915 28608 30717 -19501 -22172 9802 -11889 -33997 12179 43085 4559 -28776
418b8776N794J8506J7556r755k3727K3237L3633l4909m2839K5852L6672j532j1599
$$ -28776 -22982 -4476 13080 3325 -20402 2835 36468 1559 -41280 -15428 21244 19712 8113
431H113j2865r747J3617J1029k011J6837k0m9931j3545N6060K2951l2146j3749
$$ 8113 -4752 -14499 -882 10147 8136 24973 24953 -24978 -38523 17537 40488 8342 -5407
444e407Q275j505m38l617p007J5922J2539k0109q243J1015j1964p42L3028k783
$$ -5407 2868 1363 925 -2692 -9699 6223 18762 -1347 -9590 1425 -10539 -11281 21747 18964
458A8964m1534n692K0418O304J4557J0496k8750k6286J0113J6753J2702M057k2797
$$ 18964 -22570 -28262 -7844 -1540 13017 23513 -5237 -31523 -21410 -4657 8045 12102 -10695
471a0695r239K7259Q52l0561R690K7676j1701j4869R423k996l040J8692O527p638
$$ -10695 -19934 7325 8177 -22384 -12694 14982 3281 -11588 -2165 -5161 -8201 10491 17018 9380
485I380o038k2651j2634M0562L5199k6084k9508M549Q306Q752N479j5179m091
$$ 9380 3342 -19309 -31943 8619 43818 17734 -11774 -7225 1081 9833 15312 133 -3958
498c958J8730r238j9780K2992J8780k6219r655K2360m752k5560k139K2030K8212
$$ -3958 14772 5534 -14246 8746 27526 1307 -8348 14012 9260 -16300 -18439 3591 31803
511C1803l795m9600k1396M5450K3356l0573n042J9774j6437j9302K0973K1697
$$ 31803 28008 -21592 -42988 2462 25818 -4755 -9797 9977 -6460 -25762 -4789 16908
523A6908o577k0679j6392J5347K8328j4819k8441K5812K9934k7089l0612Q544
$$ 16908 10331 -10348 -26740 -11393 16935 2116 -26325 -513 29421 2332 -28280 -19736
535a9736J6139J2796P647j5929j2361R039l211m522L0210J1223m2502k1164L1454
$$ -19736 -3597 9199 16846 917 -11444 -2405 -5616 -10138 20072 31295 -11207 -32371 -917
548i17K5160n554j6689j1892J3582J6047k2367j6747L2676J7039l1128j0396J6469
$$ -917 24243 18689 2000 -9892 3690 19737 -2630 -19377 13299 30338 -790 -11186 5283
561E283q708j1986J9501J8630m280k3393k6189J3099M4491o03m1942n369K0511
$$ 5283 -3425 -15411 4090 22720 18440 -4953 -31142 -18043 26448 25845 -16097 -21466 -955
574i55k975p94J3484l358j1235J94m330q8J3780m989j2360J7608J1176k7127j5861
$$ -955 -3930 -4724 8760 5402 -5833 -5639 -9969 -10057 3723 -1266 -13626 3982 15158 -11969 -27830
589b7830K0445K1838P246j3511l1436j612L3226P799j4496P762l44k7006L195
$$ -27830 -7385 14453 21699 8188 -23248 -24860 8366 16165 1669 9431 9087 -17919 -14724
602a4724L2626N083j8924q840K163J0590M415j9071m681K9084O889k9122q096
$$ -14724 17902 22985 4061 -4779 -2616 7974 12389 -6682 -11363 17721 24610 -4512 -12608
615a2608J2729J622R024J2458j6971k3077P18P016J3986K0731j2801l3486K115
$$ -12608 121 1743 10767 23225 6254 -16823 -16105 -9089 4897 25628 12827 -20659 -18544
628a8544K2541J349n489l372p752N283J0954j3865q826K0915P544j4238Q74k87
$$ -18544 3997 5346 -143 -3515 -11267 -5984 4970 -8895 -17721 3194 10738 -3500 -2626 -2913
642b913j6172M961K6173N710j4767j8991j2217K0591L4648p541k8601J179N603
$$ -2913 -19085 -14124 12049 17759 2992 -15999 -28216 -7625 27023 19482 -9119 -7940 -2337
655b337o256J1743J3291j3493p783J1429n16o080L934j447J927J5428n516k5360
$$ -2337 -8593 3150 16441 2948 -4835 6594 6078 -2 3932 2485 4412 19840 14324 -11036
669a1036k585J5587J0249O945j0631l0088M15L2083P973j1801j958j1300j7361
$$ -11036 -13621 1966 12215 19160 8529 -21559 -21144 10939 18912 7111 5153 -6147 -23508
682b3508J2860K0359l845p933O45l83N099M16j7990j272K6023K951k2521o813
$$ -23508 -10648 9711 5866 -2067 -1422 -1805 3294 3710 -14280 -15552 10471 13422 -9099 -15912
696a5912M748L282J6858Q850k1806j7384N670J0136J4796J1613j8957k2820J0559
$$ -15912 -11164 -7882 8976 17826 -3980 -21364 -15694 -5558 9238 20851 1894 -20926 -10367
709a0367J6276M34L020j921r585Q826J0176j8512j1286J7972R602p104k195q402
$$ -10367 5909 6343 9363 7442 -2143 6683 16859 -1653 -12939 5033 14635 7531 5336 -3066
723c066j0693J1822J8838l7j1550j7928j2164K1887K8581j2179k3770L235M688
$$ -3066 -13759 -1937 16901 16864 5314 -12614 -24778 -2891 25690 13511 -10259 -7024 -2336
736b336j201J2154L473j6008j579R907o119o761K651j746N276J3403r716k2189
$$ -2336 -3537 8617 12090 -3918 -5497 4410 -1709 -8470 -5819 -7565 -2289 11114 1398 -20791
750b0791J109J4729J1605P966j3779k8319N350K8078N347o965k38q626m939J6536
$$ -20791 -19682 -4953 6652 14618 839 -27480 -22130 5948 11295 4330 4092 -4534 -9473 7063
764G063Q409j0646n081p12k411Q214K052j5695L564K4933l19k2750r346N80P652
$$ 7063 15472 4826 -255 -967 -3378 4836 6888 -8807 -5243 19690 19371 -3379 -12725 -12145 -4493
779d493J9918N528k0254j1743M909P801J4116M199k0099j2757J3004Q800k130
$$ -4493 15425 20953 699 -11044 -6135 1666 15782 19981 -118 -12875 129 8929 6799
792F799M78r528j0787J3063P453j8721n971J9500O696p854n191j1688o328J4979
$$ 6799 7277 -2251 -13038 25 7478 -11243 -17214 2286 8982 1128 -4063 -15751 -22079 -7100
806g100J5858M18p000j4483p121K2427K0505j5461j8802L186L522L255R424m662
$$ -7100 8758 9176 2176 -12307 -19428 2999 23504 8043 -10759 -7573 -4051 -796 8628 3966
820C966j1338P263O174q531j832L245l951P930J2091j2812j7882N956J4619J0928
$$ 3966 -7372 -109 6065 -2466 -4298 -1053 -5004 2926 15017 2205 -15677 -9721 4898 15826
834A5826O291j5928k2174Q850K2211P86p768n887r637O45J2900R31p091r8l238
$$ 15826 22117 6189 -15985 -7135 15076 15862 8094 2207 -7430 -6785 6115 7046 -45 -143 -3381
849c381j808R819m073j8480O849K3108m042j7104l331K461R022J6586j795k0225
$$ -3381 -5189 4630 557 -17923 -11074 12034 7992 -9112 -12443 -9982 -960 15626 13831 -6394
863f394p882M578P601J3228J009j8979p739J1319N251J82J083q739l023J4374
$$ -6394 -14276 -9698 -2097 11131 12140 -6839 -14578 -3259 1992 2174 3257 -5482 -8505 5869
877E869M04j7443O13J5451L104j530o75j1630j723J6980R228o622r221j3481l506
$$ 5869 6273 -11170 -10557 4894 7998 6468 5793 -5837 -7560 9420 18648 12026 2805 -10676 -14182
892a4182K1183J5152j3750j3404K006Q26L509N042p643o394Q410K196n997Q11
$$ -14182 7001 22153 8403 -5001 -2995 -2169 1340 6382 -1261 -7655 755 2951 -3046 -2235
906b235m26l157J2150P994j7547j2552R007Q908N814L886j5518j8293J0644J8860
$$ -2235 -2661 -5818 6332 14326 -3221 -15773 -6766 2142 7956 11842 -3676 -21969 -11325 7535
920G535K28n815n814p585L562J0279j906l526J579k283J484Q592o159j1634J2269
$$ 7535 7763 1948 -3866 -11451 -7889 2390 484 -3042 -1463 -3746 -2262 6330 171 -11463 806
935H06J5334q012j0934k539k059Q785J5622n722j6480k879N483O711J0543k962
$$ 806 16140 8128 -2806 -5345 -7404 1381 17003 11281 -5199 -8078 -2595 4116 14659 11697
949A1697j7314l324R423J693R29J473o097k71J0142l012j2521K445Q334J260J028
$$ 11697 -5617 -8941 482 2175 3104 4577 -1520 -1791 8351 5339 -7182 -4737 3597 4857 5885
964E885o685j3534L629J6882K889n792m162j1893k421J9323Q955j4047q749L024
$$ 5885 -800 -14334 -10705 6177 9066 3274 -888 -12781 -15202 4121 13076 -971 -9720 -6696
978f696J517N637M023o048l043O551l71l878J07k625L85J2765J847j6017n017
$$ -6696 -5179 458 4481 -1567 -4610 1941 1570 -2308 -2201 -4826 -4441 8324 10171 -5846 -10863
993a0863Q600N167P036L998j5444j2651J1348J2543j265l213n625n968O554Q100
$$ -10863 -2263 2904 9940 13938 -1506 -14157 -2809 9734 8469 5256 -369 -6337 217 8317
1007H317m559k707K418l460o41M695o511o859J0859R239p028o621m157j542J1348
$$ 8317 3758 1051 3469 9 -632 4063 -2448 -9307 1552 10791 3763 -2858 -7015 -8557 2791
1022B791J0424r256j2431O4K191N669J0296m525j4076J349Q159j730%J427n621
$$ 2791 13215 3959 -8472 -8408 -6217 -548 9748 5223 -8853 -7504 655 -1075 -1075 352 -5269
1037e269P18P725l844q303M325O838K990J184p982j0502P744J3479q13l341l403
$$ -5269 -4551 3174 -670 -8973 -4648 2190 5180 6364 -1618 -12120 -4376 9103 8290 4949 1546
1052A546r809J381J6588L184j1999l497J618k42M887J833p311J2O122k538l479
$$ 1546 -8263 -6882 9706 12890 891 -2606 -988 -1230 3657 5490 -1821 -1809 4313 1775 -1704
1067a704J351j368J856J0231k089j4104j739O092L707N696r1j3550n161J0109
$$ -1704 -353 -1721 135 10366 8277 -5827 -7566 -1474 2233 7929 7838 -5712 -10873 -764
1081g64N864k133j473o614m840P602M338n826L02M451l252L45L223n953k452J1042
$$ -764 5100 2967 1494 -5120 -9960 -2358 1980 -3846 -3544 907 -2345 -2000 1223 -4730 -7182 3860
1097C860M498p050m675k931J297J1159N575r907o877J662N19N668O658p468r530
$$ 3860 8358 1308 -3367 -6298 -5001 6158 11733 1826 -5051 -3389 -2870 2798 9456 1988 -7542
1112g542N437N270k474J586J361m854K717M660o008m899N618M462J080M50q761
$$ -7542 -2105 3165 691 2277 3638 -1216 1501 6161 153 -4746 872 5334 6414 6864 -1897
1127a897p040Q303Q507l135l302l411o506L449J0930k058q446j45j27J013N183
$$ -1897 -8937 -634 7873 4738 1436 -1975 -8481 -5032 5898 3840 -4606 -4751 -4878 -3865 1318
1142A318n3n213L132M605n400k882K533j398L901P285m879j0076J837N068K338
$$ 1318 1265 -3948 -816 3789 -1611 -4493 -1960 -3358 543 7828 2949 -7127 -5290 -222 2116
1157B116M079l287j1124M20R322K286r07j03n608j188P213J31n160L603L382l831
$$ 2116 6195 2908 -8216 -7796 1526 3812 2905 2802 -2806 -3994 3219 3350 -1810 1793 5175 1344
1173A344J220Q67n968P98Q958k34o702k964k060K512R549L11j0171l227J749P38
$$ 1344 2564 3431 -2537 -1739 7219 6985 283 -2681 -4741 -2229 7320 7631 -2540 -5767 -4018 -3280
1189c280N086L962p128m096N388N90k557K192l60k649M023J331o631r54N770J148
$$ -3280 1806 5768 -1360 -5456 -68 522 -2035 157 -203 -2852 1171 2502 -4129 -5083 687 1835
1205A835J35j178p608j993R707M840m226j823k631m327O111P403l846l895K175
$$ 1835 1970 792 -6816 -8809 898 5738 1512 -311 -2942 -7269 -1158 6245 2399 -1496 679
1220F79r37N01L722k169l391N110J518n570p38K320j004L747L532p502o293M374
$$ 679 -258 243 3965 1796 -1595 3515 5033 -537 -1275 1045 41 3788 7320 -182 -6475 -2101
1236b101M462J367K257m604q321L127O529l62m24j009m117J288N125l344l962
$$ -2101 2361 3728 5985 1381 -6940 -3813 2716 2354 1930 921 -3196 -1908 3217 -127 -4089
1251d089M365J381l630L31j17l414L910O111k952n098j813j455M169Q287k787
$$ -4089 276 1657 -1973 -1642 -1759 -5173 -1263 4848 1896 -3202 -5015 -6470 -2301 5986 3199
1266C199p678L25K833N53L758Q60o329n42M705r73j850L303l30j622L122j692
$$ 3199 -4479 -4154 -1321 -768 2990 3850 -2479 -3021 1684 711 -1139 2164 1834 212 3334 1642
1282A642n774K200N461M75J44k620o516J036Q941K84m090q58k577j309O144K997
$$ 1642 -4132 -1932 3529 4004 4148 1528 -4988 -3952 4989 5273 1183 325 -2252 -3561 2583 5580
1298E580n000k158J181j779J102K344l468J72N487j275o378M73K016J97L959Q62
$$ 5580 580 -1578 -397 -2176 -1074 1270 -2198 -2026 3461 2186 -4192 -3719 -1703 -1506 2453 3315
1314C315p647k842N107L050J471J065n666m543N290L591j517P05j421k860K613
$$ 3315 -4332 -7174 -2067 983 2454 3519 -2147 -6690 -1400 2191 674 1379 -42 -2902 -289
1329b89L224m126j018N707L2l166J94j988j969O281L690m387l537j131J08M708
$$ -289 2935 -1191 -2209 3498 3530 364 558 -1430 -3399 2882 6572 2185 -1352 -2483 -2375 2333
1345B333N251n015n817J600J070R43K984j323m950J974L195l167r75K450k40j9
$$ 2333 7584 2569 -3248 -1648 -578 365 3349 2026 -2924 -950 2245 -922 -1897 553 313 294
1361B94J858m004m450L948M127k78K60l210n598L459P875j209m395r20j968J028
$$ 294 2152 -1852 -6302 -2354 1773 1495 1755 -1455 -7053 -3594 4281 3072 -1323 -2243 -4211 -3183
1377c183N438M23l879Q14J253k316J676L30k661K097M416k704m636J349J130J765
$$ -3183 2255 2678 -1201 -387 866 -1450 226 556 -2105 -8 4408 1704 -2932 -1583 -453 1312
1393A312M512j622p576k52N079J383N76k87n048j461M841J619j692P47k334k152
$$ 1312 5824 4202 -3374 -3626 1453 2836 3412 3125 -1923 -3384 1457 3076 1384 2131 -203 -2355
1409b355L243N47m983P68N228j21k226j370k653L28O268Q08m610j711k18m49N329
$$ -2355 888 1435 -3548 -2780 2448 2327 101 -1269 -3922 -3594 2674 3482 -1128 -2839 -3057 -3506 1823
1426A823L004n817l945K790J447J516J507l046k245L137R87m012L89K699M55J937
$$ 1823 4827 -990 -4935 -2145 -698 818 2325 -721 -2966 171 1158 -2854 -2465 234 689 2626
1442B626Q17m953j963M508J813k36m8m098l206N165N415k379l158q06j371J597
$$ 2626 3443 -1510 -3473 1035 2848 2612 2564 -1534 -4740 425 5840 3461 303 -503 -1874 -277
1458b77L172j783k626J602O88j038J040p36k587L105L279m044l185J511R23K637
$$ -277 2895 1112 -1514 88 776 -262 778 42 -2545 560 3839 -205 -3390 -1879 -956 1681
1474A681K833l973n845J743L985M95J114j406m242L70L632k80j699K60r67Q24
$$ 1681 4514 541 -5304 -3561 424 919 2033 627 -3615 -3245 387 107 -1592 -1332 -2299 -1475
1490a475L968j157l815J796L625j852j599p65k123K861O031r70m115j494j533
$$ -1475 2493 1336 -2479 -683 2942 1090 -509 -1274 -3397 -536 5495 4525 410 -1084 -2617
1505b617J214M961J61n343p00K797L49N60L99l349j51L537K00k410J60J035l87
$$ -2617 -1403 3558 3719 -1624 -2324 473 822 1382 1781 -1568 -1719 1818 2018 -392 -232 803 416
1522D16K074j198m681R4M683J323n00j054m715j867N202K427l066j105j04n40
$$ 416 2490 1292 -3389 -3295 1388 2711 2211 1157 -3558 -5425 -223 2204 -862 -1967 -2071 -2611
1538b611K844J815k995j335J782O08m98R25j673m13L637J054l798j563J209O12
$$ -2611 233 2048 -947 -2282 -500 108 -390 535 -1138 -1551 2086 3140 -658 -2221 -1012 -400
1554d00L052J482m733l721K868K827O83M6k540k949L155L168j602n14N33j467
$$ -400 2652 4134 -599 -4320 -1452 1375 2058 2104 -436 -3385 -230 2938 1336 822 1355 -112
1570a12R82J559k741k024K624K576p67q79k272k004L234K714k858l239K89J60
$$ -112 870 2429 -312 -2336 288 2864 2097 1218 -1054 -3058 176 2890 32 -3207 -2918 -2758
1586b758L099L691k236m902K20K032n2J555J66k324R37K986j667k815N74P50J151
$$ -2758 341 4032 1796 -3106 -2886 -854 -906 649 815 -1509 -572 2414 747 -2068 -1494 -744 407
1603D07J822j996l069J053K914k71l23r03l531J425N925O43l253j298q76j86L026
$$ 407 2229 233 -2836 -1783 1131 860 537 -366 -3897 -2472 3453 4096 843 -455 -1331 -1517 1509
1620A509P04k504L87K205o95q70j05k147O95L196k32l713o29Q69J296K110P9m533
$$ 1509 2213 -291 96 2301 1606 736 631 -1516 -821 2375 2143 -1570 -2199 -1330 -34 2076 2155 -2378
1638b378j225L224J379O28m13l086j365K855J837j294N6k87j019J151J159k993
$$ -2378 -3603 -379 1000 1628 1215 -1871 -3236 -381 1456 162 218 -69 -1088 63 1222 -1771
1654a771q74K898J145j315n94j653m70M011J817k515j544k18l80K703K304k896
$$ -1771 -2645 253 1398 83 -511 -2164 -2634 1377 3194 679 -865 -1083 -1463 1240 3544 648
1670F48k740J697J326M95P78j082k203J491J015j940n67J587M89R14N05l313k152
$$ 648 -2092 -395 931 1426 2204 1122 -1081 410 1425 -515 -1082 505 994 1908 2413 -900 -3052
1687c052K633K028O8O7k191k456J530L519j036k294K05p22J546K201p48l142P23
$$ -3052 -419 1609 1677 1744 -447 -2903 -1373 2146 1110 -1184 -979 -1701 -155 2046 1298 -1844 -1121
1704a121O35p91M82L68j247J554K309j316l131k52J335J643K274j617l295J59
$$ -1121 -486 -1277 -795 -427 -1674 -120 2189 873 -2258 -2510 -1175 468 2742 1125 -2170 -2011
1720b011K360P80M66o85k317j0K780N82j578o9n77l18K107K47k828N67K807m03
$$ -2011 349 1129 1595 910 -1407 -1417 1363 1945 367 298 -279 -597 1510 1757 -1071 -504 2303 1900
1738A900j648r35j317J177L429k45k351q25p33j66K993J054l043j160J492Q92
$$ 1900 252 -683 -2000 -823 2606 2361 10 -815 -1548 -1714 1279 2333 -710 -1870 -378 514
1754E14k34L32j902n37K334O55j761K63K71j05Q76l77k853n64L443J300k94o46
$$ 514 280 612 -1290 -1827 507 1162 -599 -336 -65 -170 706 329 -2524 -3088 355 1655 1361 715
1772G15k443j194K615K302j298j017o5j95J463J210j539j585J752O40q34L72o37
$$ 715 -1728 -2922 -307 1995 697 -320 -385 -580 883 2093 554 -1031 721 1361 527 899 262
1789B62j250J782J399k489r45N49J029J198Q54k616k068Q63J883O46M36j132k360
$$ 262 -988 794 2193 -296 -1241 -692 337 1535 2389 -227 -2295 -1432 451 1097 1533 401 -1959
1806a959J183K094j099o38P06n21J80R07j305j903J519J589l81p16o15j266J905
$$ -1959 -776 1318 219 -419 287 -234 -54 853 -452 -2355 -836 753 372 -344 -959 -2225 -320
1823c20K710j911k181n2P51J220K366n36k882j46J039O0N79M96j247O83J167j169
$$ -320 2390 479 -1702 -1754 -1003 217 2583 2047 -835 -981 58 118 697 1193 -54 629 1796 627
1841F27j651J77K77Q35J509q21k416P28K223k40n45j032j398L60L504R77k082
$$ 627 -1024 -847 -570 265 1774 953 -1463 -735 1488 1248 703 -329 -1727 -1367 2137 3114 1032
1858A032r92o86n81J627M36j605p1K110r31r24l32o03k36K117O21k114k82J050
$$ 1032 40 -646 -1227 400 836 -769 -840 1270 339 -585 -917 -1520 -1756 361 982 -1132 -1414 -364
1876c64K53J336J74l038p63K342J174K48k6j458j616J869Q46j321l5K35k5M51
$$ -364 -111 1225 1399 -1639 -2402 -60 1114 1362 1336 -122 -1738 131 977 -344 -379 -144 -169 282
1894B82Q62j823m54K125O68j063o69j006j05K779J620k087j001J24m01O27J579
$$ 282 1144 -679 -1133 992 1660 597 -72 -1078 -1183 1596 3216 1129 128 252 -149 478 2057
1911B057j979j774J016J338n35O22n20j659M46J305j619l60J598R14M1K21k098
$$ 2057 78 -1696 -680 658 123 745 225 -1434 -988 317 -1302 -1662 -64 850 891 1112 -986
1928i86j992K415J569j97L2j046j380P82J944q37j526P1L51L93J470j15j885N63
$$ -986 -2978 -563 1006 809 841 -205 -1585 -803 1141 304 -1222 -1151 -800 -407 1063 948 -937 -374
1946c74P40q93k3R33n16J010J967j512k542M7J014Q75J710q75k566L71J909m90
$$ -374 366 -527 -550 383 -133 877 2844 1332 -1210 -1163 -149 726 2436 1561 -1005 -634 1275 785
1964G85m03j97j427j14K107j04p80N9J28p21O15Qj265O03K000k02j032r44r33
$$ 785 382 185 -1242 -1356 751 647 -133 -74 54 -667 -52 -44 -1309 -706 1294 1092 60 -884 -1817
1983a817O28K535J05k259m31N16j56J476P64k144r65J350L28j20M59l08m15J437
$$ -1817 -1189 1346 1451 -808 -1239 -723 -879 597 1361 -783 -1748 -398 -70 -190 269 -39 -454 983
2001I83J04j666P0J245j89K27K99j462j012K564J028j070r99j319p22K149J439
$$ 983 1087 -579 -509 736 547 774 1073 -389 -1401 1163 2191 1121 122 -1197 -1919 230 1669
2018A669j202m25J27m87K73R68j186p79J517O04j020j27l74j23P93J090j762j616
$$ 1669 467 42 169 -318 -45 923 -263 -1042 475 1079 59 -68 -442 -565 228 1318 -444 -2060
2036b060J388N54Q75R07k294k384J381J853l2L42l78j279L97J563o89j041O21
$$ -2060 -672 -118 757 1664 -630 -3014 -1633 220 188 530 152 -1127 -730 833 144 -897 -276
2053b76N97q1M72o94j400J492J769j150q42l16p21J455K170j357k124R9M90O88
$$ -276 321 240 712 18 -1382 110 1879 729 -113 -429 -1150 305 2475 1118 -1006 -907 -417 271
2071B71J332k30j742k65J098n42j08K07o39P06J171j015j699P08J073J95O21r96
$$ 271 1603 1373 -369 -634 464 -78 -186 21 -618 88 1259 244 -1455 -747 326 521 1142 146
2089A46k033j44K858K03r15m33j441J2K240R01j626n02O4j78P50N82j357K77J553
$$ 146 -1887 -2031 827 1030 115 -318 -1759 -1747 493 1394 -232 -734 -670 -848 -98 484 -873 -596 957
2108I57k01j271RJ3J66J890K64k670n07J292P95R11j80k302r88K211P16m31Q3
$$ 957 756 -515 -506 -493 -327 1563 1827 -843 -1350 -58 737 1648 1468 -834 -1822 389 1105 674 757
2127G57q40j017J455Q26j503j5J038k26k33M6j438l46J809J295j576n82p95k10
$$ 757 -83 -1100 355 1181 -322 -337 701 475 242 288 -1150 -1496 313 1608 32 -550 -1345 -1555
2145a555K270J345j894j781L09M42L76J274o73j762J205J161r31l17K52p66J307
$$ -1555 715 2060 166 -1615 -1306 -864 -488 786 113 -1649 -444 717 -214 -531 -279 -1045 262
2162B62O19j472j297J497J495K66J13j658k055J734J983l64m21m18j632R08J712
$$ 262 881 -591 -1888 -391 1104 1370 1483 -175 -2230 -496 1487 1123 702 284 -1348 -440 1272
2179A272p8j813L65M01J63R83k13j943P11J582j476j172O45k6P17K210j381k521
$$ 1272 1194 -619 -254 147 310 1293 1080 -863 -152 1430 -46 -1218 -573 -599 118 2328 947 -1574
2197a574j31R74Q90N22m70k212K96K495l7l85n31n81r41K016j07j464N25J145
$$ -1574 -1705 -731 159 681 211 -2001 -1705 790 753 368 -163 -744 -1685 331 224 -1240 -715 430
$$ [...]
8191b6
##END NTUPLES=NMR FID
##END=
