##TITLE=1H_TG-2245-C
 CDCl3, 8 sc, 
 25.10.2019
##JCAMPDX= 6.0         $$ Bruker NMR JCAMP-DX V2.0
##DATA TYPE= NMR FID
##DATA CLASS= NTUPLES
##ORIGIN= UXNMR, Bruker Analytische Messtechnik GmbH
##OWNER= root
$$ XWIN-NMR		Version 3.5
$$ Fri Oct 25 14:23:51 2019 Russian Standard Time (UT+4h)  she@DPX200
##.OBSERVE FREQUENCY= 200.1315
##.OBSERVE NUCLEUS= ^1H
##.DELAY= (6, 6)
##.ACQUISITION MODE= SIMULTANEOUS
##.ACQUISITION SCHEME= undefined
##.AVERAGES= 8
##.DIGITISER RES= 18
##SPECTROMETER/DATA SYSTEM= spect
##.PULSE SEQUENCE= zg30
##.SOLVENT NAME= CDCl3
##.SHIFT REFERENCE= (INTERNAL, CDCl3, 0, 15.7039)
##AUDIT TRAIL= $$ (NUMBER, WHEN, WHO, WHERE, WHAT)
$$ ##TITLE= Audit trail, XWIN-NMR		Version 3.5
$$ ##JCAMPDX= 5.01
$$ ##ORIGIN= Bruker BioSpin GmbH
$$ ##OWNER= she
$$ F:/spectra/data/she/nmr/H-F/1/audita.txt
$$ ##AUDIT TRAIL=  $$ (NUMBER, WHEN, WHO, WHERE, WHAT)
(   1,<2019-10-25 14:22:41.28 +0400>,<she>,<DPX200>,
      <created by zg, POWCHK disabled, PULCHK disabled
       configuration hash MD5:
       00 E9 B6 7A A2 85 ED C7 34 08 36 98 17 FE 4E 26
       data hash MD5: 16K
       3B E7 76 B6 9C 38 71 DD 0B AD 3E F0 6D EA DE 06>)
$$ ##END=
$$ 
$$ hash MD5
$$ E2 0F 59 2E 42 11 97 92 66 B6 BD A0 CF DF 5C CF
##$RELAX= 
##$RELAX= 
##$RELAX= 
##$RELAX= 
##$RELAX= 
##$RELAX= 
$$ Bruker specific parameters
$$ --------------------------
##$DU= <F:/spectra>
##$EXPNO= 1
##$NAME= <H-F>
##$PROCNO= 1
##$TYPE= <nmr>
##$USER= <she>
##$AMP= (0..31)
100 100 100 100 100 100 100 100 100 100 100 100 100 100 100 100 100 100 
100 100 100 100 100 100 100 100 100 100 100 100 100 100 
##$AQSEQ= 0
##$AQ_mod= 1
##$AUNM= <au_zg>
##$AUTOPOS= <>
##$BF1= 200.13
##$BF2= 200.13
##$BF3= 200.13
##$BF4= 200.13
##$BF5= 200.13
##$BF6= 200.13
##$BF7= 200.13
##$BF8= 200.13
##$BYTORDA= 1
##$CFDGTYP= 0
##$CFRGTYP= 5
##$CHEMSTR= <none>
##$CNST= (0..31)
1 1 145 1 1 1 1 1 1 1 1 1 1 1 1 1 1 1 1 1 1 1 1 1 1 1 1 1 1 1 1 1 
##$CPDPRG= <>
##$CPDPRG1= <>
##$CPDPRG2= <>
##$CPDPRG3= <>
##$CPDPRG4= <mlev>
##$CPDPRG5= <mlev>
##$CPDPRG6= <mlev>
##$CPDPRG7= <mlev>
##$CPDPRG8= <mlev>
##$CPDPRGB= <>
##$CPDPRGT= <>
##$D= (0..31)
0 1.2 0 0 0 0 0 0 0 0.06 0 0.03 0 0 0 0 0.0002 0 0 0 0 0 0 0 0 0 0 0 0 
0 0 0 
##$DATE= 1571998960
##$DBL= (0..7)
120 120 120 120 120 120 120 120 
##$DBP= (0..7)
150 150 150 150 150 150 150 150 
##$DBP07= 0
##$DBPNAM0= <>
##$DBPNAM1= <>
##$DBPNAM2= <>
##$DBPNAM3= <>
##$DBPNAM4= <>
##$DBPNAM5= <>
##$DBPNAM6= <>
##$DBPNAM7= <>
##$DBPOAL= (0..7)
0.5 0.5 0.5 0.5 0.5 0.5 0.5 0.5 
##$DBPOFFS= (0..7)
0 0 0 0 0 0 0 0 
##$DE= 6
##$DECBNUC= <off>
##$DECIM= 24
##$DECNUC= <off>
##$DECSTAT= 4
##$DIGMOD= 1
##$DIGTYP= 9
##$DL= (0..7)
0 120 120 120 120 120 120 120 
##$DP= (0..7)
150 150 150 150 150 150 150 150 
##$DP07= 0
##$DPNAME0= <>
##$DPNAME1= <>
##$DPNAME2= <>
##$DPNAME3= <>
##$DPNAME4= <>
##$DPNAME5= <>
##$DPNAME6= <>
##$DPNAME7= <>
##$DPOAL= (0..7)
0.5 0.5 0.5 0.5 0.5 0.5 0.5 0.5 
##$DPOFFS= (0..7)
0 0 0 0 0 0 0 0 
##$DQDMODE= 0
##$DR= 18
##$DS= 0
##$DSLIST= <SSSSSSSSSSSSSSS>
$$ [...]
##$SUBNAM2= <"">
##$SUBNAM3= <"">
##$SUBNAM4= <"">
##$SUBNAM5= <"">
##$SUBNAM6= <"">
##$SUBNAM7= <"">
##$SUBNAM8= <"">
##$SUBNAM9= <"">
##$SW= 24.0689530833862
##$SWIBOX= (0..15)
0 0 2 0 0 0 0 0 0 0 0 0 0 0 0 0 
##$SW_h= 4816.95568400771
##$TD= 16384
##$TD0= 1
##$TE= 0
##$TE2= 300
##$TE3= 300
##$TEG= 300
##$TL= (0..7)
0 120 120 120 120 120 120 120 
##$TP= (0..7)
150 150 150 150 150 150 150 150 
##$TP07= 0
##$TPNAME0= <>
##$TPNAME1= <>
##$TPNAME2= <>
##$TPNAME3= <>
##$TPNAME4= <>
##$TPNAME5= <>
##$TPNAME6= <>
##$TPNAME7= <>
##$TPOAL= (0..7)
0.5 0.5 0.5 0.5 0.5 0.5 0.5 0.5 
##$TPOFFS= (0..7)
0 0 0 0 0 0 0 0 
##$TUNHIN= 0
##$TUNHOUT= 0
##$TUNXOUT= 0
##$USERA1= <user>
##$USERA2= <user>
##$USERA3= <user>
##$USERA4= <user>
##$USERA5= <user>
##$V9= 5
##$VALIST= <valist>
##$VCLIST= <CCCCCCCCCCCCCCC>
##$VD= 0
##$VDLIST= <DDDDDDDDDDDDDDD>
##$VPLIST= <PPPPPPPPPPPPPPP>
##$VTLIST= <TTTTTTTTTTTTTTT>
##$WBST= 1024
##$WBSW= 4
##$XGAIN= (0..3)
0 0 0 0 
##$XL= 0
##$YL= 0
##$YMAX_a= 157445
##$YMIN_a= -292856
##$ZGOPTNS= <>
##$ZL1= 120
##$ZL2= 120
##$ZL3= 120
##$ZL4= 120
##$ABSF1= 10
##$ABSF2= 0
##$ABSG= 5
##$ABSL= 3
##$ALPHA= 0
##$AQORDER= 0
##$ASSFAC= 0
##$ASSFACI= 0
##$ASSFACX= 0
##$ASSWID= 0
##$AUNMP= <proc_1d>
##$AZFE= 0.1
##$AZFW= 0.1
##$BCFW= 1
##$BC_mod= 2
##$BYTORDP= 1
##$COROFFS= 0
##$CY= 11.3945322036743
##$DATMOD= 1
##$DC= 2
##$DFILT= <>
##$DTYPP= 0
##$F1P= 19.5091578491511
##$F2P= -0.509923556040331
##$FCOR= 0.5
##$FTSIZE= 0
##$FT_mod= 4
##$GAMMA= 1
##$GB= 0.15
##$INTBC= 1
##$INTSCL= 1
##$ISEN= 128
##$LB= 0.24
##$LEV0= 0
##$LPBIN= 0
##$MAXI= 10000
##$MC2= 0
##$MEAN= 0
##$ME_mod= 0
##$MI= 1.114404
##$NCOEF= 0
##$NC_proc= 0
##$NLEV= 6
##$NOISF1= 3.799351
##$NOISF2= 2.8
##$NSP= 1
##$NTH_PI= 0
##$NZP= 0
##$OFFSET= 15.70392
##$PC= 1
##$PHC0= -9575.196
##$PHC1= 20.60083
##$PH_mod= 1
##$PKNL= yes
##$PPARMOD= 0
##$PSCAL= 0
##$PSIGN= 0
##$REVERSE= no
##$SF= 200.130013532006
##$SI= 16384
##$SIGF1= 3
##$SIGF2= 2
##$SINO= 400
##$SIOLD= 16384
##$SREGLST= <1H.CDCl3>
##$SSB= 0
##$STSI= 0
##$STSR= 0
##$SW_p= 3612.71676300578
##$SYMM= 0
##$S_DEV= 0
##$TDeff= 0
##$TDoff= 0
##$TI= <>
##$TILT= no
##$TM1= 0
##$TM2= 0
##$TOPLEV= 0
##$USERP1= <user>
##$USERP2= <user>
##$USERP3= <user>
##$USERP4= <user>
##$USERP5= <user>
##$WDW= 1
##$XDIM= 8192
##$YMAX_p= 0
##$YMIN_p= 0
$$ End of Bruker specific parameters
$$ ---------------------------------
##NTUPLES= NMR FID
##VAR_NAME=  TIME,          FID/REAL,        FID/IMAG
##SYMBOL=    X,             R,               I
##VAR_TYPE=  INDEPENDENT,   DEPENDENT,       DEPENDENT
##VAR_FORM=  AFFN,          ASDF,            ASDF
##VAR_DIM=   8192,          8192,            8192
##UNITS=     SECONDS,       ARBITRARY UNITS, ARBITRARY UNITS
##FACTOR=    0.0002076,     1,               1
##FIRST=     0,             0,               0
##LAST=      1.7004516,     0,               0
##MIN=       0,             -292856,         0
##MAX=       1.7004516,     157445,          0
$$ Real data points
##PAGE= N=1
##DATA TABLE= (X++(R..R)), XYDATA
0 0 0 0 0 0 8 -8 8 -8 8 -16 16 -24 24 -32 40 -48 56 -71 80 -96 112 -129 152 -176 201 -231 264 -299 339
29 339 -384 432 -486 546 -610 680 -759 844 -938 1041 -1154 1277 -1415 1566 -1733 1921
45 1921 -2132 2366 -2635 2943 -3301 3722 -4225 4844 -5615 6622 -7988 9961 -13081 18770
59 18770 -32515 134754 55258 -185128 94431 157445 -43118 -92352 94899 92989 -7605
70 -7605 21397 137909 99573 -19515 -40146 49373 54741 2627 8792 27689 -15957 3008
82 3008 57537 15040 -39094 5756 14060 -7146 52814 56487 -69769 -75600 43459 28001 -60164
95 -60164 -21516 24064 -10168 4652 46488 -6179 -65742 -37771 -2327 -9892 -5301 21277 19242
108 19242 -19759 -12578 51425 18469 -110552 -89310 56509 35012 -65562 14627 84910 -31547
120 -31547 -59830 63217 31725 -105266 -64587 41284 13228 -30543 319 4026 -28903 -16108
132 -16108 23860 20901 -25617 -37947 12257 30896 -18312 -37177 -21107 -34731 -14406 45881
144 45881 20380 -25183 33683 47492 -40861 -18510 61992 -32331 -114313 30891 127338 1161
156 1161 -61547 45358 75935 -15940 -38030 27534 30648 -34240 -20132 77510 74031 -34622
168 -34622 -37258 52250 34728 -27787 5894 26282 -17444 4446 49575 9722 -16057 11722
180 11722 -6501 -11448 55675 45278 -47811 -37231 41839 24996 -32123 -23451 7260 16105 24346
193 24346 35456 33368 6574 -25173 -14480 10600 -3963 -12064 6621 -2965 13687 90261 61531
206 61531 -61334 -33522 77906 17854 -70541 16537 68633 -29722 -33474 79773 66816 -46536
218 -46536 -46200 41888 53299 -7587 -20996 19498 11208 -31797 1930 48807 -11487 -58927 14880
231 14880 54204 -3168 -15543 1078 -36569 -29132 32079 7526 -43713 -1437 27777 -13013
243 -13013 -6457 20697 -30092 -67615 -13894 31074 9248 -15914 -7034 13505 12557 -5294 -5224
256 -5224 -12361 -48791 -32877 39603 30815 -34368 -10940 33098 -2948 -10566 30336 -5662 -50947
269 -50947 4207 37000 -12891 -18412 8512 -20451 -26578 33840 41132 -18571 -29655 17406 33293
282 33293 -6400 -38485 -16637 3921 -19269 -8251 45398 23775 -38361 -3598 44406 -2416
294 -2416 -28844 3857 -13621 -25198 40525 44880 -33247 -21631 43527 12415 -30264 12657
306 12657 32443 -18228 -24469 36471 52989 -10954 -48621 10729 55903 -684 -34044 25905
318 25905 31589 -32983 -9986 49764 4252 -44694 1657 33957 14755 11017 -4429 -32374
330 -32374 -4062 22782 -19062 -36172 6461 14280 -7932 10271 27893 -3406 -37254 -27924
342 -27924 5950 8685 -30737 -36660 10194 18242 -9998 5260 10605 -36827 -28678 28802 4678
355 4678 -42327 -8356 7923 -29052 -6083 33134 -16308 -50205 7562 36543 -8464 -27643
367 -27643 -6466 -6866 -24524 -15555 13229 5185 -37114 -23728 37566 20558 -46363 -30223 8772
380 8772 -25097 -28850 25946 8875 -43988 -9585 30168 -5908 -27047 -13999 -28500 -25293 16038
393 16038 16426 -18430 -15406 5803 4667 -2727 -4395 -8024 -16787 -20615 7148 36814 -1577 -47173
407 -47173 -418 45212 -1246 -22175 25617 15754 -29079 5688 41060 -3202 -32481 -5463
419 -5463 12492 22098 28070 83 -15219 18024 28830 -3781 -14374 944 1483 -4587 7398
432 7398 28997 24735 -19055 -29107 29446 41413 -28665 -35354 29830 20235 -22953 12771 32411
445 32411 -24315 -31346 22195 21828 -9332 -4582 -916 -7399 11466 18717 -11069 -25894 -3247
458 -3247 18918 13544 -7690 -5807 10311 -9112 -27760 12197 25309 -35069 -36317 40517 37659
471 37659 -26505 -16688 13389 -16283 -26158 6482 569 -22509 -9253 7559 9108 9110 -8924 -28616
485 -28616 -13875 5417 -1565 -13822 -17715 -10989 4585 1206 -13753 -3193 -1148 -26617 -7826
498 -7826 32742 -1509 -46683 -8173 19726 -18590 -19795 13628 -3953 -23586 10757 24505
510 24505 -8842 -22654 -12378 -6777 -36 3721 -4227 -7080 -1548 6868 12395 -6467 -28486 -11099
524 -11099 5904 -11565 -1100 25658 -7851 -34365 17640 33822 -30733 -39856 11795 6215
536 6215 -21542 5156 20844 -12209 -23403 3263 17349 1582 -20561 -17423 8436 12884 -4147
549 -4147 -4825 -5433 -16057 1843 22769 1599 -8023 12981 3160 -11789 19235 17659 -33970 -24455
563 -24455 32126 25537 -7947 5441 16745 -59 740 12848 5645 -6394 -9399 2348 24650
576 24650 21684 -4797 -9827 3412 6833 11053 8159 -12947 -6032 22452 9588 -10361 10814
589 10814 5241 -32395 -6619 40356 7509 -32875 -1058 21524 -3828 -10892 1870 -7569 -16897
602 -16897 -2055 15643 12982 -10760 -21750 -2132 6431 -10822 -10038 -1950 -16811 -6741 27453
615 27453 8432 -30218 -10792 7751 -18930 -13382 15008 -9493 -32111 5066 24970 -6630
627 -6630 -22007 -8547 -3871 -5099 -2831 -1205 -3691 -14130 -15108 7410 11271 -18552 -20491 7102
641 7102 5614 -3268 7641 -4472 -24707 -2487 12810 -9337 -8102 10697 -4214 -6931 23753
654 23753 14886 -24014 -16708 11873 6773 -2665 4392 7778 4853 4598 8581 11976 -2113 -19740
668 -19740 -1853 23759 8273 -4667 11901 7546 -5770 15862 18039 -18558 -13865 20905 8370
681 8370 -8977 13855 11376 -18805 -4799 25679 10510 -15582 -7486 11930 12416 -2695 -9005
694 -9005 1388 -1501 -14272 4820 25293 -2443 -21024 9178 17254 -9038 -6522 1780 -16487
707 -16487 -7117 22151 7851 -14723 1462 7245 -8381 415 10367 -8819 -16736 3560 16393
720 16393 7464 -8965 -13678 107 6593 -5922 -2813 7389 -8289 -12109 16134 13479 -18536
733 -18536 -14143 2721 -6249 -375 14259 -7793 -21093 6238 12018 -12042 -9371 1193 -11723
746 -11723 -9610 13560 11392 -11375 -17941 -4157 8647 375 -16289 -8017 6290 -5357 -3671
759 -3671 18442 1853 -29237 -6852 19026 -4102 -13152 5391 -3547 -12507 13640 16108 -14976
772 -14976 -14250 8007 5047 -1407 5221 1301 -9844 -7808 6106 13276 -1897 -18945 279 23725
786 23725 4450 -11271 8315 4303 -20100 -44 24220 -1921 -16766 8483 14743 3325
798 3325 7287 1858 -13641 -1632 13928 4272 -612 6252 2770 1686 11501 10198 -680 -7634
812 -7634 -4200 12113 18984 -2110 -9095 12852 11036 -5993 8580 16340 -11730 -10440 21533
825 21533 13665 -10515 444 6092 -6187 4881 17758 -1374 -11452 5200 10345 317 -3384
838 -3384 -2688 -3448 -3493 -360 10893 8479 -15110 -12873 17158 8673 -22226 -7307 12242 -9573
852 -9573 -11142 18023 6434 -23281 -7761 11717 -2067 -8508 -1520 -5977 -4548 6527 3565
865 3565 -6218 -8518 -7240 -1086 3683 -3590 -5209 -1127 -6619 -3637 12227 -554 -24651 -5285
879 -5285 16594 -3839 -11815 8387 -1416 -18552 1940 12418 -9360 -14232 387 1825 2316
892 2316 5870 -4428 -11760 -2470 3741 828 -2262 -6788 -3329 5056 2163 1103 7208 -6062 -16188
907 -16188 10182 22055 -10018 -15675 13037 7156 -11009 7626 13771 -11045 -8051 17451 14295
920 14295 -1285 -637 58 -158 6247 7488 2337 -1420 -253 10480 17240 2638 -6651 5177 3515
935 3515 -6449 10999 17484 -11143 -10277 23309 15893 -11146 42 10021 -6872 -2382 17327 7573
949 7573 -8693 -1506 8255 8352 4268 -3622 -4118 2607 3083 5037 8083 -4018 -10337 6950 10715
964 10715 -4056 -266 5762 -9176 -3640 17911 2126 -20253 -1897 10619 -4915 -1742 10254
977 10254 -4187 -12714 3324 7504 -4857 -9729 -7299 -1795 3818 1935 -2530 -2231 -7414 -6042
991 -6042 6616 -285 -16141 -4820 7027 -6970 -3523 12805 -6681 -23658 4259 15718 -12046
1004 -12046 -14422 7584 1859 -9180 3122 6172 -7814 -10811 -822 8046 4294 -7656 -6244
1017 -6244 6336 2303 -4735 4025 1433 -11960 1206 15867 -1062 -8097 7129 592 -9530
1030 -9530 9191 11544 -13004 -8189 14707 7583 -4831 2274 2469 -4553 1156 7296 3779 -1613
1044 -1613 -4367 1262 10159 3722 -6247 875 2852 -2497 7993 12612 -8012 -8318 12937 5408
1058 5408 -9426 5584 8117 -10495 57 21157 5050 -11898 1278 7926 -150 384 3969
1071 3969 316 -1330 2927 9260 8995 -3956 -9284 5355 8367 -3135 1791 7387 -6597 -2904
1085 -2904 17304 5271 -14720 549 9257 -5832 331 13199 -3904 -13921 6579 12568 -3532
1098 -3532 -6525 3 345 -43 1421 2219 -627 -9724 -6516 10730 7345 -12713 -5996 8294 -3121
1113 -3121 -6686 7212 -3105 -18725 -580 11272 -4846 -6046 4091 -6115 -8926 6982 2527
1126 2527 -14224 -9772 1727 1506 -744 -2696 -4644 -3693 -4691 -2920 3304 -3029 -15008 -2882 10148
1141 10148 -2990 -8626 2426 -4924 -12808 6600 8664 -13869 -8726 9829 -662 -8084 6348
1154 6348 2875 -13436 -3872 11411 4709 -6236 -5041 2892 6240 -149 -2835 4639 1519 -7342
1168 -7342 5919 16734 -3547 -10786 9059 8142 -4510 5616 8892 -7257 -744 16412 5031
1181 5031 -6225 4539 5477 -2744 5577 10651 121 -3522 3575 7471 5745 -713 -3391 5090
1195 5090 6609 -503 5579 8892 -7437 -6280 12919 5450 -10827 1294 8835 -4913 837 13664
1209 13664 -2124 -12084 3809 7263 -5049 -1864 3123 -3339 -2262 5195 3370 -2623 -6094 -3471
1223 -3471 5243 2801 -7822 -2691 3895 -6309 -4252 10267 -1383 -16868 285 10697 -6400
1236 -6400 -6991 4575 -6103 -10312 6493 5483 -10440 -6244 3098 -1862 -3318 299 -3512 -7714
1250 -7714 -4692 1175 5156 -2765 -11559 -977 7879 -5407 -8531 4930 -3570 -14348 4288 13332
1264 13332 -7932 -11009 5319 938 -5872 3103 -291 -10424 -1173 7337 106 -2994 -340 -2326
1278 -2326 -1859 2573 1744 85 -4019 -5846 5116 10108 -5145 -8284 6248 2764 -6633 6436
1292 6436 8330 -11042 -5544 12969 3496 -7518 3283 3368 -5152 4734 10797 -2037 -6520 2410
1306 2410 4912 2737 1570 124 1900 2110 962 7172 6812 -7324 -5795 12093 7356 -6314 3789
1321 3789 8324 -6058 -743 13771 560 -10641 4336 8224 -1103 2905 6861 -3333 -3709 5429
1335 5429 4708 -1242 -3156 -1626 3768 5207 -787 237 2557 -5383 -3102 9040 695 -11982 1292
1350 1292 8420 -5559 -2746 8294 -4701 -11949 5417 7388 -7629 -4878 1644 -2886 -2174 2659
1364 2659 -2562 -6093 -2144 -237 1231 -170 -6272 -4027 1672 -3348 -3106 4065 -3828 -10911 4372
1379 4372 7915 -10225 -7332 5988 -4162 -9149 6742 4772 -11254 -4409 6972 -598 -5814
1392 -5814 -1826 -3272 -3026 1646 1876 410 -1195 -3910 780 4692 -3462 -6017 2831 -614 -5610
1407 -5610 7304 8313 -9642 -5266 11625 2072 -7772 3582 4164 -6081 2071 9805 -2 -4315
1421 -4315 2303 2793 2649 4678 1092 -1073 1832 3087 4132 4692 -2832 -2794 7987 5780 -2380 5419
1437 5419 5671 -6589 727 13954 559 -9096 6493 8095 -2819 3506 8406 -3283 -4846 6130
1451 6130 5773 209 721 408 1564 4793 2332 549 264 -3844 -637 9610 3505 -7146 1838
1466 1838 7056 -4177 -970 8168 -4409 -10017 6390 7944 -5041 -937 4434 -4531 -3861 5962
1480 5962 748 -6780 -3118 1362 2270 1008 -3867 -3962 233 -2468 -2326 3389 -2119 -9581 1155 6223
1496 6223 -6175 -5657 3544 -5223 -8377 6582 4294 -10822 -4526 5163 -2362 -4570 1281 -2238
1510 -2238 -5846 471 2778 -317 -2333 -5016 -2571 3111 -348 -3982 1743 -91 -4554 3888 5646
1525 5646 -7832 -5688 5763 -549 -4207 7153 3288 -7963 2553 10305 -2826 -6611 2992
1538 2992 1537 -2122 3429 4385 636 85 814 2897 4938 -1685 -3763 4455 4589 -1391 4592 5428
1554 5428 -5676 -658 11164 1231 -6537 5504 6096 -3686 3152 8795 -3143 -4545 5627 4581
1568 4581 -671 2339 2190 -305 2397 3015 1508 1439 -2031 -1155 7052 4634 -4097 684 4379 -3165
1584 -3165 -343 7912 -2267 -7380 6451 7177 -4372 -192 4188 -5583 -3992 6402 1751 -4865
1598 -4865 -292 2852 903 1337 -455 -3497 -1624 -1504 -612 4065 -227 -6724 1047 6110 -4195
1613 -4195 -4356 3744 -4146 -7139 5779 4938 -8149 -2896 3846 -3495 -3195 3681 -2748 -7400 965
1628 965 4380 -1300 -3194 -3075 -2511 361 -1241 -2943 807 -1757 -6225 2025 5904 -5718 -6666 3522
1644 3522 -935 -4750 4147 1330 -9191 -1797 6715 -2344 -5129 2007 -888 -3338 3534 2996 -3698
1659 -3698 -3213 -203 662 2045 -608 -2698 2439 2236 -1372 3549 4075 -6127 -4002 7354 2249
1674 2249 -4141 4097 3490 -3994 3491 8012 -3059 -4925 4659 2958 -1131 3965 3300 -1634 1306
1689 1306 4339 2362 1363 -798 -1262 4781 4856 -1438 1635 4215 -2425 39 8035 153 -6008 4319
1705 4319 5386 -3029 1443 5656 -3887 -2887 6719 2837 -3785 480 1494 -1496 1345 2245 -1619
1720 -1619 -1461 -429 223 3596 363 -5490 -819 3493 -3916 -3263 4045 -2475 -6850 3754 4259 -6406
1736 -6406 -3274 2421 -4383 -4402 3117 -1408 -6887 -573 1572 -2261 -1482 -2229 -4747 -1512 182 -2522
1752 -2522 -1740 -1938 -4711 66 2853 -5220 -5468 2312 -2047 -5559 3566 2042 -8345 -2249 5379
1767 5379 -2648 -4694 1581 -1984 -5087 2263 2656 -3298 -2418 401 -619 816 649 -2643 -702 343
1783 343 -1661 2160 3095 -4862 -2935 6674 1695 -4459 2649 2484 -5094 1192 7160 -1578 -4269 3560
1799 3560 2880 -988 3429 2506 -3024 35 3549 1208 1089 725 -1152 2333 4300 121 1174 1972
1815 1972 -2674 -37 7348 1091 -5422 3110 5378 -2432 1488 6002 -3049 -3504 5473 3340 -2943
1830 -2943 1459 2059 -1348 1898 3937 -18 -817 -235 -564 2225 2442 -2893 -1296 2964 -755 -66
1846 -66 4249 -2111 -6581 2893 4315 -4888 -2124 3048 -3313 -3239 4695 95 -6182 -1194 1445 -2805
1862 -2805 -827 240 -3264 -2070 517 -1000 -864 -1436 -4974 -1754 2195 -2896 -3944 1425 -2480
1877 -2480 -5443 2710 1886 -7709 -3689 3460 -2553 -4408 2026 -1713 -6301 369 2790 -2906 -3000 -685
1893 -685 -2231 -569 171 -2416 -1695 -173 -2615 405 3162 -3156 -3727 2866 376 -3975 2051 1661
1909 1661 -5670 60 6780 -1240 -4442 2953 1045 -3179 2278 2780 -3023 -517 3392 1485 837
1924 837 1015 -1129 682 2596 68 1187 3112 -1025 1 6127 2229 -3555 2488 3552 -2348
1939 -2348 2122 6706 -1585 -3065 5678 3901 -2023 1401 2398 -1588 1355 4005 664 -548 922
1954 922 477 2530 2799 -1141 -384 3067 -531 -494 4370 -172 -4583 2198 4455 -2780 -441 4106
1970 4106 -2334 -2976 4884 1362 -5575 -658 2492 -1181 388 1885 -1793 -2387 338 -286 -650 -1071
1986 -1071 -3847 -1201 2924 -1131 -2772 1114 -1767 -5492 1097 2317 -5698 -3051 3121 -2013 -3067
2001 -3067 3146 -1314 -7255 -1052 2228 -2906 -2532 -117 -2425 -1017 1171 -1357 -2500 -1724 -3052
2016 -3052 -228 2338 -2728 -4040 1608 421 -3766 1342 1559 -5405 -1545 4962 -1136 -3812 1980
2031 1980 -4 -4091 2017 3430 -2556 -1683 2170 911 267 1054 -1315 -748 1466 801 1551 3010
2047 3010 -1731 -1398 4680 2152 -3124 1941 3482 -2296 1285 6649 -26 -2846 4052 3011 -2175
2062 -2175 2259 3692 -1510 560 5124 2264 114 752 323 1010 2519 494 468 2632 344 592
2078 592 5029 1315 -3894 1809 4000 -2099 -238 4680 -1500 -2404 4649 2085 -3627 181 2738
2093 2738 -1687 -461 3158 -1001 -2101 491 170 -241 497 -1831 -1264 1541 -539 -1767 1423 -1435
2109 -1435 -4608 1734 3042 -4396 -2338 3352 -1720 -3941 2243 -613 -6019 -1176 2605 -2010 -2112
2124 -2112 971 -1830 -2606 31 -1002 -2259 -1380 -2018 -289 2029 -1140 -3280 748 -613 -3909 428
2140 428 1364 -5192 -2143 4702 -22 -3714 1385 -12 -4614 490 2737 -3118 -2499 1667 120 -781
2156 -781 1155 -510 -1874 8 345 460 1338 -1766 -2098 2785 1561 -2536 1240 2137 -3391 381
2172 381 5941 -350 -3924 2661 2603 -2028 1772 3044 -1746 -667 4154 1686 -618 1244 503 239
2188 239 2430 1675 838 1858 -89 -191 3882 1634 -2944 1042 3922 -1063 1405 5426 -691 -3309
2204 -3309 4097 3062 -3432 106 3378 -1223 321 4502 801 -1558 819 881 -326 724 -407
2219 -407 -724 1575 364 -592 2265 -227 -3769 783 3014 -2577 -1856 2762 -1417 -3631 3354 1464
2235 1464 -5256 -1388 2299 -2072 -2056 1440 -1616 -3060 563 212 -2146 -1215 -1793 -1644 411 -809
2251 -809 -2698 -342 -982 -3446 641 1588 -4534 -2740 2330 -1804 -4240 1402 -124 -5586 -236 3398
2267 3398 -2445 -2804 1223 -1091 -2428 278 -861 -3170 -892 51 -51 891 -670 -2133 1138 251
2283 251 -2918 398 1588 -3095 -709 4790 -473 -3385 2636 1548 -3008 1352 3537 -2375 -1595
2298 -1595 3571 1740 -511 1370 660 -804 1762 1640 342 804 163 -59 3037 1874 -1723 1470
2314 1470 2790 -911 474 4237 -576 -2688 3739 2994 -2051 1418 3766 -1687 -658 4208 1049
2329 1049 -2166 1150 1766 202 1591 1112 -382 875 1031 74 1565 -30 -2921 990 3292 -1532
2345 -1532 -747 2777 -1162 -2870 3473 1375 -4347 -584 2491 -1894 -1419 2487 -725 -3555 567
2360 567 1187 -1675 -1235 -1056 -1486 80 144 -1429 -297 -1128 -3071 261 1499 -3585 -2890 2174 -1096
2377 -1096 -3102 1691 -75 -4950 -772 2334 -3191 -3019 1164 -1671 -3192 1067 707 -2629 -1383
2392 -1383 -35 -1104 -406 -639 -2479 -733 -226 -1814 393 1256 -3146 -1610 3100 -954 -3406 1692
2408 1692 612 -3495 1010 3730 -2339 -2251 2886 216 -1851 1662 1080 -2383 399 2209 304 871
2424 871 -17 -157 1675 1712 -845 987 1964 -916 608 4343 -117 -2373 3347 2779 -2061 1419 3329
2441 3329 -1775 -841 4331 1687 -1408 2091 2230 -472 1206 2371 -392 316 1312 836 1991 1542
2457 1542 -1332 1135 2889 -618 -328 2745 -977 -2205 3462 2715 -2824 675 3048 -1465 -990 3070
2473 3070 -325 -2779 1359 1765 -1496 76 665 -1313 -350 565 -918 -512 -654 -2225 216 1413
2489 1413 -2558 -1883 1798 -1689 -2699 1631 -21 -4470 -676 2427 -2574 -2497 1555 -1258 -3404 1009
2505 1009 705 -3040 -1758 89 -1606 -532 -83 -1683 -1025 -275 -1205 -150 529 -3041 -2299 1866 -911
2522 -911 -2585 1327 683 -3645 454 3262 -3066 -2899 1756 -367 -2404 1941 1326 -2463 69 1858
2538 1858 -250 -585 227 -743 326 1474 -178 296 1566 -1356 -102 3337 18 -2204 2082 1995
2554 1995 -1404 1432 3520 -1686 -1019 4053 1713 -1590 1669 1723 -1312 1382 2937 -38 174 1778
2570 1778 608 1439 1824 -330 317 1583 -65 391 3394 254 -1811 3061 2688 -1823 645 2605
2586 2605 -1873 -921 3903 326 -2671 1638 2014 -1061 379 1454 -1789 -813 1202 42 -80 643
2602 643 -901 -16 1567 -1381 -1527 1178 -1106 -2460 1957 1239 -3431 -685 2069 -2174 -2411 1813
2618 1813 -1213 -3739 704 1304 -2882 -825 283 -2104 -1033 339 -1323 -1828 -384 -1397 -654 622
2634 622 -2148 -2044 1103 -666 -2770 390 -11 -3775 -526 2286 -2549 -2243 1503 -361 -2922 1234
2650 1234 973 -3190 -1146 1020 -999 -615 893 -642 -371 1028 -100 -390 233 -1078 -1052 2224 287
2667 287 -1966 1672 1583 -1704 983 2869 -1968 -1315 3225 792 -1396 2001 1801 -1519 965 2905
2683 2905 -484 -355 1621 -76 651 2072 490 -41 1738 597 171 2401 246 -1383 1912 2466
2699 2466 -1196 991 2731 -1083 -470 4010 710 -2003 1391 1765 -1411 1137 2269 -891 -581 1888
2715 1888 693 -219 902 -575 -686 1415 39 -899 1242 34 -1721 1826 1059 -2676 -761 1587
2731 1587 -1819 -1613 2106 -668 -2993 1270 1571 -2579 -553 529 -2252 -1389 1043 -785 -1554 -175
2747 -175 -693 -1225 347 -1252 -2281 -157 -824 -1996 936 239 -3162 -587 1867 -1961 -2637 1275
2763 1275 -1359 -3169 777 732 -3095 -837 893 -1790 -996 774 -1179 -1704 176 -41 -936 231
2779 231 -1168 -1193 1112 98 -1794 524 692 -2348 46 2454 -1561 -1800 2573 163 -1514 1479
2795 1479 1296 -2551 95 2425 -516 -621 1683 383 233 1698 665 -613 1076 417 133 1898
2811 1898 915 -794 1416 2312 -877 968 2517 -1151 -918 3280 972 -1547 2021 2194 -1366 883
2827 883 2787 -941 -821 2098 480 -271 1303 208 -335 1734 1086 -678 1184 266 -1340 1157
2843 1157 1762 -1685 -265 1653 -1115 -873 2602 131 -2460 605 1343 -1965 -356 1434 -1669 -1161
2859 -1161 1829 -437 -1969 135 -777 -1567 368 -353 -1534 55 -202 -1894 406 361 -2880 -1320
2875 -1320 1023 -1628 -2298 1186 -696 -2844 1098 1213 -2582 -1087 512 -1851 -1479 931 -989 -2095
2891 -2095 580 42 -1075 146 -842 -2124 482 214 -1776 -9 495 -2137 -407 1920 -1353 -2037
2907 -2037 1257 73 -2105 1225 1061 -2362 -14 1777 -591 -522 1005 -250 -1038 1441 744 -785
2923 -785 944 524 -599 1426 1218 -1077 690 1763 -817 583 2670 -468 -671 2852 1103 -1439
2939 -1439 1349 1392 -1657 627 2842 -325 -479 2050 769 170 1816 650 -762 1026 1207 -253
2955 -253 1206 976 -704 1505 2283 -556 -158 2032 -639 -688 2383 512 -1908 761 1458 -1145 270
2972 270 1807 -1131 -1208 1567 153 -1178 526 -105 -1038 708 656 -1265 -84 -14 -1399 124 692
2989 692 -2080 -820 1313 -1073 -1525 1222 -572 -2800 422 652 -2559 -1101 1279 -1374 -1290 1034
3005 1034 -688 -2324 -131 -439 -1625 -102 -155 -1914 53 432 -1269 -236 313 -2164 -1197 1633
3021 1633 -1101 -2218 1063 -17 -1987 807 914 -2615 -648 1608 -1020 -929 1588 -394 -1607 1287
3037 1287 745 -810 329 134 -943 1011 984 -1082 380 1111 -510 112 2212 -498 -1319 1914 901
3054 901 -1217 1464 1805 -1354 579 2782 -75 -581 1631 475 -479 1506 1175 -702 1108 1460
3070 1460 -28 1286 1269 -648 481 1740 -325 134 1688 -115 -742 2695 1130 -1408 1403 1278
3086 1278 -967 616 1973 -497 -851 1949 705 -773 1088 414 -1287 553 1084 -986 18 548
3102 548 -980 164 1499 -1246 -1118 1258 -616 -1119 1376 -10 -2773 373 1316 -1658 -793 988
3118 988 -1454 -1861 1243 -266 -2104 -128 133 -1482 126 323 -1336 -729 -42 -1469 -530 506 -1856
3135 -1856 -869 1264 -425 -1846 557 -495 -2218 292 675 -2494 -1104 1247 -1001 -1236 1069 -42
3151 -42 -1992 430 317 -1321 -234 88 -1106 79 711 -799 -410 651 -995 -560 1539 -418 -1316
3168 -1316 1324 815 -1173 1044 1288 -1507 -290 2183 -58 -1045 1682 530 -663 1625 1413 -556
3184 -556 555 1070 -269 745 1495 -409 357 1864 365 193 1711 93 -959 1863 1445 -1169
3200 -1169 595 1652 -647 550 2695 44 -1065 1775 664 -534 1182 682 -894 926 1343
3215 1343 -186 569 615 -589 365 1417 -641 -671 1089 57 -985 1736 800 -1896 -120 1055 -1324
3232 -1324 -796 1076 -1161 -1516 1199 290 -1531 -237 262 -1649 213 402 -1242 -721 679 -921
3248 -921 -656 386 -1411 -1614 516 -473 -1652 471 -139 -2120 -238 1151 -1879 -1086 815 -991
3264 -991 -1672 843 -673 -2196 -468 639 -1148 -56 417 -1436 -341 648 -762 -819 415 -894
3280 -894 -686 1418 -75 -1359 694 467 -1490 363 1045 -1749 -731 1812 -254 -749 1287 140
3296 140 -1062 978 878 -633 83 1006 -309 539 1421 -141 5 1185 -66 4 1598 291 -556
3313 -556 1549 1631 -786 690 1441 -623 329 2296 86 -1054 1717 920 -446 1523 1298 -755 496
3330 496 1444 -20 -167 1246 -526 350 1523 96 -297 1252 218 -892 1377 601 -1522 121
3346 121 1550 -649 -174 1638 -671 -1300 888 704 -1226 45 454 -1237 254 1131 -802 -643 682
3363 682 -994 -297 782 -980 -1456 582 -529 -1249 327 61 -1894 -121 878 -1674 -1476 1007 -1180
3380 -1180 -1364 659 -75 -1843 -460 318 -1381 -654 90 -1125 -1023 490 -520 -961 68 -763 -1102
3397 -1102 796 -567 -1637 232 217 -1474 496 1025 -1229 -870 1430 -315 -1163 746 192 -1566
3413 -1566 604 1195 -639 1 393 -416 -134 1047 -152 -593 624 -24 -93 1530 295 -909 1197
3430 1197 1036 -779 294 1235 -922 -172 2128 798 -766 1347 716 -700 1194 1400 -713 28
3446 28 1769 570 539 1111 225 15 1415 505 -394 849 216 -568 1458 1540 -594 264 1304 -352
3464 -352 -220 1521 -425 -1160 1351 929 -407 118 1009 -1089 -164 1135 -592 -557 707 -425 -412 853
3482 853 125 -1120 444 -97 -1083 605 -30 -1504 -207 967 -904 -855 880 -707 -1646 618 -63
3499 -63 -1676 -326 634 -1141 -190 466 -1095 -1063 221 -298 -830 -232 -787 -1210 275 -186 -1171 -360 256
3518 256 -1420 -46 867 -1417 -1431 894 -392 -1054 1062 256 -1688 238 679 -712 -571 503 -596
3535 -596 -337 987 -39 -486 599 117 -529 738 -42 -1148 327 1131 -622 384 1503 -690 -630
3552 -630 1883 316 -1083 1088 812 -641 1061 1664 -583 -60 1027 173 166 1463 210 -582 1071
3569 1071 929 169 1070 235 -298 1259 1209 -410 219 1242 -58 59 1759 382 -684 1184 1027
3586 1027 -555 550 962 -981 -104 1364 126 -193 956 -14 -406 870 88 -655 70 311 -636
3603 -636 665 751 -1196 -132 975 -742 -691 854 -804 -1233 1033 625 -1505 59 699 -778 -322
3620 -322 1023 -1038 -1436 276 -327 -668 279 -483 -1212 -24 46 -1237 -395 -199 -1600 -90 987 -1037
3638 -1037 -1157 423 -609 -1231 497 -7 -1525 -399 763 -849 -699 590 -567 -885 729 -154
3654 -154 -917 91 31 -899 471 408 -1100 67 474 -601 -109 1001 -999 -670 1240 138 -1122
3671 -1122 969 588 -439 704 1284 -831 -612 1215 -196 -332 974 540 -53 718 933 178 731
3688 731 440 -656 484 1085 -184 424 1102 -319 1 1754 238 -1052 1134 970 -616 740 1185
3705 1185 -397 -92 1576 401 -357 973 2 -334 1068 860 -498 254 436 -353 643 865 -633
3722 -633 -262 1213 -402 -328 1112 -262 -983 821 738 -1473 -125 632 -981 -630 921 -335 -816
3739 -816 334 -49 -737 111 -426 -1270 12 441 -446 -145 -226 -956 -498 561 -968 -1329 549 -598
3757 -598 -1082 358 -1 -1682 -263 599 -730 -806 527 -996 -1479 321 375 -898 -154 -185 -847 133
3775 133 245 -946 -342 143 -626 -340 636 -652 -649 962 -60 -718 546 238 -1142 449 1240 -147
3793 -147 -546 1067 56 -550 816 303 -497 588 576 -221 377 612 -623 520 1169 -61 -121 890
3811 890 20 -185 1554 481 -485 780 976 -168 673 1330 -610 -265 1142 548 -250 908 398 -475
3829 -475 726 1084 -174 1 515 67 787 715 -292 -283 675 -215 -169 695 9 -821 730 960 -815 157
3849 157 1112 -564 -294 1067 -235 -924 174 403 -792 289 -35 -958 -308 389 -543 -291 28 -961
3867 -961 -652 636 -667 -683 262 -444 -1245 501 436 -1641 -386 401 -766 -908 662 -760 -1263 581
3885 581 183 -1036 -188 -124 -961 -180 342 -845 -451 175 -502 -320 317 -748 -1140 144 -86 -830 363
3904 363 93 -1329 280 883 -747 -883 390 -379 -928 902 234 -942 145 796 -128 223 420 -542
3922 -542 -182 762 17 -92 892 -318 -156 1279 211 -662 606 646 -347 693 1223 -317 -487 1465
3940 1465 321 -213 1186 597 -704 732 1079 -237 161 604 -153 248 1296 -68 -224 820 341
3957 341 -214 1125 276 -635 875 1107 -571 255 817 -775 -432 1447 433 -675 538 84 -773
3974 -773 -39 664 -819 -158 374 -173 -184 311 -880 -328 841 -200 -809 29 -95 -1152 496 390
3992 390 -1116 -195 832 -1052 -464 321 -535 -1341 276 81 -691 107 197 -926 -139 581 -730 -724 19
4011 19 -541 -630 505 -563 -811 49 -21 -989 67 -10 -1423 -223 835 -444 -798 286 -279 -1001 487
4030 487 503 -640 -219 221 -797 45 663 -439 -182 669 -23 205 509 122 -481 970 441 -745 65
4049 65 480 -602 478 1438 -366 -668 724 553 -428 692 431 -480 611 1205 113 269 549 -158
4067 -158 97 1107 166 -189 702 183 -21 1226 636 -958 303 758 -276 151 1354 -296 -25 1185
4085 1185 503 -531 751 353 -354 455 909 -470 -115 775 71 -328 864 -227 -406 578 269 -540
4103 -540 159 152 -1028 545 696 -696 -276 304 -630 -469 669 -420 -1040 257 543 -611 25 268
4121 268 -910 -430 297 -693 -724 253 -533 -527 509 -202 -945 -71 57 -933 130 239 -1120 -406 591 -617
4141 -617 -613 535 -354 -1255 685 663 -823 -245 691 -638 241 614 -582 -386 13 -284 -594 458 -188
4160 -188 -752 511 427 -382 59 512 -672 -184 871 -98 -746 654 135 -88 603 627 -526 -39 1055
4179 1055 -257 59 676 -388 -381 1036 476 -498 446 327 114 848 879 -661 603 873 211 117 844
4198 844 34 -266 1020 107 -798 663 534 -112 889 992 -171 -188 746 -82 -150 1186 -95 -612 643
4217 643 613 -211 436 314 -673 150 683 -301 -324 735 51 -477 982 127 -1242 168 265 -553 6 392
4237 392 -693 -293 877 147 -623 325 -93 -784 308 80 -791 -82 62 -878 16 392 -975 -702 320
4256 320 -324 -696 525 -353 -1272 148 555 -735 -320 155 -849 -409 547 -804 -904 186 -118 -512
4274 -512 412 -46 -760 67 439 -597 -106 115 -733 -94 943 -206 -651 428 68 -701 178 334 -905
4293 -905 -47 576 -287 -107 726 -230 -355 639 295 -180 498 87 -223 812 659 -419 132 700 41
4312 41 155 1108 -290 -267 848 475 -393 630 633 -407 387 1200 -37 -140 619 260 -51 1092 342
4331 342 -524 544 759 28 555 573 -421 232 1120 129 -3 437 -96 -453 715 442 -720 118 569
4350 569 -170 364 901 -557 -405 565 -428 -594 160 -425 -531 43 219 -592 -168 -88 -458 -108 74 -579
4370 -579 -581 227 22 -460 473 -98 -1193 -47 444 -640 -490 -92 -1072 -334 653 -357 -880 -148 -83 -387
4390 -387 258 -175 -1046 5 476 -349 -169 380 -788 -548 468 -88 -751 133 -174 -739 187 307 -726
4409 -726 -556 385 -298 -239 354 -346 -351 384 139 -662 353 264 -519 125 428 -556 -407 590 -264 -95 906
4430 906 5 -599 567 435 -492 338 698 -369 297 1339 178 -91 433 -5 2 469 433 -581 369
4449 369 500 9 624 633 -347 1 862 189 -31 547 -27 -443 750 340 -484 -3 643 -303 134 445
4469 445 -351 -114 711 259 -30 320 134 -593 350 691 -311 -266 193 -400 -59 518 -398 -433 475 -138
4489 -138 -405 174 20 -1225 92 519 -553 -345 135 -643 -442 318 -110 -823 195 -184 -553 351 -167
4508 -167 -784 -497 322 -430 -243 250 -816 -638 388 -290 -640 56 -31 -885 40 446 -657 -406 293
4527 293 -388 -275 597 -428 -906 263 175 -511 187 227 -587 127 359 -366 -283 406 -254 -23 603 -66
4547 -66 -334 525 206 -348 289 419 -238 139 602 130 -346 216 118 -479 613 278 -111 403 403 -99 251
4568 251 557 -303 -67 776 130 -200 813 85 -386 777 324 -638 194 459 -410 421 1098 -41 -404
4587 -404 615 45 -54 658 238 -727 42 702 -128 94 146 -160 -25 345 -103 -518 259 -12 -437 446
4607 446 27 -934 236 495 -393 -205 145 -439 -502 369 -84 -658 55 13 -606 -173 383 -725 -467 170
4627 170 -536 -151 222 -408 -535 257 64 -691 182 181 -852 -24 505 -799 -571 443 -645 -388 254
4646 254 -203 -817 139 242 -8 70 -13 -472 -125 323 -532 -521 221 -186 -155 643 -9 -694 283 104 -314
4667 -314 248 254 -450 -141 540 -160 -226 225 174 -270 249 462 -444 -111 209 -210 247 766 -10 -166 649
4688 649 53 234 529 305 -512 488 580 -199 360 500 -278 -193 1094 -282 -309 375 373 -266 567 481 -271
4709 -271 102 581 -72 125 335 -546 -61 434 -28 -417 653 -96 -340 554 148 -458 -152 414 -59 45
4729 45 296 -189 -511 398 557 -167 131 130 -528 91 189 -484 -208 273 -251 -192 265 -595 -592 158 -36 -295
4751 -295 228 -37 -658 75 490 -530 -718 17 -369 -803 92 16 -429 -297 -5 -509 -164 120 -555 -353
4771 -353 417 -307 -336 644 -322 -355 206 206 -561 125 38 -650 141 393 -507 -93 584 -56 -375 60 -69 -249
4793 -249 204 301 -198 -30 313 -133 -34 403 49 -117 212 230 -88 524 -322 -541 450 450 -459 85 385 -456
4815 -456 196 710 158 -299 505 355 -436 403 230 -241 -51 442 -144 29 469 147 158 510 354 41
4835 41 281 237 66 664 394 -490 36 560 -107 -119 324 -523 -584 245 189 -256 47 371 -96 -5 389 -308
4857 -308 -452 -98 45 -273 218 -199 -356 169 52 -300 -35 72 -635 -299 478 -465 -340 194 -512 -491
4877 -491 311 200 -1008 32 274 -277 -344 -43 -418 -557 213 -312 -276 -190 -89 -598 383 325 -302 -51 25
4898 25 -457 -140 349 -307 -583 371 -243 -310 108 -125 -607 177 375 -184 137 516 121 -206 459 -501 -272
4919 -272 377 192 -239 321 -114 -531 330 209 -139 -106 404 79 63 619 78 -240 445 181 -128 285 437
4940 437 -448 183 797 12 117 599 67 -21 254 46 -129 450 157 -98 369 406 -410 96 643 -45 14
4961 14 292 11 -221 443 327 37 313 359 -131 -157 506 119 -129 418 28 -18 535 312 -470 5 210
4982 210 -42 -73 264 -393 -164 495 -51 -407 252 -183 -287 128 282 -664 -314 425 -263 -467 8 -389
5002 -389 -371 -64 124 -90 -132 157 -215 65 54 -712 -275 -22 -250 -364 56 -565 -683 92 -180 -455 150
5023 150 -224 -604 -233 318 -237 -440 432 -245 103 232 27 -105 -22 87 -266 248 124 -280 161 200 140
5044 140 168 588 -184 -328 519 54 -45 299 270 -322 202 518 -137 -438 116 356 327 504 -242 -98 218
5065 218 261 -311 494 226 -160 336 458 -110 -223 544 112 83 609 346 -403 261 430 -333 150 387 -7
5086 -7 -82 611 -38 22 254 280 -86 384 124 -246 -39 392 -179 68 244 -138 -96 143 0 -43 153 -202
5108 -202 -403 -42 323 -459 -292 90 -250 -25 322 -221 -412 336 -80 -536 180 -200 -395 -24 294 -297
5128 -297 -103 295 -517 -240 137 -356 -423 -250 -26 -484 129 240 -431 -282 294 -188 -255 155 -339 -268 148
5149 148 38 -431 -358 -198 44 84 253 -427 -20 52 -254 -286 167 -259 -46 342 353 -541 338 352 -491 -15
5171 -15 472 -80 -270 186 297 -16 289 365 -301 356 315 -51 77 300 154 157 572 75 -170 130 108 -225
5193 -225 337 302 -175 209 379 48 59 282 102 -211 612 37 -262 358 -48 -327 495 469 -145 357 355 6
5215 6 69 393 -260 -213 333 -18 -207 174 138 -484 208 139 -471 -26 190 -607 96 498 7 -310 140 237
5237 237 -317 87 -8 -506 -179 83 183 35 -188 -408 -97 397 -130 -536 165 -317 -266 194 -206 -395 -96
5258 -96 -24 -420 -256 216 -354 -359 313 -188 -123 -114 -85 -101 42 324 -280 -198 295 -318 -202 144 -238 36 236
5281 236 118 -34 104 156 -349 38 499 38 -386 311 -151 -236 290 -163 -125 113 216 -331 51 445 80
5302 80 -21 389 227 340 555 22 156 369 169 125 155 172 39 129 417 -226 -197 594 252 -87 130 65
5324 65 -422 292 235 -172 181 104 -384 258 421 87 -165 214 303 -447 327 63 -292 314 402 -235 21 -95
5346 -95 -137 -21 380 -320 -283 174 76 -222 104 244 -307 -217 -188 -373 -31 383 -227 -186 270 227 -309 -47 145
5369 145 -559 179 102 -343 -345 276 -206 47 72 -200 -387 221 -1 -171 -160 -228 -225 33 97 -245 -64 348 -344
5392 -344 -19 29 -420 -195 167 306 -369 211 31 -389 -49 40 -105 -247 266 -124 -91 223 89 -367 368
5413 368 -136 -129 282 119 -267 -220 455 364 -104 353 91 -95 386 0 -121 26 60 -43 252 346 -57 3
5435 3 265 318 18 187 116 -25 265 326 50 179 224 20 -179 673 1 -192 319 177 -271 542 203 -233
5457 -233 109 240 158 239 272 -124 17 395 -42 -55 411 334 133 39 491 -347 -375 -10 -115 -55 282 241 -23
5480 -23 -128 -125 -182 -86 -130 -234 105 282 -302 87 242 -163 -255 150 -200 -340 22 68 -183 10 255 -391 -74
5503 -74 128 -151 -124 -11 125 -349 376 61 -244 -117 -26 -151 -201 15 -196 -112 402 225 120 95 -183 -220
5525 -220 172 226 -551 -85 67 -171 -130 208 218 -63 246 -6 -339 240 96 -120 44 458 -186 -59 275
5546 275 -293 -133 562 -255 -216 366 112 -314 409 129 31 -136 333 -214 45 360 -54 -62 341 372 -179 136
5568 136 173 -69 205 368 -154 216 104 -289 -4 306 -257 118 285 15 -58 38 79 -2 362 399 -340 -190
5590 -190 14 -32 -2 307 158 -144 214 206 34 164 -5 -182 32 335 -513 -467 327 -168 -77 282 -268 81
5612 81 154 38 -252 -82 -49 -352 -208 421 -210 -277 19 -377 -404 -253 140 -416 -171 26 -474 199 193 -293
5634 -293 -355 192 -397 -512 92 -104 -57 75 106 -495 -276 142 -193 -209 402 -237 -332 -44 36 -85 -134 -162 -355
5657 -355 111 163 -280 93 44 -7 -46 568 -217 15 435 -36 -114 -142 106 -372 -5 172 -199 -13 387 -522
5679 -522 16 575 -38 -50 515 130 -123 365 126 -91 271 421 -176 -41 271 2 -40 427 338 -130 508
5700 508 31 13 309 400 -147 -59 310 217 72 275 122 -186 147 124 78 -39 33 -146 -90 314 -309 -74 293
5723 293 -107 76 660 152 -171 193 51 -304 318 414 -492 -206 274 98 -128 133 -107 -313 -44 153
5743 153 -253 180 -265 24 -92 -301 -513 -229 252 108 -119 91 -37 -237 31 112 -481 -119 -3 -170
5763 -170 -346 435 -145 -327 212 112 -187 -51 -44 -345 -43 183 -119 -225 170 -233 -38 207 9 -263 -30
5784 -30 -144 -381 38 142 -322 -258 356 50 -80 156 56 -64 115 105 -154 -53 59 -126 207 120 -244
5805 -244 144 214 155 -208 409 -146 7 396 434 -315 -107 253 -411 116 109 -126 -146 169 -274 181 271 -46
5827 -46 -99 136 12 -383 117 35 -223 225 289 -44 -89 334 -115 -459 135 16 -445 -68 270 -133 -159 -59
5849 -59 -222 -67 367 -164 -250 252 89 -131 168 8 -1 -223 149 6 181 -10 -177 -307 368 243 -174
5870 -174 -24 -238 -621 233 334 -179 -344 11 -368 -147 251 -305 -519 109 49 -225 124 -131 -211 -43 557
5891 557 -286 -32 -26 -159 -93 281 -326 -266 93 -257 -538 -117 111 -395 -352 317 2 -302 255 -121 -155 350
5913 350 58 -186 -248 -60 -245 186 126 -274 -13 134 -224 -366 216 -136 -394 260 417 -165 282 34 -256
5934 -256 184 315 190 -162 285 162 -276 395 -158 -244 477 228 109 56 210 -209 289 186 179 201 44 360
5956 360 -316 323 323 -241 108 -4 8 -379 -227 131 -322 222 -27 -490 210 -75 -387 21 285 -310 110
5977 110 246 -423 -73 -298 -84 -95 217 -131 -274 18 63 -194 -125 47 -431 -253 -242 -321 -80 -73 -246 -176 67
6000 67 -148 9 315 -94 -184 -95 -108 -252 -390 -60 -158 -76 91 -56 -381 -100 -220 -300 71 -67 -90 -136 46
6023 46 69 -79 192 56 66 132 -155 -354 169 -192 -426 -121 47 -333 -327 101 145 -225 314 90 -29 230
6045 230 -37 160 63 279 86 -75 168 -280 -181 198 48 -7 308 109 -84 -146 266 0 162 400 -406
6066 -406 -77 283 204 30 287 -3 17 291 361 -101 367 195 -24 75 -87 -337 97 272 197 -185 -73 178
6088 178 -22 8 103 -126 97 236 -300 -181 92 -103 120 57 177 -326 101 136 -233 80 7 -120 12 211
6110 211 36 -50 203 259 -479 40 -9 -320 122 87 -432 -183 -52 -287 -136 107 -17 -171 -82 -51 -366 -246
6132 -246 -8 -116 84 190 -155 -209 310 -142 -8 244 -236 -259 -180 -148 -364 -61 -97 -189 -117 368 -231 78
6154 78 207 -215 303 -56 -126 -240 67 69 -166 -38 172 -244 -301 150 72 -170 228 -30 38 429 183 -335
6176 -335 -61 184 -60 112 319 -308 -168 351 -1 83 239 81 -326 47 316 127 -102 52 -63 372
6196 372 630 251 34 -8 -58 98 118 387 -57 -37 62 -24 65 341 55 -53 458 56 -241 282 333 -96 112
6219 112 -12 -167 47 123 -240 -154 151 -80 -381 197 -31 -453 7 114 -15 -167 166 -251 -46 5 -370
6240 -370 -229 131 -14 -206 -73 -136 -234 346 81 -106 -179 220 -247 -82 90 -24 -143 -128 -142 -313 6 -210
6262 -210 -320 113 -179 -77 -476 -18 -187 -285 131 -136 -225 -1 -97 -322 366 123 48 -83 178 -172 -94 290
6284 290 173 -249 107 173 90 -40 99 304 118 60 -221 -55 193 8 -158 191 174 0 -63 150 48 -124
6306 -124 517 -48 -80 183 -44 11 307 325 15 245 90 -122 183 117 29 -245 205 -37 319 -19 60 154
6328 154 291 23 -204 100 397 -174 66 194 51 -23 104 73 -112 155 -106 -117 515 330 -217 145 -42
6349 -42 -50 -198 223 -78 -17 313 36 2 243 69 -109 19 139 -182 -223 27 18 -43 51 -130 -473 119 -24
6372 -24 -194 -42 118 -289 -74 119 -31 192 148 -327 -294 58 -226 -316 -145 -61 -241 -128 2 -355 -161 40
6394 40 75 -360 104 -205 -234 300 -169 -48 145 243 -313 182 267 -55 -293 13 -306 -129 112 204 -445 213
6416 213 9 12 -220 -35 60 -140 299 -100 207 88 169 -19 106 -47 -30 174 121 -328 90 172 -109 -1
6438 -1 301 338 -15 171 91 232 423 437 -147 365 86 77 -8 -168 20 246 427 64 -128 261 -199 83 211
6461 211 262 -62 89 17 -214 287 -120 0 -215 83 281 -79 62 -141 -91 -186 -79 -101 -67 334 -280 0
6483 0 99 1 37 191 -43 70 33 -394 99 -40 111 -107 -233 60 -190 50 -231 -125 -152 -147 25 -405 -8
6506 -8 -5 -330 -60 160 -230 -35 145 -50 -64 119 -80 -9 287 -55 -264 -295 -120 -306 -267 257 37 -203 153
6529 153 -86 -138 -28 36 -306 -209 310 -117 -98 -7 -129 -221 347 105 -165 315 34 -163 -222 18 -30 399 221
6552 221 -107 -78 327 133 97 137 213 -311 219 435 -157 264 196 14 203 45 -371 58 86 -90 -110 80
6574 80 99 -118 -49 133 -249 132 56 148 39 309 235 -74 122 -44 60 59 174 -280 337 72 60 -239 154
6597 154 -155 45 487 -193 -359 -53 -357 -336 225 139 -326 117 34 -54 -16 -68 -484 -84 -4 -25 17 127 -94
6620 -94 -473 -168 237 -180 -219 61 -126 -246 140 252 -83 -29 30 -257 -174 -145 -118 -71 349 388 -86 147 -491
6643 -491 -365 -76 78 -172 89 258 -230 -250 62 -349 -189 267 -153 -133 247 -85 56 108 -54 -40 142
6664 142 304 -213 -79 74 33 -219 304 -9 -268 -25 41 -191 -12 20 -128 291 100 -39 -73 182 -84
6685 -84 17 -185 70 25 203 105 -181 -60 263 -138 -75 293 -23 183 189 244 -219 2 121 8 270 29
6707 29 58 -36 332 -25 441 98 30 216 249 92 23 123 -71 -342 -28 344 -141 210 82 -79 1 272
6729 272 -127 47 -32 102 -19 -149 34 -35 88 187 -108 -239 7 27 -71 -125 63 -109 210 -103 -105 11 -293
6752 -293 73 311 400 -297 -63 0 11 -45 -1 21 -21 -28 98 -382 -183 125 -161 35 317 143 -301 -177 -176 -261
6776 -261 76 -61 -81 -89 54 -369 63 19 -7 -409 109 -105 282 88 103 -39 238 64 32 316 198 38
6798 38 24 150 -191 -96 138 -109 -116 219 -176 -22 129 62 -89 95 409 28 90 66 288 -162 -141 234 -65
6821 -65 298 68 -190 173 66 29 172 44 107 -233 284 82 -202 54 -26 -36 33 205 -169 77 28 123 240
6844 240 104 -96 -11 -65 34 -108 -28 -102 -395 -74 262 -250 -18 -171 -156 4 230 16 -136 73 31 -69
6866 -69 162 277 -131 40 129 -141 -317 -125 -21 -172 102 -146 90 336 124 -389 -200 137 -183 -58 12
6887 12 92 -23 -245 -128 -246 137 41 -136 57 137 50 -90 -85 72 -264 -175 -17 -173 5 153 63 -1 60 -54
6911 -54 -184 337 -22 -36 224 -92 -111 138 -200 -140 -219 -29 -273 -2 109 48 -98 -145 -15 -94 386 157 -206
6934 -206 210 392 -173 -52 137 -15 86 146 3 -126 283 29 -140 240 129 10 135 145 151 -128 164
6955 164 174 59 91 -293 49 136 -281 56 -5 133 -202 23 170 63 170 15 -81 -181 165 -103 135 -42
6977 -42 174 -26 241 51 113 193 97 -197 221 14 -124 10 -170 -223 -197 91 319 156 33 75 -240 -246 209
7000 209 -155 -103 142 -41 -35 174 -43 -38 303 -156 -134 -199 -64 -73 -213 221 56 -291 -170 212 -22 -41 12 -186
7024 -186 0 253 -168 17 261 -169 -184 29 -287 -192 -105 -167 -254 -55 97 -51 53 377 80 -74 188 65
7046 65 -114 -42 256 -159 250 236 -279 -13 161 -137 -156 443 79 291 478 -25 83 140 -28 -128 80 308
7068 308 -94 238 65 -2 79 176 -153 -205 329 -55 -13 62 457 127 -21 -259 -153 -87 164 -245 123 160 105
7091 105 294 447 -74 -124 -95 -126 168 228 266 -20 -305 246 -46 -214 225 11 -273 -158 -9 -163 -179 117
7113 117 -22 -54 26 -101 -158 195 -278 -291 219 214 -189 235 169 173 -121 9 86 -25 353 -207 -434 -135 121
7136 121 -3 106 270 -89 -24 -87 -274 -214 -81 -118 -255 128 10 -270 179 154 -375 -97 -220 -496 -228 117
7158 117 -32 191 160 95 11 -115 132 -158 -178 -94 -128 -25 15 -414 -13 -33 -216 -54 40 128 -546 148 153 -274
7182 -274 62 14 -10 -91 299 -200 -68 257 76 -187 54 74 -77 326 258 -227 168 317 -142 83 386 49
7204 49 58 152 440 53 76 22 116 -28 -117 -129 -64 230 231 -147 -17 148 80 35 218 -57 -216 224 224 212 203 -398
7230 -398 -180 393 -75 -9 148 77 -16 -148 255 192 130 -56 -219 -28 -100 -222 -180 174 57 66 -115 -52 -185
7253 -185 -217 -151 -171 13 -105 -362 -140 27 72 -106 190 -256 -209 -79 -165 -151 -68 176 -73 174 355 -116 -163
7276 -163 308 157 -24 -31 285 -143 24 292 -58 -84 -63 -134 -123 292 -39 -27 -171 -171 40 394 -38 -213 26
7299 26 220 -170 -85 159 114 129 37 126 -10 310 15 -264 2 26 90 80 221 -89 -3 83 90 5 -145 128 -100
7324 -100 188 251 -143 -45 115 -440 134 191 116 132 -113 -18 119 206 357 -79 146 14 116 41 214 -11 -63
7347 -63 348 148 -27 -2 121 -41 20 -146 46 -128 79 -44 -119 148 281 2 213 172 -43 60 -100 -50
7369 -50 -108 76 -124 -96 -38 -23 115 -11 133 -235 140 190 -150 -200 -8 41 -130 -114 -124 -249 38 -247 -215 -20
7393 -20 31 -47 -76 -146 -117 -300 -47 -321 -345 -23 -82 86 54 37 -52 -68 24 -280 86 208 156 -80 550 411 -122
7418 -122 128 -201 -222 -52 -233 -133 -57 298 -135 -181 -145 135 253 109 -179 -490 204 76 -322 164 159 -49
7440 -49 -91 125 -1 -23 -5 -124 -16 283 434 48 465 233 -185 154 157 101 -222 204 -85 -39 322 86 -57
7463 -57 240 95 -75 288 249 -226 -10 37 114 -1 -58 -189 122 220 -192 -263 75 74 74 194 7 -232 -252 282
7487 282 -9 -48 282 -185 -320 216 -75 -117 44 277 -456 -107 -26 -178 -88 -216 -23 22 83 -6 28 -42 -31
7510 -31 -151 23 273 -200 -190 -109 -240 -78 132 -63 68 113 -276 137 -149 -14 -118 -249 -286 -195 61 206
7532 206 45 -211 162 133 -166 218 268 -107 -75 -187 -12 77 -10 16 94 -28 -218 7 135 118 -118 141 569
7555 569 -114 18 -37 -8 221 394 83 -305 -8 -12 -257 197 173 -152 -101 403 67 19 -7 -7 53 82 180 24
7579 24 293 204 -30 -133 252 -131 63 -48 72 243 36 -287 -240 262 122 -124 195 228 41 220 74
7600 74 144 179 279 85 -122 179 112 75 263 170 169 144 293 84 -80 208 -224 -165 49 -62 -189 -182 -12 -95
7624 -95 -17 -205 -305 0 114 -72 -164 249 -21 52 -214 -313 -118 -100 172 23 -226 -44 -199 84 160 34
7646 34 -471 -191 84 -195 116 -253 -262 32 304 -59 -249 92 123 -316 263 -74 3 94 186 -209 227 104
7668 104 4 58 45 101 -101 120 -217 155 -93 124 -123 164 175 -175 -10 -155 -153 -53 138 -143 -24 350
7690 350 -356 -109 249 252 -135 12 208 -58 245 192 -63 -315 307 -102 -274 -128 205 -153 17 253 90
7711 90 118 -140 -231 153 -160 -123 98 323 -59 -331 7 97 -185 179 -3 -389 89 318 -91 86 94 -186
7733 -186 17 129 254 86 274 -199 -33 1 72 248 336 -34 -161 -207 22 87 -63 76 -68 -232 113 -40
7755 -40 -1 45 308 -94 77 6 -6 -144 135 -151 -335 210 16 -384 -125 -183 -260 174 26 -253 -187 40 -163
7778 -163 -37 272 -5 -2 158 292 -117 -154 3 -356 36 223 -17 -321 -6 -127 -76 -58 -65 -127 108 78 138
7801 138 -379 186 -62 184 33 166 -217 -67 271 -254 -59 16 -179 -226 50 192 265 454 -133 -93 -30 49
7823 49 -20 90 24 63 157 217 -53 -132 244 183 -11 185 125 -111 148 306 -225 -275 280 -44 338 -52 -186
7846 -186 92 -62 -39 -264 47 354 -142 -106 364 81 144 21 -55 -198 -50 -128 34 -38 122 -191 -81 -141
7868 -141 -101 100 75 -287 -193 181 97 47 -139 -45 195 53 -53 -228 -152 237 198 -139 230 -213 -152 192 -102
7891 -102 -225 202 106 110 414 -22 184 22 110 -24 -7 -22 -38 -72 127 36 -82 -50 -38 -88 25 22 -152 156 233
7916 233 -18 53 110 216 -355 348 -13 -159 142 40 -74 1 268 -34 37 164 67 -174 237 -163 -52 -1
7938 -1 -41 -61 153 80 -156 -127 16 78 21 206 -94 -193 227 38 30 -78 -18 -319 144 168 -102 123 604 -109
7962 -109 8 80 57 134 139 289 117 33 14 -50 39 135 7 -102 85 213 -227 185 93 -8 199 -11 -401 99
7986 99 187 -47 -117 -71 182 151 238 -30 -197 -65 57 -257 -33 -421 79 -120 112 112 65 -35 -149 -268 -21
8009 -21 92 -264 -413 144 -75 219 -8 141 -76 -141 -140 -10 2 -48 -113 129 200 -77 -168 372 -148 -16 274
8032 274 29 -143 -13 -316 -72 -119 104 -218 213 16 258 191 -89 -98 -146 -11 39 -66 -15 74 -132 194 72
8055 72 -243 -83 128 -331 -67 76 227 -218 229 145 -293 -109 9 -94 -234 95 -1 250 -36 -5 -229
8076 -229 211 -52 -159 266 231 -25 89 493 15 172 142 100 -67 242 -186 253 -130 244 -98 160 -163
8097 -163 -102 25 583 -33 12 0 117 96 100 -312 -325 376 175 -45 -117 43 -223 -113 65 -123 62 50 20
8120 20 298 79 86 -88 -55 -1 159 151 136 -71 23 138 -90 -62 28 -245 -189 -4 49 -146 44 -49 128 182 181 -171
8146 -171 111 148 -66 -358 -199 -275 -43 139 22 85 10 -281 -201 80 -73 -121 -173 -33 139 -128 -23 341
8168 341 -188 -15 56 -388 -72 16 120 42 -21 4 -223 47 -114 -309 31 -70 -134 -119 165 -157 317 -89
8190 -89 121
8191A21
$$ Imaginary data points
##PAGE= N=2
##DATA TABLE= (X++(I..I)), XYDATA
0 0 0 0 0 0 0 0 0 0 -8 8 -8 8 -8 10 -16 16 -24 24 -29 32 -40 47 -53 59 -69 81 -90 101 -114 130 -145 164
32 164 -183 202 -226 252 -279 308 -345 381 -420 466 -515 571 -635 704 -784 876 -983 1108
50 1108 -1257 1440 -1669 1964 -2364 2929 -3799 5276 -8267 16619 -84300 -292856 -2597
63 -2597 132819 -87088 -140658 69204 92291 -41010 -27159 76450 30055 -91023 -86735
74 -86735 22235 39940 -27944 -29905 8127 -17897 -16256 34172 1388 -58520 -11566 22552
86 22552 -13462 7431 15988 -85304 -91683 36992 35413 -69920 -40383 28031 -11304 -28689
98 -28689 4946 -36963 -90157 -44715 8870 -3076 -14432 238 -6186 -40952 -40317 6156 -14677
111 -14677 -109322 -76013 73761 61379 -61923 -13561 69757 -34025 -87109 32689 29452
122 29452 -100934 -56821 73435 41100 -32670 -3476 17137 -14696 -7092 29103 18236 -25670
134 -25670 -31265 16519 31783 -20033 -40342 -3596 5030 11573 52886 29619 -30551 7390 35513
147 35513 -42801 -41754 45856 -8893 -84485 44306 137897 -1985 -86236 28188 71674 -29085
159 -29085 -54182 25047 40900 -17762 -8610 72147 61640 -46222 -49675 51976 46156 -30736
171 -30736 -4137 39259 -388 1304 47067 11187 -28428 7256 11672 -6096 36292 30008 -56733
184 -56733 -47591 41032 26062 -42514 -27173 17622 18355 7756 2663 -11587 -36421 -54625 -36226
197 -36226 -3065 -11812 -26631 -4765 -1644 -4716 34015 5763 -102236 -76946 45188 4429
209 4429 -94476 -16459 57257 -34561 -60552 46451 37463 -78871 -70614 32294 39500 -33696
221 -33696 -47876 917 6270 -32783 -11232 34986 -12124 -59644 10511 55249 -14814 -44733
233 -44733 -7337 -20388 -22388 32061 16537 -42483 -8235 32254 -13053 -27045 4859 -25132
245 -25132 -54761 4746 49736 11772 -24111 -11591 8248 2199 -19163 -22088 -15400 -28891 -12128
258 -12128 47221 37140 -34941 -20848 35597 4148 -23725 15304 -97 -43674 6365 48534
270 48534 -5767 -25558 14946 4371 -9377 37966 42415 -22207 -32373 20154 31370 -12746
282 -12746 -37908 -6717 24411 6410 2329 40635 20439 -42287 -15894 38800 -4361 -44359
294 -44359 -1616 5395 -15476 28718 35418 -41552 -40061 33532 11043 -43366 -5186 25931 -20572
307 -20572 -31315 24471 33247 -30403 -57624 4756 48429 -8360 -49951 7885 28493 -33868
319 -33868 -24525 38699 3112 -51500 -1590 39730 3311 -16512 -16900 -31440 -8221 22496 -11941
332 -11941 -33330 12249 25576 -7963 -4530 10473 -20025 -46597 -24550 10761 10317 -24870 -28506
345 -28506 16626 25385 -15143 -15313 140 -32829 -31229 24429 8779 -45490 -14781 20076 -15738
358 -15738 -11096 28371 -9439 -46385 10432 41934 -11843 -36876 -4393 6011 -9506 -1595
370 -1595 21201 13372 -21076 -10769 40651 24908 -42992 -27230 29470 7386 -12346 33871
382 33871 25970 -30793 -4659 41823 2620 -29824 -3990 1619 -879 30541 28978 -12758 -12378
395 -12378 15131 11312 -3806 -4894 -4279 -5436 -2730 16130 32444 -1475 -40398 3077 51475
408 51475 4174 -31188 15687 20742 -26605 -2621 37465 -4359 -35310 5183 30612 22255
420 22255 16347 -5074 -18723 11400 24749 -9184 -20201 4799 12340 4914 11880 23263 12742
433 12742 -21826 -25848 25424 37520 -28276 -38904 31588 31005 -24987 -3209 26743 -22496 -34916
446 -34916 22894 25627 -18678 -15829 1034 -5814 2870 9263 -17363 -28175 32 19390 5046
459 5046 -18070 -17564 602 -8301 -25335 4599 22362 -27278 -33582 36672 34905 -40215 -35623
472 -35623 11378 -8582 -26117 8164 10388 -16796 -4789 15435 7428 -3407 -14684 -26426
484 -26426 -8810 13237 2481 -12781 -10431 -897 10065 5891 -10990 -5387 4115 -12920 -4894
497 -4894 28680 1349 -43577 -6150 33328 -4620 -18660 19194 11226 -16053 11580 26989
509 26989 -9949 -23477 170 11660 12821 13307 5257 1980 9741 13882 12575 -1421 -16299 4010
523 4010 27241 11627 8113 29662 6583 -22426 20200 41711 -19312 -31873 28869 32443 -6767
536 -6767 9800 29019 -3394 -16372 13674 24308 2823 -15887 -7158 17590 18863 -4629 -8549
549 -8549 -135 -5002 5828 22498 1605 -16817 3743 3605 -16004 3548 10474 -31168 -23540
562 -23540 34383 26624 -20575 -11888 9008 -7605 -11925 2338 -2850 -13217 -9039 4265 17436
575 17436 9367 -17616 -19604 1963 6703 2243 -570 -13216 -8569 17913 8126 -18821 -2266
588 -2266 6266 -23322 -5784 38604 7391 -38323 -5251 26402 -3358 -17911 1010 -491 -9174
601 -9174 5019 17781 6690 -14923 -20309 1357 13167 -5300 -9005 5153 -1195 -58 24397
614 24397 8179 -31438 -12822 17946 -4600 -9831 19380 4155 -21598 11169 32046 -5010
626 -5010 -23750 -801 9306 3865 3532 3701 513 -4902 -3742 13074 16294 -11312 -14376 15932
640 15932 16193 -3130 1964 -532 -17036 1494 21855 -780 -8217 13798 5372 -6484 16197
653 16197 11592 -25075 -15709 20583 15325 -2758 3350 9111 3460 1987 3757 4323 -4123 -14020
667 -14020 3877 28023 11675 -9194 6575 10695 -5710 7206 15390 -14957 -13170 24877 16840
680 16840 -10305 6645 14048 -13321 -4631 26546 10057 -19193 -6768 14919 10760 -6509 -11385
693 -11385 852 3988 -6342 4263 20983 -4175 -25854 3104 16421 -13782 -16662 1014
705 1014 -8945 -6991 18504 5039 -23238 -7665 6554 -10484 -8688 4402 -9780 -17766 3878
718 3878 13515 -1953 -16982 -15876 -135 7372 -5009 -7834 4374 -4362 -11975 10609 10729 -21164
732 -21164 -16911 9533 3526 -1577 10523 -4444 -19285 7250 17232 -10233 -11685 6668 -327
745 -327 -3367 15670 11523 -13131 -15321 3588 14261 4054 -10865 -2495 14708 5532 -1727 14387
759 14387 4500 -23814 -3250 27491 4875 -13373 8238 8905 -4726 13582 19073 -11625 -11984
772 -11984 15880 13818 -320 4331 4542 -4683 162 12832 15007 847 -11384 5254 26403
785 26403 6779 -15126 3138 9576 -12075 1112 26521 2312 -17963 8656 18796 -1583
797 -1583 -3138 -1138 -11923 -1498 15902 4274 -6697 2037 1539 -2779 4081 2514 -8692 -10578
811 -10578 -2644 9161 11991 -7596 -15950 5669 9677 -11071 -3748 9411 -12235 -15673 15992
824 15992 11192 -18682 -9198 6618 -4540 -1460 11318 -4956 -17095 1361 8659 -5395 -9678
837 -9678 -4284 -2548 -1374 982 5791 2409 -15518 -13890 13033 8110 -23154 -11302 15320 -2487
851 -2487 -13613 12406 6175 -24365 -9998 15106 300 -12132 -1208 -643 -2815 5455 2653
864 2653 -8683 -8018 -1772 2809 5917 -914 -5077 1237 418 -949 10160 2562 -18494 -1424 23537
879 23537 3239 -12604 8025 6728 -11940 4150 18627 -3817 -11248 8563 11933 4352 5363
892 5363 -1416 -7726 3291 10781 4123 -129 -1245 2552 9852 6539 420 4406 -1474 -10098 10589
907 10589 22600 -8026 -17764 13556 13860 -10011 2733 14834 -7628 -8759 17352 13134 -8153
920 -8153 -6878 960 733 4562 5965 -337 -2414 804 7813 10479 -3105 -12772 413 5400 -5167
935 -5167 4597 12973 -10587 -13724 17977 13537 -18697 -9765 9299 -5087 -6388 12170 3951 -14832
949 -14832 -5771 7095 2945 -4008 -8788 -7146 989 2353 -871 244 -7157 -12523 2908 9052
963 9052 -8190 -8484 2448 -7328 -7724 11568 346 -23002 -5092 14141 -3028 -7792 5486
976 5486 -4370 -14128 1748 7816 -7219 -10972 -2720 2456 5124 724 -5168 -4427 -4702 -3972 5278
991 5278 1417 -13156 -3849 11572 -1011 -6374 8610 -3147 -20338 4524 19789 -8891 -15691
1004 -15691 10168 7941 -8586 979 7540 -6334 -8661 4655 10516 3603 -6663 -4626 7875
1017 7875 6476 -4068 2186 5053 -5834 2505 17638 2047 -10353 6330 7131 -5675 7551
1030 7551 14422 -7947 -6497 18192 11874 -6475 313 6344 -742 2922 9364 3700 -1693 -1117
1044 -1117 3865 10256 3877 -6657 197 6687 210 3990 8960 -7780 -11134 10742 7324 -11509
1058 -11509 140 9390 -8436 -3921 15969 974 -19230 -4111 7751 -2723 -5295 480 -2357
1071 -2357 -4400 307 2468 -63 -9993 -12933 1294 6287 -7081 -6439 2751 -7069 -8750 9004
1085 9004 410 -20508 -6543 9255 -6145 -7601 6911 -5620 -17078 2550 10674 -8375 -13024
1098 -13024 -1641 291 -2189 -1699 -1971 -3926 -8091 -5109 8460 6325 -13469 -9064 8932 116
1112 116 -9416 4061 584 -14169 1429 15928 -1863 -8880 4428 -543 -6907 6773 5951 -10460
1126 -10460 -5413 10057 7268 587 -381 -1359 431 1754 1830 5518 1768 -7782 1935 15441 2187
1141 2187 -8226 4064 3453 -6201 7614 13236 -8653 -7681 13921 5963 -7471 4890 6310 -8934
1155 -8934 -1486 14514 5586 -7851 -3787 5428 6936 -124 -3703 3296 3223 -5159 3370 13247 -4091
1170 -4091 -13762 7139 10775 -5757 7 8475 -5932 -4309 13725 3479 -11598 134 6769
1183 6769 -2763 1274 7497 -2791 -6892 2126 5809 1373 -3908 -5351 2557 5676 -2477 -983 3817
1198 3817 -7352 -8980 9337 5483 -13690 -3140 9374 -4505 -5414 8048 -3783 -16094 942
1211 942 7885 -6518 -6570 1831 -2815 -4365 2586 355 -6872 -8057 -3091 3387 1080 -9001 -5803
1226 -5803 3674 -3723 -6424 5892 -907 -16602 -1243 12281 -5978 -11217 4087 -1571 -9774
1239 -9774 5292 6993 -10355 -7172 5784 899 -4328 -255 -1423 -4955 -253 4607 4719 -1853
1253 -1853 -8824 877 10023 -2018 -8630 5585 3961 -8670 5664 16034 -5030 -11308 8138
1266 8138 7362 -4426 2726 4471 -5327 2231 12498 3421 -3241 1838 2344 1476 5383 4271 944
1281 944 -87 75 7219 11055 -2565 -7230 8145 8419 -4471 4322 10031 -7113 -5351 14710
1295 14710 6863 -8768 1534 6667 -2670 2542 9747 -2958 -8088 3327 6052 469 -875 -1240
1309 -1240 128 1687 -27 2378 2635 -7888 -7343 9555 6457 -10350 -2585 6689 -5934 -5681 9370
1324 9370 -815 -13925 1049 9118 -3878 -3941 2653 -5848 -7329 3296 2245 -5157 -5203 -1813 1914
1339 1914 2666 -3790 -5156 -463 -4958 -4757 5663 794 -12948 -1508 9142 -4962 -7189 6014
1353 6014 -3147 -12153 4168 8509 -8071 -7823 3771 -294 -3395 2228 -1390 -5902 -354 2676
1367 2676 1114 -719 -4488 -2518 3598 427 -2680 3758 -32 -7549 4621 10500 -6809 -7980
1381 -7980 8662 2551 -6352 7299 8489 -8468 -3501 10792 2602 -5422 537 2925 1355 4916
1395 4916 4807 1123 396 -466 2461 6195 -469 -4492 4982 5317 -1586 6404 9272 -7008 -5142 12684
1411 12684 5240 -8636 2392 7856 -3423 699 9757 329 -5864 2651 4999 1690 2760 475
1425 475 -2057 1589 2994 1967 1764 -2913 -3374 6977 5941 -4820 -343 4549 -6197 -2455 10697
1440 10697 -105 -12192 2843 9001 -4789 -2921 4803 -4999 -8060 4372 4316 -4082 -3527 -1265
1454 -1265 -692 1101 -1180 -4530 -2999 -3481 -1884 5906 924 -10377 -2647 5357 -4830 -6293 4385
1469 4385 -3461 -10823 4337 8263 -7320 -6299 3234 -4028 -6153 4093 408 -8312 -3093 3165
1483 3165 1687 -1166 -4614 -4127 902 206 -2274 2300 -366 -7596 961 8030 -4468 -7353 4437
1498 4437 -259 -6178 6249 6202 -9400 -4772 8235 1028 -5051 2385 1242 -3460 1945 4927 -23
1513 -23 -2205 -1947 224 5173 2445 -3103 1806 3029 -2292 2761 5871 -5316 -5185 8195 4682
1528 4682 -3208 5852 5292 -6226 1155 10565 -1919 -7773 4549 5729 -522 3233 5025 27
1542 27 -1037 1609 2731 3068 -1154 -3645 4388 6023 -1420 1161 4595 -4484 -2526 9602 1915
1557 1915 -8618 2537 7060 -4287 -930 6375 -3751 -7192 4480 4777 -3627 -1220 788 -2053
1571 -2053 29 739 -1821 -2024 -2874 -2380 3576 2123 -7098 -3897 2652 -3666 -4544 4067 -2672 -9548
1587 -9548 2638 5733 -7713 -6018 2349 -5107 -6174 4341 1276 -7975 -2710 2096 -1762 -2992
1601 -2992 -3348 -5552 -2722 -548 -1557 1090 -1482 -7416 -1262 4983 -4360 -7354 2362 -1340 -6738
1616 -6738 4429 5163 -8152 -5260 4907 -965 -4356 3024 -680 -6283 2565 6230 -1305 -3550
1630 -3550 -1020 20 2346 1276 -1193 1710 1482 -2515 3047 7055 -3026 -5487 5790 4332 -3021
1645 -3021 3847 4274 -5734 -222 9542 954 -4240 3413 3430 -1330 4140 4579 -3093 -2082 3021 2994
1661 2994 2559 988 -1191 2583 4244 -987 923 3432 -4584 -3900 7984 4281 -5209 1507 4761
1676 4761 -3717 374 6359 -4003 -6977 4389 4078 -3075 1017 2083 -3243 -1205 2778 -302 -2248
1691 -2248 -2290 -1997 2670 2664 -4062 -2971 2180 -3692 -3300 4653 -1315 -8386 892 4952 -5047 -3283 3318
1708 3318 -4421 -6101 4302 1949 -6781 -2317 1179 -2716 -1547 349 -3467 -3277 -401 -763 453
1723 453 -1209 -6313 -2551 3113 -2987 -5117 2610 -812 -6254 2315 4565 -6891 -5602 3241 -2027
1738 -2027 -4510 3135 559 -6042 -16 3789 -1803 -2515 -691 -2590 -410 2681 -696 -1090 -134 -1952
1754 -1952 811 4259 -3331 -4539 3893 2271 -3833 3417 4656 -5705 -1650 7705 194 -4629 3122
1769 3122 2302 -2688 3298 5416 -1886 -1511 3500 1904 1683 2003 -934 249 2961 1346 2537 3919
1785 3919 -2113 -1594 7321 4322 -4371 1607 4927 -2785 489 8368 -30 -4529 4323 5001 -1562
1800 -1562 1451 2455 -2931 -284 4261 913 -549 622 -811 1366 3284 -958 -1873 950 -1916
1815 -1916 -1503 5217 657 -7052 593 5167 -3245 -2368 3195 -3392 -5832 3561 2853 -5039 -1560 1468
1831 1468 -2814 -1110 1647 -3140 -3879 -983 -1092 -109 271 -3734 -3151 1832 -1400 -3416 1121 -2290
1847 -2290 -7237 1123 4208 -5355 -4355 2926 -1894 -4316 2924 306 -7292 -1597 2559 -1723 -1881
1862 -1881 1035 -1932 -1756 1566 -100 -1560 -942 -2932 -564 3557 -509 -3620 1853 733 -3434
1877 -3434 2906 4055 -5358 -2917 6363 721 -3884 3262 2321 -3426 1830 5519 -1202 -1829 2273
1892 2273 1310 1212 2763 -67 -68 2513 1108 1554 3959 -523 -2374 4221 3614 -1827 2485 4554 -2463
1909 -2463 614 7848 719 -4307 3435 3637 -1792 1939 4281 -1518 -368 4748 2085 -284 752
1924 752 -286 435 3030 804 105 2579 -397 -936 4431 1565 -4886 286 3771 -2150 -502 5272
1940 5272 -1580 -5119 3919 3757 -4391 -1886 1890 -2166 -873 2749 -769 -2840 -461 -405 -135 499
1956 499 -2779 -2944 1163 -1021 -2525 1485 -742 -5825 245 4200 -3676 -3740 2232 -2259 -5083 2401
1972 2401 997 -6803 -2409 2732 -1135 -2247 358 -2522 -3562 67 -200 -1374 -1091 -2554 -645
1987 -645 2771 -468 -3789 143 -135 -4009 1040 3607 -3760 -3212 4738 489 -3396 2410 709 -5287
2003 -5287 410 5141 -700 -2058 1902 781 130 2261 369 -1878 300 450 1207 3467 184 -2431
2019 -2431 3400 3043 -1669 1640 3994 -2493 -798 6655 1573 -3492 2577 2958 -1926 2201 5233
2034 5233 -1070 -1539 3881 2663 105 1193 339 107 2941 2069 1034 2436 -348 -1197 4013 2846
2050 2846 -3304 588 4157 -1478 -304 5650 -125 -4654 2539 3504 -2885 44 3573 -1184 -1113 3949
2066 3949 906 -2884 -911 -227 -534 1272 -533 -1598 1128 153 -1683 1604 -634 -5665 -765 3719
2082 3719 -2771 -2888 2782 -1397 -4524 2038 1555 -5630 -2220 2121 -2031 -2597 1491 -1707 -4048 -319
2098 -319 75 -1720 -993 -1938 -1883 722 -662 -2924 -613 -914 -4277 250 3149 -4215 -4250 2957 -566
2115 -566 -4615 1058 1094 -5072 -823 4099 -1384 -2946 930 -532 -2252 1033 677 -1700 -381 440
2131 440 520 2529 -380 -2743 915 1545 -2134 1000 3185 -2342 -729 5914 2004 -3614 1775 2509
2147 2509 -2567 1419 4998 -1100 -1816 3871 2345 29 2071 1204 -856 1343 2375 1344 1937 178
2163 178 -1052 3270 3220 -1828 813 3818 -1475 449 5707 736 -4111 2566 4256 -1794 322 3533
2179 3533 -1304 -1219 3989 1410 -2045 39 587 -188 1257 872 -874 -244 -240 -1375 1646 475 -3823
2196 -3823 -177 3262 -1534 -1415 2946 -2034 -5096 1500 2200 -4535 -2049 2385 -1379 -1980 1815 -884
2212 -884 -4519 -1188 77 -1782 -1094 -1147 -2089 -314 -249 -1734 -183 -1343 -4494 -935 2321 -2842 -3434
2229 -3434 1872 -888 -4088 1357 1469 -5695 -1913 3232 -1166 -2689 1215 -535 -2935 771 972
2244 972 -2354 -1141 -122 -681 784 345 -2053 365 939 -1556 729 2440 -2621 -2407 3492 436
2260 436 -3291 1796 2475 -3447 682 5252 -400 -2610 2500 1386 -1686 1175 1816 -808 1110 2676
2276 2676 1356 1558 488 -723 1842 2011 -1096 687 3397 -949 -8 5486 1404 -3013 2313 3637
2292 3637 -1892 700 4474 -960 -1717 4202 2751 -1646 870 1828 -460 1359 1972 -182 202 547
2308 547 285 1777 1271 -2386 -211 2504 -997 -1188 3211 -653 -3735 2426 3098 -3373 -1205 2637
2324 2637 -1967 -2401 2799 266 -4156 -323 1566 -1052 -436 -40 -2001 -1084 78 -1425 -737 -918
2340 -918 -3052 -705 2268 -2189 -2693 1252 -1397 -4114 1077 1251 -5197 -2132 2761 -1554 -3087 1647
2356 1647 -648 -3994 113 1396 -2168 -2153 -655 -1128 79 389 -1420 -888 -514 -1603 236 1677
2372 1677 -2594 -2389 2833 702 -2716 1876 1466 -3824 -265 4259 -1053 -2706 2551 1197 -1877
2387 -1877 1981 2523 -1486 -579 1797 381 548 751 -319 890 2392 443 1200 2567 -1091 -552
2403 -552 3816 1458 -2651 2160 3394 -1541 1481 4800 -552 -2114 3787 2270 -1463 1596 2272
2418 2272 -1139 637 2956 984 176 801 113 1284 1841 -1091 -77 2235 -439 -223 3114 327
2434 327 -2927 2021 2964 -2454 -424 2879 -1381 -2110 3531 1398 -3095 -44 1811 -1775 -730 742
2450 742 -1332 -1175 366 -198 15 175 -2122 -861 1222 -1633 -2342 946 -848 -3480 1335 1641 -4036
2467 -4036 -1985 1901 -2302 -3248 1615 -500 -4085 46 1518 -2385 -1617 184 -1711 -1371 192 -853
2483 -853 -1366 -627 -1798 -540 1357 -1692 -2555 1578 -262 -2980 1136 1008 -3962 -1080 3460 -1110
2499 -1110 -2500 1918 442 -2636 1244 2270 -2464 -1254 1831 371 -83 1261 -494 -447 1148 24
2515 24 314 1332 -868 -743 3091 1619 -1716 1755 2305 -2011 827 4347 -911 -2229 3199 2343
2531 2343 -1005 2172 2831 -1399 205 2967 639 -335 1293 688 954 2244 665 321 1795 81
2547 81 -132 2984 724 -2416 1648 3200 -1193 264 3141 -1277 -2171 3595 1440 -2905 333 2219
2563 2219 -1348 170 2361 -836 -1454 764 47 -320 694 -1368 -1507 928 -367 -1222 1567 -334
2579 -334 -2908 1168 1800 -3251 -1608 1846 -1803 -2309 2345 -12 -3942 190 1671 -2624 -1529 568
2595 568 -1998 -1723 888 -343 -1469 -781 -1349 -1169 315 -1599 -2587 226 -444 -2651 793 954 -3419
2612 -3419 -1829 2207 -1663 -3013 1426 -8 -3392 803 2188 -2342 -1713 1369 -884 -1167 819
2627 819 -591 -1556 301 357 -282 882 -792 -1207 1679 791 -1911 1072 1722 -1980 228 3427 -747
2644 -747 -1963 2966 1606 -1883 1420 2421 -1967 -455 2715 917 -49 1655 399 15 2016 975
2660 975 -183 979 363 280 2666 1437 -1458 1380 2724 -1301 154 3236 -945 -1812 3285 2137
2676 2137 -1817 1397 2250 -1443 -219 2887 -661 -1479 1572 780 -13 1303 165 -1131 764 180
2692 180 -592 1065 -161 -2035 1085 2027 -2081 -830 1873 -1178 -2003 2344 450 -3590 3 1461
2708 1461 -1828 -772 1295 -1878 -2166 1038 -334 -1606 -657 -1012 -1426 -5 -456 -1577 -225 -444
2724 -444 -2271 73 995 -3147 -2003 1498 -1281 -2124 1479 -474 -3516 -46 1638 -2819 -1827 940
2740 940 -1525 -1564 1175 89 -2170 94 91 -964 507 -181 -1890 295 954 -1400 672 1172 -2291
2757 -2291 -485 2584 -925 -2413 1684 531 -2198 1463 2668 -1833 -457 2826 289 -876 1621
2772 1621 399 -788 1446 1464 32 984 917 -101 1876 1661 -1066 847 2263 -773 406 3267
2788 3267 -93 -1281 2965 1763 -1418 1652 2370 -1263 136 3141 262 -798 1802 873 -435
2803 -435 1228 639 -1120 534 987 -267 1352 902 -1566 402 2131 -1329 -710 2097 -986 -1867
2819 -1867 2347 1218 -2491 494 1973 -1734 -522 1441 -1314 -2277 1128 359 -1470 140 -24 -1590
2835 -1590 77 300 -1546 -571 -259 -1919 -216 933 -2378 -1474 1119 -1363 -2334 1190 -189 -3447
2851 -3447 10 1567 -2160 -1581 1080 -1111 -1884 920 -200 -2651 -446 -96 -1377 39 16 -1588
2867 -1588 -172 381 -1463 -242 709 -2150 -1242 1901 -523 -1948 1033 601 -2073 727 1936 -2307
2883 -2307 -1117 1820 -131 -754 1703 566 -1437 1027 1582 -353 473 628 -744 1156 1915 -570
2899 -570 173 1830 -407 398 2803 286 -1606 2177 1541 -998 1533 2315 -1129 -107 3217 346
2915 346 -647 1834 1042 -613 1648 1961 -459 472 1159 123 1045 1250 -1012 169 2021 -168 -37
2932 -37 2297 132 -1208 2161 1740 -2030 242 1702 -1245 -506 2337 -436 -1402 1394 736 -1478
2948 -1478 368 317 -1792 -215 558 -927 -172 270 -1432 -379 1268 -1251 -1709 1060 -1132 -2212
2964 -2212 1251 200 -3175 -217 1513 -1945 -1353 939 -1489 -2431 935 16 -2221 -470 -187 -1776
2980 -1776 -56 185 -1996 -1097 316 -1317 -586 658 -1768 -1384 1458 -537 -1984 761 165 -2552
2996 -2552 97 1935 -1895 -1159 1917 -256 -1305 1361 118 -2194 356 940 -969 158 988 -640
3012 -640 482 1624 -399 -436 985 -809 -441 2215 322 -1361 1681 1622 -1177 1225 2277 -1041
3028 -1041 -341 2333 516 -841 1723 1170 -678 1567 1871 -311 446 1378 31 924 1727 -160 20
3045 20 1778 192 286 1547 -19 -1071 1715 1669 -1132 702 1967 -1038 -127 2506 -74 -1772 1271
3062 1271 724 -935 1125 999 -1533 171 1482 -256 88 584 -1446 -762 1160 -654 -1068 969
3078 969 -499 -1367 1196 693 -2384 -544 1140 -1559 -950 1086 -1049 -1999 918 430 -1866 -680
3094 -680 66 -1657 -362 702 -1633 -1247 233 -1340 -694 748 -1451 -2147 445 -537 -1716 562
3110 562 -30 -2379 -361 1519 -1359 -1755 783 -987 -1650 718 358 -1768 118 930 -1118 98
3126 98 590 -1397 -510 1156 -548 -162 938 -630 -866 1805 257 -1621 835 1030 -1247 604 1920
3143 1920 -716 -679 2081 749 -837 1694 988 -914 915 1793 -406 278 1597 81 328 1804
3159 1804 16 65 1568 154 -176 2045 716 -1158 1577 1686 -749 442 1660 -772 -256 2363
3175 2363 83 -1012 1627 1160 -754 900 1411 -1102 -98 1486 -257 134 951 -334 -262 1503
3191 1503 164 -730 733 217 -1671 776 1216 -1502 -400 1572 -1071 -923 1573 -597 -2156 773
3207 773 607 -1558 -325 354 -1097 -698 916 -962 -1089 -14 -1016 -790 665 -758 -1716 439 131
3224 131 -1593 111 76 -2403 -668 1040 -1397 -1591 1047 -733 -1966 890 375 -2088 -767 493
3240 493 -1036 -599 533 -1197 -705 990 -458 -943 269 -695 -1098 749 269 -1721 503 484 -1624
3257 -1624 316 1631 -1195 -1383 1420 221 -1014 1256 564 -1368 590 1809 -320 -175 805 -390
3273 -390 73 1551 371 -330 1188 716 361 1867 490 -879 682 1647 -528 552 2155 -560
3289 -560 -319 2434 1006 -625 1200 917 -696 569 1624 -397 91 1331 152 362 1181 76
3305 76 -642 1316 386 -479 1006 562 -1030 1016 1428 -877 -273 1459 -884 -957 1652 112 -1674
3322 -1674 554 813 -1131 -140 586 -1236 -641 1157 -487 -882 739 -583 -757 583 -675 -1663 155
3339 155 -152 -1526 306 365 -1922 -676 1201 -829 -1337 528 -608 -2022 287 675 -1904 -490
3355 -490 577 -1256 -476 859 -968 -1419 171 -600 -878 328 -841 -1530 574 155 -1156 3 281
3372 281 -1460 -285 1174 -907 -1428 1123 90 -1098 970 611 -1530 -448 1262 -718 -601 958
3388 958 -255 -588 1217 431 -405 659 106 -330 1236 788 -939 523 1312 -196 690 1583 -597
3405 -597 -860 1801 987 -561 1398 1124 -776 552 1974 -99 -534 1672 410 100 1668 311
3421 311 -490 1160 752 64 1167 546 -685 897 1461 -890 111 1177 -118 -379 1629 848 -1285
3438 -1285 647 857 -1161 43 896 -1138 -736 1466 268 -722 527 -18 -767 454 295 -953 -208
3455 -208 17 -815 491 945 -1683 -1271 846 -930 -1088 741 -486 -1942 464 631 -1710 -673 501
3472 501 -1575 -1277 556 -617 -1468 402 -371 -647 173 -584 -1301 -251 105 -1226 -607 357 -1658 -554
3490 -554 1243 -713 -1274 852 -285 -1376 486 624 -1285 -409 1384 -758 -590 754 -287 -682
3506 -682 600 299 -796 155 -112 -424 732 750 -606 172 944 -670 234 1657 -601 -829 1529 788
3524 788 -578 1016 1111 -903 130 1777 -13 -553 1243 753 246 1269 758 -502 658 613 -116
3541 -116 666 620 -575 700 1790 -315 287 1244 -51 -531 1366 739 -1034 995 1157 -539 229
3558 229 1332 -395 -673 1231 316 -575 437 189 -497 711 779 -287 66 321 -554 334 960 -1219
3576 -1219 -680 709 -473 -815 805 -364 -1874 30 513 -1150 -788 440 -1178 -1016 870 -230
3592 -230 -1260 -66 -362 -923 -162 -250 -1307 -584 56 -1137 -232 -57 -1392 -706 612 -1010 -1323 199
3610 199 -608 -1504 398 800 -1471 -654 778 -1141 -561 426 -460 -962 367 399 -683 -11 -17 -936 468
3629 468 571 -928 -225 775 -385 208 1358 -227 -1044 734 569 -752 773 956 -1072 236 1565
3646 1565 75 -269 1010 127 -561 1142 898 -541 198 851 463 874 801 -381 216 1260 26 -72
3664 -72 1096 -224 -345 1505 977 -912 778 1322 -408 557 1400 -110 -1041 1145 496 -351 814
3681 814 455 -420 351 971 -472 166 466 -408 632 1202 -177 -466 717 -2 -719 526 -38 -1584
3699 -1584 179 932 -894 -551 676 -919 -964 794 -81 -1328 -360 48 -1329 -27 289 -1216 -371
3716 -371 120 -472 -783 304 -1116 -804 756 -303 -1211 505 -222 -1528 419 628 -1593 -832 715
3733 715 -685 -484 238 -507 -956 83 243 -898 -220 -64 -1008 -246 425 -411 -346 107 -620 -328 1142
3752 1142 -437 -1022 374 316 -661 684 756 -954 -33 1643 205 -803 921 15 -555 618 779
3769 779 -438 324 741 -311 359 746 -155 -50 1519 96 270 1123 58 -600 1149 1217 -558 636
3787 636 809 -499 568 1593 55 -496 1242 716 -37 1061 778 -481 416 1525 -242 69 592
3804 592 -223 318 920 -231 -376 467 -316 -186 1034 707 -762 216 1011 -325 -206 684 -678 -895
3822 -895 845 473 -959 216 191 -694 389 331 -926 -566 375 -664 -271 598 -577 -1087 225 -163
3840 -163 -724 197 -166 -1085 145 529 -775 -875 605 -698 -973 514 -324 -1261 -194 650 -730 -202
3858 -202 70 -1080 -405 91 -590 -1005 135 -948 -979 839 -261 -966 279 184 -1122 5 476 -1084
3876 -1084 -540 977 -532 -889 648 67 -869 451 705 -773 -41 349 -350 181 715 363 -353 541
3894 541 373 5 993 83 -381 749 908 -328 315 1000 -492 14 1347 -137 -658 1023 486 18
3912 18 834 821 -499 229 1118 176 305 974 -238 12 1153 471 -225 709 453 -314 1161 410 -773
3931 -773 434 1108 -277 6 1135 -243 -433 710 632 -636 482 563 -716 -25 945 -308 -177 665
3949 665 -91 -150 275 -347 -712 352 33 -635 731 -217 -1040 427 447 -812 -821 407 -733 -966 579
3968 579 46 -1141 157 368 -982 -122 69 -1022 -903 403 -317 -711 18 -567 -726 401 -117 -922
3986 -922 -224 -37 -948 248 357 -836 -666 479 -173 -841 242 -358 -1291 293 428 -534 -249 415
4004 415 -290 -346 747 -104 -566 559 334 -276 777 287 -818 586 651 -244 69 621 -668 -182 1411
4023 1411 288 -641 772 346 -632 697 1061 -583 155 879 3 330 1042 169 -79 981 678 70
4041 70 601 279 -479 738 840 -328 518 1246 -18 74 1084 -180 -637 699 493 -392 420 590 -597
4060 -597 276 611 -402 -341 150 -110 -165 762 314 -330 300 264 -386 289 169 -1149 -62 784 -574 -300
4080 -300 818 -497 -659 633 276 -1171 -239 315 -971 -339 303 -703 -812 518 -199 -886 264
4097 264 -373 -942 107 66 -951 -329 67 -771 -283 466 -1152 -1338 453 -504 -979 445 -161 -1161
4115 -1161 -2 715 -591 -433 347 -689 -491 660 -114 -565 279 22 -451 421 47 -1011 -138 436
4133 436 -299 -98 801 -557 -591 948 209 -792 411 273 -729 419 1143 -566 138 1070 132 141 1094
4152 1094 91 -623 524 770 -214 465 450 -430 576 813 -293 -35 932 -383 45 1492 72 -477
4170 -477 723 954 -435 451 924 -780 121 1249 152 6 915 -149 -132 780 361 -642 178 432
4188 432 -381 449 331 -301 -121 828 -111 -643 781 -608 -805 395 391 -888 143 371 -641 -137 795
4207 795 -591 -1220 16 -71 -595 190 -135 -821 153 209 -629 -305 148 -827 -572 352 -568 -958 62 -344
4227 -344 -723 432 -20 -1214 -324 234 -719 -515 560 -787 -588 451 41 -920 -392 98 -925 313
4245 313 123 -710 -324 248 -504 -197 805 -618 -608 411 -57 -702 397 104 -929 744 801 -605
4263 -605 -615 546 20 -406 1040 264 -524 804 478 -219 68 290 -517 526 697 -469 -152 799 -42
4282 -42 -63 1315 289 -708 750 506 -11 314 711 -395 25 752 311 -94 280 -75 -447 609 678
4301 678 -229 338 636 -117 445 1001 -287 -527 902 -187 -61 504 -27 -597 779 391 -752 -129
4319 -129 341 -619 -365 854 -561 -711 582 67 -382 238 59 -1145 -324 373 -387 -270 99 -752 -194
4338 -194 602 -431 -636 -75 -216 -812 363 169 -934 -332 328 -667 -466 462 -857 -1056 429 -156
4356 -156 -889 65 -285 -514 -105 399 -737 -635 50 -668 -394 476 -707 -966 515 67 -513 160 34
4375 34 -791 20 685 -696 -437 886 -452 -489 580 76 -664 477 53 -221 15 165 -646 287 833
4394 833 64 -220 168 -117 -487 745 367 -540 361 781 -165 789 797 -257 -144 1305 -75 -317 458
4413 458 301 -231 600 471 -301 78 767 -109 254 692 -58 60 417 122 -288 701 170 -610 626 1138
4433 1138 -106 193 259 -411 153 1081 -281 -482 419 -113 -552 334 39 -681 194 719 -569 69 343
4452 343 -558 -220 557 -314 -801 421 -46 -396 227 451 -808 -324 246 -433 -138 285 -434 -799 259
4471 259 220 -668 39 -23 -771 -86 314 -984 -629 82 -279 -476 417 -256 -688 -60 -153 -672 -326 146 -757
4492 -757 -61 635 -303 -525 578 -101 -490 195 119 -857 361 83 -327 147 476 -726 -427 250 140
4511 140 -225 247 52 -310 410 65 -644 167 580 -430 64 629 -541 -398 909 164 -180 564 316
4530 316 -246 658 704 -536 21 660 33 206 765 -172 -308 198 334 -52 930 163 -498 606 536 -23
4550 -23 21 701 -240 -166 895 2 -472 668 280 -400 422 585 -264 107 440 -131 -50 378 -561 -253 584
4571 584 -61 -383 147 -24 -641 183 54 -423 -709 215 -385 -17 655 -190 -769 434 45 -515 -118 195
4591 195 -712 88 475 -484 -390 268 -633 -184 166 -280 -741 411 183 -310 209 193 -471 -359 360 -384
4611 -384 -731 238 -99 -790 487 232 -696 -180 398 -415 -469 179 -515 -328 447 -281 -331 308 -201 -686
4631 -686 276 209 -437 -90 473 -447 52 825 -499 -515 406 56 -212 415 40 -648 488 775 -119 185
4651 185 330 -267 -96 699 197 -175 635 230 -41 558 202 -531 408 752 -420 65 480 -95 -178 768
4671 768 193 -350 316 214 -297 529 580 -330 -53 657 167 20 684 -168 -246 483 192 -425 280 108 -277
4692 -277 158 577 -304 -24 700 -647 -366 750 -81 -764 366 299 -360 311 118 -740 -260 499 -262
4711 -262 -561 86 -517 -453 400 37 -629 142 141 -488 -221 -35 -669 -400 240 -443 -361 274 4 -734 538
4732 538 332 -629 -156 130 -663 -295 264 -625 -185 312 -410 -443 317 -189 -577 84 360 -369 19 279
4752 279 -457 -143 567 -293 -701 324 -107 -533 602 309 -710 97 616 -21 -232 400 -274 -82 577
4771 577 143 -19 562 367 -233 553 491 -403 99 287 160 167 462 -178 -141 947 48 -402 94 203 -91
4792 -91 127 999 8 -179 446 28 5 331 246 -663 289 511 -180 362 98 -496 425 697 -84 -77 419 -375
4814 -375 -193 745 378 -572 109 279 -316 -15 360 -165 -324 452 -242 -99 -65 4 -318 460 -8 -321 113
4835 113 260 -761 261 13 -532 -397 309 -199 -181 -51 -345 -901 150 485 -564 66 165 -533 -137
4854 -137 50 -371 -798 -68 -93 -349 232 154 -519 -166 141 -278 82 -126 -149 -316 338 -140 -703 191 52
4875 52 -432 251 61 -418 -109 507 -91 -190 343 -223 -315 274 401 -530 157 177 -561 348 452 -361 -47
4896 -47 365 -212 -53 740 -157 -382 563 526 -117 263 247 -120 -7 537 22 -98 232 57 -23 280 152
4917 152 -321 222 495 87 291 228 -506 240 790 -137 -167 469 14 -300 538 195 -612 172 227 -160 198
4938 198 364 -739 -253 802 41 -278 136 -185 -285 221 278 -473 -46 243 -339 117 257 -364 -113 296
4958 296 -330 -321 481 -151 -356 -127 253 -412 -180 286 -188 -21 438 -162 -260 45 -16 -674 -51 -167 -627
4979 -627 -67 213 -533 -95 160 -663 -167 527 86 -440 -64 -120 -281 124 -252 -651 -376 226 -305 -161
4999 -161 169 -86 -405 195 89 -252 17 245 -271 156 394 -558 -175 347 -132 -375 404 150 -353 364
5019 364 290 -403 0 331 -327 -111 204 5 141 350 130 -93 694 83 -362 33 519 42 245 427
5039 427 135 61 625 -142 222 342 64 -265 466 310 -70 269 498 -78 299 592 -464 -140 646 175
5059 175 -40 309 130 -337 425 386 -355 80 306 -92 -151 647 -167 -109 320 -64 82 210 349 -605 -169
5080 -169 254 -319 -39 226 -186 -266 275 -75 -510 -67 -336 -342 97 161 -245 -335 282 64 -150 46 -656 -488
5102 -488 166 -355 -289 -283 97 -707 27 255 -610 -398 252 -316 -93 358 -492 -448 74 215 -362 -177 247
5123 247 -233 65 378 -189 -370 215 -313 69 405 -102 -315 -62 179 -220 299 190 -410 -228 432 158
5143 158 -117 282 132 -58 381 294 -33 393 396 291 302 -43 -118 100 278 -99 -226 392 270 -43 536 374
5165 374 -204 57 270 -98 170 535 -90 78 520 165 -1 252 28 -280 164 359 -120 212 279 -125
5185 -125 29 84 -27 -287 483 93 -312 241 158 -538 -203 603 -82 -315 368 -256 -110 495 191 -299 128
5206 128 5 -245 55 9 -609 -401 21 -186 -405 384 -463 -659 204 -215 -508 137 -95 -467 180 -115
5226 -115 -493 -155 100 -260 -156 189 -207 -282 38 134 -328 -64 -11 -537 -176 -46 -234 -253 5 -179 -277 186
5248 186 302 -220 34 309 -345 -398 182 -274 -167 180 48 -423 80 -145 -15 352 315 -17 184 20 -190
5269 -190 0 273 107 -318 742 -154 367 370 61 -327 347 399 -399 265 203 -99 -137 386 -411 -242 291
5290 291 201 -31 459 162 -343 366 535 -30 427 450 -79 -141 127 137 -248 220 382 -172 549 345 -279
5311 -279 102 313 -363 89 427 -367 -126 519 102 -333 161 457 -634 -23 406 -263 -22 111 -195 -63
5331 -63 -70 -156 -628 158 119 -212 143 74 -383 -123 310 -143 -196 -107 -32 -233 276 -202 -617 122 240 -298 -146
5354 -146 279 -618 -194 464 -120 -621 -185 -83 -202 1 61 -233 28 103 -374 114 414 -335 -110 79 -218
5375 -218 -163 429 -66 -456 24 44 -373 -141 105 125 115 175 -331 -13 240 152 17 227 244 -224 176 179 -195
5398 -195 283 408 -190 334 534 84 -159 249 41 -69 350 542 -162 -11 249 243 -81 135 -118 170 627
5419 627 113 88 338 481 148 412 454 -85 225 511 199 71 556 -34 34 209 243 -341 321 198 -336
5440 -336 248 260 -238 50 274 -227 -425 24 133 -56 273 261 -411 -129 210 -276 -225 92 -140 -558 125
5461 125 282 -236 151 37 -185 156 43 -117 -252 -158 -417 -65 162 -198 -78 64 -494 -438 26 3 -126
5482 -126 -70 -2 -347 -82 137 -132 26 -70 151 -172 280 -25 -314 49 356 -150 55 126 -356 -121 75
5503 75 -106 -495 172 49 -52 302 186 -291 206 22 -234 -212 290 205 -211 598 -27 -260 371 10 -217
5524 -217 373 328 -383 -89 88 99 -60 404 -172 -188 231 161 -7 160 124 29 182 96 -81 14 247 -26 150
5547 150 277 -254 -151 67 219 105 192 148 -87 166 497 -242 -305 221 153 -50 448 121 -179 223 -149
5568 -149 -10 172 295 -66 -194 125 -36 -57 270 -202 -37 568 34 -201 26 179 -428 -274 565 -136
5588 -136 -106 24 196 -251 -6 -13 -239 165 179 -129 2 -76 -226 -63 276 -14 -414 34 -132 -379 -18 -97
5610 -97 -498 74 113 -412 -217 163 -194 -103 343 -20 -138 -138 16 -25 -56 261 -733 51 539 -116 -136 366 -115
5633 -115 -311 335 267 -158 192 174 -204 200 366 -283 1 277 52 -135 163 66 -29 314 102 -346 131
5654 131 423 -242 141 347 -293 -40 521 75 -6 91 -43 -180 330 342 -309 355 192 -223 -122 236 -153
5675 -153 61 334 -270 -177 -96 178 -363 62 24 -154 536 150 -248 -38 265 -95 72 123 76 -437 291 203
5697 203 -209 -162 -104 -219 -14 57 -53 39 109 178 -300 298 -149 -287 113 -464 -371 112 201 -325 232 176 -281
5720 -281 -399 277 -66 -474 208 -153 -434 -176 196 -276 -414 -96 -274 0 35 -15 -381 -294 -189 -261 -111
5741 -111 -163 -331 -239 83 -379 -211 216 -232 -394 355 -193 -551 176 207 -303 249 42 -403 -82 146 67
5762 67 -213 368 -55 -251 86 224 -303 70 76 -420 -11 535 -170 -158 340 140 285 22 132 -178 40
5783 40 343 -195 191 323 -2 136 274 121 78 422 -74 -157 386 248 -140 -14 209 6 200 237 -229
5804 -229 -127 376 153 -420 394 118 -140 176 197 28 -10 251 79 120 252 234 47 177 126 -82 314 -192
5826 -192 -360 -178 260 -242 -228 -47 -155 52 186 -142 -535 22 50 -570 38 -29 -597 -138 -5 -366 -235
5847 -235 -38 -296 -79 158 209 -66 -198 -293 -260 108 -6 -192 -67 -31 -109 -407 -16 -71 -437 131 -187 -244
5869 -244 -193 -97 -480 76 72 -276 -319 304 -371 7 46 75 -360 109 70 -262 133 -22 -304 -358 255 -94 -259
5892 -259 -61 -195 -114 341 361 -278 358 -65 -247 174 391 -296 -261 225 -57 -140 149 136 -281 247 339 -121
5914 -121 154 199 -78 -152 404 99 -169 529 166 -35 65 286 -161 235 37 -122 73 73 -225 181 310
5935 310 76 -331 285 108 -138 185 375 -274 -177 274 66 -16 131 -31 -61 75 98 -144 60 119 -238 -53
5957 -53 219 -261 21 7 -310 -138 48 -219 -231 347 97 -109 87 74 -306 53 -61 -170 -158 352 195 -104
5979 -104 132 77 -34 5 -286 -504 -276 280 -142 -268 286 -390 -369 27 -125 -305 290 230 -184 282 -104
6000 -104 -346 76 48 -309 -155 -58 -129 -157 187 199 -209 215 -51 -408 -55 146 174 -252 43 61 -214 23
6022 23 1 -19 35 318 -118 177 3 89 117 227 110 -54 378 303 -158 110 4 92 203 255 -79 234 379
6045 379 -371 -38 417 25 -10 554 110 -62 56 -22 -211 360 458 -276 28 159 154 120 270 -63 -199 170
6067 170 180 -239 71 132 -226 191 333 -280 -240 24 -254 -85 -1 46 -314 -127 -9 -267 -232 178 118 30 31
6090 31 -94 -310 232 -127 -231 -170 -111 -346 67 270 -171 -340 -37 -124 88 278 -133 -340 89 94 -274 406
6112 406 -36 -439 -164 44 13 -156 37 -6 115 14 -360 -74 182 132 -330 110 -69 -42 -141 370 -229 167
6134 167 193 -191 -247 6 -208 -294 421 240 -303 52 268 192 161 148 95 -232 -14 56 -3 119 278 98 294
6157 294 382 -206 91 190 -34 -46 241 -79 -317 418 216 79 256 67 -108 318 194 -120 330 59 -169
6178 -169 -12 169 82 -48 314 127 136 80 -9 -12 105 211 148 73 193 -51 65 31 -47 -170 223 -16 -334 213
6202 213 65 88 22 -157 -116 -484 35 -120 -262 260 -108 -371 107 -182 -53 -89 283 -131 -31 60 -3 -124
6224 -124 -272 94 -231 228 127 -212 -202 337 -257 25 -95 -218 -434 101 -161 -226 70 -141 -271 -134 -5
6245 -5 -285 -308 39 -180 -209 28 -221 -265 31 -323 -89 11 39 -449 59 92 73 -19 361 -251 82 40 -138
6268 -138 78 203 379 -294 221 67 15 -14 -15 -27 -96 339 -300 -85 226 357 86 106 209 -98 266 44
6290 44 -15 72 108 245 -61 148 -60 6 4 37 42 -61 80 -272 -71 51 128 17 -32 88 -55 17 -194 -266 120
6315 120 93 85 112 -35 -88 3 31 -33 -147 -48 -214 -196 -56 75 -440 194 116 67 -168 45 -275 204 -82 -3
6339 -3 -201 188 -175 -337 -3 83 -601 -277 -62 -175 -78 -173 -234 -546 362 190 -196 -131 76 -324 85 446
6361 446 -199 -72 -6 -151 -39 42 -239 -110 -37 32 -195 -220 -39 -335 -271 241 -223 -106 79 -16 -357 125
6383 125 21 -164 39 32 -133 77 51 1 238 -44 -248 -71 35 135 -58 196 354 -69 -76 272 -162 339
6405 339 -91 -28 15 138 249 -84 -10 221 -365 -268 204 -49 269 268 -59 109 25 109 227 334 49 -277 455
6428 455 173 -110 21 460 -317 -19 162 103 65 42 -37 -331 95 63 82 65 167 318 -415 237 -35 -116 187
6451 187 71 -293 267 79 -173 -97 300 -136 187 -15 -117 -130 168 142 -106 -53 97 -13 339 -58 -556
6472 -556 65 -27 -412 -37 22 -454 -247 -145 -327 15 -12 -94 47 -33 28 -43 45 -27 -318 -227 48 44 -184 -66
6496 -66 93 -123 2 -99 -198 188 188 -60 -303 224 65 -30 549 228 -339 30 -55 -219 264 157 -174 48
6518 48 143 -68 115 311 234 110 214 -34 -134 -135 53 132 101 224 -22 95 353 41 -116 211 -26 150
6540 150 22 -37 15 81 187 -145 -8 87 -4 -110 320 -31 85 140 -25 283 481 -90 -42 -37 107 -113 -172
6563 -172 118 -127 107 357 -299 -56 386 -49 33 141 -67 -53 -69 275 -67 -61 363 -82 -355 115 101 -320
6585 -320 -147 169 -58 -49 -76 -266 -73 74 -364 -143 202 -143 5 -27 -162 -281 -47 -96 79 157 -15 8
6607 8 83 313 -163 227 323 -180 135 141 108 -435 -99 203 -54 100 54 -4 -48 83 204 -204 43 110 -361 -1
6631 -1 151 -535 171 22 -161 -139 96 83 157 296 -233 -155 293 219 126 25 23 50 -51 275 -96 181 376 186
6655 186 -62 6 224 -204 140 -30 -105 155 369 -60 -105 301 111 79 116 -7 -175 192 106 -344 162 61
6677 61 -153 462 276 212 -231 210 72 -335 95 -136 -50 165 168 102 104 456 37 69 129 -388 -41 156 -54
6700 -54 -53 315 418 -26 -227 -142 -74 -147 285 -293 -272 256 -259 -175 31 153 -317 -62 -173 -154 -142 231 -64
6723 -64 -306 -3 -5 -81 26 -240 -219 22 -28 -471 -9 20 75 -104 -142 -239 -35 10 125 -148 201 -97 -123 -93
6747 -93 -43 -332 -80 244 -159 -69 25 -8 -19 92 244 -56 132 -87 -243 -43 340 -103 -40 214 -131 107
6769 107 6 -174 19 124 217 -388 -160 239 -174 -16 215 -235 -49 237 -44 32 146 33 12 5 215 107
6791 107 -201 -40 -139 -63 -143 85 34 233 330 -236 -109 173 101 239 205 60 -120 121 -49 462 380 202 143
6814 143 183 -103 -168 19 151 -74 151 133 92 -104 296 58 10 375 -44 -65 52 -258 -339 -75 11 -118 74
6837 74 177 90 84 104 -117 11 263 -339 -558 -137 -3 -310 -271 166 -105 23 220 37 34 210 -35 -588 22
6860 22 29 -28 51 -226 -136 93 124 86 -71 -60 -147 -342 123 -87 -40 -52 442 -128 71 149 -40 -125 124 -54 -280
6885 -280 70 72 40 107 -10 -52 347 172 164 208 243 -284 170 -77 188 107 430 -146 -194 38 33 -168 369 160
6909 160 -123 152 413 560 45 -103 192 -71 -11 141 -255 147 104 118 97 125 157 310 18 -150 -135 131
6931 131 -38 -184 23 43 -303 -175 126 113 230 97 -134 75 7 -48 -270 31 325 56 -135 169 -450
6952 -450 -284 132 -20 -19 208 -61 182 -40 261 -128 -209 -12 105 22 6 18 -173 35 -48 -334 83 -94
6974 -94 -146 -110 -198 -342 -3 -129 -220 139 162 168 -355 64 -51 -312 206 -91 -329 175 -39 -199 -257 197 -148
6997 -148 -106 -198 -117 -327 40 -196 -346 -3 -135 10 -118 215 -352 -89 184 -211 36 4 215 -65 -197
7018 -197 21 -230 148 63 -26 86 346 -63 -160 207 43 78 294 -43 -84 111 197 -324 -6 -68 -148 262 366
7041 366 -162 80 271 207 224 54 31 -166 70 176 79 109 146 69 -165 -92 140 -258 -143 333 -88 -45 247
7064 247 -369 -186 241 -179 -103 223 -14 16 207 -22 -106 91 -61 -147 -133 56 116 134 439 -225 -259 -234 -46
7087 -46 56 307 -90 -420 -270 352 12 10 170 -101 -196 211 -34 -205 264 -17 -405 149 -161 -200 52 -92
7109 -92 -105 -104 86 -57 -99 320 -271 -258 -150 -191 -253 -79 130 -147 -142 337 8 3 -92 -136 6 317 24 -28 318
7134 318 -40 -156 50 -172 -110 13 188 -179 -258 -158 72 -105 114 -26 83 217 -24 97 336 248 -231
7155 -231 113 124 233 39 336 20 -98 96 349 125 -116 -97 99 43 252 3 -211 -5 -121 -20 121
7176 121 259 -231 8 296 -214 -165 233 -208 -317 349 -79 -150 52 -92 -294 146 -200 44 -157 307 17
7197 17 78 204 -104 -32 30 376 60 39 -77 -461 22 82 -165 -234 -114 150 -184 166 -188 -96 -100 -200 -157 108
7221 108 37 -44 59 175 177 -383 23 83 -130 60 -77 -287 -189 -68 -334 -310 -3 -231 -127 -126 -75 -202 118
7244 118 -164 -202 55 46 -34 -58 89 134 -315 -39 -56 -177 186 56 -218 62 -133 -315 78 284 -284 140
7266 140 166 -321 167 73 -205 -62 -7 376 -92 23 87 -53 56 103 -21 -172 106 -148 38 230 -205 -252
7288 -252 -5 197 106 -1 -14 -270 -203 -62 -236 53 155 -58 -204 71 -19 3 176 63 72 228 259 21 -224
7311 -224 246 86 -113 360 105 -230 -10 -200 82 293 110 53 -236 -36 109 -46 -49 -150 -472 -299 338
7332 338 -131 13 13 -258 -33 -111 -55 -223 -126 -107 60 144 13 -110 89 185 -207 -23 -1 45 -10 30 -206 -184
7356 -184 -166 -415 -81 36 129 -175 32 -431 -162 -78 91 47 166 347 -63 10 113 -78 -231 122 47 -39
7378 -39 -275 74 -84 178 -44 -6 29 93 42 -158 -236 47 279 8 137 -13 233 72 -48 128 89 280
7400 280 153 476 -32 -126 -5 -24 -84 -68 205 -303 13 230 -5 76 86 235 -258 -139 258 -145 26 -8
7422 -8 -352 233 113 -71 -19 227 -248 -67 336 167 -109 -152 414 -118 -185 244 -122 -170 41 -80 -12 316
7444 316 -23 -4 120 -115 -37 119 153 -156 10 106 -100 187 -275 181 -289 177 -125 -8 -267 -1 -68 -44
7466 -44 98 -226 -256 106 -205 -146 73 -93 -176 153 0 66 87 165 -12 116 227 -98 -79 348 -98 -326 -2
7489 -2 -36 190 -100 18 -269 -92 200 -328 -585 -57 -61 -237 -27 -170 -203 257 167 -294 -229 122 263 -31 349
7512 349 72 -15 73 -12 -292 143 -11 -381 -36 145 81 228 -70 192 193 36 72 24 232 64 91 -46 271
7535 271 -62 -74 169 12 -17 55 -22 -290 46 -146 -71 -46 140 32 233 -85 -259 6 165 40 134 -140
7557 -140 -241 42 101 -35 -37 15 247 -141 189 68 33 15 73 39 -25 342 -13 -105 115 -47 -158 14 126
7580 126 -145 95 93 382 -328 34 -23 79 -185 183 -131 5 5 -86 104 -24 152 145 223 33 -436 72 -55
7603 -55 -246 210 51 135 -40 194 -179 -156 -143 -276 -251 -111 0 -115 -286 -197 -268 119 163 -137 -196 -8 127
7626 127 -38 78 -193 58 278 181 -235 -68 -226 -53 -92 -77 -49 356 8 -80 -67 237 -147 -97 -53 -27 -123
7649 -123 316 207 -134 133 334 -30 -161 250 -15 16 166 354 -233 265 -95 -165 58 143 113 81 98 -25
7671 -25 125 307 -158 -27 90 198 -257 128 -13 -240 47 -54 2 -330 -103 50 -283 87 -87 231 -68
7692 -68 -6 135 267 67 -96 -5 37 -118 -198 149 6 48 197 -178 -144 -131 198 82 -9 291 191 -74 296
7715 296 141 -221 -64 13 -465 -368 170 -135 85 -25 -66 -245 182 -93 76 -75 137 -33 23 95 -142 334
7737 334 -11 30 67 21 94 138 98 -410 -381 37 -52 -106 -217 31 63 -163 16 -115 -117 -3 -135 64 88 -300
7761 -300 -73 29 16 -100 87 41 -137 192 119 194 -116 13 -56 54 16 -222 -76 198 239 -43 -73 -123 117
7784 117 -87 -146 43 147 323 153 113 98 427 61 229 76 -48 -114 419 -239 -254 87 -262 -324 -318 -78 -19
7807 -19 241 -358 -53 192 406 -160 62 193 -198 -66 41 131 -82 -362 100 -135 122 43 24 109 32 -117
7829 -117 37 115 153 -64 297 648 -120 173 14 -177 -61 -102 -125 -369 31 -185 -65 65 93 -129 97 33
7851 33 -50 29 -79 -108 -10 153 -75 -310 138 -251 -498 291 -271 22 101 183 -148 110 45 111 252 66 25
7874 25 147 -143 83 338 -47 -199 -143 -170 188 -122 -258 273 -5 -137 52 -71 -79 164 293 -381 -245 63
7896 63 22 13 -92 -2 93 325 81 261 112 -81 -284 295 -13 105 -27 -135 -32 -10 131 -40 74 -167
7918 -167 -28 -98 164 128 111 -79 228 -199 -107 237 104 106 -114 62 100 250 55 -158 159 353 -75 206
7940 206 177 -13 162 429 317 -24 52 167 40 -75 226 37 -36 8 4 -30 -4 -54 -231 86 -49 -254 170
7963 170 353 41 163 24 -226 -121 105 96 -129 129 141 -509 -30 -49 -101 151 150 125 -60 132 -185 -408 173
7986 173 -72 -9 31 -221 -100 50 -29 128 73 45 54 65 84 -137 -310 -94 -97 -115 -64 10 -119 275 37 140 177
8011 177 193 -304 67 66 -101 -169 -67 -193 -57 53 -312 -30 -374 144 -150 171 -116 118 -47 200 -4
8032 -4 24 -178 -215 -11 -123 78 -149 60 227 165 110 -32 149 -144 -57 12 76 34 50 132 166 335 32 -45 256
8057 256 283 71 253 191 177 189 205 -91 107 174 97 -105 50 -13 125 326 122 -338 18 59 177 47 277
8080 277 -62 -24 201 20 170 327 66 233 195 -38 -9 11 -197 52 39 8 -132 -353 269 -368 -192 220
8102 220 147 -31 37 -94 -260 -3 21 50 44 -256 -194 -169 -61 -15 -341 -96 -53 -69 162 -223 26 -28 -31 -78 -294
8127 -294 122 71 110 -130 80 233 -49 75 -134 61 -143 -175 -166 4 104 -187 58 -73 -288 42 366 -60
8149 -60 197 152 -56 16 73 51 -13 -48 -240 -178 -247 114 -70 120 -137 -145 -75 83 -75 10 -171 161 21 77 -38
8174 -38 60 433 99 -241 71 -151 -357 -166 -51 247 -141 59 118 -288 68 121 26
8191B6
##END NTUPLES=NMR FID
##END=
