##TITLE=1H_TG-2244
 DMSO-d6, 8 sc, 
 25.6.2019
##JCAMPDX= 6.0         $$ Bruker NMR JCAMP-DX V2.0
##DATA TYPE= NMR FID
##DATA CLASS= NTUPLES
##ORIGIN= UXNMR, Bruker Analytische Messtechnik GmbH
##OWNER= root
$$ XWIN-NMR		Version 3.5
$$ Tue Jun 25 15:23:25 2019 Russian Standard Time (UT+4h)  she@DPX200
##.OBSERVE FREQUENCY= 200.13155
##.OBSERVE NUCLEUS= ^1H
##.DELAY= (6, 6)
##.ACQUISITION MODE= SIMULTANEOUS
##.ACQUISITION SCHEME= undefined
##.AVERAGES= 8
##.DIGITISER RES= 18
##SPECTROMETER/DATA SYSTEM= spect
##.PULSE SEQUENCE= zg30
##.SOLVENT NAME= DMSO
##.SHIFT REFERENCE= (INTERNAL, DMSO, 0, 15.7039)
##AUDIT TRAIL= $$ (NUMBER, WHEN, WHO, WHERE, WHAT)
$$ ##TITLE= Audit trail, XWIN-NMR		Version 3.5
$$ ##JCAMPDX= 5.01
$$ ##ORIGIN= Bruker BioSpin GmbH
$$ ##OWNER= she
$$ F:/spectra/data/she/nmr/H-F/1/audita.txt
$$ ##AUDIT TRAIL=  $$ (NUMBER, WHEN, WHO, WHERE, WHAT)
(   1,<2019-06-25 15:22:22.39 +0400>,<she>,<DPX200>,
      <created by zg, POWCHK disabled, PULCHK disabled
       configuration hash MD5:
       00 E9 B6 7A A2 85 ED C7 34 08 36 98 17 FE 4E 26
       data hash MD5: 16K
       13 24 88 E0 33 DE 66 9B B5 69 C5 3D FF 36 8F E8>)
$$ ##END=
$$ 
$$ hash MD5
$$ 2A 41 F1 1A FC B6 51 43 77 B8 A8 52 7D 9C C7 A2
##$RELAX= 
##$RELAX= 
##$RELAX= 
##$RELAX= 
##$RELAX= 
##$RELAX= 
$$ Bruker specific parameters
$$ --------------------------
##$DU= <F:/spectra>
##$EXPNO= 1
##$NAME= <H-F>
##$PROCNO= 1
##$TYPE= <nmr>
##$USER= <she>
##$AMP= (0..31)
100 100 100 100 100 100 100 100 100 100 100 100 100 100 100 100 100 100 
100 100 100 100 100 100 100 100 100 100 100 100 100 100 
##$AQSEQ= 0
##$AQ_mod= 1
##$AUNM= <au_zg>
##$AUTOPOS= <>
##$BF1= 200.13
##$BF2= 200.13
##$BF3= 200.13
##$BF4= 200.13
##$BF5= 200.13
##$BF6= 200.13
##$BF7= 200.13
##$BF8= 200.13
##$BYTORDA= 1
##$CFDGTYP= 0
##$CFRGTYP= 5
##$CHEMSTR= <none>
##$CNST= (0..31)
1 1 145 1 1 1 1 1 1 1 1 1 1 1 1 1 1 1 1 1 1 1 1 1 1 1 1 1 1 1 1 1 
##$CPDPRG= <>
##$CPDPRG1= <>
##$CPDPRG2= <>
##$CPDPRG3= <>
##$CPDPRG4= <mlev>
##$CPDPRG5= <mlev>
##$CPDPRG6= <mlev>
##$CPDPRG7= <mlev>
##$CPDPRG8= <mlev>
##$CPDPRGB= <>
##$CPDPRGT= <>
##$D= (0..31)
0 1.2 0 0 0 0 0 0 0 0 0 0.03 0 0 0 0 0 0 0 0 0 0 0 0 0 0 0 0 0 0 0 0 
##$DATE= 1561461741
##$DBL= (0..7)
120 120 120 120 120 120 120 120 
##$DBP= (0..7)
150 150 150 150 150 150 150 150 
##$DBP07= 0
##$DBPNAM0= <>
##$DBPNAM1= <>
##$DBPNAM2= <>
##$DBPNAM3= <>
##$DBPNAM4= <>
##$DBPNAM5= <>
##$DBPNAM6= <>
##$DBPNAM7= <>
##$DBPOAL= (0..7)
0.5 0.5 0.5 0.5 0.5 0.5 0.5 0.5 
##$DBPOFFS= (0..7)
0 0 0 0 0 0 0 0 
##$DE= 6
##$DECBNUC= <off>
##$DECIM= 24
##$DECNUC= <off>
##$DECSTAT= 4
##$DIGMOD= 1
##$DIGTYP= 9
##$DL= (0..7)
0 120 120 120 120 120 120 120 
##$DP= (0..7)
150 150 150 150 150 150 150 150 
##$DP07= 0
##$DPNAME0= <>
##$DPNAME1= <>
##$DPNAME2= <>
##$DPNAME3= <>
##$DPNAME4= <>
##$DPNAME5= <>
##$DPNAME6= <>
##$DPNAME7= <>
##$DPOAL= (0..7)
0.5 0.5 0.5 0.5 0.5 0.5 0.5 0.5 
##$DPOFFS= (0..7)
0 0 0 0 0 0 0 0 
##$DQDMODE= 0
##$DR= 18
##$DS= 0
##$DSLIST= <SSSSSSSSSSSSSSS>
##$DSPFIRM= 0
$$ [...]
##$SUBNAM2= <"">
##$SUBNAM3= <"">
##$SUBNAM4= <"">
##$SUBNAM5= <"">
##$SUBNAM6= <"">
##$SUBNAM7= <"">
##$SUBNAM8= <"">
##$SUBNAM9= <"">
##$SW= 24.9336996594482
##$SWIBOX= (0..15)
0 0 2 0 0 0 0 0 0 0 0 0 0 0 0 0 
##$SW_h= 4990.01996007984
##$TD= 16384
##$TD0= 1
##$TE= 0
##$TE2= 300
##$TE3= 300
##$TEG= 300
##$TL= (0..7)
0 120 120 120 120 120 120 120 
##$TP= (0..7)
150 150 150 150 150 150 150 150 
##$TP07= 0
##$TPNAME0= <>
##$TPNAME1= <>
##$TPNAME2= <>
##$TPNAME3= <>
##$TPNAME4= <>
##$TPNAME5= <>
##$TPNAME6= <>
##$TPNAME7= <>
##$TPOAL= (0..7)
0.5 0.5 0.5 0.5 0.5 0.5 0.5 0.5 
##$TPOFFS= (0..7)
0 0 0 0 0 0 0 0 
##$TUNHIN= 0
##$TUNHOUT= 0
##$TUNXOUT= 0
##$USERA1= <user>
##$USERA2= <user>
##$USERA3= <user>
##$USERA4= <user>
##$USERA5= <user>
##$V9= 5
##$VALIST= <valist>
##$VCLIST= <CCCCCCCCCCCCCCC>
##$VD= 0
##$VDLIST= <DDDDDDDDDDDDDDD>
##$VPLIST= <PPPPPPPPPPPPPPP>
##$VTLIST= <TTTTTTTTTTTTTTT>
##$WBST= 1024
##$WBSW= 4
##$XGAIN= (0..3)
0 0 0 0 
##$XL= 0
##$YL= 0
##$YMAX_a= 110521
##$YMIN_a= -176996
##$ZGOPTNS= <>
##$ZL1= 120
##$ZL2= 120
##$ZL3= 120
##$ZL4= 120
##$ABSF1= 10
##$ABSF2= 0
##$ABSG= 5
##$ABSL= 3
##$ALPHA= 0
##$AQORDER= 0
##$ASSFAC= 0
##$ASSFACI= 0
##$ASSFACX= 0
##$ASSWID= 0
##$AUNMP= <proc_1d>
##$AZFE= 0.1
##$AZFW= 0.1
##$BCFW= 1
##$BC_mod= 2
##$BYTORDP= 1
##$COROFFS= 0
##$CY= 11.3945322036743
##$DATMOD= 1
##$DC= 2
##$DFILT= <>
##$DTYPP= 0
##$F1P= 18.9103706918063
##$F2P= -1.10871071338519
##$FCOR= 0.5
##$FTSIZE= 0
##$FT_mod= 4
##$GAMMA= 1
##$GB= 0.15
##$INTBC= 1
##$INTSCL= 1
##$ISEN= 128
##$LB= 0.24
##$LEV0= 0
##$LPBIN= 0
##$MAXI= 10000
##$MC2= 0
##$MEAN= 0
##$ME_mod= 0
##$MI= 1.114404
##$NCOEF= 0
##$NC_proc= 0
##$NLEV= 6
##$NOISF1= 3.799351
##$NOISF2= 2.8
##$NSP= 1
##$NTH_PI= 0
##$NZP= 0
##$OFFSET= 15.70392
##$PC= 1
##$PHC0= -8502.355
##$PHC1= 13.00097
##$PH_mod= 1
##$PKNL= yes
##$PPARMOD= 0
##$PSCAL= 0
##$PSIGN= 0
##$REVERSE= no
##$SF= 200.130013532006
##$SI= 16384
##$SIGF1= 3
##$SIGF2= 2
##$SINO= 400
##$SIOLD= 16384
##$SREGLST= <1H.CDCl3>
##$SSB= 0
##$STSI= 0
##$STSR= 0
##$SW_p= 3612.71676300578
##$SYMM= 0
##$S_DEV= 0
##$TDeff= 0
##$TDoff= 0
##$TI= <>
##$TILT= no
##$TM1= 0
##$TM2= 0
##$TOPLEV= 0
##$USERP1= <user>
##$USERP2= <user>
##$USERP3= <user>
##$USERP4= <user>
##$USERP5= <user>
##$WDW= 1
##$XDIM= 8192
##$YMAX_p= 0
##$YMIN_p= 0
$$ End of Bruker specific parameters
$$ ---------------------------------
##NTUPLES= NMR FID
##VAR_NAME=  TIME,          FID/REAL,        FID/IMAG
##SYMBOL=    X,             R,               I
##VAR_TYPE=  INDEPENDENT,   DEPENDENT,       DEPENDENT
##VAR_FORM=  AFFN,          ASDF,            ASDF
##VAR_DIM=   8192,          8192,            8192
##UNITS=     SECONDS,       ARBITRARY UNITS, ARBITRARY UNITS
##FACTOR=    0.0002004,     1,               1
##FIRST=     0,             0,               0
##LAST=      1.6414764,     0,               0
##MIN=       0,             -176996,         0
##MAX=       1.6414764,     110521,          0
$$ Real data points
##PAGE= N=1
##DATA TABLE= (X++(R..R)), XYDATA
0@%%%%%%%oJ4j6J6j6K4l2L3m1N0n8P2q8J04j20J37j56J80k09K40k72L06l47L92
31B07m41M95n53O18o91P70q55R50j052J164j290J429j582J752j942K155k397K674
49A411k995L370l813M351n021N877p020Q640j1120J5443k5155Q7741k8572j50397
63a07260O7067J12889L7825r2073p0545P940O9618L9748l39l9629l8351j6095
75b9205L0060L3430q81m1280l2233K439L2407K9525O722k8666m3955j6629M4876
88a3390O0986m056p5540m4030N2405P8653k365p3976m2626L3426M3689n903k5922
101a8649M326J8601l613j1977J6562K9869m134m4363l4590J5922M4945K0437k6837
114F499m3815q145M7326N9221j075o7195n3499K6800O9982K0528n2839n6402Q224
$$ y = [0, 0, 0, 0, 0, 0, 0, 0, -6, 8, -8, 8, -8, 16, -16, 17, -24, 26, -32, 40, -48, 56, -64, 73, -83, 97, -112, 128, -144, 162, -185, 207, -234, 261, -292, 326, -365, 405, -450, 500, -552, 612, -678, 751, -831, 921, -1021, 1134, -1263, 1411, -1584, 1786, -2027, 2324, -2697, 3180, -3840, 4800, -6320, 9123, -16032, 71709, 43137, -107260, -40193, 72696, 110521, 18448, -52097, -44157, 25461, 65209, 64870, 25241, -13110, -29205, 855, 34285, 33404, -7876, -40109, -37670, -5263, 24262, 30984, 2318, -41637, -58266, -13390, 47596, 43540, -32000, -76030, -23625, 55028, 52663, -21313, -63939, -30513, 13176, 7273, -18649, -14323, 4278, 665, -11312, 5250, 35119, 30985, -13378, -47968, -32046, 12899, 33336, 6499, -37316, -45461, 1865, 61086, 60011, -7184, -60683, -33883, 36099, 56627, 3788, -52614, -44390]
127d4390N2636L0851j4719k9518j8930m527J6262L3282J6812l0616n2730o321
139e1908N7632N0358k6200p5393l3145M3538O4452J2360m8499m9162R554N9311
151A2898M1606k3058o0956k9201L0196M6930N626l4043k4631J1343K8054J9236
163B4000L665j0648k0651j6307P201K8976J5304k4132l7561r52L9561L2802j2043
176B9215l8669j9236J9207K8255L863j8402j7312j889J0343J2263N240o973j4247
189h342j3529r67J7934K2797J842k5710k3280J3842M2777J9378l3481n0537o325
202d3601M3916L7770j1965m2525j8244K8848M2330R448k6398l0854o835J7356
214g54K1836N004j7150k3830p612K0847L3674R901l0055l8333j482L9609L3536
$$ y = [-44390, 8246, 39097, 24378, -5140, -24070, -28597, -12335, 20947, 37759, 7143, -45587, -51908, 5724, 56082, 29882, -45511, -78656, -35118, 29334, 41694, -6805, -55967, -46413, 12898, 54504, 31446, -29510, -58711, -28515, 18415, 24041, -10002, -34633, -23290, 4764, 24000, 27665, 17017, -3634, -19941, -12740, 16236, 31540, 7408, -30153, -31105, 8456, 41258, 29215, -9454, -28690, -9483, 18772, 22635, 4233, -13079, -14968, -4625, 7638, 12878, 5905, -8342, -21871, -22838, -4904, 17893, 19735, -5975, -29255, -15413, 27364, 46742, 13261, -37276, -43601, 315, 38085, 26120, -16405, -34649, -5801, 36529, 45977, 19579, -11275, -18110, -754, 21082, 26086, 8936, -14894, -22506, -1659, 32015, 41916, 11861, -26472, -27954, 11655, 45191]
227D5191j4637m9304k5032L0881M8146N460m2568l8838R669M1085K1667j9371
239A2349k9918m904J9807J8307O79j2327j4247p574R51J0687J4035J594j6044
252f605j5511Q486K8536J6942j7958l4332j0302K5836K6377o390k8231j3932J5350
265a1734K5726P074j3470j4184j415N956M453L600K475n352j2985o332J3720K2697
279B0229J894k7677k5943J0690L6215J8728k2660l6691m053L4938L0422j2320
291B3772l9166k0240J8398L0281P348j9088j8725J789J6537J5512L313j1256j9023
304a0548j0264R067K0922R022j5841k5626l096K9183K9840o320l5391k2553J7231
317a4374L4663P917k8365k8703N040K8872J7784j1313k2625q624J2106J4499J869
$$ y = [45191, 30554, -18750, -43782, -12901, 35245, 40705, -1863, -40701, -31032, 10053, 31720, 12349, -17569, -22473, -2666, 15641, 16320, 3993, -10254, -17828, -16877, -6190, 7845, 9439, -6605, -22116, -13630, 14906, 31848, 13890, -20442, -30744, -4908, 21469, 15079, -13152, -27084, -11734, 13992, 21066, 7596, -6588, -8003, -2047, 2406, 6006, 8481, 3129, -9856, -16188, -2468, 20229, 22123, -5554, -31497, -20807, 15408, 34136, 11476, -25215, -29268, 5670, 36092, 23772, -15394, -35634, -17236, 13045, 20393, 1305, -17420, -15631, 906, 16418, 19731, 8475, -10548, -20812, -11745, 9177, 18199, 2358, -23268, -26364, 2819, 32659, 26339, -9052, -31605, -14374, 20289, 28206, -159, -28862, -23822, 5050, 22834, 11521, -11104, -19728, -7622, 6877, 8746]
330H746o396o576m228O60P009R490J958j3347j7160L97K0392J5593p334k1430
344a2226p815J7547K3045P67k1725j7307N038J6228P495o710j0178k178N237P900
358E118O356K522o663j3258n811J1330J6333J190j8931j8774O978K6804J4341
371B7535j6630k8578n550K2867K3563l926k5347j5777J0953K1080P844j2602j8579
384a3147o403R184J4609N834o508j2676o579R502J7716P173j4886k2348n214J8832
398d911K0670k370k2898j4012J3285K5567R378j6985k1526r94J6792J3124n718
411I402j4016o234N768J0487N304j669n633o185k630N837R436K877r091j1780
425h127o10J3747J2285n269j7547q892R439J5037L506j0294j1097R89J0794P656
$$ y = [8746, 2350, -4226, -8454, -7794, -785, 8705, 10663, -2684, -19844, -19447, 945, 16538, 9204, -12226, -20041, -2494, 20551, 21318, -407, -17714, -12676, 3552, 11047, 4337, -5841, -8019, -2782, 5118, 11474, 13996, 7333, -5925, -11736, -406, 15927, 17117, -1814, -20588, -13610, 13194, 27535, 10905, -17673, -23223, -356, 23207, 19281, -6066, -21843, -10890, 10190, 18034, 5432, -13147, -19550, -10366, 4243, 10077, 3569, -9107, -15686, -6184, 11532, 18705, 3819, -18529, -23743, -4911, 15759, 13389, -9509, -23521, -10236, 15331, 24709, 7724, -13802, -14796, 1996, 15120, 9402, -4614, -10848, -5080, 5407, 10711, 9042, 3409, -2776, -5406, 431, 9867, 12744, 3653, -8127, -8737, 5010, 17295, 12026, -5521, -14413, -4974, 10063, 13569, 3275, -7822, -6833, 3961, 11617]
439A1617j881q058q176k148M456P824L771n051j0276l951J1208J5731J360j6949
453e23j6710L504J8952J2178j1309k0736n112J6466J9299k11j7460j3788M475
466a0975J6311Q337o870j2424o438N580J1471O294n206j2665p414N593J4825P858
480A4277q879j5888m059J3794J6029j846j8407j4036O260J7509P094j0129j3228
493a1509n95J1317J0418q50r343o770K6M645M482J129l166n518k090M580R262
508F018M311o891j1025j943R531R896j480j1540p932N018J1457M246o334r879
522f547l308N919P632K279m338o335k775L547P909M511o383j1526n643Q336J3179
537F457K941j1739j1845K989J6460J0412p353j6972o794J0529J4754R40j1700
$$ y = [11617, 9736, 1678, -6498, -8646, -4190, 3634, 7405, 2354, -7922, -11873, -665, 15066, 16426, -523, -17233, -13729, 5223, 17401, 6092, -14644, -19756, -3290, 16009, 15798, -1662, -15450, -10975, 5336, 13673, 6803, -5621, -12059, -6479, 4992, 11286, 6080, -6585, -13999, -8406, 6419, 14277, 5398, -10490, -14549, -755, 15274, 13428, -4979, -19015, -12755, 4754, 11848, 1719, -11509, -12104, -787, 9631, 8781, -562, -7332, -7306, -2661, 1821, 2950, -216, -5734, -7824, -3244, 6018, 10329, 3438, -7587, -9530, 1, 9897, 8417, -3123, -11055, -6037, 5420, 9666, 3332, -6547, -9855, -3936, 3696, 5975, 1637, -4698, -7473, -3926, 3983, 8494, 2111, -9415, -15058, -6722, 6457, 9398, -2341, -14186, -11197, 5263, 15675, 8322, -8650, -15444, -4915, 9839, 10779, -921]
550i21j0675L133J2607Q845k529j0553o536K408R098O259l444j0450n902N190
564c470J0880N418o391j2394l432R051J1493K06j1626q475K997J1414O203o460
578E414j0267k845N408O910J519m371m560l2L390M049K543k193o274m271K051
593c529O846L997m060p987k209P004Q794N06q204p805O42Q148N852l173p631m240
609g049L116O842M337l490p155m222K883Q115M741l914r681l943P125J0046J353
624I104r691j1148P59J1970R000m365j1657m766P151J1338K271q714j0519r07
638a0174Q068P586r97p658n672K428Q220N880k131q252n868K521Q546M347m166
653B678q763k702O589Q899J136p768o989J085P103N108k440o249l199L260M829
$$ y = [-921, -11596, -8463, 4144, 12989, 10460, -93, -6629, -4221, 4877, 11136, 7692, -2758, -8660, -3470, 7410, 12828, 6437, -5957, -9389, -338, 11155, 11361, -265, -8740, -5743, 5671, 11874, 5414, -4853, -7698, -2290, 4620, 6139, 1768, -2792, -2824, 566, 4615, 7158, 4965, -1309, -5580, -3529, 3317, 7314, 3254, -4733, -6942, 62, 8856, 9362, 1158, -6647, -6005, 2143, 7995, 4822, -2809, -7049, -3933, 2909, 7246, 3756, -3399, -7621, -4738, 3377, 8118, 4204, -5477, -9420, -2295, 7751, 9104, -587, -11735, -10976, 994, 9994, 5629, -6028, -10794, -3643, 7695, 9966, 1252, -9267, -10174, -2106, 5480, 4483, -3175, -8847, -6419, 1801, 7681, 5550, -2702, -8570, -6049, 2497, 6844, 2678, -6085, -8787, -2198, 6701, 7837, 69, -6920, -5835, 1268, 6376, 3936, -2313, -5512, -2252, 2577]
668B577K209k336m228l426Q78M438K736p88m585l338K027N541L395l253o963l880
684h996M286O791J726n034o004J23O735N824l32o407n181Q30O086M967j305o454
700b345m353K936Q134M377l452q376l581N780R099K286q314p945M83Q742P188
715A0659l200r913m855M578Q711L157n710p433j250N874O485o32n879o375j04
730e887N689N576j417n544m390K074O587M222l625p212k703L636N892J550m561
745a13m936K78N099M105o57l817l217N18L250L010o19k756k791p7L995L403m71
762D204l808l990R7M776M233j355n511k991K237O087K778m134o865j695M285N441
778C789O59m839m564K71N313M710p43o034n366J689O254M090l244o955k783M701
$$ y = [2577, 4786, 2450, -1778, -5204, -4326, 112, 2848, 2060, -2525, -5863, -3836, 1705, 5100, 1847, -5116, -8996, -4710, 2081, 3807, -1227, -7231, -7108, -373, 5451, 5119, -1288, -6469, -5639, 447, 5414, 4109, -2345, -6698, -3762, 4372, 8749, 5297, -3079, -6660, -880, 8219, 10505, 2191, -5754, -5271, 3471, 10659, 7459, -2454, -7309, -2731, 5980, 9137, 3427, -4006, -5256, 618, 7103, 6471, 592, -5783, -5887, -198, 5378, 3961, -1583, -5973, -3899, 2688, 6910, 3285, -3927, -6630, -2994, 2898, 4448, -113, -5049, -4771, 328, 4433, 3776, -41, -3258, -2740, 510, 3520, 2901, 145, -2646, -2723, 1272, 4675, 4204, 396, -3594, -3497, 1279, 5512, 4157, -1354, -4345, -2108, 3979, 6757, 2623, -4242, -5937, -1652, 3789, 4448, -391, -4955, -4684, 629, 5339, 4596, -1438, -6804, -5115, 1139, 5229, 1985, -4970, -7753, -3052]
794c052P287J919n488o964j27O665N487j473p010m333K934P204L108l881o182
809c906j548M044N909Q48m691m752L58M709L800o15m829l997J032M329L429j575
825B545m532k016K314M378J168k501m037j470K129L515M86k068k690p59K443L182
841B087K94k404k675r81K450L575M58k958l128j11L658L531M1m679l723J625M866
858A926L040j941m766k063K757N511J390m212n606r19M624N531n35n094m074J619
874b812O073K837k601o258l318L434N674J647m390m909k27M949M990j353n129
889a393l595J103N250K526k412m634j669K742M735J238l192l637k62K843L633
904C276J11l476k778L92L552K288m73l347j819M13L258J716j208k324j525J248
$$ y = [-3052, 4235, 6154, 666, -6298, -6425, 240, 5727, 4254, -2756, -7089, -4155, 3049, 6157, 2276, -3906, -5454, -1410, 4499, 5347, 656, -4096, -3738, 971, 4771, 4156, -673, -4670, -3638, 691, 4120, 2545, -1987, -4003, -1689, 2689, 3857, 1356, -2681, -4151, -2022, 1493, 1979, -89, -2779, -3538, -1095, 2087, 2381, -23, -2698, -3679, -1229, 2346, 2804, -154, -3282, -3393, 265, 3796, 3837, -842, -4565, -2940, 1926, 4966, 3025, -1741, -3804, -1047, 4464, 5854, 1642, -3964, -4883, -259, 5272, 4737, -357, -4431, -2812, 3261, 6098, 3497, -2761, -6079, -2645, 3029, 4676, 286, -4623, -4850, 99, 5089, 3736, -1393, -4988, -3885, 1365, 3891, 1479, -3155, -4824, -2082, 2653, 3891, 699, -2938, -3200, -357, 3276, 3387, -89, -2867, -2475, 1077, 3365, 2892, -455, -2274, -1861, 1397, 3113, 1905, -419, -1944, -696]
920f96K570J627j636k650j847J078K648J741j831l046j078J916L872Q29k669l807
936b979p56K993L485r9l489l318J059L905L096j631m156k611K419M892J235k575
952A470m463o79L304M595k4m162m083P47N078L393j688n173k151K604N114J237
968E119l666m521m15L504L647m76l672k815J040L540K355j372m053j927J665L313
984A266R66j934k969p31K557K683Pk205k525K84J621K420j04k016j657K81K181
1001A25J528j58j973j809M23K125J944m51k190j404P47K084K034j182k758j815
1017b730J423K751J964k220k989r90K466L326L85k899l539K29K676L121q98l976
1033a900k207J868L516K051k359m010j076L024L877M5l591l293O70L408K792j137
$$ y = [-696, 1874, 3501, 1865, -785, -2632, -1554, 1094, 2835, 1004, -2042, -3120, -1204, 2668, 3497, 828, -2979, -3735, -742, 2743, 2644, -845, -4163, -3104, 801, 3897, 2266, -1890, -4501, -2082, 2810, 4045, 1470, -2993, -3672, -368, 4227, 4203, 41, -4042, -3295, 1783, 5176, 3488, -1685, -3836, -1232, 3882, 5119, 1453, -3068, -3483, 21, 3668, 3192, -480, -3295, -2255, 1285, 3640, 2268, -1785, -3712, -2047, 1266, 2232, 298, -2671, -3402, -845, 1838, 1845, -360, -2885, -2601, -980, 1440, 1336, -680, -2337, -2056, 125, 1653, 1495, -478, -2287, -1864, 261, 2205, 1754, -436, -1840, -1093, 991, 3025, 1843, -915, -2730, -1307, 1444, 3408, 1188, -1801, -2791, -325, 3001, 3386, 487, -3052, -2823, -147, 2974, 2076, -1900, -4107, -2239, 1277, 3328, 969, -3041, -4117, -1093, 2784, 2829, -762, -4055, -3385, 23, 2815, 1678]
1049A678l423j921J506L620J732k078l487m59K335L326J04l118k382L03K616K399
1065B751o50k259j599R62K662Q60j209k089r11P92J914P42j260j863PO45K132
1082A627J76j057k059k12J342J076P07j057j777n46J668J616L65j877k181K53
1098a936K431J872p13k025j713R57K821J519j580l241j596K365L258Q46k630k736
1114b101k5K863K595m30l493k493J132L451J630j540l584q62J750L735M90k699
1130D19k763J29K471K356n59l156j617J360K368J588j398k652j002K071K443j76
1146A882j823k042J87J955J819o73j422j568K59J493J426n39j455j053O78J470
1162E94J031o75j575q75K02J451Q97m76j550r21Q83J734J077j187j845r91J520
$$ y = [1678, -1745, -3666, -2160, 1460, 3192, 1114, -2373, -2832, -497, 2829, 2933, -185, -2567, -2264, 352, 2751, 2101, -158, -1757, -795, 1867, 2727, 1518, -571, -1482, -690, 1224, 1966, 706, -1157, -1150, -505, 1627, 1803, 746, -1313, -1525, -183, 893, 1600, 543, -1234, -1780, -112, 1504, 1869, -8, -2189, -1936, 495, 2367, 1654, -371, -2084, -1127, 1694, 3213, 1633, -1608, -3204, -839, 2419, 3265, 635, -2101, -2126, 737, 3332, 2902, -591, -3084, -1952, 1499, 3129, 1589, -1995, -2857, -1107, 2628, 3118, 419, -2344, -2215, 256, 2612, 2053, -1103, -2720, -1360, 1008, 2596, 1198, -1454, -2456, -385, 2058, 1882, 59, -1983, -1796, 159, 1978, 1305, -117, -1685, -1426, 67, 1493, 954, -501, -1554, -876, 594, 1625, 950, -625, -1500, -1298, 153, 1050, 574, -976, -1897, -1014, 720, 1797, 610, -1235, -2226, -706]
1179g06J749M32j727j792j27J785K055j11k484j519M88K472J907j125k450j259
1195b412J313K737N83k327k091J4K169K552o41k270j842J004K753J318j528k564
1211a232r16J406K530M29j933j994J65K145J823p97k050j685Q58J815J557j387
1227G34j857n58J338J953j11j502j540Q1J016J283j80o37j161K90N91J172m0o60
1245B12j279j2Q68J313l8r06j297O31J228J250p18j628q36L78J759J141r70j307
1263b11q44P98J365J267j372j741m87R65J926p5j829j902J73K645J304o88k150
1280h56j449J293K122R72j867k197k90K244J798k38k246j608R40J833J069j099
1296D21j576r19J248J713O38j342j785k15J462J948k05j593j156O03J337J008
$$ y = [-706, 1043, 1475, -252, -2044, -2171, -386, 1669, 1558, -926, -2445, -1957, 515, 2422, 1297, -1153, -2412, -1099, 1638, 2221, -106, -2197, -2183, -14, 2538, 1897, -373, -2215, -1211, 1542, 2860, 1332, -1232, -2148, -742, 1788, 2217, 284, -1710, -1545, 600, 2423, 1626, -424, -2109, -1251, 564, 2121, 734, -1123, -1681, -343, 1610, 1499, -3, -1543, -1462, -446, 837, 657, 20, -1141, -851, -260, 912, 872, 212, -1067, -1079, -211, 1102, 1064, 158, -1139, -508, 720, 1970, 1252, -376, -1212, -834, 925, 2066, 1096, -211, -1055, -257, 1108, 2375, 1003, -738, -1225, -260, 1666, 1591, -238, -2140, -1967, 678, 1982, 1294, -856, -2305, -1012, 1110, 2082, 215, -1982, -2272, -28, 1770, 1532, -714, -2322, -1382, 451, 1520, 421, -1155, -2074, -826, 887, 1525, 183, -1602, -1817, -355, 1593, 1388, -205, -1361, -758, 579, 1587]
1312A587n93j375p90P58J375R6n46j317m00R89J146P8n03r33o61P74P15L59l64
1331C95j135j47N61J082K76j098r57o24J365J337pj272r06RJ460J124n90j747
1349h74r12M80J762P45n98k044j33J506J303M03j447j690J81J698J582o16k284
1366i38q96J213K004O26j438j570m64J676J163k67j543j229K27J840J019m84j550
1383f11q68J083J359K67p18j299o88J338J356k18j174j419N50J059P72l00j059
1400e70j40L56Q52L91k88q29p59O50O08L71P6o38n06L10N31O59k99j291p7K21
1420c72J116M16o13j364o5R55Q71P1r48j272M6J353Q69k37j454p43M17J236N61
1439H43k78j730k81Q46J842J94j537j518M06J483J235m28j204j635P98J617P98
$$ y = [1587, 994, -381, -1171, -413, 962, 1058, 512, -805, -1205, -216, 930, 1008, 505, -428, -1089, -315, 400, 759, 395, -740, -887, -326, 756, 1032, -66, -1023, -1647, -282, 1055, 1048, -224, -1130, -1121, 339, 1463, 873, -874, -1786, -1306, 456, 1201, 603, -1441, -1574, -68, 1235, 1638, 191, -1499, -1318, 380, 1962, 1346, -938, -1834, -621, 1383, 2009, 571, -999, -1463, 213, 1376, 1109, -434, -1663, -1436, 404, 1423, 939, -611, -1479, -396, 963, 1230, 512, -787, -1475, -137, 1219, 1001, -173, -1592, -1042, 17, 789, 489, -570, -710, -354, 498, 889, 601, -228, -987, -337, 271, 642, 718, 80, -426, -116, 415, 1074, 775, -516, -593, -372, 744, 1160, 547, -817, -882, 73, 944, 1015, 67, -1205, -1159, 194, 1063, 826, -628, -1371, -954, 282, 843, 565, -1165, -1446, -600, 1242, 1436, -101, -1619, -1213, 270, 1505, 1077, -127, -1762, -964, 653, 1451]
1456A451r06j502J28P69J215J41j038j565R07N18R66j91j019n95N29P59M85m73
1474E79j024l09L31Q57M87p68r14N8R78O89J0j273n23M11L68O70k07n13j82m36
1494g11N45M77L71q08n16l09R14N83J22j112l15L16N64R47o48j167j6M35J076
1513G48J5r54o82M6J043R49n4j389q95O98J125O19m51j571k77O42J233K69j018
1532I6j294K53R50J148l16j504q34N12J617N17p85j549Q0P52R13Q2q28p91J66
1551h15J264j24N4o41o13J75J076K53k17o07l79K23J063j12k29p47J00J73M38
1570C35j5j8p43k2M56L81K3j78n89n55O01O26L42p83m88m85R72Q42j01p45q34
1591i78KJ223O01l44r12p93Q66J245K43j153q52J26O33J165k34j150n02M9J256
$$ y = [1451, 545, -957, -829, -60, 1155, 1296, 258, -1307, -400, 118, 1084, 893, -126, -721, -192, 567, 1052, 579, -445, -754, -423, 434, 921, 153, -761, -703, 275, 964, 974, -299, -822, -411, -43, 627, 420, -93, -275, -711, -166, 311, 682, -126, -642, -951, -37, 546, 668, -444, -759, -443, 121, 1068, 420, -747, -763, -328, 748, 763, -191, -873, -827, 216, 1165, 1111, -278, -1173, -475, 650, 1269, 818, -753, -1030, -388, 845, 1114, 96, -1198, -945, 5, 1153, 837, -667, -1501, -989, 628, 1145, 360, -1189, -1109, -357, 556, 638, -190, -981, -815, 449, 325, 379, -262, -875, -700, 376, 629, 412, -195, -574, -351, 712, 600, 371, -376, -276, -103, 335, 320, 302, -441, -463, -7, 374, 397, 219, -370, -925, -324, 302, 644, -139, -627, -1112, -140, 702, 601, -144, -978, -976, 247, 848, 504, -408, -1201, -335, 910, 1153, 0, -852, -726, -93, 1072, 838, -312, -814, -765, 491]
1610D91Q31n19j453k82O76J193N8o39j180p9J194O85m09j225k89N06P66L92o00
1629A17p59k76O50P79J05o76m29l09Q59O16k39m91j94M0M84N74k46m34q45O31
1649d3J23M76m00m53k6K37M93M8k38m84P3j24N89L08m41m19n32O12N62K8m9p77
1671d37J10M19N25O0p92n88J32Q16N36m72q64n80N22J062K17l30j157J45O39N76
1691E39k29l81p34j14P03J040k51r35n42M49J299N0q64o54KP23O24p7p99o63Q15
1712AP08m8j66o05j19J14M92K18l94n98L63k7M69M0m39j70l04L69N37k17m52k95
1734e23J90K59q3M11m16m43R3K8O38J26k46n77K1P56K56n9n33l44K32K87L36k91
1756A18m82k26M73R02m1o57l99J70L01N51J86r13p44O73M23L80m04q98K21N59
$$ y = [491, 1322, 803, -650, -932, -256, 937, 995, 356, -824, -903, 291, 976, 567, -658, -947, -441, 325, 717, 117, -642, -918, -268, 511, 616, -60, -489, -798, 61, 677, 438, -53, -247, -207, 277, 851, 605, 171, -674, -43, 80, 556, 156, -297, -323, -86, 407, 455, 217, -267, -194, -318, 271, 579, 138, -281, -813, -201, 361, 389, 340, -437, -327, 92, 617, 677, -115, -703, -571, 245, 781, 309, -555, -1135, -613, 449, 666, 336, -821, -676, -37, 539, 310, -71, -805, -919, -216, 824, 573, -362, -904, -455, 844, 894, 30, -624, -622, 101, 725, 648, -151, -814, 1, 709, 661, 495, -110, -229, -115, 377, 595, 201, -397, -34, -61, 408, 448, 9, -161, -465, -96, 441, 224, -228, -523, -333, -74, -157, 254, -162, -605, -512, -484, 154, 280, 34, -543, -522, 234, 490, 431, -102, -446, -214, 73, 409, 118, -364, -590, -117, 785, 744, 87, -312, -142, 159, 710, 896, -17, -761, -88, 335, 715, 311, -587, -366, 193]
1776A93N14J43p61o43N06L67L31l83o12n85L47Q89l5j55n65K45K95K17N6o43l12
1797e91J89N63L35j28o24k27K66K90L74l23m23J61J85J48ml06j22J05J75Q4L04
1818D31k23n88J39M44J25R9l41j55k17L02N31l69m13J26l14L89M86k18m29j39
1838c34J24K87K23j0p88j95M44O20l1m99k76n22J122J64j58n36l08L33R20j12
1858D68l90o98K70K51N13R6l13r05K76Q38L31k79n84m01L41N57K02l16p54J51
1878c46M64L73k94m69J44L5K07k40M91o33P8k22N99q7J14m04o5J15L29K08j80
1899B17k33k83J96J63O3KJ97n79J43K60K96l64k50J2j43N51L16m35k61j59N07
1920B16J75J94n49l45J48M11L45k84n64j15N02J87J10m95k08k35M29M93k56m90
$$ y = [193, 707, 850, 89, -554, -48, 319, 650, 267, -345, -930, -583, 306, 271, 116, -449, -204, 91, 308, 364, -279, -591, -402, 161, 496, 368, -256, -483, -217, 73, 447, 124, -299, -138, 47, 195, 191, -115, -237, -132, 43, 127, 431, 208, -380, -241, 203, 328, 427, 86, -69, -286, 16, 547, 178, -235, -109, -423, -34, 452, 234, -195, -334, -210, 77, 300, 290, -498, -693, -249, 371, 340, -159, -435, -957, 165, 329, 171, -365, -673, -340, 580, 468, 78, -620, -350, -99, 414, 510, 197, -708, -432, 406, 737, 458, -126, -527, -186, 371, 573, 257, -497, -346, 118, 491, 197, -272, -128, -93, 114, -126, 365, -268, -190, -412, 187, 100, 214, -190, -255, -140, 189, 397, 217, -16, -299, -103, 60, 123, 125, 322, -257, -114, 146, 442, 78, -172, -160, -303, 248, 564, 129, -132, -291, 216, 391, 585, 36, -309, -161, 250, 595, 311, -253, -368, 134, 321, 431, -64, -272, -507, -78, 415, 159, -331]
1940c31k05M31N85L6k28o37j71L20M39K7m64j34R4L28L10q5l31k56Q5K77J20m0
1962A70l71j64N60J35o5q7m49K21K98j04K24l38k41M18j49r2m4kJ90j45j07L51
1984B09K5j7m17J7K43J19L45q88j19J14L54K17J63m40j62K33J60N0o0m29j41M02
2006b2J51L73k71q82N55j5M42j69j72o24K76N99L88o09l58K69K11L61J0m10o89
2027e86N88L38K68l44q14L28L39J88kk31l70K61k6K09L47p73J26J5l3L09j45j95
2049b03j13N5N83j75k11q8K65n6R8p5j70j05J20j7J47K76l41q2M1L91j54J54j90
2072A50l84K46J2J31j99P7l10J58N8M09n43M3l0J23L17J94m90l13j64K78M41K50
2094D54n79l47J45j20P35p9k41j91j04N82K21m71l47j02Q11q3j50k51m09M57K59
$$ y = [-331, -536, -105, 480, 516, 288, -349, -520, -200, 239, 266, -198, -332, -238, 90, 400, 315, -16, -272, -187, 90, 210, 170, -201, -365, 195, 330, 265, 178, -271, -50, 248, 144, 368, 30, -211, 207, 58, -34, -78, -80, 110, -35, -142, 209, 234, 217, -200, -183, 60, 179, 524, -364, -483, -369, -15, 202, 365, -75, -237, -4, 156, 206, 146, -283, -424, -22, 129, 502, 231, -651, -96, -111, 331, 162, -10, -634, -358, 241, 629, 20, -338, -69, 142, 503, 513, 103, -586, 2, 340, 608, 264, -550, -222, 117, 305, 303, 72, -298, -37, -63, 146, 493, -280, -154, -139, -172, 137, -8, -203, -316, -261, 322, 147, -64, -152, 113, 57, 155, 80, -90, -195, -75, -92, 55, 331, -10, -92, -51, 340, 186, 340, 150, -234, 12, 24, 155, -44, 33, -277, -119, -61, 348, -195, -152, -182, -59, 258, 452, -38, -351, -515, -237, 204, 454, -125, -472, -327, -447, 288, 209, -32, -223, -327, 255, 476, 5, -342, -444, 367, 284, 134, -117, -526, -69, 190]
2115A90J17l48l27j1M93n3K61k55J2k12J47K46j79l26JM9K04J93q5k14r8K19K88
2138C12j00k54n0o1L8J95j54R6j56j22M00k65K2J58m09L39m06N39O20r25J5j21
2160b89N94K8l01J44l97k9L25K68J42n11k60L61J28K71m15l75M31j76O95j32n87
2181h5l42PN03K22q1m54l00L53L73J39j18o39K61M0J28N6j93n6J77J06O2O6m57
2204b32J36j54M09j06J2J60l54J82R7j16ol29J45M59J5J98o86Q9O3J42K97m62
2226d1Rk8l67K61J66j97L35l52J55J9L7L46m17o3k05N53l59M47m36l3R4L66P5
2249C65k88n93N18K3J43K26n25p9J92R3J50K53m44j04k26P39k95R3o90m2P33j26
2271A16k28k38p8L75Q1K96n13j80K43M69j96K11o11J72n8J65K86l64n2n7l42O21
$$ y = [190, 307, -41, -368, -379, 114, 61, 322, 67, 79, -133, 14, 260, 81, -245, -244, -195, 9, 202, 117, -97, -195, 24, 312, 212, -42, -92, -153, -115, 80, -74, 22, -134, -256, 144, -121, -99, 59, -350, -11, -417, 122, 742, -183, -168, -289, 305, 333, 32, 176, -221, -250, 75, 343, 485, -26, -286, 75, 203, 474, 59, -316, 115, -61, 634, 502, -85, -427, -420, 83, 305, 224, -230, -530, -177, 196, 335, 217, -422, -161, -121, 7, 63, -130, -186, -9, 97, 159, 225, -232, -96, -250, 159, 53, 65, 225, -129, 53, 150, 34, 28, -301, -156, 303, 318, 516, -170, -81, -18, 124, 421, -41, -32, -60, -427, -166, 0, -197, 138, -214, -59, -40, -3, 343, -74, -137, -342, 211, -148, 299, -137, -170, -76, 290, 365, 77, -516, 2, 25, 168, 394, -131, -210, -18, 75, 225, 478, 34, -70, -296, 443, 148, 241, -449, -491, 242, 116, -112, -350, -428, -53, 28, 324, -189, -369, -126, 343, 147, 358, -253, -81, -139, 26, 312, -52, -104, -161, -503, 118]
2293A18J79l5j20j54nmK73o9j24n60O53o7K75j91j7j23N8q5K2j07K35Q4l87K76
2317A25j57R3L47n08q0L42K86j77n02k72M99K62j3m11j68j02P61O8p4n75o7M55
2339A32p7P9l70j00j48O64Q6k83J1l24O7J64J72K24n85j01P5N35l10R7l29J77
2361a44J58M38k92j59k77K76J06M3N2j67P6j93l3R2k12%J66OL7o9J60l55J41J98
2385D8O2K32l63n31N10J82j23P2n9j39J21%K10r1m5k28JQL84j98N5n1l81M23j43
2410d4l2k38J02J00K79j15j52KJ2K72J20k90n2k22K45Q8O3L0j92n9j07O1J10k78
2434b97RL0K69j8j61K18m50M71K53L0m24l08K55L03j74J46o99L49M16PL5m94K37
2457CJ66j71Kk7N2K82l33o7L55N9l78j84P1J25L29r4po3l6R6o8J33k12n7j49J46
$$ y = [118, 297, 262, 142, -12, -17, -21, 252, 183, 59, -501, 152, 85, 360, 169, 152, 29, 87, 2, 24, -83, 152, 236, -151, 125, -32, 61, 408, -100, -180, 162, 448, 271, -231, -503, -4, 258, 245, -166, -334, -436, 325, 393, 319, -256, -323, 132, 55, 134, -236, -336, -484, 180, 266, -17, -6, -330, -263, -99, 73, 297, -288, -389, -314, 221, -89, 8, -321, -144, 14, 452, 160, 1, -276, 0, 106, 149, 201, 34, 110, -83, -116, -24, -236, -236, -70, -64, -27, -96, 64, -291, -150, 48, 110, 342, -21, -552, -42, 140, 17, 89, 30, -109, 12, 12, 222, 131, 86, -142, -141, -133, 251, 53, 108, 57, -324, 99, -44, -76, -314, -212, -112, 167, 52, -100, -98, -86, 186, 306, 16, -36, -258, -13, 75, 138, 168, -24, -83, -190, -129, -19, -297, -288, -258, 11, -7, -168, 50, -400, 71, 324, 354, -70, -378, -123, 180, 6, 152, -547, -198, 218, 225, 260, -234, 3, 169, -2, 0, -27, 25, 307, -26, -93, 262, 321, -57, -241, -170, -45, 284, 190, 183, 120, 84, 180, 112, 245, 33, -24, -173, -27]
2483b7L44o04J27J15O7j70J49K93l6l21L6k1J85q6l83J38L64k09M89n79lR2K74
2506B34j02l43K83l22K76j04k1Pm0L62l02L1k0j02J92m3L9J13p4j17K3j66M99
2529C03n20M8j94K85J56N2j39J2l3N5J21j17m89K83K38j18l2J02P4K0m30L16J53
2552A46O9K53l84l27K63M0J47j84J10Kj94N1o0L99n26P9J93j43k14K23l4J03N0
2575F2N2J8L2j79J9O6K29r2l74j47O00J15m47k43K13J52K22k01O7n08J57K68O8
2598A49n20K67J27J82K8j81J76r4Q5k65N2M7o1k7j1%L59j61r3k17j3K12J76o2
2622A55j87l78J74P25k57m44K10J4j98J22J06P8k32P4RL33j48r0k41n1K83J03
2644A60l4l71L74m43J66J81j83j88K36K24j43n9J0R6j5l71M42J07p8oM5j79K44
$$ y = [-27, 317, -287, -160, -45, 22, -148, 1, 294, 258, -63, -27, -48, 137, 51, -332, -194, 170, -39, 450, -129, -132, -40, 234, 132, -211, 72, -250, 26, -78, -99, -92, -132, 230, -72, -41, -61, -163, 29, -14, 25, 138, 64, -53, -30, -196, 303, -217, -169, -363, -78, 78, 130, -9, 3, -30, 25, 146, 29, -460, -177, 61, -57, -89, 13, 87, 107, -323, -7, 146, 215, 468, 84, -243, 20, 60, 207, 23, 133, 135, -59, -8, -68, 331, -195, -116, 77, -66, -280, -57, -91, 12, 62, 114, 132, 164, -15, 4, 70, 299, 207, -167, -314, 286, 401, -46, -289, -76, 76, 298, 97, 164, -344, -187, 81, 149, -371, -104, 23, 205, 233, 52, 228, 134, 219, -46, 6, 53, -8, -35, -46, -46, 313, 152, 59, -158, -171, 41, 217, 155, -32, -410, -236, 489, 232, -212, -2, 12, -186, -64, 42, 120, -112, -38, -29, 304, 156, 66, -175, -226, 57, 160, 126, -245, 129, -314, -148, 33, -150, -338, -102, 122, -21, -80, -70, 26, 11, -360, 82, 189, 111, 105, 150, -29, 215]
2667B15j93j71L85l34K38o3j26k2j90K47L67m04M33o00J97K72j23j66J23k72N6
2688a31O3l7M40l63n4K33M4p5k5m68M37m0r4R9P5m51O48k19j15r8Oj22l9J50L15
2713A79l97J03L33j76j29J59k46lQ1J89j7J83l33J00m18M91M6j38k2j84nN28k28
2736I6n97M21L09j20l39L05P0r6J85q9j48L3k33j4J20l5K29j14k85L65k67J13
2758i1L46j73l65N2L47N9m2j76k32K22p5L23m43J84K08j86j74L5M63j03l34k0
2780a75pM32o5j14k75K05K21o2m16L14j95J99K6n2j90K9K3l2o3L96j54L8k02j75
2804b94L57M3j47j82K55R1j99M86l79j57M98l67JJ97l11J98J39k34J46m20O24
2825C45n88J2M3J07J90j6K0K1l64J66Q0k99K50j30L16k83j13j05N62j93k29K34
$$ y = [215, 22, -149, 236, -98, 140, 77, -49, -71, -261, -14, 353, -51, 382, -218, -21, 251, 128, -38, 85, -187, -131, -68, -105, 335, -28, -82, 151, 195, 120, 95, -373, 64, 24, -70, 29, 104, -347, 301, 82, -33, -131, -125, -247, -286, -136, 179, -218, -115, 218, 42, -87, 72, -174, -177, -96, 93, 76, 259, -74, 26, -392, 99, 145, 7, -15, -199, -204, 324, 96, -501, -80, 229, 109, -230, 75, 145, 49, 234, 145, -3, 30, -203, -217, -97, -132, 97, -17, -302, 63, -204, -91, 255, 82, -283, -231, 116, 175, 133, -43, -275, -53, -128, 195, -248, -64, 144, -42, -216, -181, 282, 179, -155, -175, -182, 250, 185, 71, -204, 1, 222, 160, -256, 58, -137, 62, 88, 36, -154, -125, -102, -134, -197, 199, 45, 83, -119, -294, 63, 106, -41, -223, 32, 123, -76, 410, 31, -126, 372, 5, 6, 203, -108, 90, 229, -5, 141, -279, 345, -243, -231, -188, -81, 109, 93, 113, 134, -230, -64, 16, -283, -33, -163, 153, -130, -243, -348, 214, 21, -208, 26]
2847B6r4M09l35j85J86M5o9n5R3J01m39L33j23J09o6J15J77l10Q1rj97L39j24
2870Hk82J83J03L19k40l15O22m52J40l1jj49K41L7k05m67N26Q6m2M8P1j4Q3l61
2894i2p1n4J11P2K01j02j21j07K73j47j2m8J02J57j1k48P2l00J23J2l3Q1j45P7
2918b10mJ26K07l11J27KK43j59l40K84l69O08Q5k74J31o5KR6P5j09k41Q7j3O5
2942D3j91P7J42k5M8l00K2n3j21K86j57M24k62%l0n4L19J73k14j41j93q6L80k02
2966a15j46L16R6k5j68n0K38r6j90O4k9J49J0j32nJ63J38j31l14J28J90j86J6
2989g9k56M2L35m2j46L63M4j82m5JJ60k04N0J28o9r6l82O21l21J6j03K64j1qj34
3014e4p6K17j50k97M04j70Q4l0l46M50J51j36j28N1r0Q4J29Q9l04J99Rj32j95
$$ y = [26, -68, 341, 6, -179, 7, 52, -17, -72, 21, 122, -317, 16, -107, 2, -64, 51, 228, -82, -1, -10, -207, 132, 8, -274, -91, 12, 331, 91, -224, 398, -54, 86, 55, 54, -95, 146, 183, -22, -489, 37, 123, 81, 129, 200, 186, 269, -92, -163, -217, -106, -34, 167, 65, -56, -163, 110, -37, -49, -97, 5, 162, 151, -97, -25, -325, -202, -190, -223, -142, -287, -210, -214, -88, 119, -192, -65, -63, 180, 21, -319, -35, -404, 204, 289, 15, 146, 81, 83, 179, 254, 145, -96, -9, -22, 43, -148, -71, 71, 46, 94, -206, -184, -237, -358, -72, -229, 195, -67, -67, -97, -151, 168, 341, 127, -14, -207, -293, 87, -115, -261, 55, 151, 126, -42, -92, 146, 50, -140, -76, -105, 44, 54, -78, -83, 80, 218, 87, -227, -99, 91, -95, -79, -335, -293, 42, 0, -146, 217, 261, 79, 34, 35, 195, -9, 41, 169, 100, 4, -378, 243, -78, -62, -165, 99, 88, 80, -54, -130, 87, -63, -360, 44, -126, -42, -72, -418, 32, 183, 47, -81, -30, -120, -36, 93, 182, -122, 77, 86, -46, -241]
3037b41K90j74J45J81j79j00l4K68j64m1j05K01j37L94l38J33P9R6M9m55M20j43
3059A45j89J97j95j69J44J93j88pN7K77J17k79l84L94k30K1J94l9Kk51R2P3K48
3082B23l39j9N99l53j43K51j85m5j24J8p7J28m2J74L7J06j85l3l2L34j87k40j15
3105b49L17l4J13N4k25J83L2k63r4o9N20m95N5J21J25j24O6j38J11J29K6m7q8
3128B6j92K35Nj55k10J78l02O72k60L06k55l25L68j2k83M9J28M7j77L08l09K20
3150F2o7K1J29l77K15K04q2o8n9K46l22L6J26j13P8J2j54J80m3K07l36K92j35
3173E2K2k38N5J40r4J79j35k3j30P5L09J10l42P9j39K55m47L26m25M63k05J93
3195H0j94QQ7k14K23J40k23J60r2j36J26J59j24M2j07j01J61R5p7j27K26q7J24
$$ y = [-241, 49, -125, 20, 201, 22, -78, -112, 156, -8, -49, -154, 47, -90, 304, -34, 99, 178, 274, 323, -132, 288, 145, -44, 153, -42, -211, -67, 126, -62, -69, -12, 265, 382, 103, -281, 113, -117, -96, 98, 59, 61, -190, -98, -25, 223, -116, -135, 464, 111, -32, 219, 34, -11, -135, -117, -194, -66, -108, 66, 103, 209, 24, -9, -41, 293, 106, -134, -249, 68, 34, 147, 201, -24, 159, 191, -72, -166, -235, 285, -210, -155, -34, 91, -33, 33, -105, 6, 135, 161, 114, 26, -166, 69, 74, -81, -291, -113, -415, 257, -3, 303, 48, -277, 91, 79, -204, -155, -27, 20, -157, 151, -158, 62, -5, 16, 145, -232, -17, 187, 105, 37, -22, 224, -98, -62, 64, -49, 29, 41, -113, 67, 24, 231, -105, 187, 52, 74, -164, -109, 31, -63, 116, -19, -42, -172, -97, 212, 322, -20, 59, -80, 175, -272, 54, -371, 92, -113, 80, -114, -106, -19, -233, -10, 130, -93, 67, -25, -161, -35, 124, 0, 42, -65, -166, -5, 90, 13, -114, 112, 25, 149]
3218A49k67L4j0J59P8k59l9K46j61N0N8O2K5m4j53r0K88j26R5k86J34J28m7J0
3242C4j7O3l91O06j35j87J42k61L83R0j58m00Q3P1jJ31j30j66k2J94j06L00o4
3265E9m0j77L09K59m44J42k32K49k40K04k07J33O9Q1k12l6r2j69J41j53N38m55
3287b73P0K82P7j88K79m00L28j14k83L05Q4k63J05l3O7O4j88J59n3j09M3l7O9
3310il91M46J50j91J18k42K95J42j90l99M78j17r6J22J19l28M36n25J86O2L0j71
3332g5J65o2J39k28j55K97k60m8p0L13KJ05j67J10k38J01k07R2L21j71l8Q3J07
3355A16J95q0j16M3j74M17n6l57K1N7l02J18K57j89j16J10o0N6j38K03j4K58l65
3378a16J38n7K51l4k58J28R2m07N18j06l31J16j03K35l93K45j74K97p9j0j91K33
$$ y = [149, -118, -84, -94, 65, 143, -116, -155, 91, -70, -20, 38, 100, 125, 81, -72, -162, 126, 0, 95, -191, -57, 71, 24, 34, 17, 80, -311, 295, 160, -27, 115, -146, 237, 327, 169, -231, -148, -77, -78, 53, -77, -243, -265, -71, -177, 123, 59, 19, -158, 151, 410, -34, 108, -124, 125, -115, 89, -118, 15, 84, 165, -47, -83, -175, -344, -203, -356, 182, -273, -203, 79, 156, -32, 247, -153, 175, 61, -222, 83, 167, -96, 9, -24, 43, 107, -81, 78, 25, -84, -41, -78, -9, -400, 46, 196, 5, 123, -119, 176, 318, 128, -271, 207, 90, -6, 116, 235, -93, 343, -182, 4, 66, 96, -75, 90, 28, 167, -61, -216, 81, -179, -227, -297, 16, 18, 123, -44, 66, -172, -71, -278, -186, 135, -36, -74, 9, 116, 311, 231, 115, 158, -16, 401, 345, -12, 9, 66, -236, -118, 139, -50, -166, -56, -116, -60, -198, 5, -9, 249, -116, 22, -35, 216, 182, -76, 52, 144, -263, 255, 149, -182, -66, -169, 66, -327, -82, -256, 41, -38, -48, -239, -6]
3400fl14L79Q6j61p5K79k78M01j85j75M05n62L02m65N71l37J31k7J10M2j17J55
3422A59l18L49j67j86m9o8K10OJ07N8J1l20K90O8pl1r3j30J67l11J77j3J73q8
3446fp0j00P5O7m0K88k87j81M0K38J0j23K0J17j63L21M7j86K7j54J78j41K38k17
3470bj79L2L01n1l02J06L09k34J1l6J65o9N9j10O7j8P8r4L82j15l37N5K03l37
3494a16J05R7m34O43m26K44k40lJ02J30J21k99K80M5m42K26j80R1j65Q3J00K85
3516B47l65L51n07K63r6j30J86j56J52L3k3J22K43l57j31L7l5Q9M3n5k07N17l65
3539a44K12q3K10Lp6j50J53j67oK34j08m1k51J43M5K62l45K25m09N06j49j36j23
3562a95J62M2K7ko6k16J50J7K4K92k06L40l34m5k43M43k69q0J2J48r9n3j76K33
$$ y = [-6, -320, 59, 145, -16, -91, 188, -90, 311, 126, -49, 356, -206, 96, -369, 202, -135, -4, -31, 79, 121, 4, 159, -159, 190, 23, -163, -212, -280, -70, -64, 43, 101, 112, -208, 82, 150, 143, 112, 19, -111, 56, -255, -78, -91, 82, -6, -76, -176, -101, -34, -74, 214, -73, -254, -214, 24, 34, -89, -69, 48, -115, 206, 253, 67, 94, -60, 118, -23, 215, -2, -181, -149, 152, 101, -201, -95, 214, -20, -9, -45, 120, 51, 110, 0, 67, 49, 127, 33, 415, 300, -37, 18, 221, -116, -11, 86, -348, 295, -131, 113, -127, -130, -28, 102, 223, -76, 204, 249, -193, 33, -147, -56, -221, -138, -38, 247, -118, 233, -274, -11, -107, -237, -51, -207, -55, -22, -45, 77, 320, -37, -168, -131, -166, -77, -34, -89, -296, 221, -144, 68, -15, 195, 198, 122, -28, 125, -42, -48, 186, 78, 37, -214, -71, -26, 236, -109, 116, -293, 213, 64, -72, -195, -33, 9, 36, 34, -32, -248, -98, -81, -57, 235, 29, 369, 35, -10, -253, 190, -79, -159, -147, 1, -98, -151, -327, -94]
3586i4L40l46n5L26l25jM07j78n7J34j16l0j17J21r3k6J6j30K61k28K18O3l1k19
3610a60K07K2j29R7J4J3R1j14l14J56q6K01L3M60o23q7L15J05j73l03K32p0J08
3633em0L2K25j97pK70j63l4l27J23K99l42L00m46K55M9j47J39K03l71L73m00K21
3656A0j24R8p3k3k5J68j38l3K84q2K61j62q9J15j19k06J82l56M31j10j24M61j71
3679A75k58J85j53l4k6L48k07K9o4k77L50k15Q0n6j54J96J51l33j02K52k32J52
3701a93j11L99l36N13k39l1L69n75R5K44j01k39J07O9K6j39J46r4M7k9M48n36
3723a60J27j84K3P5R6J26K07j45l05Q2j67O06m19K34l05M0O9k06O75n13p2K03
3745H7j59J79m61L46j88K22j13K51k57R7k02j43O68l61Pn7M1K25Q8k1O4j19k84
$$ y = [-94, 246, -100, -155, 171, -154, -155, 252, 74, 17, 151, 35, 5, -112, 9, -84, -110, -94, -224, 37, -191, 27, 90, 59, -160, 47, 69, -60, 37, 51, 64, 155, 41, -273, -117, -203, -2, 31, 491, -132, -219, 96, 201, 28, -275, -43, -113, -5, -45, -13, 212, 15, 8, 278, 115, 81, -246, -123, 176, -166, 134, -312, -57, -8, -155, -16, 187, -184, 189, -211, 10, -114, -16, -89, -112, -137, 31, -107, -140, 144, 62, 323, 161, 72, 187, 68, -138, 44, -312, 119, 9, -115, 346, 175, -83, 102, -51, -85, -111, 237, 30, 59, -5, -282, 68, -147, -67, -123, -277, -81, 70, -263, -365, -113, -345, -193, -304, 95, -241, 272, 33, 2, 371, -204, -109, 135, 34, -205, -98, -29, -3, -142, 4, -90, -43, -72, 376, -160, -33, -217, -194, -119, -23, 103, 310, 165, -140, -58, -225, 381, -38, 196, -109, -69, 0, -206, 469, -44, -116, 87, -72, 107, -354, -8, -196, 26, -87, 164, -93, 4, -198, -341, 327, -34, -27, -84, -43, 182, 270, 249, 313, 194, -90]
3768i0j21J48K14l91J84n5R6j98K65j03R0N7n1N0j07l83L45L81L8l06j5J01j72
3791b3J46j48qk4J42L81o30K27JK9n6ljN4K38o19L28J47k84K13n8k90Q7K05J94
3816B48r3k42k30K04K35j40P8k6j84J60K9K43M6k55j4k50J53K54l72p9J02K79
3838A46rk18J38N4j54J07J46p4p6L3l23N38l01J22j47M9K39k87j24l9L73k59k45
3861c11K29Q33q67K66j74j71M80M3l88k43K89r4J39q6L5j08R6P1J5j30K17k64
3883a23J32P3Lk01j78K72J21j60K0p0J60n3p6K15k08k6K68K5j51m0J36j77K19
3906A81j49J13r1j67J71j43K02k39M0J3L58l46j74K97k10l5l1M25k42j50J91K10
3928B24j16j19n3K89j88j85o5m8L24j31j4j14J22Q3L10l58k75M55l25N9j50K66
$$ y = [-90, -211, -63, 151, -240, -56, -111, -15, -213, 52, -51, 39, 96, 45, 95, -12, -395, -50, 331, 369, 63, 48, 149, -23, 123, -25, -33, -57, 85, 466, -164, 63, 64, 93, 37, 34, 33, 87, 325, -294, 34, 181, -103, 110, 52, -238, -151, 54, 248, 155, -87, -317, -113, 122, -18, 60, 34, -150, 10, 39, 282, 328, 73, 59, -191, -38, 216, -156, -235, -133, 146, 137, -81, 57, 111, -43, 64, 210, 136, 60, 93, -230, 308, 7, 129, -18, 31, 270, -17, -141, -180, 193, -66, -311, -82, 751, -116, 150, -24, -195, 285, 328, -60, -303, -14, -108, 31, -55, -20, -128, -32, 39, 54, -76, 141, -123, 9, 82, 85, -116, -294, -22, 99, -61, -41, -111, 49, -4, -80, 135, -73, -99, 169, 194, 43, 3, 139, -38, 181, 32, 145, 54, -113, 58, -85, 117, -122, -82, -69, 289, -57, -231, 66, -144, -179, -210, 215, -27, -177, 14, 224, 108, -11, -64, 225, 37, -148, -213, -261, 63, -68, -82, -196, -74, 9, 319, -39, -314, 141, -184, -125, -275, -9]
3950iL2j93R3K6O8P4j59J03m9M90k62k20R8J0o2r2K0K1J04K45n40J85Kp6j38L73
3976A44k24r2O7N45l13j03J31m05J62Q0J9m5k6L4j28J05J41j94Q2j47K98J90m29
3999a08K49k31j24K81j53q5L81j31R3j16j0m57J83M4R1L40l69M68m22J8Q6j30
4021a02j29L23k7R7n19K98j1n8J09j37K70k25K74Q5K3l63MM88m88K00j82J18l14
4044b66O61p09L66n0J38J67n12K39p8k01N64m11Q1K24k99q2K22j40J68k44L24
4065A62k68j48L4L42k52K58j34k00J95l75L44M6Kj10K6L41o3K7K8l23J55k43J63
4088GJ24m3j6m9o4PJ12o1J1j4J43r5Q9j68k6k52J54J60k39J05J72K07m28L06m32
4113b90J79K12j87j19Q7j27j8QK44r5Q0M01m82M7n9O0L17J52n14J91k22K31j99
$$ y = [-9, 23, -170, -77, -51, 17, 91, -68, 35, -14, 476, 214, -6, 92, 102, 40, -52, -32, -11, 93, 338, -202, -17, -15, -91, -229, 144, -80, -172, -105, 440, 127, 24, 155, -250, -88, -8, 11, -34, -60, -26, -154, -49, 92, -102, -20, -167, 131, 321, -108, 141, -90, -214, 67, -86, -171, 210, 79, 172, 56, 46, -411, -228, -184, -93, 247, -122, 346, -76, -58, 28, -102, -231, 92, 65, 162, -357, -59, -70, -128, -19, -156, 114, -111, 163, 248, 271, -92, -88, 400, -88, 112, -70, 48, -266, 395, -314, 52, 2, 140, 307, -205, 34, -44, -245, 319, -92, -11, 213, -86, -168, 54, -86, 82, -162, 162, -106, -254, -220, 122, -130, 128, -6, -206, -11, -386, -42, 4, 6, -104, -78, 263, 200, 227, 255, -68, 87, -156, 7, 131, 88, 72, 23, -41, -34, 78, 17, 28, 14, 157, 62, 151, -17, -43, -295, -141, 19, -220, -115, 57, 264, -164, 142, -290, -111, 101, -86, -205, -118, -245, -263, -255, -11, -106, -26, 375, -107, -60, -119, -59, 258, 410, -104, 87, -135, 96, -103]
4136a03q4j40QK54K84k43M27l92R5O1k59j9K42l11P0R0L8j10L45J34n57K54R0
4159A74J7j99J37q1J07k05J88ln08M02k32J44J38k44m4M42k6m17L86l45M0L66
4181B37j54J48k48J84k68L26l71J67k7l41M50k86K22k5k22K90j81J28j2j0m2l6
4203g1j13J36j68J34m7P5K34j99L39o02L13N9k20K15k51K91j29K51k97L65K0k58
4225G7j22Q5k36J84l18L58r3L07k64j1m9J8q0J32j37J66kk54K90l5mj78K25k83
4249b24J84o2o2L26k68M0Q9j05L3J30l16M15m09J22k9K06j42L2J4r9J96l62J31
4272a60J28L27p32L42K3K00l1j45j37L73o9k81N23Pr5l52K07j9j00l15J24K0J38
4295b4j34L16k58L91l43j74K6N36m66J5L04l69k1J64J98k27Nj3Pj6o8m7O85p09
$$ y = [-103, -187, -327, -319, -65, 219, -24, 403, 11, 106, 167, -92, -111, 131, -180, -110, -20, 18, -92, 253, 387, -170, 84, 174, 191, -8, 129, 48, 155, -50, 138, 135, -373, 29, -203, -59, 79, -165, -209, 233, 207, -210, 176, -169, -129, 237, 83, 231, -17, 167, -101, 225, -146, 21, -6, -347, 103, -183, 39, 14, -208, 82, -99, 29, 17, 7, -35, -71, -184, -48, -216, -82, -129, -54, 180, -19, 320, -282, 31, 90, -130, 85, -166, 125, -4, 247, -50, 315, 335, 77, -45, 40, -196, -12, -330, 28, -65, 242, -22, -33, -82, -64, -144, -12, -149, 17, 15, -239, 51, 16, 12, -166, 59, -224, -40, -102, -164, 162, -106, -66, 23, -82, -49, 81, -235, 180, -229, -107, -136, 70, -72, -40, -26, -125, 71, -291, -160, -32, 295, -437, -95, -72, 128, 97, -48, -185, 188, 119, -162, 361, 368, 273, -79, 128, 109, 9, -306, -182, -162, -24, -158, 158, -100, 291, -52, -226, -200, 336, -130, -115, 189, -180, -201, -37, 161, -66, -61, -74, -67, -83, -151, -198, 487, -222]
4319b22R6J31o8K35LJ41o35K30J68j57K16j26j26j14J07O7K0N8k27J43k04M45
4341A81k68N2J23k63L63o8j02q0P7K45k08j8O9o2n4K50j35k26R9J07O4j83J90
4364A53j12k09K43K51n61L54R2l15l6Q8n4J25r1N6k59j30M16j16K11j83j17L71
4386A77k48J41j35L64m06j52J78J00j27J7n7J44N0j84o3K81J40k43N8J97m30J28
4408g0j32Q3J06K00n1l36J64K51l50J94R8r6L9J00j40J5O8j95j17L11k30j78L82
4431A16k40M61n70RO23n77n6K38k19K10j50M90j27l51L50r1Jk93K33L8L8k17k48
4454c32L85k11K10J95M1l61K37O8J6k73J85K3O5j71R3l0n2Nmj35nJ02J91j76j1
4479E5k94M68k56ro8j6J41k12JM38j72j79J32J45k73M9j32P4K14l4n7j66J76K08
$$ y = [-222, -126, 5, -63, 172, 175, 316, -319, -89, 79, -78, 138, 12, -114, -228, -121, -54, -34, 24, -203, -60, -264, 181, -87, -35, 88, -175, 188, 120, 18, -62, 15, 260, 52, 34, 103, 41, -13, 237, 102, -124, -25, 82, 146, -37, 153, 41, -168, 75, 326, -235, 119, 211, -104, -140, -52, -106, 19, -72, -16, -275, -405, 11, -105, 106, -77, -194, 177, -71, 70, -65, 299, -107, -259, -81, 19, -108, -91, -148, -4, 46, -138, -201, 80, 220, -23, 35, 232, -198, -70, -202, -119, -13, 187, 136, -200, -36, 215, -135, 59, 157, 61, 100, 200, 60, 75, 143, -52, -169, 142, -88, -266, 116, -124, 337, -233, -224, 399, -178, -234, 4, -215, -5, -155, 335, 208, -143, 207, 116, 117, -176, 57, 95, 133, -84, -332, 53, -158, 52, 247, 288, -73, 164, 232, 248, -25, 160, 183, 248, 77, 170, 140, 88, 93, 89, -46, -51, 51, 242, 66, 55, -239, 229, -27, -36, -104, -120, 21, -191, -190, 248, 76, -103, 29, 174, -99, -50, -182, -108, 106, 72, 15, -151, 25, 233]
4503B33k74j80K46M0p2M3o4O9Mr4n4J72O9k67J0KK17j99K10l04J14jK2nP1O3K11
4530B82n22L58R3l37R3R8L45l17k53J88J06j37L9L9k71K48l23J13L92n0k28j9
4552f3RJ1K68L2l22J75m0k36J56J52KOk58J04Q6n5Pk49O2K86m53K32J84J5q2L8
4578F7j47K30j8k49K09r9r1j51M68k54J47k3J14j29Q7j29R6j57o8J50J52j58j7
4601C0pk08N2N9j05O4P7k87K87K11j77o9q6RK37l7k34K39J9j67M7J61Q5j94p4
4626f8O1j23J32L7K9k7p8J31j13J72K05k71o9k0q4J01j35k43K70L92P8o19K54
4649A2J4k64N74n02N23m38J65j50K09m66K58k9J51o9R4j21J31J19n57K58L5j44
4671a97L77o8j00j26J15K4j48q9K13k54J43p8O7J75j92K09k7o7O4k79J75p3N3
$$ y = [233, -41, -221, 25, 65, -7, 36, -28, 41, 45, -49, -103, 69, 138, -129, -119, -117, 100, -99, 111, -193, -79, -80, -58, -63, 8, 71, 282, -240, 118, 211, -126, -33, 65, 410, 93, -160, 28, 134, -3, 36, 75, -196, 52, -271, -158, 234, 184, -44, -63, -54, -43, 225, 257, -65, 110, 70, -166, -10, 142, 144, 150, -108, -4, 82, 27, 34, -215, -153, 133, -320, -88, 96, 111, 29, 67, -80, 150, 132, -117, 92, -7, -98, -249, 219, -35, 112, 89, 203, 74, 161, 32, 128, -29, -97, 53, 205, 47, 30, 23, -185, -133, -74, -179, -115, -38, -325, -38, 173, -4, -73, -159, -150, 87, 50, -184, 55, 74, -93, -46, 115, 200, 6, -68, -7, -130, 2, 39, 68, 41, -37, 94, -19, 153, 358, 87, 18, -2, -86, 15, -120, -363, -93, 299, 377, -242, 12, 26, -238, 336, -166, 357, -81, 84, -66, 143, -323, -65, -94, 57, -12, 82, -39, 92, 211, -346, -88, -53, -197, 180, 112, 12, -114, 1, 25, -123, -212, 1, -253, -110, -188, -121, 54, -138, 71, 44, -23, 41, -238, -63, -136, -83]
4694h3J85k78j35J83NJ02K45k95J35k28J85K43l51J94j71J61k44P8P2l09L44K1
4716E9P8j04L21k51j18J04j02N9O8j80M7N9J34j02l76N32p1l91L36j37P7j41o2
4739a61K51r8J8J64l43J46R1j25ql1J35m4J78l69K30k50L42j81O5j52j85N49o3
4762A59j21j69J92q9m3K31J17k85K79m74M15l39KK8j38J91o8J1J90l39J34K96
4784A80j2j56j67L4L35l02K57k18Q1k33L1K63L90k16n5j97l04M53k10M7j15n0
4806a64J99R4j43R3j34L34l75J30Q3o3M5l14K08j94K30r0QL53j79k0j86l2L14
4829A97k16K20j50o4l1k10J75k42K38j01J33o7kJ99L0n2J92j72J06J90l95J3k61
4852b70M90J01n05K31J50j52J79p1k50j14M31o9J3n7j32M5K3j53j67O7J89O2l8
$$ y = [-83, 102, -176, -311, -128, -123, -21, 224, -71, 64, -164, 21, 264, -87, 107, -64, 97, -147, -69, 3, -306, 38, 59, 137, 33, 354, 103, -15, 89, -13, 46, 114, -66, -19, 40, 174, 72, -304, 228, 157, -234, 102, -35, 42, -99, -161, 90, -8, 10, 174, -169, -23, 68, -57, -65, -96, 39, -5, 173, -196, 34, -216, 126, -55, 10, -142, -327, 222, 159, 38, -131, 61, -28, -71, 160, 277, -8, 271, -203, 212, -127, -125, -97, -235, -44, -112, -101, 89, -250, -116, 180, 168, 12, -155, -121, 214, -88, 169, -49, 32, -201, -170, 93, 483, 267, 212, 15, -289, 164, -46, 1, -114, -164, 35, 129, -14, 79, -55, 279, -96, 34, 117, 54, 99, -215, -7, -201, 29, -61, -53, 300, 121, 101, -85, -117, 197, -19, 201, 51, -13, -44, -254, -79, -321, -83, -184, -51, -118, -120, 79, 109, 57, 249, 77, 183, 373, -22, -9, -270, 220, 321, -184, 47, 197, 45, 224, 153, -97, -211, 220, 151, 164, 107, -25, 20, 43, -110, -277, -210, -21, 41, 3]
4875Cj08M8k15L48K26l15j03p9m6M0J02l1J35j73M1K02J21q3j48K79j42J31j79
4898E4J76l37K57j47j67M14p1q46M80M72j17k41P3kj15L50l30J86l18M58K32n13
4920e2R9k39K12l7r6JL50o5m64L32j37K63m45K24J9L8K7o3K9N3j04p3nK68l62
4945b27L03j17K05Q7j36q2j49J79l7J48J39m49L61k83j92K86J97l39L2j26M52
4966B52m61K34r7K74j09Q0k63L59j77L14o33n2K97j01J30J71k83r3K20J3q1J27
4988A21P4L1k12k76M38k86P1mM7j12K42k36M55k68j28j5lj94K94o4j10L2L78l32
5012e7m2M76k3l25J43j92J1j25J19r2o2J89J49j22l8J49K1k15l8J01l52M50k85
5035a60L9j52L09k14K10j13K8J14j99K45Rk76p7M28q6J14k31nj6q9J46K10l01
$$ y = [3, -105, -57, -272, 76, 302, -13, -116, -195, -241, -201, -99, -130, 5, -168, -127, 75, 196, 113, -35, 244, 102, 233, 54, 230, -107, 150, 3, -164, 250, 179, -667, -187, 285, 168, -73, 0, -2, -117, 233, -97, 89, -229, 229, 461, -52, 47, -192, 20, -17, -113, -112, 238, 173, -291, 41, -96, 167, -278, -54, -35, 3, 30, -33, -4, 49, -55, -128, -133, 135, -227, 76, -41, 164, 251, 115, 33, -116, 63, 26, 174, 313, -136, 225, -58, -250, 36, 233, -106, -74, -200, 252, -209, 25, -72, 202, 93, 173, -90, 269, 92, 406, -227, -279, 18, -83, 47, 218, -65, -158, 62, 75, -6, 121, 195, 226, 14, -262, 176, -110, -39, -43, 4, -108, 134, -102, 353, 85, -43, -58, -61, -255, 39, -25, -135, -103, 275, -57, -99, 377, 354, 29, 172, -20, -9, -134, -15, -107, -169, 20, 169, 47, 9, 158, 179, -36, -74, 27, -325, 125, -160, -121, -273, 36, -178, 32, -81, -53, 61, -138, 107, 116, -160, -237, 191, 105, 219, -12, -17, -33, -122, 24, 234, -67]
5058f7L1J47j08r1J03j50m7J74j24l4J31j5k4J5K19l18K54k13J38O9lk28Q2j64
5082b23L80l5N0q4k00L10k09K5J74j73k75R7M15l98J84J4J41j35m9j28m11M31
5104i9K36j79n3j20J85j18K52k12M9n8Q4j12j79O59k14k64o0K7K79M4k72Q8j06
5127a43P5L35k88j51L5q3M19Rp0j11m1R7J18j71n1J42J29j68j06J58k53K14N2
5150A47k79M63n0K5l88J09K3k03N3J33l50K31k0q8O8K33K5J22m60J87q8M60k32
5173A21k37L72l18L26k94k09j45K69K87j90j1R3o7n1J36N3l87L95n3k22M9m5L38
5196B10k92J55l25J42L0k3q8K14j07j80LM07l13K3J69j55J40k28K26k84k05O26
5218A45j79j87L9M11l95L27k46J06o2K19o8q8R3j84l31M73l06K08K19L5m8r0k6
$$ y = [-67, -36, 111, 3, -88, 15, -135, -182, -8, -132, -166, -35, -50, -74, -59, 160, -158, 96, -117, 21, 90, 87, -141, -59, -223, 157, 122, 172, 88, -112, 198, -11, 14, 188, 15, -260, -163, 252, -146, 38, 52, 193, 58, 9, -119, -530, -99, 137, -42, -95, -215, -30, -148, 104, -108, -59, -117, -33, -145, -324, 335, 121, -143, -203, -176, 103, 147, -125, -37, -143, -68, 267, -21, -172, -137, -220, 199, 208, 138, 27, -14, 83, 201, 30, -21, 121, 250, 82, -24, 134, -119, 95, 147, -132, 331, 281, 306, -82, 27, 50, -153, -100, 33, -317, -86, -106, -194, -126, 107, 132, 254, -206, -19, -107, 353, 121, -116, 256, -62, 264, -30, -239, -384, -115, 172, -18, -29, 64, -3, -54, 82, 135, -252, 143, 90, -132, -83, -128, 210, -82, 73, -252, -110, -80, -103, -191, 23, -84, -264, -261, 146, -167, -144, 25, -130, 10, -218, 8, -276, -481, 145, -34, -221, -182, 229, -166, 161, -85, 21, -41, 178, 110, 22, 115, -69, -400, 73, -233, -25, 194, 229, 181, 91, 65]
5241F5j15j35Q0o7j04M17m42M45j21j71J94qK0J88N4q3m85L38k53P2K13k81L67
5264A88m5j3l20M06m13L18J17m28M66l48Lk36J55K64j32J29k71j39K88n7J48l
5286G7p9j49J53q6J34k09l1L5J37L4P1J19J6m67M3K48N6j5j94O24p48O43n19k01
5310c08M59oj73L37l47O8J24j48M11m70N1K44k39l16K38J89P1j79J47m29L08j26
5332i4j2o1K96j95j68K10l2M0l8k20L04J89j41o4j84K46j57K80n3n56K19M07k30
5355a4K8l60M43L8k32N9j90Q4m5J28J44p0j48O3K00l58M4O5J7K56k39k10L84%
5379H7K33l2k37j09k61N02m20N32k93l81O79l02N7k56M3J08k2L00q4k92Q7L6j15
5402a40K45j2k47Q5K83k62j26J61K59l12L77k65K00m29M33l73K7R9J32o7l7K22
$$ y = [65, -50, -185, -105, -172, -276, 141, -301, 144, 23, -148, 46, 38, 58, 246, 300, 217, -268, 70, -183, -111, 102, -179, 188, 143, 130, -190, 216, -197, 121, 238, -190, 276, -72, -69, -305, -150, 114, -18, 111, -160, -299, -11, -68, 80, 77, -2, -151, 2, -84, 50, -159, -190, -155, -18, 16, 87, 206, 222, -245, -202, 46, 102, 87, -107, 517, -231, 412, -107, -308, 151, 145, -28, 309, -38, 30, 154, 6, 417, -53, -2, 242, 3, -313, -75, 114, 185, 6, 153, -276, 32, -94, -106, -167, 129, -66, -234, -24, -56, -16, -54, -274, 30, 219, 78, 14, -170, 76, -81, 199, 146, -410, -191, 216, -14, 14, -346, 97, 135, -97, -38, -228, -144, -189, -61, 83, 13, -135, -72, 128, -230, -186, -121, -104, 152, -87, -297, 87, 87, 320, 288, 51, -58, -319, 183, -237, 295, 2, -379, 300, -2, 55, -201, -158, -50, -72, 228, 144, -148, -61, -25, -140, 105, 93, -154, -69, 214, -48, -174, -13, 246, -66, 311, 46, 246, -183, 250, -123, -96, 3, 135, 68, 31, 253]
5424B53l08n6NL27k32R4jk14R0q2J62J17k36J12J1l38K70J06j28J87r8l73K53
5447g9j38L34K53o63K40L69k11m78L17J59k00J32j19J84Pk70J24K20k78K25J29
5468B57l27p9k5J43p6K09j94R2n7PJ24L01m15L4j91K52J70k50r2R1O6j25L77j57
5492A35l37K94k77K03O5j42P5L5j01J40j25j0P8j48L36l32L00m8l6j81M03k52
5514G5j78J68o6J49J94l07n9m1O5K45l78K76k2j7o4J30j34N7J03k33q4K03m2O4
5538A04J52m08K54o0J64j39j31K88o00L93k70L12k43J81J85l35K72l49J92K02
5558A64k90K11M8J68k38qJ20p6l17K45J1K03l97J65J36J39k89J11j31j2P5K1j19
5581f0k06K75J62j19j31l26M19j8k53N68k11rl43K28L8J09j50J33r7J56l40k7
$$ y = [253, -55, -111, -106, 221, -11, 83, 82, -132, -42, -124, 38, 155, -81, 31, 42, -296, -26, 80, -48, 139, 41, -332, -79, -217, 117, 370, -293, -53, 316, 105, -373, -56, 103, -97, 35, -84, 100, 107, -163, -39, 181, -97, 128, 257, -70, -149, -174, -31, -107, 102, -92, 0, -57, -50, 74, 375, -40, -6, -197, 55, 225, -25, -117, -26, 40, -85, 292, 135, -202, 92, -185, 18, 83, -59, 16, 51, -50, 90, -35, -45, 33, -115, 221, -111, 189, 141, 105, -76, 327, 75, -103, 65, -1, 148, 342, 35, -24, -65, 0, 245, -133, 143, 121, 104, 40, 170, 36, 93, 196, -37, -121, 82, 40, 104, 256, -152, 102, 42, 206, 67, -64, 224, -376, 17, -253, 59, -184, -3, 182, -153, 119, -230, -38, 164, -126, 85, 133, 301, 63, 55, 175, 99, -218, 27, 38, 241, -156, 9, 145, 284, -5, 106, -25, -37, 38, 59, -60, -266, 9, 171, 52, -79, -405, 14, -4, -257, 311, 100, 91, -252, -24, 14, 123, -27, 106, 9, 165, -175, -202]
5603b02M60m12L43m31O7J17P2q4J3j65J96k47K78J9q4K86qk11j02k00L02o5L19
5626B61j53N3j03j7l79J64K08j53J97j76J96m2J49k36j35J98o9J34j0J10k54K7
5648c0m8J45r1p2N08o38PJ43j39L75pM6k71j27L18k70K91k05p1M01o43L13J72
5671A07m63K49r7L60l07MM06k43k7k9R5k54L57k92K27l25L51p0P7l40K39L0k13
5694a58K98r2l7M1N5j12L6R2j82N5L36k45O6r1k71M18l28K71j80j7J35l5J21m15
5718b39M41L6k88J0o8O3J9l53N66k58R4j17J7K81k69j49L90j46J48m02K45k39
5740b18J06K00k36L33j93j52K23K77n72L53q0k92J22Q5KL25n76L62j25n4Q0K02
5762A72l44l2l9J99q0j39O31k87j99m6M4qM05l67J08j71N6M02m16K52k18K96j59
$$ y = [-202, 258, -154, 189, -242, -175, -58, 14, -70, -57, -222, -26, -273, 5, 24, -60, 226, 218, 7, -95, -295, 7, -58, 261, 108, 161, 58, 41, -338, -174, 34, -119, 78, -98, 98, 56, 205, -31, -166, 32, -37, 97, 87, 197, -57, -30, -78, 67, -24, -96, 412, -226, -219, -76, -215, 160, 153, 199, -72, -199, 119, -151, 140, -65, -136, 265, -378, -65, 107, -356, -107, -204, 156, -151, -147, 259, 16, -11, -40, 55, -199, 158, -134, 93, -232, 119, 49, 126, -214, 25, 55, -158, 140, 48, 11, 52, 107, -5, 31, 123, -59, -4, 332, 87, 153, 62, -209, 209, -119, 152, -28, -45, 90, 55, 176, -239, 202, 238, -50, -40, -108, -45, -26, -379, 187, -71, 23, -94, -77, 204, -65, -214, 176, 30, 178, -224, 21, -218, -112, 88, -148, 185, -8, -160, 63, 340, -232, 121, 41, -251, -129, -44, -42, 283, -293, 69, -56, -110, -30, 172, -172, -204, -243, -44, -124, -263, 368, 81, -118, -164, -120, -128, 277, -90, 18, -153, -97, 305, -111, 141, -77, 219, 60]
5785F0nR7j32j23J2J79j02j46K89k76o5J49q8M5J21J12l20N83o90P23l37j14J52
5808A24k21P9J59j46M3r3J65Kk3j98J8j73K65R0k14J90j77jM48l56o1K22j83j00
5832a41j55L88m14L56l93J46Q5K72l8q8j27N8k29K85k81L19P1o2k19J61j04k08
5854c18L05j05J98k42N13j81o7o9k49L00K02o9L0k70M2O4n8j24P3N39l93k49J15
5877a3k66L57l39N8O17j16l69J2j6L34m3l70K71J02r1l16jM88j75k00M2j05L6
5900a03K69M0k18L3L8k54M37k76k0L01k99k15K00K1K31k52j45K87p3J26k2l19
5922b13L33l32pK87o1R1%P8k04o3k51L92J01n10L69j23o3q3J17P5R3j00j40L06
5946I2K9q7p3J8J84j65q1P7j93L58l95J80k0J12K71k46P4o6k07JL38k01M1k18
$$ y = [60, 55, 152, 20, -103, -91, 88, -14, -160, 129, -147, -212, -63, -151, -106, 15, 127, -193, 390, -300, 423, 86, -28, 124, -97, -18, 141, -5, 38, -55, 110, 112, 89, -109, -91, -264, 1, 91, -123, 67, -110, -111, 337, -19, -80, 142, -41, -141, -296, 92, -322, 34, -359, -213, -128, 144, 106, 18, -109, -51, -280, 5, -276, 43, 114, 52, -167, -6, -110, -318, -13, -118, 80, -162, 351, 170, 103, 34, -215, 85, 287, 218, 248, -22, 20, 84, 26, -98, -25, 514, 121, -128, -13, -279, 78, -261, -203, 414, 298, -71, -59, -75, 259, 216, -154, 117, 219, 128, -188, -189, 299, 124, -76, -34, -139, -103, 166, 206, -12, 21, 59, -195, 242, -34, -54, 247, -52, -267, -67, -46, 185, -67, -212, 75, 2, 128, 106, -213, 120, -212, -219, 68, 7, 98, 98, 176, -28, -91, -342, 50, 151, -359, 10, -113, -176, -259, -142, -67, 26, -74, -214, 92, 121, 34, -39, -21, 163, -2, -83, -6, -199, 159, -236, -56, -76, 36, 307, 61, 135, 69, -138, -137, 201, 0, 41, -177]
5970a77j70K94K29l66J72o6J52n74R18l76kJ86k91J9N6L1J04n6q1Q8J67j44l36
5993b23J08K40m94L32j46M48l10J83J18J27k89j24k5J30k81J10l7k2J56M9m3o4
6015e7R0j81o3K23J95m98L68j29J01l39M98l46J29L42n74J46J02p8m00M32k84
6036c23K33M86k32m88J96L47k2o9l7m7j15K0O5L71r6m37L19j21k8M1J68l72J92
6059E1m73J75J56N2R4P1Q7j01j14L1N3q1k60K82r9k6o8J57kR9J04j82Q6j95L26
6084B23k43K45k73j0k12j45M42N3j51J2J87Mm33J71l4L4K94l22N49l01k35K70
6106A25l3j78R9j72P9N1j9J0j69K8Q5J47J51l05J20p2N4j35J79j39K09N0J26k67
6130B4j26J32o0O2N5m8k60J93P7m9j6R4oj50J64L3k99K20l51K48l71J40K55K21
$$ y = [-177, -347, -53, 176, -190, -18, -84, 68, -506, 412, 36, 34, 220, -71, -52, 4, 35, 139, 83, 2, 90, 257, 113, -223, -115, 125, -369, -37, -183, 265, -45, 138, 256, 383, 94, -30, -55, 75, -206, -96, -133, -155, 1, 50, 7, -57, 33, -148, -211, 12, 207, -291, 77, -52, 49, -290, 208, -138, -9, 333, -241, -95, 7, -71, -471, -39, -323, -90, 396, 164, -324, -128, 219, 197, 128, 91, 44, -71, -51, 14, 385, 289, -148, 171, 50, 22, 63, 231, -141, 51, -422, -247, -91, -39, 55, 126, 213, 112, -2, 29, 82, 1, -259, 23, -76, -102, -170, -13, -15, 84, 188, 6, 92, -103, 223, -20, 225, -48, -58, -270, -415, 27, 80, -71, -59, 128, 132, -301, -130, -164, -130, 164, -158, 391, 90, -145, 125, 92, -86, 13, -159, -80, -29, -48, -38, -207, -179, -94, 53, 204, -101, 19, -53, 1, -134, 45, -94, 115, 165, 291, 24, -102, 30, -30, 32, 87, 39, -221, -28, 49, 0, -16, 78, 72, -78, 86, 119, -180, 40, -311, -63, -434, -294, -39, 182]
6154A82j38J26l18L44k11J61K6p2j79j23J49j10l0j35N67j49k34j80K54M06j99
6175A37j21q5k4N36l10n93M19KP1L59n35J89k32J15J32j37N3M1j19J3j2p3J47
6198b7k05J88j48j65L20J33o3o8K61n44O70k04k19J16M7r3j19N8r6J33kj62K32
6221D3j57K81L4j68k41K66j91j90R1K56J35k62K53L4k39j64J21J41Q9m33L75n
6243F9j49J4J70k70J37q9l7K01K06k42K40l74k0K61L9l33J28J11P5k44K18k71
6265a60Q2J88o7J22n0l5j83K13j60K57l05K3j29J12JP5m1J33j47j90K93l3L59
6288C58m95K83o8J50j76L9J67j63JJ43n30L57k28J50j59n8J44L3l28M30o0j55
6310a65n2L84l4l70J9K55j00L47k52J35j88J21k48L03k08K59j10j77L45n63M06
$$ y = [182, 44, 170, -148, 196, -15, 146, 172, 100, -79, -202, -53, -163, -193, -328, 239, 90, -144, -324, -70, 336, 137, 16, -69, -93, 443, 133, -460, -41, -39, 32, 391, -144, 45, -187, -72, 60, -77, -24, 17, -102, -89, -101, -174, -27, -232, -44, -192, -357, -37, 96, 33, -35, 226, -318, 352, 148, -71, 45, 92, -1, -120, -62, -158, -25, -27, -189, 43, -114, 167, 201, 33, -208, 58, -133, -323, -232, 24, 159, -103, 150, 184, -55, -219, -98, 43, 132, -301, 74, 69, -80, -66, 104, -166, -29, -118, -155, 46, 252, 10, 250, -124, -144, 117, 156, -177, -49, 62, 137, -107, 111, -160, -78, 110, 43, 165, 115, 80, -103, 110, -50, 207, -98, -75, -204, -92, -91, -16, -57, 76, -71, -261, 32, -1, 358, -137, 146, 78, 228, 52, 91, 258, 95, 96, 239, -291, 66, -162, -12, -171, -229, -85, -52, -380, 50, -10, -165, -217, 167, 133, -237, -218, 37, -63, 284, 32, 167, -21, 100, -148, 155, -53, 206, 96, -81, 264, -299, 107]
6331A07l3l01J08J82Q9k64J56Q2k1k64K35l0J89l33J00j06M4J82l11K61j81j9
6353a28L27j67J18j32J01j17k46L03j5K97j27J20l32N4OM0j47J80J51l67K61N8
6375B38j9m88K24j05j85L12J00M0l96M38k4k47MO5J39j71N92n44n6kJ16J09j74
6398c4j0L21l20j33J82L8J77j66LK1k2r2J50j54J67q3K58l10J0J69m57J50K79
6421A44q4k26J76l9J46Q5m00Q7K46m23N18j21k59l0J05P6k73J61J28R5J94o0p4
6444A72j76R7J8m74L17j58J19K10j09k3O6j66q9J4J10j7J03j2J15K46m09M8JK2
6468B5Pk15K58j66J12J82k18l07K76K01K1m22M47q6J47j97j17k0k9k2J92m8K6
6491D7K7k02L24m2K9k8k70P2QM9J26j00R2k63K55l28N12m75O0J01j71L82j49k45
$$ y = [107, 74, -227, -119, 63, 152, -112, 44, 126, 105, -159, 76, 46, 235, -98, 2, -104, -60, 122, -189, 72, -109, -128, 199, 32, 150, 18, 119, 2, -244, 59, 44, 341, 214, 334, 2, 56, 62, 102, -45, 135, 286, -81, 180, 238, 219, -269, -45, -150, -335, -23, 77, 117, -279, 159, 135, -112, -108, -43, 96, -75, 517, -27, -83, -85, 31, 140, -34, -44, 277, -43, -176, 6, 44, 221, 55, 58, 79, 57, -35, 115, -39, 128, 45, 303, -7, 3, 172, -285, -135, 144, 60, -166, 10, -29, 117, 202, -198, -111, 135, -288, 230, 109, -150, -180, -75, 1, -272, -111, 17, 112, 306, 246, 172, -4, 93, 111, -363, -46, -204, -85, 125, 16, -7, 59, -107, -196, -182, -72, -89, 14, 2, 117, 363, -46, 2, 3, 25, 32, -183, 75, -91, 21, 203, -15, -322, -46, 155, 176, -246, 201, 115, 262, 65, -52, -72, -101, -123, 69, 21, 47, 74, -128, 196, 154, 183, 155, -115, -43, -35, 14, 140, 40, 132, -131, 124, -204, 308, -167, -107, -6, -177, 205, 56, -189]
6515a89j23L82L29j89j96j44L7O7J57l53K9J64K13k93L27j55O6k59J89p1K11j73
6537B6l7mkk61K68r4r4L26j44m7q7J12J38j74K93l22L36j11l18L20lO0j86J14
6561A09k40J28O6K68p3k66j19K91k85l1Q5J27j09j28M97q15O00j39J7K74j66j6
6583G5j99J53j84J95k7j15K50k13J6k8k3J70K3o2M1j8j98J54K1m7J02l07K39n1
6607c3J41op8N2K6O9M6j41Ml41M06k0l87J04j2J75J7M2J13k84J6N6L5J86l88Q7
6633a15K50J08L3l37J24O7l01K33j05J5N58n18R9Pm16K70NK36k81P4k17M44l41
6656a08M4K1J5l06M00L05o40J79J39k15J98J37kj36Q7Jj65L14k74M1J14r3j10
6679e4o4PK80j66J00R7j4Kj97J08J13k82O3J59R5j02j76j73J53J35l57J81j30
$$ y = [-189, -312, 70, 399, 210, 14, -130, -93, -26, 131, -222, -193, -29, 184, -109, 218, 63, 129, -130, 59, -12, 199, 26, -11, -15, -17, -278, -10, -104, -198, 128, -16, -63, -150, -38, 100, -74, 219, -103, 233, 122, -196, 124, 121, 181, -5, 109, -131, -3, 63, 331, 258, -8, -127, 164, -121, -152, -67, 60, -49, -177, 320, -495, 105, -34, -17, 257, 91, 75, -124, 29, -155, 40, 13, -102, 148, -65, -49, -77, -100, 70, 93, 31, 72, 54, -144, 10, 31, -16, 86, -221, 18, -33, 108, 102, 24, 76, 102, 171, 217, 76, 80, -261, 145, 125, -262, -158, -170, 5, 22, 64, 177, -107, -91, -35, 0, 186, -202, -115, 135, 243, 276, -61, 63, 130, -171, 62, -43, -28, 530, 12, 111, 118, -298, -28, -23, 213, -68, 6, -211, 233, -108, -64, -43, -28, -334, 66, 371, -269, -90, 49, -166, 32, 169, 167, 31, 118, 119, -46, 268, -6, 35, 149, 56, -54, -118, -111, 169, 3, 103, 200, 186, 188, -9, 99, 212, -70, -7, 152, 247, 145, -31, -204, -51, 84, -273, -92, -222]
6702b22M52j21k19J80k60L02l31J32J2n4K91m30J90K61j18L6j46j41L15J10m08
6723a69M06l03P0j75J17K66k66P7M9j4k37L6K01j03J06L4P4lm4m0pj98J4j45J47
6748a07J62J08k74O4j22K25k17K49k14K8J11j57L08q2J1m50J89L59l7J62nl30
6770a9L0J59k99K97l99kJ23L13l61l9J20l7L96n44K61M5k46L4P8P0j3J14j49j33
6794b01J52J47q4j0J81m00N63l72M0M1j12J97k16P3oN8k30L15m8mK12l53J74j30
6818a3M2k78J66J70k31o7k91L81j18j6L34P8m16Q7N2K49m8k23J43J8j90l67L75
6841a63J94J65l83K54O0k97m4L7j47L2M75q8j09k8N7PJ55k33M08o13L52j11K25
6864B05j44p2q2K36r0k2j37J07J8K48k51O6%k15J82l0J4Q1p0k84M23j99J44k95
$$ y = [-222, 230, 109, -110, 70, -190, 112, -219, -87, -75, -129, 162, -268, -78, 183, 65, 101, -45, -186, 129, 239, -169, 237, -66, 4, -171, -54, 212, -54, 23, 72, 58, -179, -143, 58, -45, 61, 95, 169, 166, 122, 82, 75, -123, -109, -254, -107, 55, 163, -111, -47, -169, 56, -161, 88, -126, -98, 13, -144, 164, 82, 93, -357, -168, 191, 154, 316, 311, -19, 11, 170, -129, 168, -231, -233, -110, 203, -158, -197, -77, -114, 282, -262, -1, 44, -202, -168, -90, -20, -33, 81, -68, -201, -49, 98, 14, 4, 185, -215, 348, -24, 16, 57, -55, 142, -74, -1, -7, 51, -179, 136, 88, 84, 296, -57, 117, -13, 29, -249, -83, 87, -144, -211, -502, -121, -239, -255, 79, 157, -259, -172, -120, 129, 81, -142, 1, 19, -171, -538, -163, 31, 196, -187, 67, 127, -170, -214, -177, -324, -292, 183, 95, -14, -42, 15, 22, 177, -56, 352, -261, 91, -20, 205, 61, -11, -93, 143, 53, 31, -106, 1, 19, 267, 16, 82, 82, -133, 49, 19, 33, 114, 44, -240, 183, -16, 128, -167]
6888a67PR6K40j35J6j27m2k23K93K79j18j68K54j06k83L44j28R4J39m54J97P0
6910G8M1k44J66r6j60M6M49n61N77o9j97J82o3l46P3M30l04L73l79j01k8j2K47
6933A02j20J62j44J50j91M8k3l06R5J90K3j17J79O4k97rJ34K14Kj11j42K35J74
6956C12l31j26o5Q0M05k75r4K56l02K48k45J77K6o5kj10L30j95P6k16J33L65k85
6979I7j0o7K21n7j58J16j35R5M2J32j75k7k05J05M32k81j02P4L3lJ15j05j16j71
7003a50M89m3l48P1J08m9j53J71n1l2r7j70L74r2o8r1K92k92P3R5qj24Ol7Q1L32
7029B87j67J51m14J28M0J04o6J50Q7l71k53M17j26Q5J17K14m43j44J29J0K17k44
7051i2J4J68k2Q6l92J37K18j47k59O11l25Qq5L62l11J00o3j23J77o3O9j83L87
$$ y = [-167, -160, -64, 176, 41, 57, -70, -112, -335, -42, 237, 119, -49, 205, 99, -184, 160, 32, 126, 265, -189, 8, 78, 119, -125, 41, -55, -215, -169, 280, -281, 296, 227, 30, 212, 149, -197, -124, 306, 2, 375, -4, -105, -133, -145, 102, -18, 144, 0, 150, -41, 7, -16, -322, -227, -37, -14, -131, 48, 112, -185, -194, -60, 154, 156, 45, -97, 138, 312, -19, -145, -210, -130, 275, 0, -94, 162, -140, 108, -137, 40, 66, 1, -1, -111, 219, 24, 100, -116, 17, 382, 97, 87, 20, 241, 184, 26, 142, 7, 102, 144, 276, 101, 74, -131, -26, 406, 125, 23, 97, 130, 127, 242, 137, 21, -150, 339, 296, -52, 19, 127, 78, -75, 96, 45, 13, -84, -254, 120, 28, -40, -131, 161, -131, -58, 37, 29, -95, -89, -126, -45, 287, 120, 271, -143, -15, 25, 129, 63, 213, 300, -71, -324, 93, -33, 52, 169, 383, -60, -204, -75, -65, 152, -92, -78, 90, 68, 154, -238, -101, 117, -30, -289, 322, -3, 5, -80, 282, -29, 71, 8, -115, 62, -1, 68, -115, 272]
7074B72l5k54K77L6l30m14M37P4k28O0L40j79j6jnj2J08n30L05L21m15N48m34
7097g5Q4L45l46l78K3L10o1R5k0O9k27K36j48J08p1j80J63j10L39l09J42j49J74
7120A4j38J6J56k30L47pJ12l11J79r0j06j64K29K9p6J21k3J01j10j83J00l3J52
7143H5k02K59q5Q9j78O1m2J39j28o0J5J88r6J96r3j85M2M0PJ00Mm02R4P1K01k31
7169a11J8l5r4M96m82L46j59K8j7p7P5J53j36j4k12J94j50K76o7j96k1%J14n8
7193a29K48n2o7O8mq6m67O41j03R2q8j32J2M37k53l0l05K3L4j11J36J00J59o9
7217E4m0k06Q5q9L67K08l57oJ36l68rK61J83l70K20l83L19N0j78J5J32RJ46k17
7241c8O1Q7o6n7K80q0n6kk11J01l9N3J09j58k60K31N3j63O0K7pp2K20j57k12K77
$$ y = [272, 237, -17, 260, 296, -34, -448, -11, 63, -165, -105, 235, 56, 40, 39, 34, 22, 130, -400, -95, 226, -189, 359, -75, 9, 354, 8, -370, -347, -37, -98, -3, -23, 46, -181, 55, -93, 15, -56, -236, -73, -183, 156, -153, -11, -160, 14, -124, -108, 48, -182, 165, 158, 270, -41, 138, 48, -58, -222, 7, 36, -40, 81, 58, 159, 49, -134, -34, -67, 85, -117, 142, 57, 146, -32, 29, -13, 126, -2, -62, -47, 141, 45, 241, 148, -37, 5, 45, 52, 152, 156, -246, -152, -81, 120, -111, -93, -128, -222, 274, -208, 138, -21, 7, -10, -87, -12, 141, 5, -9, -221, -27, -177, 99, 32, -164, -185, -185, -71, -129, 119, 67, 0, 68, 64, -22, -489, 152, 49, 141, 53, -79, -67, 370, 117, 87, -218, -195, -161, -272, -136, -36, 123, 54, 14, -192, -107, -196, 171, 379, 22, 16, 152, -216, -225, 36, 219, -151, 69, -314, 5, 55, -123, -108, 24, 33, 179, -38, 23, 110, 44, -13, 267, 187, 131, 129, -82, 19, -20, 33, 142, -16, -276, -45, 8, -155, -95, -68, -75, -147, 73, -84, -296, -19]
7267a9j11J73K37j38n6r0K93l17l8J18J30q6j44p8K90M6r2j41j09L23l83K22o7
7290c7K1k50R8J79M6kL6J39m41L13J32k00N2j89Lj7K12j71p7K23j5M4k12J95l20
7315b38J10J22N0J08l25J18J11l39J08O9j79N20j62N7j68j08j00K53Q1kk1k0J50
7338A95l01K2Q8K10l04j10m4K53P1j22j62K4Km3J23n4K10j8Nk2k47K51j01M0K41
7363B07j13l03k01O31l68K67j48M9N1k00J35M1J01k41J48L3l6n3j48j70L04R4
7385H0J28k84J72p8J57l01k63L09j32N1Q3n2K5L78k94pr9K53J19j58K32l84K52
7408A87n3R8j49j53R6j40J50L3k03K39j55J0k47L02o5M1N1k57L58l7j49J43j09
7431ik00M05j81O0j08P7j6r4J54J25L9k43K9n2N6O8k43P2J3J88j30K1j75M46m00
$$ y = [-19, -130, 43, 280, 142, 86, -4, 289, -28, -66, 52, 182, 96, -48, -126, 164, 210, 118, -23, -132, 191, -192, 30, -37, -16, -266, -168, 11, 57, 55, 91, 230, -211, 102, 234, 34, 86, -103, -100, -117, 95, -76, -153, 70, 55, 99, -113, 82, -238, -128, -6, 44, 152, -173, -55, 56, -283, -175, -106, -285, 235, 73, 130, -38, -146, -246, 7, 88, 86, 65, 45, 195, -106, -84, 4, 214, -90, -200, -244, 9, 80, -42, -204, -180, -178, -221, -98, -152, 58, 40, 45, 23, -224, 27, -74, -34, 207, 94, -209, -410, 221, -147, 120, -28, 21, 72, -128, 7, 48, 149, -92, 56, 89, 53, 0, -148, -318, -14, 80, 208, -76, 96, 18, 175, -126, -389, -80, -212, -161, -78, -130, -105, 273, -21, -28, -127, 126, 245, 87, 319, -65, 187, 134, 232, 83, -70, 26, -114, 36, 69, -134, 105, -50, -40, -287, 15, -50, -9, 42, -215, 143, 106, -43, 100, -9, -209, 196, 15, 75, -33, 44, 28, -66, 88, 213, 252, 9, 38, -14, 42, 110, -133, -61, -48, 140, 10, 31, -144, 302, -98]
7456i8k33K52J46K3l47L18m58M83lr1q4L76l30j03L91k54j20L7O3M10k78Q2j45
7479C7J1K69j6n32N22l36L2M26l59j69kJ79Q5M5j05j29L59l05K85l36J38k03j05
7502b09L90n25R4J75J11P0l52K31j09M30n2n34N04j68K0K7j36J77k09N53m49j29
7524i0J38j67Q8j58J03J25n1P7m5nL0J41k03K09j27o8K69k75j14m2j5L46p9l97
7548c10K00J13j29L14m00J78l8K15P4j25q5k13k8J78P7N6o5n5J98l58q1K89J24
7571A29l23J94lj76J98k09K58k00o1J24K65k6o02K93L03k85M64p3q1l96K7O8J30
7594A8k15L09j02k7N7J37j46J16j12K7k66N1K40K6J79m5p8J80n71N8L9k1l0N8
7618a18r3J10Q5O3j23R5J16l22K39j00P4j15q0k0K62j34k36L19J11j11o3j48J64
$$ y = [-98, -331, -79, 67, 90, -257, 61, -397, 86, 83, -8, -92, 284, -46, -149, 242, -12, -132, -95, -32, 378, 100, 182, 37, 48, 317, 301, -231, 291, -45, -13, 413, 54, -115, -117, 62, 147, 192, 87, -42, 317, 12, 297, -39, 99, -104, -209, 181, -344, -250, -75, 36, 106, -246, -15, -124, 306, 254, -280, 224, 56, 76, 103, -33, 144, -65, 488, 39, -90, 48, -119, -31, -189, -86, 39, -12, 65, 20, 15, 45, 186, -17, 192, 65, -3, 266, -9, -123, -165, -180, 166, 87, -310, -110, 3, -126, 188, -212, -34, -72, 143, 217, 92, 7, -206, -234, -56, 21, 77, 12, -43, 155, -203, -284, 5, 129, -194, 0, -3, -179, 19, -190, 68, -132, -193, -69, 196, 170, -432, -139, 164, -121, 343, 270, 189, -207, -180, -112, 18, -197, 112, 10, -17, 40, 177, 31, 147, 35, 62, -204, -153, 87, 113, 292, 247, 169, 349, -222, -164, -125, -146, -176, -118, -211, -101, -16, 47, -76, 19, 135, -187, 52, -48, 26, -89, -169, -189, 73, -61, -297, 22, 133, 22, -41, -189, -25]
7641b5J40j84J72L9l02R7Q1m4N9J18k50O5N2q0N9k04J3K68j33k22K71K20k13J00
7665I7J11j24K40m01q4K6M63k50J5j39q0K16k81oK6J02J85k1l24PJ2K01L11m60
7689a58K39M4j50J13o4k13J55k31J34j72J42R2j6J15m3j38k1O1P0N7j92J04K85
7712B13j61l3j68K14q0k70M78k36j84L38Ll62L64Q3j86K13j79j20M5MP8j16J21
7735E9k0k15J59q8K68P7l37O2j2OK7j78K13o4K22k66L2M1J5M4j27J60k51J14K93
7760B34o73K84j09M48j52k96J38J53k53M04rk87K68qj63n9K07j04J50k59J47l7
7782B4L7J24j62k40K78j1l1k73K69k7K29j82j06m50O35j47M4l15K97j70K70L8
7804A31J3Q4l63K72m8j12K26m85J93O0l0oq1oJ40J07j85K36j53K74k70j84M48
$$ y = [-25, 115, -69, 103, 142, -160, -63, 18, -26, 33, 151, -99, -34, 18, -62, -3, -207, -194, 74, -59, -281, -10, 210, -3, 97, 208, 84, 324, -77, -161, -135, 328, 78, 93, -46, -126, 90, -191, -197, -171, -69, 116, 95, -229, -222, -210, -9, 302, -158, 81, 125, -25, 88, 24, -189, -34, -265, -131, -303, -161, -69, -85, 30, -13, -151, -172, -111, -41, 16, -176, -72, 213, 52, 19, -149, 65, -15, -285, 193, -43, -227, 111, 114, -248, 116, 199, 13, 226, 47, -73, -28, -24, 54, -62, 59, 39, -176, -17, -105, 163, 240, -97, -35, -47, -41, -14, -192, 21, -43, 179, -87, -55, -14, 1, 45, -82, 78, -173, -59, 234, -439, -155, -264, 184, 32, -264, -126, 27, -226, 178, 169, -118, 150, 142, -21, -80, 127, 23, 173, -86, 61, 24, 61, 185, 23, -217, 61, 50, 19, -254, 15, -12, 217, 35, -71, -521, 114, -33, 11, -304, -7, -177, 93, 131, 144, 228, -135, 137, 89, -23, 203, -282, -89, -29, -59, -65, -146, -152, -12, 95, -90, 146, -7, 267, -3, -187, 261]
7827B61k27j81L7O8n4j31J18J32L89m07J45j00J88k06j43L49k33LJ32pk13K54
7849A74k05j60j7L97j85j39K41p2J84l61P4J19J47k46K50l68K2J70k30L18j14
7870aj55mJ37O8o4J88j08m15J70L39j94l83M02J26k36L19j17j28PM21m93J45M19
7893D43m98J69j40j46Q0M9J1J82j17K33j53q5n3qJ68j99J76j03j69K33Lk44M11
7916B43k12q3K08l43J76q1J40j25J03Q6j42j14K22m0P5k96M1k44J84PJ77Q5j35
7939f8q8J18K21j2k17K96k78K3J93j67r8r2J00R5k22J84p3N1r8M7K34j45J00m06
7963c02N11k68j84L67j59J93j72j3J99l94K91k4r7Q9p1m4K08j02k27K82j96J70
7985E7n48L95R0R3L1r4j16OO6K11q6k86J34k00L41ml47J31j34J88K6k19K65n5
$$ y = [261, 34, -147, -110, -42, -96, -227, -109, 23, 412, 5, 150, 50, 238, 32, -111, 238, 5, 8, 140, 133, -80, 174, -31, -191, -208, 189, 4, -135, 106, 34, 218, -143, -69, 50, 197, -49, 201, -167, -145, 25, -205, 113, -1, -156, -160, -23, 45, -19, 169, 61, -354, -184, 155, -39, -422, -20, 106, -130, 189, 72, -56, -49, 372, -121, 24, 443, -55, 114, -26, -172, -92, -43, -32, 150, 33, 266, 113, 28, -25, -33, 135, -64, 112, 9, -160, 73, 76, -168, 243, 31, -52, 156, -187, -11, -92, 48, -77, 26, 112, -30, -144, 78, 38, 113, -183, -142, -386, -202, -195, -18, 67, -68, -156, -38, 183, 171, -46, 250, -28, -5, 188, 21, -77, -169, -69, 26, -196, -12, -85, -34, -132, -85, 149, 4, 104, -302, 209, -59, -243, 124, -35, 158, -14, -27, 172, -222, 69, 45, -52, 37, -34, -78, 130, 28, -199, 83, -113, 57, -491, -96, -6, 87, 118, 24, -92, -86, -20, 191, 105, -181, -47, -247, 94, 90, -257, -126, -260, -72, -46, -265, 0, -55]
8009e5L32j2m62J07J16K9K19l32M8K9p4j29K19K02k97m5L41o6j77p7L51k63M11
8032D15o05K17K65j61M8j42k60J00K34l75P4J6K84l35R6l32O16j63P4k49M02l41
8054a22K65n9j37K58k03k24K68k30J91p8L8J82k13L46l50r2K57Mj80l8L9P7j10
8077a11J71j42p3R1K77k33K30l13L97l04K2OJ3L5R8O1j30j85K91L0m1r2j13l05
8101c20O20k37j19Q2l15L15K5Q7k32J7P8K0k39M28q1l65J86K69m06J94K25k01
8123C1O0n1j12K9Q2J80l88L31M1Q1m58r4J55P8K53l77K19k19J74N0J21k78J30
8146C8J7N0j46J67m9j44j31j16M5J47L40k50j37J16Q9l24J86J94j51Q1q6K46J47
8169C29j53j84o3J02K35l70L23q9j24J02k69J47k0j31M16k78j41J18k8K14k52
$$ y = [-55, 277, 265, -197, -90, 26, 55, 274, -58, -10, 19, -55, -184, 35, 237, -60, -105, 236, 170, -7, -84, 267, 4, 415, -190, 27, 292, 131, 179, 37, -223, -123, 111, -264, -190, -174, 110, -225, -129, -461, 155, -8, 66, -183, 219, -122, 143, 84, -53, 205, 2, -222, 46, -184, 7, -71, -33, 149, -64, 282, -68, -160, 97, 101, -79, -117, -78, -1, -111, 60, -82, -155, -64, 213, -20, 210, -103, 294, -10, 12, 18, 31, 66, 164, 225, 95, -90, 201, 231, 190, 98, -15, -320, 300, 63, -56, 26, -289, 26, 51, 138, -94, -77, 1, 21, -218, 210, 129, -236, -50, 219, -187, 7, 232, 31, 91, 40, -72, -43, 39, 219, -169, 162, 203, 284, -174, -268, -113, -35, 218, -159, 60, -159, 15, 65, 186, -92, 38, 55, 105, -41, 126, 77, -67, -198, -314, -269, -122, 218, -32, -169, -53, 36, -288, -102, 92, -59, 22, -64, 182, 329, 176, -8, -71, 31, 266, -104, 219, 130, 6, 108, -161, -14, -34, -165, 251, -27, -168, -50, -78, 136, -116]
8190a16m
$$ y = [-116, -120]
8191a20
$$ Imaginary data points
##PAGE= N=2
##DATA TABLE= (X++(I..I)), XYDATA
0@%%%%%%%%%%qJ6j6J6j6K4l2L5m3N1n9P1q2R2j05J21j40J59j81K04k30K61k91
33a53L24l61M03m47M98n52O08o76P49q30R20j018J131j257J396j558J751j975
51a047K242k571K982l519M252n316P010j0138J7824p1847j16868J17421J25825
64F6250J728j11132n1549N0828Q4369K1129l3405m9519k3143J0863M1711K7590
76C5720j3861m1095j4363K5086M0034J6823j4559l5562k7517Q369N0579M0485
88G0139k8730p4363k1562O6618O3023l1156q3500k5624N4164M7544j6426l5161
100a5034L199K1183m043j4630R527J6865j6531m1798j5305L4617M5247N007l6948
113h644l2660J3747N1383L6038k9084p0053k9219N1529O7513k016o4797m0365
$$ y = [0, 0, 0, 0, 0, 0, 0, 0, 0, 0, 0, -8, 8, -8, 8, -8, 16, -16, 19, -24, 27, -32, 39, -43, 49, -56, 65, -75, 84, -97, 107, -123, 138, -153, 171, -190, 213, -234, 264, -288, 320, -356, 393, -437, 483, -535, 596, -661, 735, -823, 928, -1047, 1195, -1376, 1606, -1913, 2339, -2977, 4033, -6105, 11719, -60128, -176996, -59575, 66250, 67978, -43154, -94703, -43875, 40494, 61623, 28218, -21301, -44444, -33581, 8130, 35720, 21859, -19236, -33599, -8513, 31521, 48344, 33785, -1777, -29294, -20925, 29654, 70139, 41409, -32954, -54516, 12102, 75125, 43969, -39531, -65155, -10991, 36553, 20127, -15034, -11835, 9348, 5305, -9325, 202, 17067, 536, -41262, -56567, -21950, 23297, 28304, -8644, -41304, -27557, 23826, 59864, 30780, -39273, -68492, -16963, 50550, 48534, -16263, -56628]
125e6628L3255O0984J5357l5628l5386n449J4892K2337K1251k029l7491l7532
137d2067J5257N8695K8381m7512o8563k910O6329N5486j5316o1118l4088L1318
149a6108N8462J6404m6711n8471n468M9796M3823r891m1771j5878K4548L0470
161B9205O473j5220k0336j6521m223J5915K4586M183k8780k7379J3527M2434J8230
174D2094k8504m0565n889L0331K6462p626k5997j2962P649J5250R386l842j2149
187f362j2267l119R544J9636J3322r919k6427j3005K1829L3600R00m2890l8157
200e3315J5669N2448K5416k8047m1729k942L8677L3434j0385l9151k5117R285
212b5757K7209J7975o374k0834j5313P591K7167K3341q239l6197k6351J6382M2380
$$ y = [-56628, -23373, 37611, 52968, 17340, -18046, -23495, -8603, 13734, 34985, 32956, -4535, -42067, -26810, 31885, 60266, 12754, -55809, -58719, 7610, 63096, 47780, -13338, -47426, -16108, 42354, 58758, 12047, -46424, -51892, -2096, 41727, 31836, -9935, -25813, -1265, 29205, 35678, 20458, 122, -16399, -20622, -4707, 19879, 24062, -4718, -32097, -18570, 23864, 42094, 13590, -26975, -32864, -2533, 23929, 16303, -9694, -22656, -15007, 243, 9629, 5787, -6362, -18629, -21748, -12204, 7432, 20754, 10835, -15592, -28597, -6768, 26832, 27732, -15158, -53315, -37646, 14802, 40218, 12171, -29558, -32500, 6177, 39611, 29226, -9925, -35042, -25757, 1452, 19427, 13053, -7781, -23094, -15503, 11664, 35005, 26766, -9431, -35782, -19400, 22980]
225B2980J9075l0107m5616n069M3835M0410j3531n0020k4429K7926M3709Q611
237C7774l2629k9143O004K6497J3020j1024j8473j0987J280J0242J2460P320n130
250G211j5799r021J4218K3677K838k7412k8894M172L2709K0506j5913k8480l659
263b3847K5117K2437m003k1321j3338N381J1120M916l28k151n953p944J312J5486
277F884J4986p870k7536j4115K1803L3929M569l2602l0228J0174L7931J7635k6715
290H845l8346m757L1476K8541m123k6119j4581J1134J9722P898q213j7519j3857
303a9899P93J6827J7566N38j9570j7817Q530L0846J7283k0073l6622r381K8247
316b732L0785m124l4299j9643J8018L2142P871k1444k2976N40J8568J2951m331
$$ y = [22980, 42055, 11948, -33668, -38737, 5098, 45508, 31977, -18043, -42472, -14546, 29163, 37774, 5145, -23998, -17994, 8503, 21523, 10499, -7974, -18961, -17681, -7439, 5021, 12341, 7211, -8588, -17609, -3391, 20286, 23124, -4288, -33182, -29010, 3699, 24205, 8292, -20188, -23847, 1270, 23707, 19704, -1617, -14955, -9574, 1546, 6462, 6134, 3983, -1970, -9914, -8602, 6884, 21870, 14000, -13536, -27651, -5848, 28081, 32650, 48, -30180, -20006, 17925, 35560, 8845, -29501, -34258, -2782, 25759, 21636, -4483, -19064, -7930, 11792, 19690, 11477, -6042, -19899, -19106, -2279, 15287, 15825, -3745, -21562, -13032, 17814, 35097, 15024, -21598, -30979, -2732, 28053, 23929, -10370, -30013, -11995, 20147, 28018, 6574, -16402, -15862, 2706, 15657, 11326]
329A1326j1758o055K70M413O347M363m344j3832r481Q165K0819Q674j5148j9800
343a6041l82K0818J5966r900k4689j1170J3502J9038L098j1667r205K428R052
356H48P261P97m121q751q660J632J3965J2000n620j9234r705J5267K5251M075
370B5005k3827k3505N997K8470J6009j4262k6637p231J9209K0314j299j9100j5695
383a6552L142J6211J2688j884j1988j0753j88J1886J2826k628j9338j6721N211
396a8088K2886J4768j1208k3500n760J9729K1504k480k3850j8023P538K0955Q839
409A3310j1720j4636p24J1709J0294K79o245p002l131K315P105P089k098j0335
423c790p911N796J4086O504j0673j6329j680J4749J3751k476j3883q332N675J2031
$$ y = [11326, -432, -6487, -6217, -1804, 4543, 8906, 4562, -9270, -18751, -10586, 10233, 18907, 3759, -16041, -16423, 4395, 20361, 10461, -14228, -25398, -11896, 7142, 10240, -1427, -10632, -8204, 848, 8109, 8906, 4785, -3966, -12626, -10994, 2971, 14971, 9351, -9883, -19588, -4321, 20930, 25005, 1178, -22327, -16330, 12140, 28149, 13887, -12750, -19981, -772, 19542, 18243, -857, -16552, -13410, 2801, 15489, 13605, 1617, -9136, -9324, 2562, 15388, 12760, -6578, -23299, -18088, 4798, 19566, 8358, -15142, -20902, -1173, 20331, 17851, -5999, -24022, -16484, 4471, 13310, 1590, -13046, -13770, -2061, 8233, 8512, 2267, -4735, -7866, -5551, 1554, 8643, 6545, -3790, -11701, -5905, 8181, 14685, 4012, -12317, -13997, 752, 14503, 12027, -1856, -10188, -4513, 7518]
437G518L195p086r740m570K992P817P012j004p112p425J135J2149J0149n940j8784
452i694j0290J1188J9615N132j6175j6993L479K0797J3782r172j9858p789J1753
465d225J6509K591j2474j1841j62J0933R662N38r789j0673j198J0410J2711Q41
479A3833j3239j3494K841J5850R868r026j8791o925J3063J6934J451j4281j1187
492a3103M800J3532O042p122j0933l855M121P105L108j652m259l105J537O344
506B560O039p13r062q016K565J1830O353n861j1439l340R017J0789Q7j0143p747
521g081J869Q503O575j684o946n132M96N632N990j60r094q955Q54J1402R816k438
537I647j3755q247Q349J5123L038j3490j5894j52J4645J2249n196j3935o791Q472
$$ y = [7518, 10713, 3627, -6113, -10683, -7691, 126, 7138, 6134, -978, -8403, -7268, 4881, 15030, 9090, -9694, -19984, -8796, 10819, 15951, -224, -17217, -13738, 7059, 20841, 11669, -8189, -15978, -4225, 12284, 14875, 2401, -9440, -9602, 1331, 10993, 11531, 1742, -8931, -10129, 281, 12992, 13833, 594, -12900, -10059, 5791, 15659, 6633, -12158, -19083, -6020, 10914, 12365, -1916, -13103, -8303, 5229, 11271, 4149, -6784, -10639, -6518, 587, 3695, 2043, -2216, -5321, -3784, 2560, 8599, 7886, -1176, -9192, -6627, 5203, 11556, 5695, -5744, -9084, -67, 10722, 10809, 666, -7081, -5212, 3291, 9866, 8182, 1236, -3896, -3400, 2232, 8222, 8062, -1032, -9987, -9133, 2269, 12085, 9647, -4108, -12355, -4006, 11117, 14155, 665, -15229, -15381, -736, 11513, 6317, -7618, -14409, -5937]
551e937J3023L108q456j1626k777P208R291J549o806q841j138R028R869J35r677
566b047r139J277J2886Q511m889j2041m891P717J1839J650r693q988J165R050
580B407O659k064o364l327K019M365K624j380m092n103j602M449O411Q30n906
595g4o700J193Q585N333m016r683n180N224Q552L001o272p598j48O182O599J83
611E181n233o224q52O517P292J105o796q345Q71Q859Q020l359j1213o771O267
626d681J2774M958q872j0986q79J0115Q794k885j1701p536M110J0375N001m394
640D193q403k825N805P676J610o046q076k496O248P870J022o995p274J630Q647
655B586O661l557q891m608M889P531K280n081o167n95N049M651j68l918l959r11
$$ y = [-5937, 7086, 10194, 1738, -9888, -12665, -5457, 3834, 5383, -1423, -10264, -11402, -2374, 7495, 7630, -2047, -11186, -9909, 2977, 11488, 6599, -5442, -10333, -2616, 9223, 10873, 1180, -7808, -6643, 2407, 9066, 7002, 638, -2689, -670, 3695, 6319, 4939, 847, -4256, -5858, -1409, 5002, 5832, -74, -6774, -5581, 3004, 8337, 4321, -5362, -10542, -5318, 3234, 6235, -37, -7635, -7783, -1601, 4998, 5181, -52, -6276, -7128, -611, 6681, 7786, 990, -7355, -6484, 2375, 10395, 7036, -4177, -10948, -4681, 8093, 13051, 4179, -6807, -7686, 2429, 11223, 8338, -3363, -10899, -6789, 3586, 8587, 4193, -4210, -7035, -1230, 6446, 8056, 2010, -6066, -8562, -2314, 5556, 6578, -417, -7691, -6061, 2586, 9247, 5690, -3201, -7809, -2920, 4611, 6891, 1810, -4357, -4952, 97, 4748, 4580, 662, -3297, -4208]
671d208L456M402J092k812m432j319L776M652N30n326o084l9O103N803p87o504
687a697m300K721O779K956l825o893l177L812O410K153m186o258j626N240P225
702E334R80o513p163l16P815P084k276r097n415M195R735L526o293q935j057P907
718d89Q276q54p539o311K361P778M246l749o862l600L437P013L164l553o245j545
734d472M372O045O13n826o095j27N215N219j104n632l648K796N477K259l108m880
750b896k139K508M223J190j923l297j361K007L381J985k285m043k015K452N151
765B938K534l358n373r57M570M732l02m998n443J240O431M214j899n244l364K834
781a445N644K587m149o227k854M212O488J832n419o412L30O707N497j738p368
$$ y = [-4208, -752, 3650, 4742, 1930, -2502, -3821, -45, 4607, 5137, -189, -6273, -6312, -209, 5594, 4807, -1697, -5997, -3276, 3503, 6459, 2634, -4259, -7436, -3624, 2786, 4939, 753, -5505, -7131, -1891, 5334, 6314, -199, -7362, -7678, 137, 7221, 4945, -4152, -9567, -5372, 4363, 7889, 1596, -7339, -8396, -489, 7787, 6933, -606, -6917, -4556, 3222, 7468, 3719, -3143, -6743, -3306, 3707, 6871, 3318, -2927, -4472, -100, 5945, 6558, 732, -5363, -5490, -275, 4944, 3840, -1792, -5440, -2644, 2833, 5092, 1984, -2896, -5035, -2527, 1696, 2886, 963, -2334, -3695, -1688, 1693, 3678, 1393, -2650, -4665, -2213, 2938, 5472, 2114, -3259, -4216, 354, 5086, 4784, -214, -5657, -4417, 2014, 6228, 4329, -915, -4279, -1445, 4199, 6786, 2637, -3590, -6444, -2232, 4256, 6088, 669, -5743, -5413, 1294, 6791, 5053, -2315]
796b315n168K912P644L168m448p056j667N580P011j72o072n095J019O392L684
811E417j667n507l021K723M884K289k878m891j991L513M483J458l357m311N8L544
827G46L799r14l813l233L22L481K944o08l221k382P62L342J741j153l170k300
843c657P37L336K088q17l696k603J787M126J942k431m602j500L257N262L76l364
859B41m145p36M634M393r34n114l942J980N875L631k735n789j856M055N171P41
875E470m902n170j91N051M805m37n474l828K219N560L295l738o025j994L865N181
891C687N99m423l971R0M428L289m97m678l063J487M122K242j650l712j951K403
907a598L564P99k097l227m26J847K719R12j859k588k8K312J992K06k205k262n65
$$ y = [-2315, -7483, -4571, 3073, 6241, 1793, -5263, -6930, -1350, 5661, 5489, -583, -5678, -4659, 1733, 5417, 3750, -1757, -4778, -2055, 2829, 5118, 2240, -2651, -4642, -1129, 3354, 4812, 1455, -2856, -2798, 746, 4545, 3631, -182, -3415, -3093, 388, 3332, 2724, -497, -2879, -2117, 1225, 2966, 1813, -1357, -3657, -2920, 416, 2504, 1687, -2009, -4612, -2825, 1301, 3243, 812, -3790, -5290, -2033, 3229, 3605, 241, -3904, -4640, -6, 4387, 3453, -1661, -5603, -3623, 2252, 5883, 3148, -2641, -4497, -442, 4729, 5470, 568, -4602, -4793, 258, 5063, 4626, -848, -4676, -2457, 3103, 6398, 2660, -3365, -5359, -1494, 3687, 4286, -137, -4108, -4018, 410, 3699, 3202, -1476, -4539, -3052, 1070, 3312, 1662, -2050, -4001, -1598, 1966, 2765, 668, -2559, -2985, -1138, 1581, 2493, 634, -1954, -1982, 330, 2322, 2528, 323, -1939, -2504]
924b504K138K984K23k323k739L98L076K474r81l473k735R42M172K383k367l923
940b255j367K105M305J117l443l930l96L448L970m39m116l993J612M475L038k176
956A955m854k216L137M967J241l192m354k05L849M117j241m343k917J830M076
971A850K577j907l479k112K851L730Q66l094l730k15K859L006l90k878k211N12
987a765L203J751j343k916j396J094K233J324j293k158j112J380J949J046j499
1002D98k583p35J478K090R85j129k270o48J454K529R7j703k353n89K372L118p3
1019B538k461k631P70L034K729j377l817j717J246M071J194k069m072n65L120
1034gL798m37l237l134K55L657K450j179m235j769K022L911J137k671l325p80
$$ y = [-2504, -366, 2618, 2841, 518, -2221, -1823, 1253, 3727, 2746, -727, -3462, -2520, 1652, 4035, 1668, -2255, -3622, -1517, 2788, 3905, 462, -3468, -3864, -416, 3554, 3115, -1001, -4994, -3382, 1093, 4131, 1955, -2899, -5115, -1978, 2989, 4230, 1038, -3316, -3521, 328, 4445, 3204, -1139, -4056, -2226, 1850, 4427, 2520, -959, -3071, -220, 3510, 4376, 1282, -2448, -2663, 196, 3202, 2812, -66, -2277, -1765, 1438, 3189, 1846, -1070, -2466, -1372, 861, 2185, 892, -1266, -2378, -998, 951, 1997, 498, -2085, -2820, -1342, 748, 1733, 604, -1666, -2314, -860, 1669, 1766, 63, -2290, -2879, -507, 2611, 2538, 77, -2554, -1784, 1250, 3979, 2602, -1215, -2932, -1686, 2385, 3579, 1510, -2562, -3127, -7, 3791, 3354, 117, -3017, -2762, 895, 3345, 2166, -2069, -3838, -1816, 2095, 3232, 561, -2764, -3544]
1050c544K953L224j7l462k897R23L309K191j806l092j649K136L033O22j402k711
1066b189k32J983K102J83k265j844K58J809J861k50j730j193j46J811J557o1j601
1083E3j512M19J781R90m13j424j390M51K072J101q58k273j337J306K509J289k003
1100G61k346n99J924K485P4k694k260j33K931K455l92k547k592J399L231J556
1116C253k052l493r90K386L202N15k556k916P21L135K227q89l607k001J816K877
1132A628J373j849l104n11K658K641l3k330k505M41K208J872q72k202j134Q33
1148h86K119J014j468j791n73R16J902N88j054j884R7J258P90N63j187j563k37
1165a396J029J596J66j136j378k25J397J491K08j894j403k15K139J254l89j980
$$ y = [-3544, -591, 2633, 2616, -846, -3743, -2820, 489, 2680, 874, -2218, -3867, -1731, 1302, 1924, 522, -2189, -2421, -438, 1664, 1847, -418, -2262, -2004, -195, 1666, 1416, -314, -1507, -1653, 158, 1715, 1654, 53, -1459, -1040, 741, 1731, 1318, -106, -1496, -1045, 1027, 2128, 1270, -1003, -2340, -1034, 1475, 2764, 761, -1585, -2184, -260, 2225, 2299, -395, -2655, -2788, 143, 2598, 2206, -341, -2933, -1534, 1697, 3253, 1201, -2292, -3282, -896, 2306, 2821, 265, -2651, -1930, 1205, 3432, 2543, -1064, -3065, -1249, 1628, 3001, 1152, -1952, -2463, 195, 2836, 2803, 473, -2032, -1591, 617, 2489, 1617, -585, -1719, -886, 1233, 2247, 779, -1012, -1585, -669, 1233, 1821, 767, -1117, -1020, 238, 1028, 1591, 404, -1159, -1396, -367, 1229, 1395, 259, -1119, -1344, 53, 1544, 1752, -142, -1545, -1760, 379, 1633, 1244, -736]
1181g36j436R05K257J054j343k467o29J273K443N59k249k391R6K697J819o89k463
1198a300j505J016L075J067j746k346m18J478K817k72k183j869J59K665J623k59
1214B002k457j791J300K420J028j377k592q38J571K351L31j601j837L32J515J382
1230A739o69j804j051O36J462O85m24j301n25L89J254O52o48j360n95M61J062
1247c7R84m81j232q02Q93J431M43r17j404m43J125J409L30j178j226l1J717J539
1265B120m66j405j752N95J988Q90n00k140j232J875K021N51j736j740m13J800
1281D56J806l05k018k021R40K392J124j395j998q98J646K169r6j652j889L6J805
1298A02J285n25j495j141M92J617J154j127j284q85J181J575K31r30j611k7J425
$$ y = [-736, -2172, -1267, 990, 2044, 701, -1766, -2395, -1122, 1321, 1880, -369, -2760, -2664, 33, 1852, 1163, -1300, -2805, -1789, 1286, 2353, 607, -1739, -2157, -679, 2138, 1866, -317, -2186, -2027, 638, 2261, 2002, -455, -2246, -946, 1474, 2502, 1125, -1467, -2305, -734, 1617, 1948, 347, -1490, -1158, 357, 1739, 1070, -734, -1785, -1149, 313, 998, 574, -727, -1252, -863, 391, 1043, 395, -965, -1560, -1099, -37, 947, 466, -766, -1568, -675, 756, 1199, 282, -1122, -1565, -440, 969, 1299, 121, -1105, -1136, 581, 2120, 1654, 249, -1503, -908, 1080, 1970, 1470, -670, -1902, -27, 1994, 2545, 809, -931, -1344, 456, 2262, 1957, -61, -2082, -1142, 1250, 2374, 979, -1019, -1917, -271, 1898, 1802, 150, -1739, -1703, 102, 1387, 862, -633, -1774, -1282, 335, 1489, 362, -922, -1807, -626, 949, 1180, 250, -1361, -1388, 37]
1315C7J113l3r67q38M5J159Q25m06r94n33M46O13P41r1r91r63L66Q31R07n48j028
1336c09q75N37J040Q94l89j763l33R97Q00M33j122j214o43J620R89J48j454j100
1354a744K14J444J463n69j813j221J126J472J195r53k168l73J752J947l63j861
1370d52j538R06J763J104r92j759l85R13J822N92j513j538J07J274R90O9j613
1387b50j142N97J681M32m27j713p76J171J245m7m35j309l57Q94R62Q6p56q09L7
1406i16P66P33m6n38m76m74Q33N19M24q92l89l26J067N15L86j033j169M09J251
1425F44O23o38j046r15J089J207M19p72j031n24M77J419L68j383j172L86J309
1442D60Q15k00j348j196L89J963L73j113j544j44J419J246j12j180j372M43J428
$$ y = [37, 1150, 1117, 150, -688, -643, 516, 1341, 935, -59, -592, -146, 467, 1208, 1117, 126, -837, -471, 360, 1267, 719, -309, -1184, -647, 393, 1287, 898, -865, -1198, -201, 599, 1032, -90, -1304, -1947, -327, 662, 810, -644, -1744, -1530, -86, 1377, 808, -1005, -2226, -1100, 372, 1567, 614, -1554, -1927, -175, 1772, 1409, -452, -1990, -1084, 679, 1783, 791, -968, -1353, -440, 1382, 1974, 461, -1077, -970, 304, 1294, 1363, -250, -1392, -795, 886, 1318, 891, -822, -1598, -427, 818, 771, 336, -973, -1330, -436, 526, 612, -144, -953, -916, -150, 583, 537, -1, -477, -951, -118, 401, 825, -67, -456, -782, 285, 800, 1186, 153, -1016, -607, 644, 1267, 629, -417, -1332, -243, 964, 1383, 611, -420, -944, -467, 952, 1320, -63, -1235, -849, 460, 1275, 1075, -273, -1469, -1080, 883, 1256, 143, -1401, -1545, -126, 1120, 1008, -172, -1544, -1101, 327]
1459C27J096o47j665p26Q45J251L54l38j035j48M29J276o3q63o73p7Q95O57q0
1478H15o65j039N09J067J50r1r82n09K38J204j68l15k60l21M12N22L4l46p96j97
1498g38K57P20O29o27j004l88R77Q32K31j071r07J42J281Q88o50r28o01O34J093
1517G70P08q74j111k79P01J511oj139j304J28J248Q68j39j426p58O12J437K92
1535A239q62j460m6J036J144j69j170j069K43J232Q13k60j227m66O36R60L22r16
1553b0p05k43P69M66j14k69p07L50L53N90r8o73n82L03P06N44j61q35j51J73N10
1574B06M86k83m08p19L50O47K04M0q86j61K08P35M22o76m98o14O30Q54L50o29
1594B58r70%O98Q05k23j136p65P25O89M75n35r77q4Q58P78l8n97r28j1J022O51
$$ y = [327, 1423, 776, -889, -1615, -770, 481, 835, 497, -538, -686, -257, 1019, 956, 93, -580, -657, 238, 895, 815, 150, -889, -380, 687, 837, 746, -236, -745, -507, 697, 529, 214, -46, -367, 45, 567, 601, 255, -541, -738, -481, 239, 868, 241, -763, -1151, -174, 658, 889, -182, -1089, -947, 334, 1222, 572, -356, -957, -323, 770, 1478, 604, -507, -786, -85, 1426, 1420, 281, -1023, -895, 353, 1221, 1082, -344, -1102, -490, 947, 1239, 377, -1083, -1129, -93, 1051, 882, -288, -1357, -1114, 118, 931, 671, -556, -1022, -386, 574, 896, -20, -725, -968, -199, 267, 153, -116, -823, -473, -120, 470, 372, -301, -883, -580, 126, 670, 509, -326, -477, -304, 206, 692, 409, 1, -718, -368, 279, 483, 523, -363, -524, -316, 419, 841, 165, -333, -947, -317, 537, 887, 258, -712, -712, -14, 791, 568, -568, -1333, -608, 81, 556, 21, -956, -1040, -182, 596, 558, -39, -967, -978, 44, 695]
1615F95j88j027o74O82J143M97p83j070k97J143P52J18r14r35K56J443J96n92
1633D45l53p97Q01O74K31m14o58q4M42L36j76k50m25p2K92J39J50m01k37KK34
1654a21K03L85m89m79M8N04N01Q1o81k05j97J28Q27kp48m22L00J028K20k17r46
1675b82j44L30O34K13m12r84j35Q34M87J04p73n81l5J006P29n49r04m76O57P87
1695E06K75q34m32j19N14J173l54j110n92M64P76K69k07o88q40R27R31n7o26m27
1715d51k31N06M90j8o28J3ML58K52J97q80R1j15O07J43p6n49k07M75J90K91m65
1737ck88j93L63L42R0m19m50L10J53O68p5l17p73n8M15Q75K2q18j46m62O50N17
1759D03J12q32k83L19Q81j02l74o82j69P78M72l8n93l29j78J081M20m11p55k53
$$ y = [695, 507, -520, -1194, -512, 631, 1128, 345, -725, -1022, 121, 873, 991, 77, -858, -602, 841, 1037, 445, 92, -705, 96, 770, 1001, 587, -71, -155, 287, 623, 447, 197, -228, -300, -8, 131, 281, -120, -357, -355, -121, 82, 467, -22, -501, -453, 51, 552, 633, -48, -253, -450, -322, 505, 503, -245, -667, -367, 661, 881, 664, -282, -426, -96, 538, 751, 339, -645, -780, 54, 541, 645, -128, -709, -744, 262, 991, 442, -462, -938, -281, 506, 781, -53, -485, -604, -90, 1083, 729, -381, -973, -509, 267, 536, 329, -359, -1199, -272, 659, 602, -24, -451, -682, -176, 314, 296, -332, -319, -315, 43, 295, 492, -388, -297, -412, 195, 338, 262, -287, -494, -19, 171, 462, -3, -291, -484, -121, 221, 311, -108, -558, -248, -95, 573, 498, 181, -592, -650, -235, 640, 662, -156, -302, -764, -114, 403, 515, -317, -600, -281, 600, 498, 124, -558, -727, 51, 523, 485, -108, -437, -615, 466, 886, 475, -280, -533]
1779e33O24L11L11n65p76J33O86K25P2m91l85L34K32J97j3q64q0M43N95K02o81
1800b3k30LN03j36J84l32j01j75N87O4J11l09n62K10K63L72r4m54m4J32L22j26
1822A65L52m80M1l74M97Q6j37l57k79N52J78L93m23m18k10L24P64N2o70n47KM52
1844c7P35k93o46n17N64N79M7l24o91K2N23L26j04j22q12L94M50P38m25n37l99
1865e29K94K89L40l89l40K2M20L00J81n78m07K46K49L97n05k26l22N31L85r5q8
1886A75o19m2L67n1L83p8n92K02m2M49K30n59j59j31N84K10k22Q7o47J65J82L39
1908B31j12r0k20o8L54J05L22n90l28M74J55L05k86n01j76K47P28k5l07n40M48
1929A26O2N2R5m57m47L39O25P0j37o84k93O50K37J84l96p78L63K41N05j2p57l06
$$ y = [-533, 91, 402, 713, 148, -628, -495, 191, 416, 488, -3, -388, -54, 178, 375, 362, -502, -582, -139, 456, 658, -23, -253, -250, 253, 117, 301, -31, -132, -307, 280, 344, 455, 146, -416, -206, 57, 429, 335, -119, -163, -31, 291, 165, 517, 37, 78, -296, 201, 287, 150, -207, -486, 66, 244, 637, 214, -204, -414, -90, 674, 726, 56, -491, -489, -37, 698, 405, -241, -758, -194, 385, 432, 108, -583, -561, -38, 288, 184, 62, -750, -356, 94, 832, 407, -130, -529, -235, 54, 394, 5, -335, -313, 107, 407, 588, 10, -397, -151, 98, 495, -10, -236, -558, -27, 358, 263, 175, -444, -486, -119, -170, 213, 135, -457, -255, -297, 152, 382, -177, -336, -467, 117, 327, 105, 192, -455, -290, -108, 231, 119, 29, -191, -259, 95, 200, 522, -68, -396, 78, 233, 538, 252, -249, -425, -178, 550, 525, 218, -322, 126, 188, 240, 335, -122, -569, -230, 395, 465, 328, -356, -649, 1, 238, 422, 26, -752, -389, -148, 357, 345, -412, -718]
1951g18P14J80L65n09l10O5QO07j35m34k44o4O54L55k96o13J80K73K36J30j84
1972B60m34j23L95K10J24k23k71L2k72L53J02k29J71l88L01L14J21j90m58O2L3
1993a10M67J12p07J5j8K55M26k08l63k95M6N33P2l31K19l88K67L48l72k1k49%
2015c02M51K49J46n04l77M41J39K57k32o78j75N15M03Jr7m22k21N05M45m00l09
2036a65k68L54L05K31m49N9p18N85K43J09j37o72L37M74r5j6P5o42L61P8K2Q2
2058A53l17k64K93L76J1l2n32K9J71L02j01l4J54k15l39J51L41Mj02l70K61M41
2080C81J54l18n59Q7L99m5J64l31l09J10O29m4k14o16K05Q3L04l8k07K46n27N91
2102A45N3K93m13o36K04P39l21k41r6O7M4L82J0l21j67PM97Q4k80j68q6L91j33
$$ y = [-718, -4, 176, 541, 32, -278, -213, -205, 402, 267, -167, -411, -475, 179, 534, 238, -375, -195, 78, 314, 444, 260, -174, -297, 98, 308, 432, 209, -62, -30, -302, 51, 153, -76, 95, -293, 8, 322, 443, 253, -205, -143, -110, 357, 469, -238, -223, -241, 14, 440, 232, -131, -426, -380, 153, 225, -106, 113, -275, -8, 340, -32, -53, -302, -302, 149, 398, 544, 40, -337, 104, 243, 500, 268, -410, -585, -70, 333, 334, 237, -185, -406, 99, 544, 144, -165, -433, -79, 226, 457, 8, 67, -651, -66, 177, 286, 149, -523, -186, 288, 193, 177, 252, -390, -29, 49, 71, 153, -164, -428, -135, 241, 252, 220, -312, -283, -112, 190, 89, 55, 209, -6, -345, -194, 147, 151, 49, -321, -60, 381, 535, 217, -342, -255, 144, 99, 263, -68, -377, -267, 362, 318, 104, -512, -307, -224, 80, 42, -165, 81, -446, 145, 198, 491, 78, -558, -354, 385, 64, -177, -273, -206, -162, 220, 230, -91, -258, -251, 246, 330, 50, -118, -204, 187, 54]
2125E4n0M7j3j68L12j69K76k37j68j24L44o1R6k18N6o9k41M18j98J62j77j03J2
2148b19K06R8J6m04Q0p8O81j06n26L4J44J41K37J53o83K50l26M50M2K03l28j53
2170h8J73J52k9l58p3J46mL26J04j06k43M9K13J65k38o82M86J35K65k64l70k34
2192d75N36J06j48J94l10o2qK82mk47R6p1Q2l17M68R7l72kK07k10J58k11l57N01
2216f7K22j20j06j38J74l41M82l4j48J50r2K93m96L44r6l5k65QL55n1j12J18k31
2239a86J24K62N1l71p1O3K69K56m97j87K31k23L31K02p75M5K52K6K72J70l42j35
2261b33R7p4K20K58n92k00L66K64M6K81m55l71N24L79k54m09k7k93O30K4J61n00
2283a58L69j37J28k30J31m75M33k47J09J44M3j60L1Q4qJ99m35o3K04K3K57N9l02
$$ y = [54, 4, 51, 38, -130, 182, 13, 289, 52, -116, -240, 104, 43, 139, -79, -23, -92, -333, 85, -113, 49, -128, -231, -219, -13, 85, 101, -303, -223, -301, 380, 274, -252, -218, -74, 67, 304, 457, -226, 24, -302, 148, 190, 393, 65, -88, 85, 237, 208, -150, -223, -77, -81, 245, 349, 243, 0, 49, 262, 427, 189, -493, -7, 128, 393, 129, -241, -475, 61, 167, 19, 213, -97, -159, -167, 115, 111, -136, -40, -111, -29, -346, 122, 219, -153, -155, 52, -158, 0, -211, -568, -67, 155, 35, -71, -209, -35, -376, 106, 72, -76, 74, -18, 275, -221, 123, 27, -8, -273, -265, 90, 39, -73, 45, -186, -62, 200, 251, -120, -191, -128, 141, 397, -100, -287, -56, -279, 52, 254, -521, -476, -224, -198, 74, 244, -98, -233, -136, -210, 10, 268, -324, -524, -158, 106, 152, 433, -22, -393, 131, 510, 256, -153, -180, -473, 157, 181, 342, -158, 211, 74, 202, -28, 103, -372, 61, -186, -77, 67, 110, -50, -19, 65, 57, 256, -179, -242, -38, -15, 242, 301, -1]
2306al39M62J39k46km41M94J74l21JO7R8j04j80L01M7L2n4k53J14M14J1n35l60
2330d82M78K99J03n91J68l14L54K05J02k85k81L76j09J82q3Lr4m6p0M03m23p3
2352a78l9J07P9K60J9m80k51M89N02j00p96J65L70NK2j17k96J89R5L52l31n13
2374d47J39N01qk28J17m7p6j37k24L58J75K34n46J01K90l4k50J4J44k06K62k13
2396h1K01%j23J83R7m06l5N6O2l6K91J07l2j11j38n69Q04J30l65q1q2j69N33m6
2420A90k27k65J38M43k02M2k38K26j14R2m9N5K9k91j15N67l2l52N9j09J10L70
2442C27l16k55L5J65J01k29M5q9L43J64N8n31R3J1k4K74k36r8K47p8L5k97L01
2465D6j4R7k46kN5P3qj01j6L96q7j9l35J70K52j63P2J88m06J15l33K86K64j61
$$ y = [-1, -340, 122, 261, 15, 13, -428, 66, 240, -81, -80, -13, 85, -19, -199, 102, 149, 181, 127, -126, -12, 402, 413, -122, -482, -4, 295, 398, -193, -25, -339, 15, 220, 322, 37, -244, 132, 23, 205, 122, 125, 31, -15, -85, 318, -105, -178, -217, -110, -31, 229, 248, -232, -483, 6, 508, 408, -388, -223, 147, 152, 174, 57, -239, -50, 45, 397, 66, -447, -308, 193, 185, -43, 74, 27, -49, -186, -410, -52, 123, 357, -189, -88, 202, 168, -82, -68, 76, -130, 132, -81, 120, 120, -3, 180, 277, -129, -164, -108, -46, -82, 209, 316, 284, 173, 35, -534, 270, 400, 35, -46, -128, -297, 236, 190, -37, -302, -164, 279, 77, 119, -119, 107, -7, 85, 36, 91, 120, -171, -286, 281, 249, -103, -44, -153, -43, 327, 11, -244, -209, -44, 57, -172, -127, -216, 127, 291, 349, -182, -89, -78, -102, 172, -64, -162, 85, 7, 42, -255, 46, 32, 129, -117, -119, -64, 9, 1, -100, -116, 280, 193, 174, -161, 9, 261, 98, 170, 358, -48, 67, -266, 20, 284, 123]
2489A23k1k83o9J93K76j64k31J00l3L76N4l96k29L78k20L21q4j05k53K29N1M11
2511D24m73J05k73J38K35j29J69j07j26j16K66j4Q1n29L40k22J42J50l67MK23
2532g9L00m07M86n09L14J10o5k01J85l41K79J85j95m22M69j77R7j78J46K3J0j8
2554A2k5L4M4l74OJ62j95L09R3O6m92L63M0j28J95pk87J27n4J83j92K56J29l29
2578f4k4J97j05J64m11J69N7M60l86l59K84P9N6Q7k47L1o1K53k14L5j50J22%k09
2602b36K29k22M45l76jK02o9q3J14qo7M02L8l80q8K2N61l98k73k07M29m3J04j69
2626g4O3j3J91p0Mn9%k40J96n3K4K6O0j66J38m02O15q5j72n6J28o6j22r0k4K17
2652c0J82j60k30K00J13O1l58K96k5J70m11J37L4l2N6j6k0l7k4L14k27l27M48
$$ y = [123, 102, -181, -250, -57, 219, 55, -176, -76, -109, 267, 321, -75, -304, 74, -146, 175, 91, -14, -267, -38, 13, 424, -49, 56, -217, -79, 156, 27, 196, 89, -37, -153, 113, 99, 180, -349, -9, -231, -89, 61, -306, -302, -79, 221, -186, 300, -209, 105, 215, 150, -51, 134, -207, 72, 257, 62, -360, 109, -68, 29, -149, -3, 20, 30, 12, -13, 21, 65, -309, -303, -141, -336, -27, 66, 132, -360, 3, 43, -85, 110, 103, -184, -57, -111, 72, -120, 136, 265, -64, -88, 109, 4, 168, -243, -74, -17, 443, 57, -302, -18, 61, 117, 204, -43, -12, -73, 180, -34, 1, -149, -27, -27, -236, -7, -229, 216, -160, -161, 41, -28, -111, 3, -5, -72, 330, 368, -12, -100, -78, 483, 85, -188, -395, 34, -9, 95, -74, -11, -24, 167, 97, 101, 42, 42, -198, -2, -55, -31, -5, 55, -111, 27, -375, 240, 155, -17, -73, 55, -11, -133, -223, -247, -30, 152, -8, -238, -38, 75, 136, -222, 74, 49, 219, -192, -55, -21, -53, 3, -13, -33, -70, -94, 220, -7, -334, 114]
2675A14M3K40o80L28k01K20j18l1O4q6J52k66K28Q6k97L29n3k98L66N5l02j43
2697b50J81L15j9M3l82k3J10P7J40k10mN8R5k17j50J80K0L21l51N0j82n4M61o07
2721c98J69M15M3k02R4k73L80k2k70r7J39K12j02k45K4L23j31J72Kn1k2n9k54
2744a53J40j64J22l5j19J38l4J57J65p30L42J17Q6J94j99l12K8J79K18J97m32
2765i5l13P22j84j74j29J75J02k44K34J4r6k0L55m53J35O55n87j52r0j3P13l62
2787A93k13q1K08j57M6n5l41O64k12jj14j15M5L45Ol70J20L38l77K98j09k57K94
2810A55j40l61J8L88J78l10j56J22K81J44k34m01N04k22J18j69K42r3j89L01l83
2831b07N69l41Q0l63M39k84Q0L6L57l93l3J92K99k33l88r2J13N75l73k83J62K54
$$ y = [114, 157, 397, -283, 45, -156, 64, -54, -85, -21, -107, 45, -221, 7, 93, -204, 125, 72, -226, 140, 195, -107, -250, -69, 246, 227, 270, -112, -135, -25, 52, 192, -18, -22, 36, 131, -86, -236, -56, -36, 285, -66, -16, -198, -252, 209, -398, -229, 186, 229, 27, 121, -152, 228, 206, -64, -161, -22, 190, 88, -157, -133, 190, 59, 231, 233, 182, 160, 101, -153, -13, -177, -55, -90, -209, -71, -105, 52, 217, -513, -171, -54, 32, 226, 27, -285, -257, -78, 140, 337, -95, -408, 314, 130, -44, -173, 2, 104, -140, 94, 108, 12, -8, 347, -106, 29, 684, 97, -55, -145, -158, 555, 193, -20, -101, 107, -50, -4, -59, -400, 264, 52, 51, -63, -178, -133, 212, 218, -152, -32, 306, -71, 227, 118, -139, 155, 15, -346, -328, 60, 238, -72, -228, -106, 175, 319, 85, -316, 188, -34, 84, -85, 157, 64, -125, 176, -207, 362, 21, 101, -262, 177, -107, -27, 9, 366, -27, -60, 132, 431, 198, -190, -282, -169, 406, 33, -250, -88, 166]
2853A66K44m30j82j83N10Jj77qL90l19k43r2L05J00O9k63m6K70q1Rj08J15m6j
2877@k2R3l75K47K20qk5j47l5O9j64j87K97k7J97n5j19N4n3m3R1n2j81M65k70
2902c0J19l45K48J45K3j91k7J58k79R6J35J47k64l8J15L2M1%mN1l39J28K74k14
2926a9k20M78l40J00j29j33K66j10P6k6J07J56q7k59K86k44L4K50K6m13K90kk49
2949a62K47k17O4J53j13l03L09j72l3J07K76k72n1M20o65N35j75M1r6L57K0j19
2971A51j7Rj20R4j83M14l55Q4k4O6L7k46n7J20n3K57l58k0Q5j29M03m42K31J31
2995G8l77J49J13J37J1J2j07k41M44n7m8j14k77J04K88j05j06L15K8k37J20nk46
3018a21L46l31K6K95k21o0l4K97n58L27P1p4j76L08k91K07N6J33n00K18K24j91
$$ y = [166, 410, -20, -202, -385, 125, 126, -51, -59, 331, 12, -231, -323, -18, 82, 151, -112, -158, 112, 31, 40, -68, 47, 1, 0, -22, 71, -304, -57, 163, 155, 130, -17, -52, 17, -147, -334, -37, -64, 133, 78, -41, 13, -40, -83, 8, -44, -225, 240, -30, 89, -256, -8, 137, 160, -31, -58, 100, -179, -83, 52, 199, -65, -103, 12, 44, 85, 85, 81, 132, -207, -79, 195, -19, -239, 239, -101, -1, -130, -263, 3, -107, -31, -57, 50, 206, 119, -140, 146, -98, -64, 186, 212, -201, 89, 87, -162, 85, -132, -68, 85, -28, -331, -22, -194, -227, -120, 156, -116, -167, 253, -412, 123, -52, -11, -107, 250, 270, 151, 134, 143, 23, 117, -66, 348, -7, 77, 53, 119, 156, -90, -147, -27, -80, 177, -181, -201, -116, -245, 158, -284, -53, 78, -299, -150, -37, 100, 111, 123, 16, -225, 219, 162, 114, 0, -277, -173, 115, 10, -96, 219, 247, 10, 130, 125, -121, 225, -106, -80, 215, -6, -66, -100, 197, -361, -34, 37, -37, -213, 95, -196, 11, 67, 200, -300, -82, 142, -49]
3040d9J81k87K20K5J73m5j50K62o60K52j0q4K56k9j6M29j88n4l78n0R5K49j87
3063d5O9Q7r7k38J61M8K21q9m02p8L80L1j46r4M15l1k47k7J06r3l25K89K34l00
3087a71J91j54L18r7q9k6l47L71J83M6k45n2k83K15K19j14K8J15K01j32k91J70
3109E6k29L69k23Q0k1m23J59K60m3Q5n3j11L22k84M6K12l68K23J34k54K72l51
3131a42j62L30k67Q2J65n7m4K65j39J26j95qK14p1j55J55m4K78l90k7J71m1q0
3154c6K93k01PP3Q9j32l44K48L02j90J6Q3p9m96O37l3n71P96o52K93J85o69L22
$$ y = [-49, 132, -155, 65, 90, 263, 218, 68, 330, -330, -78, -88, -172, 84, 55, 39, 468, 280, 226, -152, -202, -107, 142, -45, 24, 111, 14, -224, -63, -15, 206, 117, -285, -363, 17, 48, -98, -192, 223, 192, -55, -82, 24, -69, -394, -105, 129, -171, 20, -134, 184, 87, -2, -28, -375, -4, 179, 225, -20, -72, -355, -140, 79, -35, -7, 108, 309, 177, -114, 56, -173, 196, -27, 53, 32, -391, -232, 28, -15, 70, 17, -94, 228, -56, -10, 202, -166, 57, 191, -63, 209, -142, -304, 26, -241, -159, 6, -51, -95, 170, 31, 157, -38, -46, 168, 97, -58, 97, 53, 331, -59, -86, 85, 44, -36, 257, 56, 63, 136, 225, 93, -251, -3, 299, 109, 125, 208, 129, -367, 270, 237, -334, 462, -190, 103, 288, -381, -59]
$$ [...]
8191G8
##END NTUPLES=NMR FID
##END=
