##TITLE=1H_TG-2243-B1
 DMSO, 8 sc, 
 7.06.2021
##JCAMPDX= 6.0         $$ Bruker NMR JCAMP-DX V2.0
##DATA TYPE= NMR SPECTRUM
##DATA CLASS= NTUPLES
##ORIGIN= UXNMR, Bruker Analytische Messtechnik GmbH
##OWNER= root
$$ XWIN-NMR		Version 3.5
$$ Mon Jun  7 11:38:47 2021 Russian Standard Time (UT+4h)  she@DPX200
##.OBSERVE FREQUENCY= 200.131506
##.OBSERVE NUCLEUS= ^1H
##.ACQUISITION MODE= SIMULTANEOUS
##.ACQUISITION SCHEME= undefined
##.AVERAGES= 8
##.DIGITISER RES= 18
##SPECTROMETER/DATA SYSTEM= spect
##.PULSE SEQUENCE= zg30
##.SOLVENT NAME= DMSO
##.SHIFT REFERENCE= (INTERNAL, DMSO, 0, 17.5191)
##AUDIT TRAIL= $$ (NUMBER, WHEN, WHO, WHERE, WHAT)
$$ ##TITLE= Audit trail, XWIN-NMR		Version 3.5
$$ ##JCAMPDX= 5.01
$$ ##ORIGIN= Bruker BioSpin GmbH
$$ ##OWNER= she
$$ F:/spectra/data/she/nmr/H-F/1/pdata/1/auditp.txt
$$ ##AUDIT TRAIL=  $$ (NUMBER, WHEN, WHO, WHERE, WHAT)
(   1,<2021-06-07 11:37:39.23 +0400>,<she>,<DPX200>,
      <created by zg, POWCHK disabled, PULCHK disabled
       configuration hash MD5:
       00 E9 B6 7A A2 85 ED C7 34 08 36 98 17 FE 4E 26
       data hash MD5: 16K
       60 03 AF 84 FA 9D 54 A3 88 AA 6D 16 29 30 82 E7>)
(   2,<2021-06-07 11:37:41.81 +0400>,<she>,<DPX200>,
      <Start of raw data processing
       efp BC_mod = 2 LB = 0.24 FT_mod = 6 PKNL = 1 PHC0 = -11483.92 PHC1 = 11.00101 SI = 16K 
       data hash MD5: 16K
       A0 9B 59 1B C1 A8 CF 43 47 7D 0A 24 0C 3C FC 06>)
(   3,<2021-06-07 11:38:00.50 +0400>,<she>,<DPX200>,
      <pk PHC0 = -5.377254 PHC1 = 5.8 
       data hash MD5: 16K
       9C EB 5C 5E 6C 63 F5 D2 B3 57 98 82 6D FE A1 66>)
(   4,<2021-06-07 11:38:03.96 +0400>,<she>,<DPX200>,
      <abs ABSG = 5 
       data hash MD5: 16K
       2F 3C 28 F3 EB A9 95 89 D0 EA D9 DD BD 0D E4 54>)
(   5,<2021-06-07 11:38:19.87 +0400>,<she>,<DPX200>,
      <abs ABSG = 5 
       data hash MD5: 16K
       CA 16 CF 71 B1 25 C9 EA A4 AC 1A CD 2C 4E 71 7B>)
$$ ##END=
$$ 
$$ hash MD5
$$ BA 26 3C D2 99 CB 96 53 3D 6D F4 2E D3 C0 6C 1C
##$RELAX= 
##$RELAX= 
##$RELAX= 
##$RELAX= 
##$RELAX= 
##$RELAX= 
$$ Bruker specific parameters
$$ --------------------------
##$DU= <F:/spectra>
##$EXPNO= 1
##$NAME= <H-F>
##$PROCNO= 1
##$TYPE= <nmr>
##$USER= <she>
##$AMP= (0..31)
100 100 100 100 100 100 100 100 100 100 100 100 100 100 100 100 100 100 
100 100 100 100 100 100 100 100 100 100 100 100 100 100 
##$AQSEQ= 0
##$AQ_mod= 1
##$AUNM= <au_zg>
##$AUTOPOS= <>
##$BF1= 200.13
##$BF2= 200.13
##$BF3= 200.13
##$BF4= 200.13
##$BF5= 200.13
##$BF6= 200.13
##$BF7= 200.13
##$BF8= 200.13
##$BYTORDA= 1
##$CFDGTYP= 0
##$CFRGTYP= 5
##$CHEMSTR= <none>
##$CNST= (0..31)
1 1 145 1 1 1 1 1 1 1 1 1 1 1 1 1 1 1 1 1 1 1 1 1 1 1 1 1 1 1 1 1 
##$CPDPRG= <>
##$CPDPRG1= <>
##$CPDPRG2= <>
##$CPDPRG3= <>
##$CPDPRG4= <mlev>
##$CPDPRG5= <mlev>
##$CPDPRG6= <mlev>
##$CPDPRG7= <mlev>
##$CPDPRG8= <mlev>
##$CPDPRGB= <>
##$CPDPRGT= <>
##$D= (0..31)
0 1.2 0 0 0 0 0 0 0 0.06 0 0.03 0 0 0 0 0.0002 0 0 0 0 0 0 0 0 0 0 0 0 
0 0 0 
##$DATE= 1623051458
##$DBL= (0..7)
$$ [...]
##$SUBNAM3= <"">
##$SUBNAM4= <"">
##$SUBNAM5= <"">
##$SUBNAM6= <"">
##$SUBNAM7= <"">
##$SUBNAM8= <"">
##$SUBNAM9= <"">
##$SW= 20.0188882624521
##$SWIBOX= (0..15)
0 0 2 0 0 0 0 0 0 0 0 0 0 0 0 0 
##$SW_h= 4006.41025641026
##$TD= 16384
##$TD0= 1
##$TE= 0
##$TE2= 300
##$TE3= 300
##$TEG= 300
##$TL= (0..7)
0 120 120 120 120 120 120 120 
##$TP= (0..7)
150 150 150 150 150 150 150 150 
##$TP07= 0
##$TPNAME0= <>
##$TPNAME1= <>
##$TPNAME2= <>
##$TPNAME3= <>
##$TPNAME4= <>
##$TPNAME5= <>
##$TPNAME6= <>
##$TPNAME7= <>
##$TPOAL= (0..7)
0.5 0.5 0.5 0.5 0.5 0.5 0.5 0.5 
##$TPOFFS= (0..7)
0 0 0 0 0 0 0 0 
##$TUNHIN= 0
##$TUNHOUT= 0
##$TUNXOUT= 0
##$USERA1= <user>
##$USERA2= <user>
##$USERA3= <user>
##$USERA4= <user>
##$USERA5= <user>
##$V9= 5
##$VALIST= <valist>
##$VCLIST= <CCCCCCCCCCCCCCC>
##$VD= 0
##$VDLIST= <DDDDDDDDDDDDDDD>
##$VPLIST= <PPPPPPPPPPPPPPP>
##$VTLIST= <TTTTTTTTTTTTTTT>
##$WBST= 1024
##$WBSW= 4
##$XGAIN= (0..3)
0 0 0 0 
##$XL= 0
##$YL= 0
##$YMAX_a= 73704
##$YMIN_a= -30168
##$ZGOPTNS= <>
##$ZL1= 120
##$ZL2= 120
##$ZL3= 120
##$ZL4= 120
##$ABSF1= 17.5191
##$ABSF2= -2.499939
##$ABSG= 5
##$ABSL= 3
##$ALPHA= 0
##$AQORDER= 0
##$ASSFAC= 0
##$ASSFACI= 0
##$ASSFACX= 0
##$ASSWID= 0
##$AUNMP= <proc_1d>
##$AZFE= 0.1
##$AZFW= 0.1
##$BCFW= 0
##$BC_mod= 2
##$BYTORDP= 0
##$COROFFS= 0
##$CY= -3
##$DATMOD= 1
##$DC= 0
##$DFILT= <>
##$DTYPP= 0
##$F1P= 0
##$F2P= 0
##$FCOR= 1
##$FTSIZE= 16384
##$FT_mod= 6
##$GAMMA= 0
##$GB= 0
##$INTBC= 1
##$INTSCL= 1.334414e-10
##$ISEN= 128
##$LB= 0.24
##$LEV0= 0
##$LPBIN= 0
##$MAXI= 10000
##$MC2= 0
##$MEAN= 0
##$ME_mod= 0
##$MI= 1.114404
##$NCOEF= 0
##$NC_proc= -9
##$NLEV= 6
##$NOISF1= 3.799351
##$NOISF2= 2.8
##$NSP= 0
##$NTH_PI= 0
##$NZP= 0
##$OFFSET= 17.5191
##$PC= 1
##$PHC0= -11489.3
##$PHC1= 16.80101
##$PH_mod= 1
##$PKNL= yes
##$PPARMOD= 0
##$PSCAL= 0
##$PSIGN= 0
##$REVERSE= no
##$SF= 200.130003107234
##$SI= 16384
##$SIGF1= 3
##$SIGF2= 2
##$SINO= 5.538805
##$SIOLD= 16384
##$SREGLST= <1H.CDCl3>
##$SSB= 0
##$STSI= 16384
##$STSR= 0
##$SW_p= 4006.41025641026
##$SYMM= 0
##$S_DEV= 0
##$TDeff= 16384
##$TDoff= 0
##$TI= <>
##$TILT= no
##$TM1= 0
##$TM2= 0
##$TOPLEV= 0
##$USERP1= <user>
##$USERP2= <user>
##$USERP3= <user>
##$USERP4= <user>
##$USERP5= <user>
##$WDW= 1
##$XDIM= 16384
##$YMAX_p= 350709998
##$YMIN_p= -2289809
$$ End of Bruker specific parameters
$$ ---------------------------------
##NTUPLES= NMR SPECTRUM
##VAR_NAME=  FREQUENCY,     SPECTRUM/REAL,   SPECTRUM/IMAG
##SYMBOL=    X,             R,               I
##VAR_TYPE=  INDEPENDENT,   DEPENDENT,       DEPENDENT
##VAR_FORM=  AFFN,          ASDF,            ASDF
##VAR_DIM=   16384,         16384,           16384
##UNITS=     HZ,            ARBITRARY UNITS, ARBITRARY UNITS
##FACTOR=    0.24454680195387, 1,            1
##FIRST=     3506.09757530234, 0,            0
##LAST=      -500.312681107922, 0,           0
##MIN=       -500.312681107922, -2289809,    0
##MAX=       3506.09757530234, 350709998,    0
$$ Real data points
##PAGE= N=1
##DATA TABLE= (X++(R..R)), XYDATA
$$ [...]
7666i635j219875M86028o14525R56445J361839J75406J48697j10111j149135M34660
$$ -9635 -1229510 -743482 -1358007 -401562 960277 1135683 1284380 1174269 25134 459794
7656D59794j133713J58441q4586o67015J340891j45536o27097p09272J13017K43444
$$ 459794 -673919 -515478 -600064 -1267079 73812 -71724 -698821 -1408093 -1295076 -1051632
7646a051632k45752M98245k06356R62329M13981J6685N40113K81980q24953o41745
$$ -1051632 -1297384 -799139 -1005495 -43166 370815 387500 927613 1209593 384640 -257105
7636b57105N2038J6363q01O05060J57172o85839k50162J62871o31795O2627M41765
$$ -257105 -205067 -188704 -189505 415555 572727 -113112 -363274 -200403 -832198 -769571 -327806
7625c27806M28348j50811r93022l02376n06236J000281m20578R45970M31080o73918
$$ -327806 100542 -50269 -1043291 -1345667 -1851903 -851622 -1272200 -326230 104850 -569068
7615e69068j64171M13428J59828J65044k66021j67001Q64759L11376q93928J72661
$$ -569068 -733239 -319811 -159983 5061 -260960 -427961 436798 748174 -145754 26907
7605B6907K54785m91591k46980m08556P5902J075295l18803m11500j83407K49944
$$ 26907 281692 -209899 -456879 -865435 -789533 285762 -33041 -444541 -627948 -378004
7595c78004j50976J2262J80121o36825L59732J89974m60292Q11543J42823r48972
$$ -378004 -528980 -516718 -336597 -973422 -613690 -423716 -884008 -72465 70358 -878614
7585h78614M05671M79768P08152l94075n0525N75657r76953j50494L2448r2495
$$ -878614 -472943 6825 714977 320902 270377 846034 -130919 -281413 -248965 -341460
7575c41460K78028J38059M37626m52360l03956r0946N5198K22492k84321M17481
$$ -341460 -63432 74627 512253 59893 -244063 -335009 -279811 -57319 -341640 75841
7565G5841j08949m75539J209883j12173n59118J57709j19733K62894k6656p43587
$$ 75841 -33108 -508647 701236 589063 29945 187654 67921 330815 304159 -439428
7555d39428n57396L21439J70696K28093J112458r53840M50371k65659l02547K94848
$$ -439428 -996824 -675385 -504689 -276596 835862 -117978 332393 66734 -235813 59035
7545E9035m1689Q97514n14459P4007R82947o25262j052507j06560l29097N16457
$$ 59035 17346 914860 400401 474408 1457355 832093 -220414 -326974 -656071 -139614
7535a39614K94355k37718P4258j37641L33676L35717j063650l99157M83899j1426
$$ -139614 154741 -82977 -8719 -146360 187316 523033 -540617 -939774 -455875 -467301
7525d67301j58294P12407Q40352r26062j74782n94840K62895J224283J7030L62830
$$ -467301 -625595 86812 927164 1102 -173680 -768520 -505625 718658 735688 1098518
7515A098518k76647p04576k87196j89292q08549L82305P21194N6068J51746n89089
$$ 1098518 821871 117295 -169901 -359193 -1167742 -785437 -64243 -8175 143571 -445518
7505d45518M14264L35422q59916p7872L52329L72436J11763n14972q6121J134325
$$ -445518 -31254 304168 -555748 -633620 -281291 91145 202908 -312064 -398185 736140
7495G36140m16813k67327L22001o75727j42499K62222O95191o26834R439Q93348
$$ 736140 319327 52000 374001 -301726 -444225 -182003 513188 -113646 -104207 789141
7485G89141m90296N50689k14553m88800o7155p66491q7401J78403J69519p1507
$$ 789141 298845 849534 634981 146181 79026 -687465 -774866 -596463 -426944 -498451
7475d98451P13066J38708J1756k41449j62148L05419m05809J77917L42351K03761
$$ -498451 214615 353323 365079 123630 -38518 266901 -138908 39009 381360 585121
7465E85121q50826j37569Q14647j68222n53671N11943k15984L61304L86714o53294
$$ 585121 -265705 -403274 411373 243151 -310520 201423 -14561 346743 733457 80163
7455H0163n97600J39749N80889L04275m96691j209060Q77808N74846n62557J78584
$$ 80163 -517437 -377688 203201 507476 10785 -1198275 -320467 254379 -308178 -129594
7445a29594L1027J50756K13613K52826o06584R4392M04836K05658N8048m65547
$$ -129594 -98567 52189 265802 518628 -87956 6436 411272 616930 674978 209431
7435B09431R30914k66233p63720j093860Q00837k910m1217J07629m6572N29513
$$ 209431 1140345 874112 110392 -983468 -182631 -185541 -226758 -119129 -165701 363812
7425C63812k38411L80788L15761L74534j64293N25375p14385p37910N73374R88407
$$ 363812 125401 506189 821950 1196484 1032191 1557566 843181 105271 678645 1667052
7415A667052o87521J28247L62223r81046n58010j06768Q09999K60773j025955
$$ 1667052 979531 1107778 1470001 488955 -69055 -175823 634176 894949 -131006
7406a31006O2977P66109M3395J23393j44978P43850n24921q15273K49861R7598
$$ -131006 -68029 698080 741475 864868 719890 1463740 938819 123546 373407 471005
7396D71005K94357M26760k67044j83589J18706o28656m76002Q90911Q79178J63341
$$ 471005 765362 1192122 925078 741489 860195 231539 -244463 646448 1525626 1688967
7386A688967k1413J64293k42689m96307K66769K65383m87449l23369J2301K16266
$$ 1688967 1667554 1831847 1589158 1092851 1359620 1625003 1137554 814185 826486 1042752
7376A042752j40721j85342N97140k40208K26437k0718j30367O81523N51560J5090
$$ 1042752 902031 716689 1313829 1073621 1300058 1279340 1148973 1830496 2382056 2397146
7366B397146j317070m72425J74755R30713o82336m17610P78756J07957m35418
$$ 2397146 1080076 607651 782406 1713119 1030783 613173 1391929 1499886 1064468
7357A064468j20806K60797p615Q42763O24665m29919k01602Q11578o61656q3351
$$ 1064468 943662 1204459 1196844 2039607 2664272 2234353 2032751 2844329 2182673 2099322
7347B099322j31256O60700M23974j23400j034518M22887P5316L8098k18182m81354
$$ 2099322 1968066 2628766 3052740 2929340 1894822 2317709 2393025 2431123 2212941 1731587
7337A731587J90250j50064J37795m95147J351732O99833k19166o71643L82596
$$ 1731587 1921837 1771773 1909568 1414421 2766153 3465986 3246820 2575177 2957773
7328B957773p2095o06009R4835J681002k35581o80998l74305o38634q9318O59225
$$ 2957773 2885678 2279669 2374504 4055506 3819925 3138927 2764622 2125988 2036670 2695895
7318B695895J561125M63727m76881j92117q60280P51700M38928p15036j90818
$$ 2695895 4257020 4720747 4243866 4051749 3191469 3943169 4382097 3667061 3476243
7309C476243K60877J056867j64256K93548P1578l82731J03929M73985M14677K51977
$$ 3476243 3737120 4793987 4629731 4923279 4994857 4612126 4716055 5190040 5604717 5856694
7299E856694M82768q8212j036378R21290K60414m85382Q571J249551j68366K14637
$$ 5856694 6339462 6251250 5214872 6136162 6396576 5911194 5919765 7169316 7000950 7215587
7289G215587l23346k25255O885J753477K13488j449N37771R20650Q10031R559
$$ 7215587 6892241 6666986 6673871 8427348 8640836 8639387 9177158 10097808 10907839 10917398
7279A0917398k09264L20801J197053k65450K17730J11467N22914L1016J073175
$$ 10917398 10708134 11028935 12225988 11960538 12178268 12289735 12812649 12843665 13916840
7270A3916840J299722Q76774o87029m10738P51853J890720J71218M33818N09526
$$ 13916840 15216562 16093336 15406307 14995569 15747422 17638142 17809360 18243178 18752704
7261A8752704Q75439Q41555M20921J374345P18408J319303J275170L11355J068314
$$ 18752704 19628143 20469698 20890619 22264964 22983372 24302675 25577845 25889200 26957514
7252B6957514O17878J090072J260800J788051Q54609K336349K043798O88958J618431
$$ 26957514 27575392 28665464 29926264 31714315 32568924 34905273 36949071 37638029 39256460
7243C9256460J095896J526075K215937K314858J535222J988835J473902K755469
$$ 39256460 40352356 41878431 44094368 46409226 47944448 49933283 51407185 54162654
7235E4162654K189989K133619J804937M73327K120472K146484J586694J094210
$$ 54162654 56352643 58486262 60291199 60764526 62884998 65031482 66618176 67712386
7227F7712386L50562K73375M75043M62421q39405j843688k27061r13438j300285
$$ 67712386 68062948 68336323 68811366 69273787 68434382 66590694 66363633 65450195 64149910
7218F4149910j490228j131141j845462j926007j650361j755812j038000k133176
$$ 64149910 62659682 61528541 59683079 57757072 56106711 54350899 53312899 51179723
7210E1179723k155744k398479j518083j735689j962264o83315j618915j981411
$$ 51179723 49023979 46625500 45107417 43371728 41409464 40726149 39107234 37125823
7202C7125823j643901j994961j093275k104321j388649r50788j055800r63017
$$ 37125823 35481922 33486961 32393686 30289365 28900716 27949928 26894128 25931111
7194B5931111j313149j244094j249545n02519l15119r34442r77156J70280j320816
$$ 25931111 24617962 23373868 22124323 21621804 21306685 20372243 19395087 19565367 18244551
7185A8244551j288835m09695J393l52788p9537p01149r59193k66593k08912m8747
$$ 18244551 16955716 16546021 16547414 16194626 16115089 15413940 14454747 14188154 13979242 13930495
7175A3930495j148246M24643j59514p00876n75250j206421o98621m1297P56385
$$ 13930495 12782249 13206892 13047378 12346502 11771252 10564831 9866210 9824913 10581298
7166A0581298k76293k32145m21531k79971j38152l68719r21994j90238m03270
$$ 10581298 10305005 10072860 9651329 9371358 9233206 8864487 7942493 7752255 7348985
7157G348985m58866j35249k4430J55920q44992L26159K91692l35907o25731L58748
$$ 7348985 6890119 6754870 6730440 6886360 6041368 6367527 6659219 6323312 5697581 6056329
7147F056329n33810o65145m29774n18940K98966M81142l70232J2606j16004N57490
$$ 6056329 5522519 4857374 4427600 3908660 4207626 4688768 4318536 4331142 4215138 4772628
7137D772628m38258k69899O20585L65563j032744j73331k46412O81550K23562
$$ 4772628 4334370 4064471 4685056 5050619 4017875 3844544 3598132 4279682 4503244
7128D503244p42498j350569M25292Q37485M79252r06139o7045N44009m70363N96960
$$ 4503244 3760746 2410177 2835469 3672954 4152206 3246067 3179022 3723031 3252668 3849628
7118C849628j223602r51265O82244L71420p2131R03693j85088j547478k8423K56680
$$ 3849628 2626026 1674761 2357005 2728425 2656294 3559987 3374899 1827421 1798998 2055678
7108B055678P20818k34958j55865P78850o9682j359308j150649R65875O57915
$$ 2055678 2776496 2541538 2385673 3164523 3094841 1735533 584884 1550759 2208674
7099B208674M9708p39565R50700p31475P26984K09123o88252q69898M01194j34147
$$ 2208674 2258382 1518817 2469517 1738042 2465026 2674149 1985897 1115999 1517193 1383046
7089A383046k41322J61225L56087j31924R0424N70335J30923p96182o0630M36867
$$ 1383046 1141724 1302949 1659036 1527112 1617536 2187871 2318794 1522612 1461982 1898849
7079A898849p90720r87147P79540J66727J42248j83345l25352j8755K92202M44611
$$ 1898849 1108129 120982 900522 1067249 1209497 1026152 700800 682045 974247 1418858
7069A418858K02122n6286J80670j648322K67699O43909K16872l92913M23355m00838
$$ 1418858 1620980 1564694 1745364 97042 364741 1008650 1225522 832609 1255964 855126
7059H55126m97249P00918q6856R36810n71537N5621L42639o18055k27543l08669
$$ 855126 357877 1058795 971939 1908749 1337212 1392833 1735472 1117417 889874 581205
7049E81205r21061J086005M39659o1994n27235J57232l38830o5149l94143K96562
$$ 581205 -339856 746149 1185808 1123814 596579 753811 414981 349832 -44311 252251
7039B52251L07821q67367l98564N39843L75665J164743n77035l98944n58263L94666
$$ 252251 560072 -307295 -705859 -166016 209649 1374392 797357 398413 -159850 234816
7029B34816P31305n31365N08767Q97072p44342k44895M90907M46753J1345j581133
$$ 234816 966121 434756 943523 1840595 1096253 851358 1342265 1789018 1800363 219230
7019B19230J000370P28254j523756O61787L03994l02032m59668M05979m25467
$$ 219230 1219600 1947854 424098 1085885 1389879 1087847 628179 1034158 608691
7010F08691k49008p6741k24728N77662K8814M12712p41412J16289J77720k17406
$$ 608691 359683 282942 58214 635876 664690 1077402 335990 452279 629999 412593
7000D12593m08291q5909L25906l49021m69917L11801M24347K43915N02482R13537
$$ 412593 4302 -81607 244299 -104722 -574639 -262838 161509 405424 907906 1821443
6990A821443m18603j458117J50488J91182j82423n30365J04001J20888r02916
$$ 1821443 1402840 -55277 95211 286393 103970 -426395 -322394 -201506 -1104422
6981a104422J7795R59850L97324N62464o84303l73683J49720J283517m89068o32191
$$ -1104422 -1086627 -126777 270547 833011 148708 -224975 -75255 1208262 719194 87003
6971H7003M82972j95604m81536o2892k13536M13285L48461r95248Q19264l43282
$$ 87003 569975 374371 -107165 -170057 -383593 29692 378153 -617095 202169 -141113
6961a41113N69596M19723l18656j059116N91409J062030r90188j44197J65248
$$ -141113 428483 848206 529550 -529566 61843 1123873 133685 -10512 154736
6952A54736N82444O5979l83123M40645p76422k28369j49245m1373N57678l13103
$$ 154736 737180 803159 420036 860681 84259 -144110 -293355 -334728 222950 -90153
6942i0153m33753N0366J148760K20030J68145M17182l33825n89052j330978O96626
$$ -90153 -523906 -473540 675220 895250 1063395 1480577 1146752 557700 -773278 -76652
6932g6652L77441K6207N13752J66914p41068j6439j3826P518L61149m29287M18762
$$ -76652 300789 326996 840748 1007662 266594 250155 236329 243847 604996 175709 594471
6921E94471N07402q44015Q85475J14285K93331j082494j254107j92938J262829
$$ 594471 1101873 257858 1143333 1257618 1550949 468455 -785652 -978590 284239
6912B84239L86705j24314q16259M43757N38126o85168P13128k9988j021020m5435
$$ 284239 670944 546630 -269629 174128 712254 27086 740214 710226 -310794 -356229
6902c56229J297044L79579O51083n58537J62702j048806r12589M2442M99012l15102
$$ -356229 940815 1320394 1971477 1412940 1575642 526836 -385753 -343311 155701 -159401
6892a59401L11594M37128n9670n81901K12905K06771k27625K37508K04859q64286
$$ -159401 152193 589321 529651 -52250 160655 367426 139801 377309 582168 -282118
6882b82118m4791J5909J13899P80474O30138r03676l60202O87273L09944p01076
$$ -282118 -326909 -311000 -197101 583373 1213511 309835 -50367 636906 946850 245774
6872B45774M10614L59496n28100m80360K53532n77077J70327L05488k19313P8252
$$ 245774 656388 1015884 487784 7424 260956 -316121 -145794 159694 -59619 18633
6862A8633K78545j99461L47118J58452o87007O34593m74279J384586M31333o89450
$$ 18633 297178 97717 444835 603287 -83720 550873 76594 1461180 1892513 1203063
6852A203063j108099J2440J302713o91040j034340K93483o4872O19261r14900
$$ 1203063 94964 107404 1410117 719077 -315263 -21780 -86652 532609 -382291
6843c82291R24716l05076j56489p14858o73683Q97043L36833Q507M77902n05391
$$ -382291 542425 237349 80860 -633998 -1307681 -410638 -73805 -65298 412604 -92787
6833i2787M84883K82998K30480l91205r73310N53855L75059n1690n46672J75058
$$ -92787 392096 675094 905574 514369 -458941 94914 469973 418283 -128389 46669
6823D6669j027391M16218j24805P27577J12405p5554m85696P34861l92775J23085
$$ 46669 -980722 -564504 -689309 38268 150673 75119 -410577 324284 -68491 54594
6813E4594j01870N95185l7130R52861k9506j032625o91974O25107L43988m29314
$$ 54594 -47276 547909 510779 1463640 1434134 401509 -290465 334642 678630 249316
6803B49316K05366J9718M54631j079373l4533o76378J116875J527291q25438r85177
$$ 249316 454682 474400 929031 -150342 -184875 -861253 255622 1782913 957475 -27702
6793b7702N06157k08295K83994R44243j86324m37128l46205m91385K11520M16766
$$ -27702 478455 270160 554154 1498397 1312073 874945 528740 37355 248875 665641
6783F65641O33786L75631k5304p74842O36182j9461j018331O47833N55537m41977
$$ 665641 1299427 1675058 1649754 874912 1511094 1491633 473302 1121135 1676672 1234695
6773A234695j156380J09374Q78085j495658M87034M68013k72865K72525P83609
$$ 1234695 78315 187689 1065774 -429884 57150 525163 252298 524823 1308432
6764A308432L18269p79220j42787O35263L74079r5839j34084Q0593j109577L3104
$$ 1308432 1626701 847481 704694 1339957 1714036 1618197 1484113 1564706 455129 488233
6754D88233P32095M15487k12585r2984Q0126k90266N31683j79608O03j16025L65612
$$ 488233 1220328 1635815 1423230 1330246 1410372 1120106 1651789 1472181 1472784 1356759 1722371
6743A722371m60428k61759O97456l12374j74302Q8410O70315K13824l58093j290500
$$ 1722371 1261943 1000184 1697640 1385266 1210964 1299374 1969689 2183513 1825420 534920
6733E34920M01758J074927j56381L46017l02258J6888p4162J5051n26840m87597
$$ 534920 936678 2011605 1855224 2201241 1898983 1915871 1841709 1856760 1329920 842323
6723H42323N50008k51938K83697J471224j60402J52033O6578r41871K44179Q84236
$$ 842323 1392331 1140393 1424090 2895314 2734912 2886945 2953523 2011652 2255831 3140067
6713C140067q20846l53187J90939M93088l27150R6612k67405k11748J157184N57679
$$ 3140067 2319221 1966034 2156973 2650061 2322911 2419523 2152118 1940370 3097554 3655233
6703C655233p8793J52851m03086l07759J65509O22771j66764K59778N74495K68588
$$ 3655233 3576440 3729291 3326205 3018446 3183955 3806726 3639962 3899740 4474235 4742823
6693D742823l12852m36320k02299P4493Q12932k75824J49475J150601m09237L23493
$$ 4742823 4429971 3993651 3791352 3865845 4678777 4402953 4552428 5703029 5293792 5617285
6683E617285L57784r0786j025616r9561Q52988P3089m2228q2790O92058K2149
$$ 5617285 5975069 5884283 4858667 4759106 5612094 5685183 5642955 5560165 6252223 6274372
6673F274372P27356m10343J51939O59254J089039o96601P26058O32586q80634
$$ 6274372 7001728 6591385 6743324 7402578 8491617 7795016 8521074 9153660 8273026
6664H273026R54099p61857O80843n19291P54926P27090L2446N15641P42913K21002
$$ 8273026 9227125 8465268 9146111 8626820 9381746 10108836 10141282 10656923 11399836 11620838
6654A1620838K32210K60810N16557J121830M60782N06472O61648O29564K98544
$$ 11620838 11853048 12113858 12630415 13752245 14213027 14719499 15381147 16010711 16309255
6645A6309255P78452p52814J395950P48876J159296J136763L25218J284479J032790
$$ 16309255 17087707 16334893 17730843 18479719 19639015 20775778 21100996 22385475 23418265
6636B3418265q15320J454206O54704K587526J234879K27238O47042J530227J055295
$$ 23418265 22602945 24057151 24711855 27299381 28534260 28761498 29408540 30938767 31994062
6627C1994062J404360J903426K041771J613436J86336J479779K086592K000234
$$ 31994062 33398422 35301848 37343619 38957055 39143391 40623170 42709762 44709996
6619D4709996J322169K163015P50836P86891P52012N59271P41383N48488j076351
$$ 44709996 46032165 48195180 48946016 49732907 50484919 51044190 51785573 52334061 51257710
6610E1257710M36914o40987l35303n47980k084292j288323l79867k312162j358872
$$ 51257710 51694624 51053637 50718334 50170354 48086062 46797739 46417872 44105710 42746838
6601D2746838n19541k429248k119173j149145j167950o22320j871143k149235
$$ 42746838 42227297 39798049 37678876 36529731 35361781 34739461 32868318 30719083
6593C0719083j354360j699360q91890q81877j707701m18912j468241j419594P85473
$$ 30719083 29364723 27665363 26773473 25891596 24183895 23764983 22296742 20877148 21662621
6584B1662621J7909m53464j980380j80259j146216j163349j84341j43206K65268
$$ 21662621 21680530 21227066 19246686 19066427 17920211 16756862 16572521 16429315 16694583
6575A6694583j712559r38796L69219j01939k61417l09757J20765M44098q52520
$$ 16694583 14982024 14043228 14412447 14310508 14049091 13739334 13860099 14304197 13451677
6566A3451677k98537n97468J89924q88336k94301N17480n83463q2997N8719l61818
$$ 13451677 13153140 12555672 12745596 11857260 11562959 12080439 11496976 11413979 11472698 11110880
6556A1110880k67961k86314R0865N44104m57397n77681J077546j025848m24076
$$ 11110880 10842919 10556605 10647470 11191574 10734177 10156496 11234042 10208194 9784118
6547I784118O18348j55229P21038J41895p99831m16645j28352Q03985N97173r06299
$$ 9784118 10402466 10247237 10968275 11110170 10310339 9893694 9765342 10569327 11166500 10260201
6537A0260201n65495R25715J261569j185947J027088R24923p87712l05473N73979
$$ 10260201 9694706 10620421 11881990 10696043 11723131 12648054 11860342 11554869 12128848
6528A2128848R1791L14050K86369K21034R35839j29673R96543L04054N36311J96329
$$ 12128848 12220639 12534689 12821058 13042092 13977931 13848258 14844801 15148855 15685166 15881495
6518A5881495n15806J636311R60033O76623q53733J456289R53728j86825l51184
$$ 15881495 15365689 17002000 17962033 18638656 17784923 19241212 20194940 20008115 19656931
6509A9656931K83204M34901J001899O35763M1090J94980M63743j50109l57394
$$ 19656931 19940135 20375036 21376935 22012698 22053788 22248768 22712511 22562402 22205008
6500B2205008o81815r03296l67690K86231p39523n24498r9465j733836j84754
$$ 22205008 21523193 20619897 20252207 20538438 19798915 19274417 19174952 17441116 17256362
6491A7256362M8893j031179j490886j30785n95852o43923p64309P29163j082384
$$ 17256362 17305255 16274076 14783190 14652405 14056553 13412630 12648321 13377484 12295100
6482A2295100p26260j063962j504223l6987L71846J50745r47706j073358N09198
$$ 12295100 11568840 10504878 9000655 8963668 9335514 9486259 8538553 7465195 7974393
6473G974393K93987m90997o50716o40738j26869J29180L94040m51153j116339
$$ 7974393 8268380 7777383 7126667 6485929 6359060 6488240 6882280 6431127 5314788
6464E314788k21792m44819K7466P7966m02432M54786l93612M29268R8457N9537
$$ 5314788 5092996 4648177 4675643 4753609 4351177 4805963 4412351 4841619 4940076 4999613
6454D999613R6364k36946n5385o69559k02796j27396L05093K25814L85241p88490
$$ 4999613 5095977 4859031 4803646 4134087 3931291 3803895 4108988 4334802 4720043 3931553
6444C931553l43370J73984j083220M233L28261m57341K13296R1852r1708l67860
$$ 3931553 3588183 3762167 2678947 2683180 3011441 2554100 2767396 2859248 2767540 2399680
6434B399680J06458p2705M2390q1326n0938J48963l75411J97723k18288N27866
$$ 2399680 2506138 2433433 2475823 2394497 2343559 2492522 2117111 2314834 2096546 2624412
6424B624412o09535l00487Q3329J62291O26867r30202Q69737K83749j337241j553
$$ 2624412 2014877 1714390 1797719 1960010 2586877 1656675 2526412 2810161 1472920 1471367
6414A471367M27510q00924K23627J52214o04956L36912J42966m82193j82784M53771
$$ 1471367 1898877 1097953 1321580 1473794 868838 1205750 1348716 866523 683739 1137510
6404A137510l01385R7202k41834j28995k80990L26311K34752P40169j255041l51121
$$ 1137510 836125 933327 691493 562498 281508 607819 842571 1582740 327699 -23422
6394b3422M68923k42509k5430k08812N99302M0824P4678o5324J00833J014429
$$ -23422 445501 202992 177562 -31250 568052 608876 683554 618230 719063 1733492
6384A733492K8831l58190l21398k5372K60871n16378n0064K17986l47633J98831
$$ 1733492 1762323 1404133 1082735 1057363 1318234 801856 751792 969778 622145 820976
6374H20976n17331J26543O12260j66332m45500k00927J39188j2605j08863J06247
$$ 820976 303645 430188 1042448 876116 430616 229689 368877 356272 247409 353656
6364C53656O33712m94131J21894n67111N22325q62444k5806O08898k78210J51944
$$ 353656 987368 493237 615131 48020 570345 -292099 -317905 290993 12783 164727
6354A64727K79946M14701j95021o29871m69030J483445j29788R7342j49231k51348
$$ 164727 444673 859374 664353 34482 -434548 1048897 919109 1016451 867220 615872
6344F15872j76057N52601j06502m70202k68115J04742l31697P75444l43368l88730
$$ 615872 439815 992416 885914 415712 147597 252339 -79358 696086 352718 -36012
6334c6012r59206L39881J139837j22715K61466P67528l63899l37955M64316n92158
$$ -36012 -995218 -655337 484500 361785 623251 1390779 1026880 688925 1153241 561083
6324E61083o24156l51334N78314k7017M15320q64562J25196m34746L78965O12909
$$ 561083 -63073 -414407 163907 136890 552210 -312352 -187156 -621902 -242937 369972
6314C69972j68728J30199M15737j94097o15816k05415j99887j68114M35373J2357
$$ 369972 201244 331443 747180 553083 -62733 -268148 -468035 -636149 -200776 -188419
6304a88419P47099L17618k44827J24176m86613j545611K73214o61856J31516J029143
$$ -188419 558680 876298 631471 755647 269034 -1276577 -1003363 -1665219 -1533703 -504560
6294e04560J73608k16125M00551L85739o23611K22947K06823M1874l10534n8383
$$ -504560 -330952 -547077 -146526 239213 -384398 -161451 45372 87246 -223288 -281671
6284b81671p7084Q8173p0879r55735K09133K22462J75949q6580l42790J22200
$$ -281671 -358755 -270582 -341461 -1297196 -1088063 -865601 -689652 -776232 -1119022 -996822
6274i96822R60550K3n32965o20720N24578O01666k94894k39046m46913P01430
$$ -996822 -36272 -36249 -569214 -1189934 -665356 -63690 -358584 -597630 -1044543 -343113
6264c43113K08043K90438M7136L0793k16712n59627l43457M88922q0024k21840
$$ -343113 -135070 155368 202504 233297 16585 -543042 -886499 -397577 -477601 -699441
6254f99441j69059L7070M89294J7473k6612J9994L3877l78961J39264N45553j87902
$$ -699441 -868500 -831430 -342136 -324663 -351275 -331281 -297404 -676365 -537101 8452 -179450
6243a79450N1581J92089q3270O1128J46530n7319L13789N1008L80426l8049j542631
$$ -179450 -127869 64220 -19050 42078 188608 131289 445078 496086 876512 838463 -704168
6232g04168p46950L08291Q66538k66661l5311m27754m75185J597353J086403M61679
$$ -704168 -1451118 -1142827 -276289 -542950 -578261 -1006015 -1481200 116153 1202556 1664235
6222A664235r15862l67417o6501j910n08530K868k72101J14973J380940r91068
$$ 1664235 748373 380956 314455 312545 -195985 -193117 -465218 -350245 1030695 39627
6212C9627n8981j83385p9689P17938j92030l82126J60572M71189n78024O81615
$$ 39627 -19354 -202739 -282428 435510 243480 -138646 21926 493115 -84909 596706
6202E96706k64664l09057m09644M09628j81943n8593Q13741l13888k96059J07374
$$ 596706 332042 22985 -386659 22969 -158974 -217567 596174 282286 -13773 93601
6192I3601l83920n12836l86298L09655R32678N58734l38119K0337q5751J18037
$$ 93601 -290319 -803155 -1189453 -879798 52880 611614 273495 293832 208081 326118
6182C26118N41809k59791Q511l2964p48810k99491l50817Q83376m98908j12576
$$ 326118 867927 608136 616647 583683 -165127 -464618 -815435 67941 -430967 -543543
6172e43543j30051O4968r8369j25875R01079L18213k0581r73802l19575o87505
$$ -543543 -673594 -608626 -706995 -832870 68209 386422 365841 -607961 -927536 -1615041
6162a615041J002063L92278J67693m08167j68489K18976j73246P5324Q46542j06132
$$ -1615041 -612978 -220700 -53007 -461174 -629663 -410687 -583933 -508609 337933 231801
6152B31801j245907K24125l2600J67655K0497j95688M85990Q13861j71145j59699
$$ 231801 -1014106 -789981 -822581 -654926 -634429 -830117 -344127 469734 298589 138890
6142A38890r36474n00142j32764o25591Q87813M84889l81868J598341K27989j051937
$$ 138890 -797584 -1297726 -1430490 -2056081 -1168268 -683379 -1065247 533094 761083 -290854
6132b90854K99812r29419n21909N55530l01361J8789P08571M62686m14079q73885
$$ -290854 8958 -920461 -1442370 -886840 -1188201 -1169412 -460841 1845 -412234 -1286119
6122a286119K56160J62704P62739m98053N2348Q72973n67588j075887J38716N04963
$$ -1286119 -1029959 -867255 -104516 -602569 -550221 322752 -244836 -1320723 -1182007 -677044
6112f77044n7352R0360N58268l35993J4166q00925K14040R70036J45356q79802
$$ -677044 -734396 -644036 -85768 -421761 -407595 -1208520 -994480 -24444 120912 -758890
6102g58890M26629k442n04767l65201J05192R50518j78455K16629Q1006p82694
$$ -758890 -332261 -334703 -839470 -1204671 -1099479 -148961 -327416 -110787 -29781 -812475
6092h12475K34291O59777q34537M60412j34459o42622O27285k37971k34078O94023
$$ -812475 -578184 81593 -752944 -292532 -426991 -1069613 -442328 -680299 -914377 -220354
6082b20354r6070k3348N76404n53912J70412J45901m08551m19588R2596k03900
$$ -220354 -316424 -339772 236632 -317280 -146868 -967 -409518 -829106 -736510 -940410
6072i40410L95439j19003j62210k28673M36433j07330O93707J41783m94544N83979
$$ -940410 -544971 -663974 -826184 -1054857 -618424 -725754 -32047 109736 -384808 199171
6062A99171q53070L69221q9162o65039J248672p19159P9495j70211J03156J077453
$$ 199171 -653899 -284678 -373840 -1038879 209793 -509366 -429871 -600082 -496926 580527
6052E80527j867877o46485R65352J524836o15317j136218K56586j07747M42775
$$ 580527 -1287350 -1933835 -968483 556353 -58964 -1195182 -938596 -1046343 -603568
6043f03568J97722o24607M93350o19965L30616o71627K14176K000055l29214K61204
$$ -603568 -405846 -1030453 -537103 -1157068 -826452 -1498079 -1283903 716152 386938 648142
6033F48142l99107j56757J53668j836082O55965K87480k29944O53284J47840k79258
$$ 648142 249035 92278 245946 -1590136 -934171 -646691 -876635 -223351 -75511 -354769
6023c54769J33674L34124K65209j085791n08299j5177J221857P18596n52761p55043
$$ -354769 -221095 113029 378238 -707553 -1215852 -1231029 -9172 709424 156663 -598380
6013e98380m94301Q2595J59878K29538K49326J30743o12581j17814Q22750j104725
$$ -598380 -1092681 -1010086 -850208 -620670 -371344 -240601 -853182 -970996 -148246 -1252971
6003a252971n61758J108760K88746K2761L17176L65446m82927j43973m89580N83574
$$ -1252971 -1814729 -705969 -417223 -394462 -77286 288160 -194767 -338740 -828320 -244746
5993b44746K09350q20729L72958N47516n57159k70543L22704L11513K96449o8191
$$ -244746 -35396 -856125 -483167 64349 -492810 -763353 -440649 -129136 167313 99122
5983I9122l10391l43881L49431n10123M97145n55169M45216M37475n47756p18602
$$ 99122 -211269 -555150 -205719 -715842 -218697 -773866 -328650 108825 -438931 -1157533
5973a157533N37597Q64415n06172p33986L70481n060N7544R21397l58321k97764
$$ -1157533 -619936 244479 -261693 -995679 -625198 -630258 -572714 348683 -9638 -307402
5963c07402k64685N36992j094638O16445J40555J62705l73638j12300N95446r30145
$$ -307402 -572087 -35095 -1129733 -513288 -372733 -210028 -583666 -695966 -100520 -1030665
5953a030665K1896p2946J08259j16695k82895N40814J61618p40334R13355K17517
$$ -1030665 -1008769 -1081715 -973456 -1090151 -1373046 -832232 -670614 -1410948 -497593 -280076
5943b80076k00008k04519j57660m74125L67807O88671L24048q40056K05526k71932
$$ -280076 -480084 -684603 -842263 -1316388 -948581 -259910 64138 -775918 -570392 -842324
5933h42324J98865M39608l99694l79024J70248M13122n42874P52566K6623j42819
$$ -842324 -643459 -203851 -603545 -982569 -812321 -399199 -942073 -189507 -162884 -305703
5923c05703n73864p81087K46570J301527o43185m44307P19934N98341j97433m85212
$$ -305703 -879567 -1660654 -1414084 -112557 -755742 -1200049 -480115 118226 -79207 -564419
5913e64419k4622o35073L16423n51998j40412J158777p13346N67820k02156k68655
$$ -564419 -589041 -1224114 -907691 -1459689 -1600101 -441324 -1154670 -586850 -789006 -1057661
5903a057661k70919K07931K49316J69577m18605O36347K97111K82242j114654
$$ -1057661 -1328580 -1120649 -871333 -701756 -1120361 -484014 -186903 95339 -1019315
5894a019315P69736P28245J47567o19378K61665q82522r6250K54517l76133M553
$$ -1019315 -249579 478666 626233 6855 268520 -614002 -710252 -455735 -831868 -827315
5884h27315P70114m13103j64383M45397j07040j99236J63570J16081m41699R20121
$$ -827315 -57201 -470304 -634687 -189290 -296330 -495566 -331996 -215915 -657614 262507
5874B62507m56153L4834o10538L00528K73871J8471N49849j49601j607120Q41694
$$ 262507 -193646 -158812 -769350 -468822 -194951 -176480 373369 223768 -1383352 -541658
5864e41658J76092L82066j25518J91617n00855n37535P74813m24234P583N80640
$$ -541658 -365566 16500 -109018 82599 -418256 -955791 -180978 -605212 -597629 -16989
5854a6989K12753n26901r15140k71803J204683q7113L62032J42192o48462r6178
$$ -16989 195764 -331137 -1246277 -1518080 -313397 -400510 -38478 103714 -544748 -640926
5844f40926m73484L50852p6618p816j08073M35728k51367O14173k96383n95548
$$ -640926 -1114410 -763558 -840176 -847992 -956065 -520337 -771704 -157531 -453914 -1049462
5834a049462N89509j73354q1806q5968J24697P15130n1514p22836l4397M20621
$$ -1049462 -459953 -633307 -715113 -801081 -676384 38746 -12768 -735604 -770001 -349380
5824c49380m13250j90478m7510K16555p16393N55727P62956j53215n133M10668
$$ -349380 -762630 -953108 -1000618 -784063 -1500456 -944729 -181773 -334988 -340121 70547
5814G0547K47250n42924M03189P45978j437791L56106P44710j69599k58633j616455
$$ 70547 317797 -225127 178062 924040 -513751 -157645 587065 417466 158833 -1457622
5804a457622m73035J537546M72532k57080o63077J034822k47744o34424K33921
$$ -1457622 -1930657 -393111 79421 -177659 -840736 194086 -53658 -688082 -454161
5795d54161J71664L30980J74654L4450q54272J12228P02275n1229J35259j61017
$$ -454161 -282497 48483 223137 257587 -596685 -484457 217818 166589 301848 140831
5785A40831O6423O29148j11226J67012j687197n28575K78164J458074m44717o42328
$$ 140831 207254 836402 725176 892188 -795009 -1323584 -1045420 412654 -32063 -674391
5775f74391J87771R4627j0397Q89762q43890q97375p03274J496085j31124l29254
$$ -674391 -486620 -391993 -402390 487372 -356518 -1253893 -1957167 -461082 -592206 -921460
5765i21460N71928M0248J59867J54901k32205K855O00215l14511o16395J8751
$$ -921460 -349532 -309284 -149417 5484 -226721 -223866 376349 61838 -554557 -535806
5755e35806k16219J09803k17473J41841Q38436L60918o71173k89059L40480K0187
$$ -535806 -752025 -642222 -859695 -717854 120582 481500 -189673 -478732 -138252 -118065
5745a18065O62089r30471o18280m88305K41305M49638Q79013m85161L07207r1992
$$ -118065 544024 -386447 -1004727 -1493032 -1251727 -802089 76924 -408237 -101030 -193022
5735a93022n26386r1888L16764J61264j54128K1843K58804r12872J36289L20507
$$ -193022 -719408 -811296 -494532 -333268 -487396 -465553 -206749 -1119621 -983332 -662825
5725f62825P93307L18224m44187R9762P95175J71996m26550m26622M46130j770430
$$ -662825 130482 448706 4519 104281 899456 1071452 644902 218280 664410 -1106020
5715a106020j21229J210587j72509j69348L4707L2352O25366k57679m40639N06555
$$ -1106020 -1227249 -16662 -189171 -358519 -323812 -291460 333906 76227 -364412 142143
5705A42143m44619r96821k17848O90241J360933l05827m54451J78747L66202l43172
$$ 142143 -302476 -1299297 -1517145 -826904 534029 228202 -226249 -47502 318700 -24472
5695b4472j305508J410332m8910r22729J13261Q91936l51913j06985M02294j77746
$$ -24472 -1329980 80352 31442 -891287 -778026 113910 -238003 -344988 57306 -120440
5685a20440M32059N37867n25958m48308p204k805o7587J89071l94936L89510k55717
$$ -120440 311619 849486 323528 -124780 -131984 -134789 -202376 -13305 -408241 -18731 -274448
5674b74448K08628K47685l78050j06648J083089l17210n70323l66833m26006L94326
$$ -274448 -65820 181865 -196185 -302833 780256 463046 -107277 -474110 -900116 -505790
5664e05790K44893q35776O49434K85225R3723j92110J7713P20447Q93624r35648
$$ -505790 -260897 -1096673 -447239 -162014 -68291 -260401 -242688 477759 1371383 435735
5654D35735p74646L94595m98112k43667J43310P76397P03184n52225K76829J83129
$$ 435735 -338911 55684 -442428 -686095 -542785 233612 936796 384571 661400 844529
5644H44529N5307j62947m66882M99411q53830m61881J135466n66242n0365m41655
$$ 844529 899836 736889 270007 769418 -84412 -546293 589173 22931 -27434 -469089
5634d69089K34800j47193J40973L32221J76508N480K64841K67425M1889o85724
$$ -469089 -234289 -381482 -240509 91712 268220 273700 538541 805966 847855 162131
5624A62131l40080L75192L33093k53105K48885R8991K7376q5914j05589M38655
$$ 162131 -177949 197243 530336 277231 526116 625107 652483 566569 460980 899635
5614H99635r36323l2866L70603Q67813l764l86478L8926M89041p05658N11899
$$ 899635 -36688 -69554 301049 1168862 1165098 778620 817546 1306587 600929 1112828
5604A112828j063609r293j00336j02252K63170Q67776l76688L70992J38273p4883
$$ 1112828 49219 39926 -60410 -162662 100508 968284 591596 962588 1100861 1025978
5594A025978p25364L34982O85364q14873j47139O03844n13119P71971q51160j40683
$$ 1025978 300614 635596 1320960 506087 358948 962792 449673 1221644 370484 229801
5584B29801J05730L97475p12517l027k25219n07433R42601J20688n91813K9010
$$ 229801 335531 733006 20489 17462 -207757 -715190 227411 348099 -243714 -214704
5574b14704M62784k11806L90371n14255K74921J89897K22428m62963J68721m00377
$$ -214704 248080 36274 426645 -87610 187311 377208 599636 136673 305394 -94983
5564i4983L42796q15620M2712Q52134n8331k13246L96766M10928n87025J56444
$$ -94983 247813 -567807 -525095 327039 268708 55462 452228 863156 276131 432575
5554D32575m88569m13022l77626j06246J61217l98220Q21483q3176l86596M68430
$$ 432575 -55994 -469016 -846642 -952888 -791671 -1189891 -368408 -451584 -838180 -369750
5544c69750n7601m59368l7766R03606q03957O36915L02108p57353J184246O10051
$$ -369750 -427351 -886719 -924485 -20879 -824836 -187921 114187 -643166 541080 1151131
5534A151131p19841o97327K80746J13183j69339N43598j81348l20768Q75222K36033
$$ 1151131 431290 -266037 14709 127892 -41447 502151 320803 35 875257 1111290
5524A111290j1597m68669l98247l29447J21937q27910j8001J81088J9899k31449
$$ 1111290 1099693 631024 232777 -96670 25267 -802643 -820644 -639556 -619657 -851106
5514h51106p17451N79472J47333Q67604O40557q3574r0354j84113m86943m28454
$$ -851106 -1568557 -989085 -841752 25852 666409 582835 492481 308368 -178575 -607029
5504f07029P93858m3768n04562K17065N71461j245109P08954k28555p04143J339467
$$ -607029 186829 143061 -361501 -144436 427025 -818084 -109130 -337685 -1041828 297639
5494B97639L3321o79550J21136J23009k27488Q93935J21617k85362l46906j160310
$$ 297639 330960 -348590 -227454 -104445 -331933 562002 683619 398257 51351 -1108959
5484a108959R13674j33597q6985L63244k23715j90768m1623M62386N13788K76690
$$ -1108959 -195285 -328882 -415867 -52623 -276338 -467106 -508729 -46343 467445 744135
5474G44135L69789j231149k73847K11481O61736K97014m56399K64476j41480j241852
$$ 744135 1113924 -117225 -391072 -179591 482145 779159 322760 587236 445756 -796096
5464g96096L60187L81708K76987l93802j67865Q84499n17199j430j38684q42238
$$ -796096 -435909 -54201 222786 -171016 -338881 545618 28419 26989 -111695 -953933
5454i53933k46156Q92282j22818o6456k71677q96035J445840J52743m94006K43498
$$ -953933 -1200089 -307807 -430625 -497081 -768758 -1664793 -218953 -66210 -560216 -316718
5444c16718k16114j15378k85331P35515n00105R66926m45155J2101l22746M28432
$$ -316718 -532832 -648210 -933541 -198026 -698131 268795 -176360 -164259 -487005 -58573
5434e8573l99027M35823n03392p7062J05392Q54583J28610L3019J5012k73947
$$ -58573 -457600 -21777 -525169 -602231 -496839 357744 486354 519373 534385 260438
5424B60438L0827r53439j96937P32189J83098O3116k68061L58528k768j129141
$$ 260438 291265 -662174 -859111 -126922 56176 119292 -148769 209759 206991 -922150
5414i22150J194327M48600J33746o55344o17160p9607J31187Q3639R1770n69869
$$ -922150 272177 720777 854523 199179 -417981 -497588 -366401 -282762 -190992 -760861
5404g60861Q6022Q05835L23427K58574l14454m84451K14742J72887J25860L3323
$$ -760861 -674839 130996 454423 712997 398543 -85908 128834 301721 427581 460904
5394D60904j24901m38623M27061n67545P3023k00420K64522L9681n38475o78485
$$ 460904 336003 -102620 324441 -243104 -170081 -370501 -105979 -66298 -604773 -1283258
5384a283258R44240Q51533n58014q59533N26889J3036J46861J298385m41782j368504
$$ -1283258 -339018 512515 -45499 -905032 -378143 -365107 -218246 1080139 638357 -730147
5374g30147R87631k96345o37822K98665p84477K76113J049991j80037k2322N48480
$$ -730147 257484 -38861 -676683 -378018 -1162495 -886382 163609 -16428 -38750 509730
5364E09730o0433Q1280r46414l53910m92264O67016K58162J18954J518408q97616
$$ 509730 449297 530577 -415837 -769747 -1262011 -594995 -336833 -217879 1300529 402913
5354D02913q62860K50804K22011k62409n77425J329005m27348K41686o77642N32512
$$ 402913 -459947 -209143 12868 -249541 -826966 502039 74691 316377 -361265 171247
5344A71247l33128p13305n1618m30036J001527J26143J3002Q5904k68154K62493
$$ 171247 -161881 -875186 -926804 -1356840 -355313 -229170 -216168 -130264 -398418 -135925
5334a35925M65228J51124J76928j38860m69451p03539L72631O25585J15356p63387
$$ -135925 329303 480427 657355 518495 49044 -654495 -281864 343721 459077 -304310
5324c04310k24410L76266K37057N16906l31862O91044l95990j024382P0018J87290
$$ -304310 -528720 -152454 84603 601509 269647 960691 564701 -459681 -389663 -202373
5314b02373O3392R00648l58997n84275K68758J30098l36706o5385r2694l60419
$$ -202373 -138981 761667 402670 -181605 87153 217251 -119455 -184840 -277534 -637953
5304f37953N45548J07299l06987j226361P97409R24738O56022k64700j28861L19140
$$ -637953 -92405 14894 -292093 -1518454 -721045 203693 859715 595015 466154 785294
5294G85294p90552K13649L50803n1167n7986o72042n53169Q29135O40149n05733
$$ 785294 -5258 208391 559194 508027 450041 -222001 -775170 53965 694114 188381
5284A88381q3617O47810q4329K96827r33990l05261J14063Q55016k91092k23910
$$ 188381 104764 752574 668245 965072 31082 -274179 -160116 694900 403808 179898
5274A79898K06915L49018O1042n43935k57023L09084p75726l93392J379349o31178
$$ 179898 386813 735831 796873 252938 -4085 304999 -470727 -864119 515230 -115948
5264a15948n6862J76004m70661J64069Q44209j072098o52553O68611M06905j11437
$$ -115948 -172810 3194 -467467 -303398 540811 -531287 -1183840 -515229 -108324 -219761
5254b19761O62335j94655l49350k58781P13185r19348J362582L57727j624853
$$ -219761 442574 247919 -101431 -360212 352973 -566375 796207 1153934 -470919
5245d70919M59703P04071m71825k30331J35749K98399n36058n2913L87540k55168
$$ -470919 -11216 692855 221030 -9301 126448 424847 -111211 -164124 223416 -31752
5235c1752P05807l36433j49028m58816m91458J232984m41893K28685k03017o8936
$$ -31752 674055 337622 188594 -270222 -761680 471304 29411 258096 55079 -13857
5225a3857J271092j379235L3660J689896p3850j095780j18603m23317Q99086p24799
$$ -13857 1257235 -122000 -88340 1601556 1527706 431926 313323 -109994 789092 64293
5215F4293J88965K9424k76254O26116P70973r21690q73084J227987o96643l15795
$$ 64293 253258 282682 6428 632544 1403517 481827 -391257 836730 140087 -175708
5205a75708K01563k06498K62774k92501J610236j75916j517825J83171p2786Q38296
$$ -175708 25855 -180643 82131 -210370 1399866 1223950 -293875 -110704 -183490 654806
5195F54806K37475q75633J62823M36933L63322P3754n99600J02456j32276l55097
$$ 654806 892281 16648 179471 616404 979726 1053480 453880 556336 424060 68963
5185F8963l88894Q93651M72960M24607M2971q07232K0720O01403J94797n3361
$$ 68963 -319931 573720 1046680 1471287 1514258 707026 727746 1329149 1523946 1470585
5175A470585o92971O9927k93007o36572N16683k44670Q6634M13624L73762L53103
$$ 1470585 777614 847541 554534 -82038 434645 189975 276609 690233 1063995 1417098
5165A417098k69781J4025j21313K13192m15088o46035j5288J18696J09656l55754
$$ 1417098 1147317 1161342 1040029 1253221 838133 192098 176810 295506 405162 49408
5155D9408m09150N13852K66237J6687J67312J189731k17033j339486N32291L09300
$$ 49408 -359742 154110 420347 437034 604346 1794077 1577044 237558 769849 1079149
5145A079149l47550P77715o24918m17922J96570j31850L18684j43321k53147j00978
$$ 1079149 731599 1509314 884396 466474 663044 531194 849878 706557 453410 352432
5135C52432l40215M33929N4432L9421J092226j165757N38P16984N45452m69466
$$ 352432 12217 446146 500578 539999 1632225 466468 467006 1183990 1729442 1259976
5125A259976l09449N39359k35729J44452l31154Q54013O35844k72114k77651q78650
$$ 1259976 950527 1489886 1254157 1398609 1067455 1921468 2557312 2285198 2007547 1128897
5115A128897n78154k01444R1747N57468R27708q54526O47714L52165o41997r19400
$$ 1128897 550743 349299 441046 998514 1926222 1071696 1719410 2071575 1429578 510178
5105E10178j91200K4345J272003J93889K80436n86342o49662k71651R85194J58002
$$ 510178 318978 343323 1615326 1809215 2089651 1503309 853647 581996 1567190 1725192
5095A725192q53611M29176o58727m03290p848Q90569N2506j226197O78148K38254
$$ 1725192 871581 1300757 642030 238740 230892 1121461 1173967 -52230 625918 864172
5085H64172K04071p73207O95364n10320l33069J190792M05921l29284m46552M12505
$$ 864172 1068243 295036 990400 480080 147011 1337803 1743724 1414440 967888 1380393
5075A380393J70072j21703k69970J64518n43985q53556M22627J077612m89209
$$ 1380393 1550465 1428762 1158792 1323310 779325 -74231 348396 1426008 936799
5066I36799Q52995L04044o80074J90558P65181p69786l26028k11089Q90726j48110
$$ 936799 1789794 2093838 1413764 1604322 2369503 1599717 1273689 1062600 1953326 1805216
5056A805216k94867m59827K18421k34165O8777k699k48352J98608P42511J40902
$$ 1805216 1510349 1050522 1268943 1034778 1103555 1100856 852504 1051112 1793623 1934525
5046A934525J14943n06139K34814O66754M3659j42973j081563L00055K03380j019848
$$ 1934525 2049468 1543329 1778143 2444897 2488556 2345583 1264020 1564075 1767455 747607
5036G47607L64906M34319R62968J20240o37235L02609j017632J125599N15006
$$ 747607 1112513 1546832 2509800 2630040 1992805 2295414 1277782 2403381 2918387
5027B918387j099802R0613M24047K06019j21632J91837J16569O68313l98321r4983
$$ 2918387 1818585 1909198 2333245 2539264 2417632 2609469 2726038 3394351 2996030 2901047
5017B901047L64635L40522l58217n71434M67024M53210q01932O9626Q614M63602
$$ 2901047 3265682 3606204 3247987 2676553 3143577 3596787 2794855 2864481 2873095 3336697
5007C336697j27397m75030N61182R6081K15565o6366j2719n61636M87628l25271
$$ 3336697 3209300 2734270 3295452 3391533 3607098 3540732 3528013 2966377 3454005 3128734
4997C128734M30536n22330L52235q01684n02118J720069J371185l46979q22284
$$ 3128734 3559270 3036940 3389175 2587491 2085373 3805442 5176627 4829648 4007364
4988D007364l05162j67883J100020l48510J82868l65421N51582K50843j219448
$$ 4007364 3702202 3534319 4634339 4285829 4468697 4103276 4654858 4905701 3686253
4979C686253l43949l50142N75559N11631M27320L01873J98730j085570Q22282
$$ 3686253 3342304 2992162 3567721 4079352 4506672 4808545 5007275 3921705 4743987
4970D743987J328604o98307m48296m30015Q1807R41998k11007k77899N41633M56977
$$ 4743987 6072591 5374284 4925988 4495973 4577780 5519778 5308771 5030872 5572505 6029482
4960F029482Q2217J31989l49827m31629J12320K34025p9760m83243R62765N61474
$$ 6029482 6111699 6243688 5893861 5462232 5574552 5808577 5728817 5245574 6208339 6769813
4950F769813o26360Q00189K93655n23608L08267M62718M17215l57379l13245m17399
$$ 6769813 6143453 6943642 7237297 6713689 7021956 7484674 7901889 7544510 7231265 6813866
4940F813866R35020q660K28698m55019M75966O96584N35284J96432J9749r9099
$$ 6813866 7748886 7740226 7968924 7513905 7989871 8686455 9221739 9418171 9437920 9338821
4930I338821m42722K59691O52194P39994k63683j62746J131207M88579K90945
$$ 9338821 8896099 9155790 9807984 10547978 10284295 10121549 11252756 11741335 12032280
4921A2032280O00101m80978J59166P03272P16321J82947k58640K88430K45206
$$ 12032280 12632381 12151403 12310569 13013841 13730162 13913109 13654469 13942899 14188105
4912A4188105k85598K019250P47963j378145M12453K52400M77773j93846m1089
$$ 14188105 13902507 15921757 16669720 15291575 15704028 15956428 16434201 16240355 16199266
4903A6199266N75135j51594R77668L05907O03437M83131J62523O07226J147273
$$ 16199266 16774401 16622807 17600475 17906382 18509819 18992950 19155473 19762699 20909972
4894B0909972L05864o90581L10919K533164Q88222l80346J123577M98754j35626
$$ 20909972 21215836 20525255 20836174 23369338 24257560 23877214 25000791 25499545 25363919
4885B5363919P41122Q16324J209022j46230J087290J320892J052011R14232L70988
$$ 25363919 26105041 26921365 28130387 27984157 29071447 30392339 31444350 32358582 32729570
4876C2729570Q76091O99907J701110K103179J002256J057526J918588J352786
$$ 32729570 33605661 34305568 36006678 38109857 39112113 40169639 42088227 43441013
4868D3441013J217250J913216J889882K073460J527843K259916K404531K582474
$$ 43441013 44658263 46571479 48461361 50534821 52062664 54322580 56727111 59309585
4860E9309585J511641K055434K079386K310205J759238R34160J290423J406681
$$ 59309585 60821226 62876660 64956046 67266251 69025489 69959649 71250072 72656753
4852G2656753J191946Q67022R80874J372832J242798o40876o5091l52406m14579
$$ 72656753 73848699 74715721 75696595 77069427 78312225 77671349 77606258 77253852 76839273
4843G6839273q8761J226930J260419N00595K01852M00670J099634R62286K355892
$$ 76839273 76750512 77977442 79237861 79738456 79940308 80340978 81440612 82402898 84758790
4834H4758790J157030J358497K232800J683150J825783K480462K605774K647409
$$ 84758790 85915820 87274317 89507117 91190267 93016050 95496512 98102286 100749695
4826A00749695L293541L041168M364832L850506L672410M643236N164262O766138
$$ 100749695 104043236 107084404 111449236 115299742 118972152 123615388 128779650 135545788
4818A35545788O438084N395042O400991O998086Q995812Q435643Q752192R151239
$$ 135545788 141983872 147378914 153779905 160777991 169773803 178209446 186961638 196112877
4810A96112877J0597991J1328074J1035555J2455916J2812408J2633792J3728454
$$ 196112877 206710868 218038942 229074497 241530413 254342821 266976613 280705067
4803B80705067J2367281J2461686J1843909J1027129Q870112N971183N656993
$$ 280705067 293072348 305534034 317377943 328405072 337275184 343246367 348903360
4796C48903360J806638q27828l084360n745999p997261r683503j2140718j2969319
$$ 348903360 350709998 349882170 346797810 341051811 333054550 323371047 311230329 298261010
4788B98261010j2360470j3769615j3427850j2101692j1293516j0325828j1037553
$$ 298261010 285900540 272130925 258703075 246601383 235307867 224982039 213944486
4781B13944486j0587930q777265q049287q055941q193764p816594o734156o932588
$$ 213944486 203356556 194579291 186530004 178474063 170280299 162463705 155729549 148796961
4773A48796961o077517o098954o378696n538581n655400m882713m475311l924347
$$ 148796961 142719444 136620490 130241794 124703213 119047813 114165100 109689789 105765442
4765A05765442m012417l489815m019254l340459k887628k961103l109143l529909
$$ 105765442 101753025 98263210 94243956 90903497 88015869 85054766 81945623 78415714
4757G8415714m028808k129620k878830p95971j580344k479944l203084k622747
$$ 78415714 74386906 72257286 69378456 68582485 67002141 64522197 61319113 58696366
4749E8696366j096415j365066j235855k007022j980096j825836k054502j331951
$$ 58696366 57599951 56234885 54999030 52992008 51011912 49186076 47131574 45799623
4741D5799623m76104n19868o44055j299493k391694J686l89849j615432r57522
$$ 45799623 45323519 44803651 44159596 42860103 40468409 40470095 40080246 38464814 37507292
4732C7507292J39175p59614k912773j339037m66014O631m01007o25689k98000
$$ 37507292 37646467 36886853 33974080 32635043 32169029 32175660 31774653 31148964 30850964
4723C0850964p96758l44407m80840m03661L9252r39554k53521j526237p84232
$$ 30850964 30054206 29709799 29228959 28825298 28864550 27924996 27671475 26145238 25361006
4714B5361006o47451n86789o23810K5568j17808l62790q32436m23277o75348O00411
$$ 25361006 24713555 24126766 23502956 23528524 23410716 23047926 22215490 21792213 21116865 21717276
4704B1717276n8906j053301q8618j325358o85142J91550o23614K11945n7618p44010
$$ 21717276 21658370 20605069 20516451 19191093 18505951 18697501 18073887 18285832 18228214 17484204
4694A7484204n12245m05634k67184R2923m0479k44137n5081J23782n24770k51544
$$ 17484204 16971959 16566325 16299141 16392064 16351585 16107448 16052367 16176149 15651379 15399835
4684A5399835K27118r86622j236358k1969q3308J125965n63607j52473J23140
$$ 15399835 15626953 14640331 13403973 13382004 13298696 14424661 13861054 13708581 13831721
4675A3831721M73996q41525o71931P09263L08034p02023R9860o11899r07887J79741
$$ 13831721 14305717 13464192 12792261 13501524 13809558 13107535 13207395 12595496 11687609 11867350
4665A1867350Q69814N27980k82312L50750q72631o52870N120k60193M63155K23053
$$ 11867350 12737164 13265144 12982832 13333582 12460951 11808081 11813201 11553008 12016163 12239216
4655A2239216j85563P9415N03077N13969j008889r72328J683034m50210N74540
$$ 12239216 12053653 12133068 12636145 13150114 12141225 11168897 12851931 12401721 12976261
4646A2976261L6400r30889M65068O56620R43625n62668m15576N05077Q82175p58072
$$ 12976261 13012661 12081772 12546840 13203460 14147085 13584417 13168841 13673918 14556093 13798021
4636A3798021M03851O97653Q1073p84396k59535Q87203K20747J63373K29862M3897
$$ 13798021 14201872 14899525 14980598 14196202 13936667 14823870 15044617 15207990 15437852 15481749
4626A5481749k69612l25376K12743Q70812J218737K06800q75042K84853M71780
$$ 15481749 15212137 14886761 15099504 15970316 17189053 17395853 16520811 16805664 17277444
4617A7277444O32277o15316Q44542J085991N49810M71376M72020J114948l02067
$$ 17277444 17909721 17294405 18138947 19224938 19774748 20246124 20718144 21833092 21531025
4608B1531025M51573L06735P41894Q12209J084238l79561J553673J042991K41944
$$ 21531025 21982598 22289333 23031227 23843436 24927674 24548113 26101786 27144777 27386721
4599B7386721P95763J382939J541301J120658N00095Q71547P56982K165416K062886
$$ 27386721 28182484 29565423 31106724 32227382 32727477 33599024 34356006 36521422 38584308
4590C8584308K015049K044903J973823J855033J484616K699255L220532K188792
$$ 38584308 40599357 42644260 44618083 46473116 47957732 50656987 53877519 56066311
4582E6066311K994762K825074K778179L510748M617670L113540L417407L503917
$$ 56066311 59061073 61886147 64664326 68175074 72792744 75906284 79323691 82827608
4574H2827608L644900L681522L200716J288633L115715J997915M68925p04977
$$ 82827608 86472508 90154030 93354746 94643379 97759094 99757009 100225934 99520957
4566I9520957o34924j317888j594396k344609l549121m122107l972635m688029
$$ 99520957 98886033 97568145 95973749 93629140 90080019 85957912 81985277 77297248
4558G7297248m343378l829372l262381l290163l616402l072150k876502k310734
$$ 77297248 72953870 69124498 65862117 62571954 58955552 55883402 53006900 50696166
4550E0696166k239277k368169l243899j399009j013165j867812k232240j287809
$$ 50696166 48456889 46088720 42844821 41445812 40432647 38564835 36332595 35044786
4542C5044786j747146j377710j551606j169383j620130j123843m97820o98364
$$ 35044786 33297640 31919930 30368324 29198941 27578811 26454968 25957148 25258784
4534B5258784j011417q64119j203561m73417l57663q24926J27859r37346j325256
$$ 25258784 24247367 23383248 22179687 21706270 21348607 20523681 20651540 19714194 18388938
4525A8388938J64320j065398k58883l22058k67453j044280l87909M81296O74568
$$ 18388938 18553258 17487860 17228977 16906919 16639466 15595186 15207277 15688573 16363141
4516A6363141j026701j597685l38821l663q39291N8696J30560M1694j095256O01871
$$ 16363141 15336440 13738755 13399934 13396271 12556980 12615676 12746236 12787930 11692674 12294545
4506A2294545k57364o45827l14833J8001J9581l94391l02340M10632p60212Q9765
$$ 12294545 12037181 11391354 11076521 11094522 11114103 10719712 10417372 10828004 10067792 10157557
4496A0157557o04474l53331J85760l90453K73201k4579j031929p56100J032557
$$ 10157557 9553083 9199752 9385512 8995059 9268260 9243681 8211752 7455652 8488209
4487H488209J28083n09872J42405k64689q28135J2131O13430k90395k46273M59390
$$ 8488209 8616292 8106420 8248825 7984136 7156001 7168132 7781562 7491167 7244894 7704284
4477G704284q0984j25945K96433r64518l45878o22803R90753P17462j289762m99747
$$ 7704284 7623300 7497355 7793788 6829270 6483392 5860589 6851342 7568804 6279042 5779295
4467E779295L12704L48130n45460l18932L85830L41190n23190m54461l93970M1253
$$ 5779295 6091999 6440129 5894669 5575737 5961567 6302757 5779567 5325106 4931136 4972389
4457D972389m10196l5886J41532l0070j71544L15736J154792j066140m02224R08588
$$ 4972389 4562193 4526307 4667839 4637769 4466225 4781961 5936753 4870613 4468389 5376977
4447E376977r17749j92249M20057q0750j02448M02123j21440j48018L13625O1549
$$ 5376977 4459228 4266979 4687036 4606286 4503838 4905961 4784521 4636503 4950128 5011677
4437E011677o47861K93073l45416n91214M10312J74751K19065J46236o97594J374623
$$ 5011677 4363816 4656889 4311473 3720259 4130571 4305322 4524387 4670623 3973029 5347652
4427E347652k09641j109264k36330R16783J50560l52312J20070M26877J28224
$$ 5347652 5138011 4028747 3792417 4709200 4859760 4507448 4627518 5054395 5182619
4418E182619k38347q47508j55971N44385j49397p21583J33473k220J088941m02667
$$ 5182619 4944272 4096764 3940793 4485178 4335781 3614198 3747671 3745451 4834392 4431725
4408D431725J19147k68287o74604o7233J037311j0466q00979l63112P7296l38149
$$ 4431725 4550872 4282585 3607981 3540748 4578059 4567593 3766614 3403502 3480798 3142649
4398C142649N58349L79116J93367l54277k36559k01429r1429J180151j439514
$$ 3142649 3700998 4080114 4273481 3919204 3682645 3481216 3389787 4569938 3130424
4389C130424Q84858Q21105O26363n83446j7215j20284j355325J35656M69041M56042
$$ 3130424 4015282 4836387 5462750 4879304 4862089 4741805 3386480 3522136 3991177 4447219
4379D447219m82741k85552R18787n01907p05372J25815K15825N7179j0083j03378
$$ 4447219 3964478 3678926 4597713 4095806 3390434 3516249 3732074 3789253 3779170 3675792
4369C675792J72957n59496L08328J24389M58544J0354j10348o21226K62304L61792
$$ 3675792 3848749 3289253 3597581 3721970 4180514 4190868 4080520 3459294 3721598 4083390
4359D083390J15976n96580n85750O71431j153234O62741K31596r7911p55849N64254
$$ 4083390 4199366 3602786 3017036 3688467 2535233 3197974 3429570 3331659 2575810 3140064
4349C140064j05602n87065M42979l73901K53862M34716K26903n90205K21573m40953
$$ 3140064 3034462 2447397 2890376 2516475 2770337 3205053 3431956 2841751 3063324 2622371
4339B622371M35518J13914k77062m59321Q9257r4488n5749O81570l99552K806
$$ 2622371 3057889 3171803 2894741 2435420 2524677 2430189 2374440 3056010 2656458 2659264
4329B659264n96037K69250M063j0923J46084M04453K28794j4096J72771M95839
$$ 2659264 2063227 2332477 2336540 2325617 2471701 2876154 3104948 3090852 3263623 3759462
4319C759462k09749p11501J415q30688p37316Q86812R95017j68975K25337J02470
$$ 3759462 3549713 2838212 2839627 2008939 1271623 2158435 3153452 2984477 3209814 3312284
4309C312284j80154j19867n99048j06284M70736o246j54126L52862R7327K06086
$$ 3312284 3132130 3012263 2413215 2306931 2777667 2771421 2617295 2970157 3067484 3273570
4299C273570m26465j82281N86990P21265J34313k38297k66521J44765j5468L9762
$$ 3273570 2847105 2664824 3251814 3973079 4107392 3869095 3602574 3747339 3731871 3771633
4289C771633q8225o32089j13770L90130J364932k50010L74823m32947k42K50612
$$ 3771633 3683408 3051319 2937549 3327679 4692611 4442601 4817424 4384477 4384235 4634847
4279D634847r37377j101095L35871O97637M34479L28184M13243L5715K3511M61903
$$ 4634847 3697470 2596375 2932246 3629883 4064362 4392546 4805789 4841504 4865015 5326918
4269E326918l73761p41409N01401n87496n09731L0785J37735N97537J04898L68249
$$ 5326918 4953157 4211748 4713149 4125653 3615922 3646707 3784442 4381979 4486877 4855126
4259D855126q8919l12023j98279L61026N32821n92625P07707j16222M57941n42776
$$ 4855126 4766207 4454184 4255905 4616931 5149752 4557127 5264834 5148612 5606553 5063777
4249E063777n1429l66944n18569l95870O50099N84378l17360J016607M0355l42822
$$ 5063777 5012348 4645404 4126835 3730965 4381064 4965442 4648082 5664689 5705044 5362222
4239E362222o18736L41889J025840m54476l87286R30955j83246M2344j81937L47000
$$ 5362222 4743486 5085375 6111215 5656739 5269453 6200408 6017162 6059506 5877569 6224569
4229F224569J76903J003096q61129n01290K86042O01516k4099p2125N46066j28993
$$ 6224569 6401472 7404568 6543439 6042149 6328191 6929707 6905608 6833483 7379549 7250556
4219G250556N46519J43901k68135m1834P0367J43967q7977J73772K25094N22640
$$ 7250556 7797075 7940976 7672841 7631007 7701374 7845341 7757364 7931136 8156230 8678870
4209H678870j083211J475997k06631J33862j96921L17796R17356Q5421P41924
$$ 8678870 7595659 9071656 8865025 8998887 8801966 9119762 10037118 10122539 10864463
4200A0864463J51066p79922m94946R10085O87136N1063r3753Q78702p95874K37563
$$ 10864463 11015529 10235607 9740661 10650746 11337882 11388945 11295192 12173894 11378020 11615583
4190A1615583J99766K06351M75836L35885O94077J50765r71620P48654Q27937
$$ 11615583 11815349 12021700 12497536 12833421 13527498 13678263 12706643 13455297 14283234
4181A4283234J365741J174231k65739k30503o8142J197178Q01185J25397N97952
$$ 14283234 15648975 16823206 16557467 16326964 16258822 17456000 18257185 18382582 18980534
4172A8980534j89828J05139P85624N17272k62236M55090J998831J245872K32785
$$ 18980534 18790706 18895845 19681469 20198741 19936505 20391595 22390426 23636298 23869083
4163B3869083O49619O68514P09888R02227j18207Q5515J577277J568764N59006
$$ 23869083 24518702 25187216 25897104 26799331 26681124 26766639 28343916 29912680 30471686
4154C0471686J532283J121346J569513P89439Q5102J840910J313861J587362J073489
$$ 30471686 32003969 33125315 34694828 35484267 35569369 37410279 38724140 40311502 41384991
4145D1384991J221148Q74130J441907K500990J912358J511111K326736K646084
$$ 41384991 42606139 43480269 44922176 47423166 49335524 50846635 53173371 55819455
4137E5819455K235358J692023J629852L352666K009257K684965L303068M187267
$$ 55819455 58054813 59746836 61376688 64729354 66738611 69423576 72726644 76913911
4129G6913911L101005L901489M554618M535716M670930M160705N618629M778068
$$ 76913911 80014916 83916405 88471023 93006739 97677669 101838374 107457003 112235071
4121A12235071N789646P843370O290201O166184O255280Q005469P002769R307009
$$ 112235071 118024717 125868087 132158288 138324472 144579752 152585221 159587990 168894999
4113A68894999Q369695O832093Q191573P995644P849916O903796P130710N988664
$$ 168894999 177264694 184096787 192288360 200284004 208133920 215037716 222168426 228157090
4105B28157090P486278O419621M606748L889606K702594K913206J287743J632015
$$ 228157090 235643368 242062989 246669737 250559343 253261937 256175143 257462886 259094901
4097B59094901O8782j730593q74948l937848l949607n342506n198415o004377
$$ 259094901 259163683 257433090 256558142 252620294 248670687 243328181 238129766 232125389
4089B32125389m707271o825486p764465p756769o866301p329714q596966q112014
$$ 232125389 227418118 220592632 212828167 205071398 198205097 190875383 182278417 174166403
4081A74166403p490671p732700p261504o532606q510354p638309o214310n605860
$$ 174166403 166675732 158943032 151681528 145148922 136638568 129000259 122785949 117180089
4073A17180089m891738n665624n741234n806140m464908m462512l260768k947335
$$ 117180089 112288351 106622727 100881493 95075353 90610445 86147933 82887165 79939830
4065G9939830l813340k960659k455721l127737k384184j919904k583649l242182
$$ 79939830 76126490 73165831 70710110 67582373 65198189 63278285 60694636 57452454
4057E7452454j879266j766204j958013j529208j640208j614375j573095j957984
$$ 57452454 55573188 53806984 51848971 50319763 48679555 47065180 45492085 43534101
4049D3534101j396718j313196q19281o88060j143247r51058j611820j660296q76804
$$ 43534101 42137383 40824187 40004906 39316846 38173599 37222541 35610721 33950425 33073621
4040C3073621p1957j253971l21154j250428j178346m87866o0701j540678j51048
$$ 33073621 33001664 31747693 31426539 30176111 28997765 28509899 28449198 26908520 26757472
4031B6757472q47760L97852j339135j681965q18195j45677j110004L99092N53314
$$ 26757472 25909712 26307564 24968429 23286464 22468269 22322592 21212588 21611680 22164994
4022B2164994o44361l17132j855296j53776o76006n92213J44492Q2699j298929
$$ 22164994 21520633 21203501 19348205 19194429 18518423 17926210 18070702 18153401 16854472
4013A6854472q13272r3027J113678o875j285903k11517j103687o53424p08384
$$ 16854472 16041200 15948173 17061851 17054976 15769073 15557556 14453869 13800445 13092061
4004A3092061N28364J85062j070795J56666l64016k05724j4826j71159p77553
$$ 13092061 13620425 13805487 12734692 12891358 12527342 12321618 12306792 12135633 11358080
3995A1358080N96929L89925q72674k59651J11476r51839l02078K17708J9138q1097
$$ 11358080 11955009 12344934 11472260 11212609 11324085 10372246 10070168 10287876 10307014 10225917
3985A0225917k34513j212616L06449K91412n88852Q33456j100222R4750N5432
$$ 10225917 9991404 8778788 9085237 9376649 8787797 9621253 8521031 8615781 8671213
3976H671213m60945M31506N68550j636995o59890N32112j74571q96878M41685
$$ 8671213 8210268 8641774 9210324 7573329 6913439 7445551 7270980 6374102 6815787
3967F815787r17482R6640J95289L94733O03912k01103p60526m35247q9082m63501
$$ 6815787 5898305 5994945 6190234 6584967 7188879 6987776 6227250 5792003 5702921 5239420
3957E239420J133260L06848n8718n93107L2477l31486o58781j49452O80598l5893
$$ 5239420 6372680 6679528 6620810 6027703 6060180 5728694 5069913 4920461 5601059 5565166
3947E565166m33922N89052n00702o0081p19500l37990Q58804n23594j46386L77970
$$ 5565166 5131244 5720296 5219594 5159513 4440013 4102023 4960827 4437233 4290847 4668817
3937D668817k73705M41754M47464j482268M45167l391P59646Q9738n13946m27064
$$ 4668817 4395112 4836866 5284330 3802062 4247229 4243838 5003484 5093222 4579276 4152212
3927D152212P87469p6971L68264j69231l17145j75453m89453J56795q62320J206283
$$ 4152212 4939681 4862710 5230974 5061743 4744598 4569145 4079692 4236487 3374167 4580450
3917D580450k40989n53776O77576m32215n9286o15228Q08669j259117k27195k2749
$$ 4580450 4339461 3785685 4463261 4031046 3971760 3356532 4165201 2906084 2678889 2656140
3907B656140O45990P16693j291639m49943Q80503L6976o96515K07774M63965q9742
$$ 2656140 3302130 4018823 2727184 2277241 3157744 3194720 2498205 2705979 3169944 3080202
3897C080202l13392M88524n90383k63154N54288J2761M66018k30663n64788n95590
$$ 3080202 2766810 3255334 2664951 2401797 2956085 2968846 3434864 3204201 2639413 2043823
3887B043823K72319Q17235j83479l60872j063506J491898l82193j021539k28147
$$ 2043823 2316142 3133377 2949898 2589026 1525520 3017418 2635225 1613686 1385539
3878A385539k60630O76502R55436m6609j60916N3564M39069j189396l7779J61002
$$ 1385539 1124909 1801411 2756847 2710238 2549322 2602886 3041955 1852559 1814780 1975782
3868A975782m54306K80699J37912N72494J51510Q9993l32865j71255l90459k92805
$$ 1975782 1521476 1802175 1940087 2512581 2664091 2754084 2421219 2249964 1859505 1566700
3858A566700K79912l12109K41597K47717P55510l29161q6552m38726k05701m75559
$$ 1566700 1846612 1534503 1776100 2023817 2779327 2450166 2363614 1924888 1719187 1243628
3848A243628J578709J91158j086579M990m9718J67840N56047L10035k46124n55675
$$ 1243628 2822337 3013495 1926916 1931906 1882188 2050028 2606075 2916110 2669986 2114311
3838B114311j60579L91508n72104L63810n91926J03546P60948J27449O5954P9984
$$ 2114311 1953732 2345240 1773136 2136946 1545020 1648566 2409514 2536963 2602917 2682901
3828B682901K10785j71303m97956m1299K30803m31268P81241J09438l70762Q53659
$$ 2682901 2893686 2722383 2224427 2183128 2413931 1982663 2763904 2873342 2502580 3356239
3818C356239j77053m83855l97778J25412K11506J48010K36637O8651M8425M45209
$$ 3356239 3179186 2695331 2297553 2422965 2634471 2782481 3019118 3087769 3136194 3581403
3808C581403j056990N34783k74415L35568p3201r87906q61007N75320L96837M55036
$$ 3581403 2524413 3059196 2784781 3120349 3047148 2059242 1198235 1773555 2170392 2625428
3798B625428j57782m78534P66866J18692N11752J89916l54424n20245M31632O27772
$$ 2625428 2467646 1989112 2755978 2874670 3386422 3576338 3221914 2701669 3133301 3761073
3788C761073m85661j098587P78013k28983J17617R78393M63745j682347k45935
$$ 3761073 3275412 2176825 2954838 2725855 2843472 3821865 4285610 2603263 2357328
3779B357328k31359q89779J71825R41260L75556l15752R77629k81795k63273O93711
$$ 2357328 2125969 1236190 1408015 2349275 2724831 2409079 3386708 3104913 2841640 3535351
3769C535351k35055n56433J026330k47924j37713k56752k54721J38447M90365
$$ 3535351 3300296 2743863 3770193 3522269 3384556 3127804 2873083 3011530 3501895
3760C501895J08208J303637q90991q71504J1265L10426J44076R9002m8043k08669
$$ 3501895 3610103 4913740 4022749 3151245 3162510 3472936 3617012 3716014 3667971 3459302
3750C459302J53951n11933p27459k43394L97296Q0157j89963J39158J21626m00711
$$ 3459302 3613253 3101320 2373861 2130467 2527763 2607920 2417957 2557115 2678741 2278030
3740B278030j00007o64619o24178M95478J21916m88847R07450O9996j23777n94023
$$ 2278030 2178023 1513404 889226 1384704 1506620 1017773 1925223 1995219 1871442 1277419
3730A277419k5496l27948j22147l58186o5010M50929R40656o06411l48066j77667
$$ 1277419 1251923 923975 801828 443642 378632 829561 1770217 1163806 815740 638073
3720F38073O68539J22215m64510K97237l8566M45317m19877n39190J02503O08749
$$ 638073 1306612 1428827 964317 1261554 1222988 1668305 1248428 709238 811741 1420490
3710A420490L85097j70974k44729K91390q62797J29695q26245n37680N61689m07106
$$ 1420490 1805587 1634613 1389884 1681274 818477 948172 121927 -415753 145936 -261170
3700b61170K16458L86641O62723l88578n89430m70735M17715J93553R65148j59765
$$ -261170 -44712 341929 1004652 616074 26644 -444091 -26376 167177 1132325 972560
3690I72560q49555J76325K17082n95182M81823O5231n03443O71243L58464k5980
$$ 972560 123005 299330 516412 -78770 403053 468284 -35159 636084 994548 968568
3680I68568j646476J35919P27293O03618k40565n34919j47704M34819p01313o78326
$$ 968568 -677908 -541989 185304 788922 548357 13438 -134266 300553 -400760 -1079086
3670a079086K21723J058374N13025p1383K97254k52748o03565M56081O74595j26556
$$ -1079086 -857363 201011 714036 642653 939907 687159 83594 539675 1214270 1087714
3660A087714n21942n60235K03519o78009N71466K50825J433M89146l64009J39275
$$ 1087714 565772 5537 209056 -468953 102513 353338 354771 843917 479908 619183
3650F19183J13296k43597j97125n11520j3552M05125J68738J87957k132039L46871
$$ 619183 732479 488882 291757 -219763 -233315 171810 340548 528505 -1603534 -1256663
3640a256663N98213K33655J067273q00647K45606k11240n46413J46409J278888
$$ -1256663 -658450 -424795 642478 -158169 87437 -123803 -670216 -523807 755081
3631G55081P78260k47077q02696J135343p85517o82304K72229j95734m71739L47376
$$ 755081 1533341 1286264 483568 1618911 833394 151090 423319 227585 -244154 103222
3621A03222K11361m69714O33763l16235j59284l77023j29309P26886n40997J57135
$$ 103222 314583 -155131 478632 162397 3113 -373910 -503219 223667 -317330 -160195
3611a60195K50874K87287o02374j6896P90967k32558J123868m93272q44059p00432
$$ -160195 90679 377966 -224408 -241304 549663 317105 1440973 947701 103642 -596790
3601e96790K87257O26614l92991m91499J83261o22241j19403J492082L8473m55659
$$ -596790 -309533 317081 -75910 -567409 -384148 -1006389 -1125792 366290 404763 -50896
3591e0896m42770k68307P14444l24461Q8287R2263l97838N41846K9541J06421
$$ -50896 -493666 -761973 -47529 -371990 -283703 -191440 -589278 -47432 -17891 88530
3581H8530M74038J64928l47008j09535P12894j416883m53046O76286j62289J02565
$$ 88530 562568 727496 380488 270953 983847 -433036 -886082 -209796 -372085 -269520
3571b69520J52128M685K53011N67531n35533q97280n40436J284425J01779J35737
$$ -269520 -117392 -112707 140304 707835 172302 -724978 -1265414 19011 120790 256527
3561B56527k04888r44872Q27977N13009k47548q43822J89128M8525j89026k47329
$$ 256527 51639 -893233 -65256 447753 200205 -643617 -454489 -405964 -594990 -842319
3551h42319j49273Q43388N12580k93076N14938j35575n37748j69627M48859q68355
$$ -842319 -991592 -148204 364376 71300 586238 450663 -87085 -256712 192147 -676208
3541f76208Q61287l09651l75844L7922L41220R12657m50034R7177N97530j49425
$$ -676208 185079 -124572 -500416 -462494 -121274 791383 341349 438526 1036056 886631
3531H86631l90444j70556K50845l66728l94817L30683Q13367j67431j73285j437667
$$ 886631 496187 325631 576476 209748 -185069 145614 958981 791550 618265 -819402
3521h19402O85841N96084j175766O20496P9168O88709r37697j147842N75106P73987
$$ -819402 -133561 462523 -713243 -92747 -13579 675130 -262567 -1410409 -835303 -61316
3511f1316q38232R79467j35202J6794m77966Q3582R5476K00765M17348k52120
$$ -61316 -899548 79919 -55283 -38489 -516455 -432873 -337397 -136632 280716 28596
3501B8596j71307K70215P3557L07245l40242O19476n339l79954P71013m49064
$$ 28596 -142711 127504 201061 508306 168064 787540 782201 402247 1173260 724196
3491G24196K94119j63150k54270r28841K76886R49147k86134j37131o18709P6205
$$ 724196 1018315 855165 600895 -327946 -51060 898087 611953 474822 -143887 -67682
3481f7682o19011O8708m7221O2813O68287N16784P75623p06490m66494j139558
$$ -67682 -686693 -617985 -665206 -602393 65894 582678 1358301 651811 185317 -954241
3471i54241O93306M01837l59042K08248M38458O1138o65953M00764o19356L25269
$$ -954241 -260935 140902 -218140 -9892 428566 489704 -176249 224515 -394841 -69572
3461f9572m20253j38046j01555Q14071L47743k04686K64064j70318J04162m83955
$$ -69572 -489825 -627871 -729426 84645 432388 227702 491766 321448 425610 -58345
3451e8345l69457o14187l2033O50115j49610L02492Q20306n35199q07828R50352
$$ -58345 -427802 -1041989 -1074022 -423907 -573517 -271025 549281 14082 -793746 156606
3441A56606M75204k87858p53848L96819l70909M48362J24925J40422L89597l4519
$$ 156606 631810 343952 -409896 -13077 -383986 64376 189301 329723 719320 684801
3431F84801k71321o40237M69568k35819Q37941j72842m23169K45507L36561m87791
$$ 684801 413480 -226757 242811 6992 844933 672091 248922 494429 830990 343199
3421C43199J03144O83337q35985o31979j07000k86449K71812Q4712P75546M07986
$$ 343199 446343 1129680 293695 -338284 -445284 -731733 -459921 -375209 400337 808323
3411H08323l24599n24679m04328N1478K81024r74669N2849J375936o28438L28418
$$ 808323 483724 -40955 -445283 -393805 -112781 -1087450 -1034601 341335 -287103 41315
3401D1315K91148l14131O43960P9807m30083N95160O2571p10443M32678k64501
$$ 41315 332463 18332 662292 742099 312016 907176 969747 259304 691982 427481
3391D27481k82594l0186n09360K00885O09781m47274J263320q3130l31969j188142
$$ 427481 144887 114701 -394659 -193774 416007 -31267 1232053 1148923 816954 -371188
3381c71188P64585M0152j083524l79164M41995k00893P11501P72861j312720n40266
$$ -371188 393397 433549 -649975 -1029139 -587144 -788037 -76536 696325 -616395 -1156661
3371a156661M89166j11064k35656N08059Q69174l84371J80933K33630j037592
$$ -1156661 -667495 -778559 -1014215 -506156 363018 -21353 159580 393210 -644382
3362f44382L59741J290356q13537m6478O33667j156821q0273r30914N92178O88557
$$ -644382 -284641 1005715 192178 145700 779367 -377454 -457727 -1388641 -796463 -107906
3352a07906l30703J36983j01793M97514l6893n76762N72421J021331o37635n84982
$$ -107906 -438609 -301626 -403419 94095 57202 -519560 52861 1074192 436557 -148425
3342a48425j69210K11904K91643k86282P360p8463L71674l94687o01473q31478
$$ -148425 -317635 -105731 185912 -100370 -93010 -171473 200201 -194486 -795959 -1627437
3332a627437M57060J00015N46858L48869o9640K94022m26025l7168N00140l70263
$$ -1627437 -1170377 -1070362 -523504 -174635 -244275 49747 -376278 -413446 86694 -283569
3322b83569K03094N83420p25404m84645L78220k45415J00335N72664N16968j91281
$$ -283569 -80475 502945 -222459 -707104 -328884 -574299 -473964 98700 615668 424387
3312D24387k34818m77003j76005m0828P19330m21303K47505N13132L29237k38529
$$ 424387 189569 -287434 -463439 -504267 215063 -206240 41265 554397 883634 645105
3302F45105p34997m38087P95754n20058k76449O33196Q66675o33417j013599m68950
$$ 645105 -89892 -527979 267775 -252283 -528732 104464 971139 337722 -675877 -1144827
3292a144827M30683N12809O17939M13714o93022l79162L52419J64114o86366N1345
$$ -1144827 -714144 -201335 416604 830318 137296 -241866 110553 274667 -411699 -360354
3282c60354R85506J032006j302605n05160N20811n74750j076665P97496N81422
$$ -360354 625152 1657158 354553 -150607 370204 -204546 -1281211 -483715 97707
3273I7707n31098l04693Q79407q9347P23194N52477j190026r4126p86033n89336
$$ 97707 -433391 -738084 141323 51976 775170 1327647 137621 43495 -742538 -1331874
3263a331874J030099n25715N95660N59446J57648J12518j64318j16248l33657
$$ -1331874 -301775 -827490 -231830 327616 485264 597782 433464 317216 -16441
3254a6441l00896J31780N02702Q2973M92529r52000j095343J356443J20374N3649
$$ -16441 -317337 -185557 317145 400118 892647 -59353 -1154696 201747 322121 375770
3244C75770k15064n0037M6q9071L2387q30138K75751J77644j89016N1688L90764
$$ 375770 160706 110669 110715 21644 54031 -776107 -500356 -322712 -511728 -460040 -69276
3233f9276l31807K84792O366p67112R14543j7628M58886o75056j95796J42500
$$ -69276 -401083 -116291 -109925 -877037 37506 19878 478764 -196292 -392088 -249588
3223b49588l71891L45367R46309p31253L34340O26474j512865P52470k62716N77933
$$ -249588 -621479 -276112 670197 -61056 273284 899758 -613107 139363 -123353 454580
3213D54580P81264p21401K73323J64813J95053J97624m06213j090835O49665N60777
$$ 454580 1235844 514443 787766 952579 1147632 1345256 939043 -151792 497873 1058650
3203A058650j224659L44212p1563N33757q69737M13871L78819J18001j169415
$$ 1058650 -166009 178203 106640 640397 -229340 184531 563350 681351 -488064
3194d88064N16178J18368j110595m1540J023687M11312j622284M84301P20237
$$ -488064 28114 146482 -964113 -1005653 18034 429346 -1192938 -708637 11600
3185A1600O76255k49061N3695k63222o6687j75630L2177N24270j228849j45189
$$ 11600 687855 438794 492489 229267 162580 -13050 19127 543397 -685452 -830641
3175h30641L32868L33689P07441k77066J93568P79952K64780k11841K9752k40820
$$ -830641 -497773 -164084 543357 266291 459859 1239811 1504591 1292750 1322502 1081682
3165A081682M52051m73911n91745J53325n42631q95597P27724O61264Q12911r39271
$$ 1081682 1533733 1059822 468077 621402 78771 -816826 -89102 572162 1385073 445802
3155D45802n49552P61518k05513j46473K03086K35108k86263k75972Q49514l00416
$$ 445802 -103750 657768 452255 305782 508868 743976 457713 181741 1031255 730839
3145G30839k06020Q86481n46608l26707j81907O85468M68163o44622P1847p17569
$$ 730839 524819 1411300 864692 537985 356078 1041546 1509709 865087 936934 219365
3135B19365K83461o475q31432P68686K60316o21197Q10668J062084j104378m32084
$$ 219365 502826 496351 -335081 433605 693921 72724 883392 1945476 841098 409014
3125D09014L53250j64704K08201J00895o32505O9128K04718K50987K40082O45479
$$ 409014 762264 597560 805761 906656 274151 343279 547997 798984 1039066 1684545
3115A684545m78803j280522J229910j47807o72750R2343k08469Q77008N30876
$$ 1684545 1205742 -74780 1155130 1007323 334573 426916 218447 1095455 1626331
3106A626331j56133j60920j7053m28607L30331q9107l80543O2495J553402p19916
$$ 1626331 1470198 1309278 1292225 863618 1193949 1104842 724299 786794 2340196 1620280
3096A620280m47330P12853N32917L2607m56681k50166N9125k0346o77884K31217
$$ 1620280 1172950 1885803 2418720 2451327 1994646 1744480 1803605 1783259 1105375 1336592
3086A336592O99298l21348M52471M79576j180677j0462K10117K76407Q07694l78988
$$ 1336592 2035890 1714542 2167013 2646589 1465912 1455450 1665567 1941974 2749668 2370680
3076B370680k80720P03011n83292R40571j61182R19498L59621k47429j199894
$$ 2370680 2089960 2792971 2209679 3150250 2989068 3908566 4268187 4020758 2820864
3067B820864j21341L95326o22543Q57348K06837n51852R84047n29359K54318O05931
$$ 2820864 2699523 3094849 2472306 3329654 3536491 2984639 3968686 3439327 3693645 4299576
3057D299576m42342k49879m01931L20080K95101k05405m80216M9048q46366N71491
$$ 4299576 3857234 3607355 3205424 3525504 3820605 3615200 3134984 3184032 2337666 2909157
3047B909157J61555j85596p61619j7491j64159m25520j7945J0625K96707k42308
$$ 2909157 3070712 2885116 2123497 2106006 1941847 1516327 1498382 1509007 1805714 1563406
3037A563406K89316J07397l50332N02027k94169J7718n63576m0917J42780l58549
$$ 1563406 1852722 1960119 1609787 2111814 1817645 1835363 1271787 1230870 1373650 1015101
3027A015101m63247J051708k07176n63227k49015Q11315K56712K39001J01583
$$ 1015101 551854 1603562 1396386 833159 584144 1395459 1652171 1891172 1992755
3018A992755l99201K95225N97803p1411l81748q70375n44696Q39347J64541J5760
$$ 1992755 1593554 1888779 2486582 2415171 2033423 1163048 618352 1457699 1622240 1638000
3008A638000j89075k12676R33210j266530J62276J35304n46919J236223m65332
$$ 1638000 1448925 1236249 2169459 902929 1065205 1200509 653590 1889813 1424481
2999A424481O81981m88487J03699M75842m80541J78278r6604R564J059669J75461
$$ 1424481 2106462 1617975 1721674 2197516 1716975 1895253 1798649 1808213 2867882 3043343
2989C043343l22979l114L46210K03324k50118n97172L44884r4557N42270j1254
$$ 3043343 2720364 2717250 3063460 3266784 3016666 2419494 2764378 2669821 3212091 3200837
2979C200837l0478j88299o04678O12186n39416m85055L04881K72036r4711j157603
$$ 3200837 3170359 2982060 2377382 2989568 2450152 1965097 2269978 2542014 2447303 1289700
2969A289700N0116l06139N193J244689J44546k87203J77857m50112L55907o95921
$$ 1289700 1339816 1033677 1038870 2283559 2428105 2140902 2318759 1868647 2224554 1528633
2959A528633l79694j67706n09491K34456J76248J586449N5190p43793K70991P56977
$$ 1528633 1148939 981233 471742 706198 882446 2468895 2524085 1780292 2051283 2808260
2949B808260J7662n69076J8802K69495j121629k35809N07021J016946J34571j623934
$$ 2808260 2825922 2256846 2275648 2545143 1423514 1187705 1694726 2711672 2846243 1222309
2939A222309O62977M48922k67851J89416n79160N28693M90179n33944r43426O60856
$$ 1222309 1885286 2334208 2066357 2255773 1676613 2205306 2695485 2161541 1218115 1878971
2929A878971P70354n71538O18042J60943L46130j353672j90295j1106R17886k93119
$$ 1878971 2649325 2077787 2695829 2856772 3202902 1849230 1658935 1647829 2565715 2272596
2919B272596N91762P73774n31191j23652p05822L69502M12532k98813K99350m65290
$$ 2272596 2864358 3638132 3106941 2983289 2277467 2646969 3059501 2760688 3060038 2594748
2909B594748j32687K62589j91154o02591J75532K66550J34838r1137j84638j74849
$$ 2594748 2462061 2724650 2533496 1930905 2106437 2372987 2507825 2416688 2232050 2057201
2899B057201m64118P95126M3249l98026K71096j102320r40660J194020Q89757
$$ 2057201 1593083 2388209 2431458 2033432 2304528 1202208 261548 1455568 2345325
2890B345325o37082Q3726o5181l3787J63057J27357l09280J81705J23882j53428
$$ 2345325 1708243 1791969 1726788 1693001 1856058 1983415 1674135 1855840 1979722 1826294
2880A826294R18541r30217l46214j0487J20632j60588m96914l55876j532J26763
$$ 1826294 2744835 1814618 1468404 1457917 1578549 1417961 921047 565171 563639 690402
2870F90402k4913k31355J061127m44585n23163l7349J91941l37054M23774n20058
$$ 690402 665489 434134 1495261 1050676 527513 490164 682105 345051 768825 248767
2860B48767K2061n8561J80030j0500K5529j72640l93992M24718J095374n74630
$$ 248767 270828 212267 392297 381797 407326 234686 -159306 265412 1360786 786156
2850G86156q72668n67678J25694K61795j6606N3867l23340J31455k03036M11249
$$ 786156 -86512 -654190 -528496 -266701 -283307 -229440 -552780 -421325 -624361 -213112
2840b13112J55410k36414Q58121j175406M9667R38282L38329j537715L915J388612
$$ -213112 -57702 -294116 564005 -611401 -561734 376548 714877 -822838 -818923 569689
2830E69689K69299l98782r3342m16067O31826j58596p07206n77613L24985M12030
$$ 569689 838988 440206 346864 -69203 562623 404027 -303179 -880792 -555807 -143777
2820a43777L56812J73440n49479k82894O20845j05887n2492P77039l10702k36246
$$ -143777 213035 386475 -163004 -445898 174947 69060 16568 793607 482905 246659
2810B46659p18759J043474n38975l14660M96374N40999k7003j43617J38187N14856
$$ 246659 -472100 571374 32399 -282261 214113 755112 728109 584492 722679 1237535
2800A237535q04574o92373K39800P26399O54446O7997q65865Q02665j046708l13394
$$ 1237535 432961 -259412 -19612 706787 1361233 1429230 563365 1366030 319322 5928
2790E928K47532J421337l81622l25819r70434l84237L9589K54777N53414M72626
$$ 5928 253460 1674797 1293175 967356 -3078 -387315 -347726 -92949 460465 933091
2780I33091Q1044j137147q2666J4783m51114R35883k73687m69367O67514N68060
$$ 933091 1014135 -123012 -205678 -190895 -642009 293874 20187 -449180 218334 786394
2770G86394p22005J0112J46617n62600N47919P98660k1597j336300L81904J064602
$$ 786394 64389 74501 221118 -341482 206437 1005097 983500 -352800 29104 1093706
2760A093706P45k65806M80676l97928M70899k83242K43945J89586m40053k35541
$$ 1093706 1094451 828645 1309321 911393 1382292 1099050 1342995 1532581 1092528 856987
2750H56987K70247M81787j210913j99767O49845J06662l40242O48227k96073l61982
$$ 856987 1127234 1609021 398108 198341 848186 954848 614606 1262833 966760 604778
2740F04778R61307p79631j065190J069753N51959k12257q75214O608L21022j94966
$$ 604778 1566085 786454 -278736 791017 1342976 1130719 255505 262113 583135 388169
2730C88169o44200Q58937J05097n93514q9524J357845L12527N26168m08855j269207
$$ 388169 -256031 602906 708003 114489 24965 1382810 1695337 2221505 1812650 543443
2720E43443K35226J84580J119452j010394m76142j23703N45052K01048L73562
$$ 543443 778669 963249 2082701 1072307 596165 472462 1017514 1218562 1592124
2711A592124n43681n70474J16381q8812m77008J69161O02999P4626k4839Q5383
$$ 1592124 1048443 477969 594350 505538 28530 197691 800690 875316 850477 935860
2701I35860q10007j075816L64969J216862n13898k37532N10794m5879o00111Q36844
$$ 935860 125853 -949963 -584994 631868 117970 -119562 391232 345353 -254758 582086
2691E82086q95050L50311K29483M97043J9311q19607N86794l56262k47238J53738
$$ 582086 -312964 37347 266830 763873 783184 -36423 550371 194109 -53129 100609
2681A00609J28888k01162l80827o09759L13517J83086L2119O25644l72115P02903
$$ 100609 229497 28335 -352492 -962251 -648734 -465648 -433529 192115 -180000 522903
2671E22903l24040n96778K04061O25843p0301L39596r87931O91628j17600L09107
$$ 522903 198863 -397915 -193854 431989 361688 701284 -286647 404981 287381 596488
2661E96488O26173p64034m65735l65524L32050J40797l16977n92176R30360M09320
$$ 596488 1222661 458627 -7108 -372632 -40582 100215 -216762 -808938 121422 530742
2651E30742j463538j47255J056139Q66735J8178n84644K16582J37144J0221q86018
$$ 530742 -932796 -1080051 -23912 842823 861001 276357 492939 630083 640304 -245714
2641b45714j71763l53778Q4825N9616M60235j76363K87152n33057K14027J76607
$$ -245714 -417477 -771255 -686430 -626814 -166579 -342942 -55790 -588847 -374820 -198213
2631a98213J48314r05327J142157o07921m23642L76245Q49959o57946M06869J8265
$$ -198213 -49899 -955226 186931 -420990 -844632 -468387 381572 -276374 130495 148760
2621A48760N3067O47120k36565J206392j318270r65273L50855k249K37793N25545
$$ 148760 201827 848947 612382 1818774 500504 -464769 -113914 -116163 121630 647175
2611F47175j020624J034115k84880q16737n97441Q61064N73520K9580j13081k34359
$$ 647175 -373449 660666 375786 -440951 -1038392 -177328 396192 425772 312691 78332
2601G8332j85920m93856K98929J08229k62362l62942K0448L98892j24405P08352
$$ 78332 -107588 -601444 -302515 -194286 -456648 -819590 -799142 -400250 -524655 183697
2591A83697K29049q1651J46196k35492l39567M79533P6990l30808p6204l38507
$$ 183697 412746 331095 477291 241799 -97768 381765 458755 127947 51743 -286764
2581b86764P3419P31148q92649M03649M39093j384808j19445N12415J012524P8641
$$ -286764 -213345 517803 -374846 28803 467896 -916912 -1036357 -523942 488582 567223
2571E67223j334870J71807J85058R2648K75211q77460N18166n26283O80194j98866
$$ 567223 -767647 -595840 -410782 -318134 -42923 -920383 -402217 -928500 -248306 -447172
2561d47172O32923L63378o68637J63659K59018l4371M82860p22305M39209o5525
$$ -447172 185751 549129 -119508 44151 303169 268798 751658 29353 468562 403037
2551D03037J85020p33824N13273j30113J67148j61153o0929P67623l49069p02478
$$ 403037 588057 -145767 367506 237393 404541 243388 182459 950082 601013 -101465
2541a01465O0020j03509j8413R4965K3939R8504k65330m40779M37319M64769q47388
$$ -101465 -41445 -144954 -163367 -68402 -44463 54041 -211289 -652068 -214749 250020 -597368
2530e97368P79527j54926R73487j108174n28449j87673M55518L05825m71250o06171
$$ -597368 182159 27233 1000720 -107454 -635903 -823576 -368058 -62233 -533483 -1139654
2520a139654R99437J081841o09258r19519j87079o14032M04856j97776k81254
$$ -1139654 -140217 941624 332366 -587153 -774232 -1388264 -983408 -1181184 -1462438
2511a462438O34466m27302O7247O37083l84516O9838J160210n31319m26104j88975
$$ -1462438 -827972 -1255274 -1188027 -550944 -935460 -865622 294588 -236731 -662835 -851810
2501h51810J44546l31510K75341M62999J86255M78058r56455O3254K73249j68856
$$ -851810 -707264 -1038774 -763433 -300434 -114179 363879 -592576 -529322 -256073 -424929
2491d24929l04378J18211K09783J89741k19558p0859m19699K37448k0950M42148
$$ -424929 -729307 -611096 -401313 -211572 -431130 -501989 -921688 -684240 -705190 -263042
2481b63042k41275O59538r8912r9643j0390M3059m50846j30286J14814l96378
$$ -263042 -504317 155221 56309 -43334 -53724 -10665 -461511 -591797 -476983 -873361
2471h73361N04307L53635K16461o65650P08303l77075o57733L92681L35973q55412
$$ -873361 -369054 -15419 201042 -464608 243695 -133380 -791113 -398432 -62459 -917871
2461i17871p81211R92364R22793j9205o45584P7073j0649J08239m4304M14595
$$ -917871 -1699082 -706718 216075 196870 -448714 -371641 -382290 -274051 -318355 96240
2451I6240M77312q37414N87651n99394k05462K27731p22428j66879O58787l75710
$$ 96240 573552 -263862 323789 -275605 -481067 -253336 -975764 -1142643 -483856 -859566
2441h59566J14474M53755L62672o71615L35437O69814r30674m8307J290991q13899
$$ -859566 -745092 -291337 71335 -600280 -264843 404971 -525703 -574010 716981 -96918
2431i6918K3068P2086o08386J25407M22947L27227M15177l00802o13661n9090
$$ -96918 -73850 -1764 -610150 -484743 -61796 265431 680608 379806 -233855 -292945
2421b92945j331111k78193L73933J060455L06509O95999k07293l92304k2199L88236
$$ -292945 -1624056 -1902249 -1528316 -467861 -161352 534647 327354 -64950 -87149 301087
2411C01087L21191p69949M35812J116608l91940j74387p50449O8016M18614n84790
$$ 301087 622278 -147671 288141 1404749 1012809 838422 87973 155989 574603 -10187
2401a0187K02364o38323j63972j65491P77595O157l99315j75919O37753j10152
$$ -10187 192177 -446146 -610118 -775609 1986 8143 -391172 -567091 70662 -39490
2391c9490J23294N7970o19692j39885j34735M47309P6061K60545m39067N91922
$$ -39490 83804 141774 -477918 -617803 -752538 -305229 -229168 31377 -407690 184232
2381A84232p92481l00483J170683l53181p32430N83957L61829m84094L89090n70597
$$ 184232 -608249 -908732 261951 -91230 -823660 -239703 122126 -361968 27122 -543475
2371e43475l35075O25383M79280m95026K5720n5505m63460N56825l86489k0022
$$ -543475 -878550 -253167 226113 -268913 -243193 -298698 -762158 -205333 -591822 -611844
2361f11844R05449M303n47076k28800j02382M77622o2688q15961j57000k2209
$$ -611844 293605 297908 -249168 -477968 -580350 -102728 -165416 -981377 -1138377 -1160586
2351a160586J430714m06536J02853K53465j197687P16235J05702P6565l57846
$$ -1160586 270128 -136408 -33555 219910 -977777 -261542 -155840 -79275 -437121
2342d37121p95445r06815J136165J20149P2433J06971m2153R3059P96816l09602
$$ -437121 -1232566 -2139381 -1003216 -883067 -810634 -703663 -745816 -652757 144059 -165543
2332a65543K28287L223j14009K36668j205997O99820n81764k7167M31541J61088
$$ -165543 62744 65967 -48042 188626 -1017371 -317551 -899315 -926482 -494941 -333853
2322c33853k67594M36962J061259J60240j191943J91405J358372k73815j189757
$$ -333853 -601447 -164485 896774 1057014 -134929 56476 1414848 1141033 -48724
2313d8724k87824j26589j7919J023410o62888R0984j80885j09337J69944j413373
$$ -48724 -336548 -463137 -481056 542354 -120534 -29550 -210435 -319772 -149828 -1563201
2303a563201J44862m31101K71324J234421P9140p20336Q67219N82675J55786j182158
$$ -1563201 -1418339 -1849440 -1578116 -343695 -264555 -984891 -117672 465003 620789 -561369
2293e61369K2174L6591r7710N13980M03255j62047M93450M83332m23977p1465
$$ -561369 -539195 -502604 -600314 -86334 316921 154874 648324 1131656 707679 636214
2283F36214j48602K0250O1625j107749l66685N78303K96507J67385k5015N95137
$$ 636214 487612 507862 569487 -538262 -904947 -326644 -30137 137248 112233 707370
2273G07370r8914K162r96241p93929N19327l57992P7490n615Q01366Q22384o97136
$$ 707370 608456 610618 -385623 -1179552 -660225 -1018217 -940727 -946342 -144976 677408 -19728
2262a9728l89541L13848L56600k93841m5948n75148K93471j59569j50180M42375
$$ -19728 -409269 -95421 261179 -32662 -78610 -653758 -360287 -519856 -670036 -227661
2252b27661n30154l4509L24733o84997m41378J331939M30119n35786q44440N61901
$$ -227661 -757815 -792324 -467591 -1152588 -1593966 -262027 168092 -367694 -1212134 -650233
2242f50233J231567N7888m10643m61607l62200j59767N59572K2596J534919p98751
$$ -650233 581334 639222 228579 -233028 -595228 -754995 -195423 -172827 1362092 563341
2232E63341J86722m83256n69398K60686J1028p38783M84117j82174L44398k3216
$$ 563341 750063 266807 -302591 -41905 -30877 -769660 -285543 -467717 -123319 -146535
2222a46535J5559k75319J51642J44001k47325p53607P10090R20667L84297m50359
$$ -146535 -130976 -406295 -254653 -110652 -357977 -1111584 -401494 519173 903470 453111
2212D53111l25377m77786p62963Q50123N9078o04296j94790R75708J4490q30864
$$ 453111 127734 -350052 -1113015 -262892 -203814 -808110 -1002900 -27192 -12702 -843566
2202h43566O4214q27718L75391O81762k4315L71405j040488J221911j15829q34676
$$ -843566 -779352 -1607070 -1231679 -549917 -574232 -202827 -1243315 -21404 -137233 -971909
2192i71909l60030P754J41858N50420K22804M05024j49303J53910j115505Q78765
$$ -971909 -1331939 -1324185 -1182327 -631907 -409103 -4079 -153382 528 -1114977 -236212
2182b36212J55445j233932L24159K72986m6656k91744K67113P45520j2078l98562
$$ -236212 -80767 -1314699 -990540 -717554 -764210 -1055954 -788841 -43321 -55399 -453961
2172d53961o2405L22078j06842N73062O26210m94159n01794K95794p00553K79319
$$ -453961 -516366 -194288 -301130 271932 898142 403983 -97811 197983 -502570 -223251
2162b23251N23847R1006l46722j34525o9089M29731p3157q17110M12170j23765
$$ -223251 300596 391602 44880 -89645 -158734 270997 197840 -619270 -207100 -330865
2152c30865M33617q02747J2487R64094l48894j67863k82598K5054K41209j65090
$$ -330865 102752 -699995 -687508 276586 -72308 -240171 -522769 -497715 -256506 -421596
2142d21596j41565j4297k55648K25924O67871K11294n06427K19752O16758j13271
$$ -421596 -563161 -577458 -833106 -607182 60689 271983 -234444 -14692 602066 488795
2132D88795l27888J9135l7649K97623m75537j3785N45353K5884r11843J30199
$$ 488795 160907 180042 142393 440016 -35521 -49306 496047 521931 -389912 -259713
2122b59713l30856L57824L52354j99600N57857j60637O3445N05115o81090j09017
$$ -259713 -590569 -232745 119609 -79991 477866 317229 380674 885789 204699 95682
2112I5682L61831j026438L24963J043524l82216o56329L6709l90731K08402N07306
$$ 95682 457513 -568925 -243962 799562 417346 -238983 -202274 -593005 -384603 122703
2102A22703P98818l95427q16264J249286Q12587p76444m85424J037243O7055r40143
$$ 122703 921521 526094 -290170 959116 1771703 995259 509835 1547078 1614133 673990
2092F73990o33908k35467m89767O42914J644343L06791o27217k33419J64438j45040
$$ 673990 40082 -195385 -685152 -42238 1602105 1908896 1281679 1048260 1212698 1067658
2082A067658j83056j20561Q1076J080254j7817o94378Q26582l59441k9965K47119
$$ 1067658 884602 764041 845117 1925371 1907554 1213176 2039758 1680317 1650352 1897471
2072A897471N76717o04743n77281Q32108J110689n21529q8847J34495Q66921j99414
$$ 1897471 2474188 1869445 1292164 2124272 3234961 2713432 2624585 2759080 3626001 3426587
2062C426587K1080R2678R78427Q16051R03330n99461Q78230L90316q5894R54448
$$ 3426587 3447667 3540345 4518772 5334823 6238153 5638692 6516922 6907238 6821344 7775792
2052G775792n76879m2941P11721P44579n10029m72125O06393J45246n38430p48358
$$ 7775792 7198913 7155972 7867693 8612272 8102243 7630118 8236511 8381757 7843327 7094969
2042G094969n40997L09208j435835l81344Q54831m63889l58407n84618m97686
$$ 7094969 6553972 6863180 5427345 5046001 5900832 5436943 5078536 4493918 3996232
2033C996232n24235K0822m79854r5369J5876m34J07009k53782r69129l78261P74697
$$ 3996232 3471997 3492819 3012965 2917596 2933472 2933038 3040047 2786265 1817136 1438875 2213572
2022B213572K88150n87073k52206l00624J11822j4839j29818O65790p22411k604
$$ 2213572 2501722 1914649 1662443 1361819 1473641 1458802 1328984 1994774 1272363 1269759
2012A269759P28911J59242m20879q60236k02417k651r6969Q07525j144700M42816
$$ 1269759 1998670 2157912 1737033 876797 674380 671729 574760 1382285 237585 680401
2002F80401M78686n82874j91288M05286j71230N14849K25446Q0650j98134o00586
$$ 680401 1159087 576213 384925 790211 618981 1133830 1359276 1439926 1241792 641206
1992F41206K17243O77876m05061J5986j102931q74041J080703n1012J20012k79748
$$ 641206 858449 1536325 1131264 1147250 44319 -829722 250981 199969 319981 40233
1982D0233o58600M00272M20596k92489k09722K36005J61310Q1001K60756j23558
$$ 40233 -618367 -218095 202501 -89988 -299710 -63705 97605 178606 439362 315804
1972C15804j25929J19987M88630n13190K96121Q60296r16799L62704p95665l54120
$$ 315804 189875 309862 798492 285302 581423 1441719 524920 887624 91959 -262161
1962b62161m88794O5973Q86856n70853O77986K77045m22869M83043o05456L41954
$$ -262161 -750955 -684982 201874 -368979 309007 586052 163183 646226 40770 382724
1952C82724n00582K08166j8494n0812P28636k70011l272p6509m77694k42457K19534
$$ 382724 -117858 90308 71814 21002 749638 479627 476355 399846 -77848 -320305 -100771
1941a00771j37702R01391n60026l50375K38625L95349L18066l56948J032140j034020
$$ -100771 -238473 662918 102892 -247483 -8858 386491 704557 347609 1379749 345729
$$ [...]
##END NTUPLES=NMR SPECTRUM
##END=
